##TITLE=31Pdec_BAU-j-4.066
 DMSO-d6, 24 sc
 4.7.2019
##JCAMPDX= 6.0         $$ Bruker NMR JCAMP-DX V2.0
##DATA TYPE= NMR SPECTRUM
##DATA CLASS= NTUPLES
##ORIGIN= UXNMR, Bruker Analytische Messtechnik GmbH
##OWNER= root
$$ XWIN-NMR		Version 3.5
$$ Thu Jul  4 16:02:34 2019 Russian Standard Time (UT+4h)  she@DPX200
##.OBSERVE FREQUENCY= 81.013821
##.OBSERVE NUCLEUS= ^31P
##.ACQUISITION MODE= SIMULTANEOUS
##.ACQUISITION SCHEME= undefined
##.AVERAGES= 24
##.DIGITISER RES= 17
##SPECTROMETER/DATA SYSTEM= spect
##.PULSE SEQUENCE= zgpg30
##.SOLVENT NAME= Acetone
##.SHIFT REFERENCE= (INTERNAL, Acetone, 0, 182.463)
##AUDIT TRAIL= $$ (NUMBER, WHEN, WHO, WHERE, WHAT)
$$ ##TITLE= Audit trail, XWIN-NMR		Version 3.5
$$ ##JCAMPDX= 5.01
$$ ##ORIGIN= Bruker BioSpin GmbH
$$ ##OWNER= she
$$ F:/spectra/data/she/nmr/P31/1/pdata/1/auditp.txt
$$ ##AUDIT TRAIL=  $$ (NUMBER, WHEN, WHO, WHERE, WHAT)
(   1,<2019-07-04 16:01:38.95 +0400>,<she>,<DPX200>,
      <created by zg, POWCHK disabled, PULCHK disabled
       configuration hash MD5:
       00 E9 B6 7A A2 85 ED C7 34 08 36 98 17 FE 4E 26
       data hash MD5: 32K
       1B 9F EA C1 0E 9B B0 E6 BC AE 91 79 32 EB AD A7>)
(   2,<2019-07-04 16:01:41.40 +0400>,<she>,<DPX200>,
      <Start of raw data processing
       efp BC_mod = 2 LB = 1 FT_mod = 6 PKNL = 1 PHC0 = -2630.305 PHC1 = 182.7988 SI = 64K 
       data hash MD5: 64K
       CB 25 22 9C FF 6E 70 78 0C AD 19 69 CB 27 EF 09>)
(   3,<2019-07-04 16:01:59.29 +0400>,<she>,<DPX200>,
      <pk PHC0 = 23.09794 PHC1 = 0 
       data hash MD5: 64K
       EA 9A 40 D2 3C 2C 83 D4 90 40 A3 4F DD 38 03 E8>)
(   4,<2019-07-04 16:02:02.45 +0400>,<she>,<DPX200>,
      <abs ABSG = 5 
       data hash MD5: 64K
       44 C3 A5 3B 56 F5 E5 97 11 A1 8D 01 11 9E 69 AF>)
$$ ##END=
$$ 
$$ hash MD5
$$ D7 1D AB 02 6F 6B AD 85 85 BD 43 2D 89 72 41 96
##$RELAX= 
##$RELAX= 
##$RELAX= 
##$RELAX= 
##$RELAX= 
##$RELAX= 
##$RELAX= 
##$RELAX= 
$$ Bruker specific parameters
$$ --------------------------
##$DU= <F:/spectra>
##$EXPNO= 1
##$NAME= <P31>
##$PROCNO= 1
##$TYPE= <nmr>
##$USER= <she>
##$AMP= (0..31)
100 100 100 100 100 100 100 100 100 100 100 100 100 100 100 100 100 100 
100 100 100 100 100 100 100 100 100 100 100 100 100 100 
##$AQSEQ= 0
##$AQ_mod= 1
##$AUNM= <au_zg>
##$AUTOPOS= <>
##$BF1= 81.014009
##$BF2= 200.13
##$BF3= 200.13
##$BF4= 200.13
##$BF5= 200.13
##$BF6= 200.13
##$BF7= 200.13
##$BF8= 200.13
##$BYTORDA= 1
##$CFDGTYP= 0
##$CFRGTYP= 5
##$CHEMSTR= <none>
##$CNST= (0..31)
1 1 145 1 1 1 1 1 1 1 1 1 1 1 1 1 1 1 1 1 1 1 1 1 1 1 1 1 1 1 1 1 
##$CPDPRG= <waltz16>
##$CPDPRG1= <>
##$CPDPRG2= <waltz16>
##$CPDPRG3= <>
##$CPDPRG4= <mlev>
##$CPDPRG5= <mlev>
##$CPDPRG6= <mlev>
##$CPDPRG7= <mlev>
##$CPDPRG8= <mlev>
##$CPDPRGB= <>
##$CPDPRGT= <>
##$D= (0..31)
0 1 0 0 0 0 0 0 0 0 0 0.03 2e-05 3e-06 0 0 0 0 0 0 0 0 0 0 0 0 0 0 0 0 
0 0 
##$DATE= 1562241698
##$DBL= (0..7)
120 120 120 11 120 120 24 19 
##$DBP= (0..7)
150 150 150 150 150 150 150 150 
##$DBP07= 0
##$DBPNAM0= <>
##$DBPNAM1= <>
##$DBPNAM2= <>
$$ [...]
##$SUBNAM3= <"">
##$SUBNAM4= <"">
##$SUBNAM5= <"">
##$SUBNAM6= <"">
##$SUBNAM7= <"">
##$SUBNAM8= <"">
##$SUBNAM9= <"">
##$SW= 369.568048894756
##$SWIBOX= (0..15)
0 1 3 0 0 0 0 0 0 0 0 0 0 0 0 0 
##$SW_h= 29940.119760479
##$TD= 32768
##$TD0= 1
##$TE= 0
##$TE2= 300
##$TE3= 300
##$TEG= 300
##$TL= (0..7)
0 120 53 12 22 120 120 120 
##$TP= (0..7)
150 150 150 150 150 150 150 150 
##$TP07= 0
##$TPNAME0= <>
##$TPNAME1= <>
##$TPNAME2= <>
##$TPNAME3= <>
##$TPNAME4= <>
##$TPNAME5= <>
##$TPNAME6= <>
##$TPNAME7= <>
##$TPOAL= (0..7)
0.5 0.5 0.5 0.5 0.5 0.5 0.5 0.5 
##$TPOFFS= (0..7)
0 0 0 0 0 0 0 0 
##$TUNHIN= 0
##$TUNHOUT= 0
##$TUNXOUT= 0
##$USERA1= <user>
##$USERA2= <user>
##$USERA3= <user>
##$USERA4= <user>
##$USERA5= <user>
##$V9= 5
##$VALIST= <valist>
##$VCLIST= <CCCCCCCCCCCCCCC>
##$VD= 0
##$VDLIST= <DDDDDDDDDDDDDDD>
##$VPLIST= <PPPPPPPPPPPPPPP>
##$VTLIST= <TTTTTTTTTTTTTTT>
##$WBST= 1024
##$WBSW= 4
##$XGAIN= (0..3)
0 0 0 0 
##$XL= 0
##$YL= 0
##$YMAX_a= 13248
##$YMIN_a= -15423
##$ZGOPTNS= <>
##$ZL1= 120
##$ZL2= 120
##$ZL3= 120
##$ZL4= 120
##$ABSF1= 182.463
##$ABSF2= -187.1042
##$ABSG= 5
##$ABSL= 3
##$ALPHA= 0
##$AQORDER= 0
##$ASSFAC= 0
##$ASSFACI= 0
##$ASSFACX= 0
##$ASSWID= 0
##$AUNMP= <proc_1d>
##$AZFE= 0.1
##$AZFW= 0.5
##$BCFW= 0
##$BC_mod= 2
##$BYTORDP= 0
##$COROFFS= 0
##$CY= -3
##$DATMOD= 1
##$DC= 0
##$DFILT= <>
##$DTYPP= 0
##$F1P= 0
##$F2P= 0
##$FCOR= 1
##$FTSIZE= 65536
##$FT_mod= 6
##$GAMMA= 0
##$GB= 0
##$INTBC= 1
##$INTSCL= 5.30512e-09
##$ISEN= 30
##$LB= 1
##$LEV0= 0
##$LPBIN= 0
##$MAXI= 10000
##$MC2= 0
##$MEAN= 0
##$ME_mod= 0
##$MI= 50
##$NCOEF= 0
##$NC_proc= -8
##$NLEV= 6
##$NOISF1= 182.463
##$NOISF2= 159.3651
##$NSP= 0
##$NTH_PI= 0
##$NZP= 0
##$OFFSET= 182.463
##$PC= 4
##$PHC0= -2607.207
##$PHC1= 182.7988
##$PH_mod= 1
##$PKNL= yes
##$PPARMOD= 0
##$PSCAL= 0
##$PSIGN= 0
##$REVERSE= no
##$SF= 81.0140089999434
##$SI= 65536
##$SIGF1= 159.3651
##$SIGF2= -187.1042
##$SINO= 113.3802
##$SIOLD= 16384
##$SREGLST= <1H.CDCl3>
##$SSB= 0
##$STSI= 65536
##$STSR= 0
##$SW_p= 29940.119760479
##$SYMM= 0
##$S_DEV= 0
##$TDeff= 32768
##$TDoff= 0
##$TI= <>
##$TILT= no
##$TM1= 0
##$TM2= 0
##$TOPLEV= 0
##$USERP1= <user>
##$USERP2= <user>
##$USERP3= <user>
##$USERP4= <user>
##$USERP5= <user>
##$WDW= 1
##$XDIM= 65536
##$YMAX_p= 308731179
##$YMIN_p= -234179941
$$ End of Bruker specific parameters
$$ ---------------------------------
##NTUPLES= NMR SPECTRUM
##VAR_NAME=  FREQUENCY,     SPECTRUM/REAL,   SPECTRUM/IMAG
##SYMBOL=    X,             R,               I
##VAR_TYPE=  INDEPENDENT,   DEPENDENT,       DEPENDENT
##VAR_FORM=  AFFN,          ASDF,            ASDF
##VAR_DIM=   65536,         65536,           65536
##UNITS=     HZ,            ARBITRARY UNITS, ARBITRARY UNITS
##FACTOR=    0.456856943014862, 1,           1
##FIRST=     14782.0589164792, 0,            0
##LAST=      -15158.0608439998, 0,           0
##MIN=       -15158.0608439998, -234179941,  0
##MAX=       14782.0589164792, 308731179,    0
$$ Real data points
##PAGE= N=1
##DATA TABLE= (X++(R..R)), XYDATA
$$ [...]
$$ plain form
38196 3494052 3881433 6244342 6796151 3680707 773210 494037 -160058 -2139214 -305134
38187 -305134 7487965 14230901 13379908 8345590 5033284 1247203 -7277316 -15436587
38179 -15436587 -14270791 -5357294 995829 999820 592012 3410193 5865851 5628663 5256115
38170 5256115 5055622 1753772 -2669277 -392632 9413689 16134078 12116761 3722147
38162 3722147 973324 2925672 1569156 -4567760 -9463869 -9717387 -7767014 -6079805
38154 -6079805 -4687493 -4062838 -4977511 -5742468 -4050004 -1021303 382660 -156379 -1051409
38145 -1051409 -2248541 -3934439 -3838220 -324287 3671294 4404250 3052360 2865619 3022122
38136 3022122 1135216 -419114 2320466 6846197 6986870 3247354 2176544 5045286
$$ packed form
38196C494052L87381K362909N51809l115444k907497k79173o54095j979156J834080
38187c05134P793099O742936q50993n034318l312306l786081q524519q159271
38179a5436587J165796Q913497O353123L991m07808K818181K455658k37188l72548
38170E256115k00493l301850m423049K276645R806321O720389m017317q394614
38162C722147k748823J952348j356516o136916m896109k53518J950373J687209
38154f079805J392312O24655r14673p64957J692464L028701J403963n39039q95030
38145a051409j197132j685898R6219L513933L995581P32956j351890j86741J56503
38136C022122j886906j554330K739580M525731J40673l739516j070810K868742
$$ plain form
38128 5045286 6037915 3569747 4146276 11098120 18057485 18911512 16471756 14954301 11309661
38119 11309661 2325012 -5645606 -4120582 3603243 6209279 936281 -3656710 -2330830
38111 -2330830 -556728 -3662484 -7248792 -4609768 2027142 4706475 1333932 -2486389
38103 -2486389 -2464704 -857084 -1826111 -5849601 -10469666 -13648037 -14462409 -12622223 -9388693
38094 -9388693 -7453011 -7628391 -6727690 -1428210 6122890 9675256 6487797 416057
38086 416057 -4119235 -7791820 -12865825 -16978156 -15410438 -8660307 -2503086 209679
38078 209679 2932742 8834433 15331173 18075389 16761924 13667377 9548568 4830607
38070 4830607 2291067 4050836 7381642 7957086 6351313 6661510 8987372 8510013 3311040
$$ packed form
38128E045286R92629k468168N76529O951844O959365Q54027k439756j517455l644640
38119A1309661q984649p970618J525024P723825K606036n272998m592991J325880
38111b330830J774102l105756l586308K639024O636910K679333l372543l820321
38103b486389K1685J607620r69027m023490m620065l178371q14372J840186L233530
38094i388693J935682j75380R00701N299480P551100L552366l187459o071740
38086D16057m535292l672585n074005m112331J567718O750131O157221K712765
38078B09679K723063N901691O496740K744216j313465l094547m118809m717961
38070D830607k539540J759769L330806N75444j605773L10197K325862m77359n198973
$$ plain form
38061 3311040 -1715823 -1482976 2324993 4282308 2888887 1463854 2315952 3701311
38053 3701311 3213970 1433715 575238 965620 713229 -1402475 -4209980 -5699096 -5224056
38044 -5224056 -3455728 -1025300 1570608 3052837 1752658 -2622002 -8254969 -12470371
38036 -12470371 -13567145 -12157784 -11287667 -13731396 -17543946 -16211572 -6554803 4781260
38028 4781260 7584984 1199189 -4057912 -649381 6574203 8425142 3887980 -1370097
38020 -1370097 -5319816 -10840234 -17748671 -21122350 -18849749 -14642125 -11429988 -7263035
38012 -7263035 -720613 4378296 3707890 -1151429 -4788464 -4470077 -1429060 2589055
38004 2589055 6717840 9671246 9913515 7418118 4119474 2939381 6364352 13843798
$$ packed form
38061C311040n026863K32847L807969J957315j393421j425033Q52098J385359
38053C701311m87341j780255q58477L90382k52391k115704k807505j489116M75040
38044e224056J768328K430428K595908J482229j300179m374660n632967m215402
38036a2470371j096774J409361Q70117k443729l812550J332374R656769J1336063
38028D781260K803724o385795n257101L408531P223584J850939m537162n258077
38020a370097l949719n520418o908437l373679K272601M207624L212137M166953
38012g263035O542422N098909o70406m859319l637035L18387L041017M018115
38004B589055M128785K953406K42269k495397l298644j180093L424971P479446
$$ plain form
37996 13843798 19802601 17292527 5995168 -5792354 -9957019 -7266328 -4069879 -2545166
37988 -2545166 846027 7593335 13251385 13397326 9666654 6888361 6508907 6003973 3735851
37979 3735851 1255474 482943 1045957 1710301 3064474 6839655 12341354 15177631 11402646
37970 11402646 3135037 -1820168 2143218 11392878 16081450 10922542 1130595 -3813544
37962 -3813544 -781135 5018410 8010410 8889610 11831691 17553244 22033449 21597454
37954 21597454 16713702 10256500 4001081 -1951493 -7320950 -10559665 -9840443 -5159743
37946 -5159743 413905 2407613 -955152 -6715176 -10529832 -11558104 -12339618 -14480739
37938 -14480739 -16958908 -18473390 -18473193 -15734443 -9625069 -3583660 -2910583 -7022049 -8406249
$$ packed form
37996A3843798N958803k510074j1297359j1787522m164665K690691L196449J524713
37988b545166L391193O747308N658050J45941l730672k778293l79454n04934k268122
37979C735851k480377p72531N63014O64344J354173L775181N501699K836277l774985
37970A1402646q267609m955205L963386R249660M688572n158908r791947m944139
37962c813544L032409N799545K992000Q79200K942081N721553M480205m35995
37954B1597454m883752o457202o255419n952574n369457l238715P19222M680700
37946e159743N573648J993708l362765n760024l814656j028272p81514k141121
37938a4480739k478169j514482J97K738750O109374O041409O73077m111466j384200
$$ plain form
37929 -8406249 -2501364 5768125 9556676 9797692 11458545 13809494 12231397 8115106
37921 8115106 8432668 14679411 20092779 19963838 17510746 16571379 15439004 12120250 9357736
37912 9357736 9112327 7496694 1512894 -3461061 -217110 8577227 12407719 6049574
37904 6049574 -5559470 -15514197 -21744973 -24312855 -21732450 -13579074 -3903389 1228379
37896 1228379 -690498 -6272587 -9021652 -5050636 2727287 7153993 5328027 2939918
37888 2939918 7131354 16322568 21430611 17498660 9800720 6512732 8687798 10513299
37880 10513299 7821283 2962332 594018 719878 -1766645 -9986926 -19408408 -21976267
37872 -21976267 -15743329 -7159488 -2801722 -2464719 -2607651 -2550216 -3047717 -1889542 3422478
$$ packed form
37929h406249N904885Q269489L788551K41016J660853K350949j578097m116291
37921H115106L17562O246743N413368j28941k453092r39367j132375l318754k762514
37912I357736k45409j615633n983800m973955L243951Q794337L830492o358145
37904F049574j1609044r954727o230776k567882K580405Q153376R675685N131768
37896A228379j918877n582089k749065L971016P777923M426706j825966k388109
37888B939918M191436R191214N108043l931951p697940l287988K175066J825501
37880A0513299k692016m858951k368314J25860k486523q220281r421482k567859
37872b1976267O232938Q583841M357766L37003j42932N7435m97501J158175N312020
$$ plain form
37863 3422478 9999671 12279470 10088550 8369011 8545401 6300535 -264047 -6264932
37855 -6264932 -7388108 -6828876 -10191984 -16485259 -19305678 -16038760 -11420573 -11154413
37847 -11154413 -14812820 -16630678 -12411400 -4395271 1227382 1114181 -2504485 -6299292
37839 -6299292 -10264138 -15196916 -18407974 -16457898 -11093078 -7429728 -6318925 -3946135
37831 -3946135 174660 863795 -4557057 -11231411 -13563225 -12568045 -12312999 -12725921 -10566257
37822 -10566257 -5242306 231361 2470250 -379500 -7144960 -12049802 -9123584 -1245568
37814 -1245568 773490 -7004783 -13697268 -7722218 6074438 12646846 6976309 -2246543
37806 -2246543 -7718132 -10673505 -11674207 -6442865 3931720 8861519 1991711 -8148289
$$ packed form
37863C422478O577193K279799k190920j719539J76390k244866o564582o000885
37855f264932j123176N59232l363108o293275k820419L266918M618187K66160
37847a1154413l658407j817858M219278Q016129N622653j13201l618666l794807
37839f299292l964846m932778l211058J950076N364820L663350J110803K372790
37831c946135M120795O89135n420852o674354k331814R95180K55046m12922K159664
37822a0566257N323951N473667K238889k849750o765460m904842K926218P878016
37814a245568K019058p778273o692485N975050J3796656O572408n670537r222852
37806b246543n471589k955373j000702N231342J0374585M929799o869808j0140000
$$ plain form
37798 -8148289 -9330357 -2282771 2159585 -882955 -5735265 -6451670 -3642543 30176
37790 30176 4669008 10738135 15817422 16642536 12927059 7715689 4385189 3416128 2142781
37781 2142781 -1224573 -3757623 -1018286 5433717 8326605 4787438 1106465 3161720
37773 3161720 7002762 5366788 -132488 -1402049 3160238 6633843 4829278 1292989
37765 1292989 -583709 -2351843 -4403559 -2868349 2909021 6683478 4504559 1387166
37757 1387166 2552562 3895078 -878223 -8164429 -8891399 -2646402 2291675 2450647
37749 2450647 2885819 6270420 8232010 6999033 8353247 15247493 20301415 16015749
37741 16015749 6640137 1732251 2084421 894206 -3497742 -5533167 -3053724 -922799
$$ packed form
37798h148289j182068P047586M442356l042540m852310p16405K809127L672719
37790C0176M638832O069127N079287Q25114l715477n211370l330500r69061j273347
37781B142781l367354k533050K739337O452003K892888l539167l680973K055255
37773C161720L841042j635974n499276j269561M562287L473605j804565l536289
37765A292989j876698j768134k051716J535210N777370L774457k178919l117393
37757A387166J165396J342516m773301p286206p26970O244997M938077J58972
37749B450647M35172L384601J961590j232977J354214O894246N053922m285666
37741A6015749r375612m907886L52170j190215m391948k035425K479443K130925
$$ plain form
37733 -922799 -1919322 -1862741 2682578 8333917 10759531 11346824 13395610 15877060 15697842
37724 15697842 12819599 8722787 3075881 -3452342 -6472215 -3472963 671672 -166931
37716 -166931 -4064949 -4499235 -1154751 484050 -531225 606519 4661635 6433358
37708 6433358 4717781 4682831 6707270 3171082 -7382785 -13229898 -6267278 2838394
37700 2838394 -1103537 -14218737 -18728103 -9370601 651872 1518089 -550646 2253472
37692 2253472 5582713 2201011 -4983376 -8724485 -9263811 -11184958 -13776105 -13239254
37684 -13239254 -10338657 -7855230 -4512902 543492 1708182 -5193985 -12655339 -9983622
37676 -9983622 -124517 3561858 -2695717 -8231397 -5348945 14465 -292641 -4740121
$$ packed form
37733i22799r96523N6581M545319N651339K425614N87293K048786K481450j79218
37724A5697842k878243m096812n646906o528223l019873K999252M144635q38603
37716a66931l898018m34286L344484J638801j015275J137744M055116J771723
37708F433358j715577l4950K024439l536188j0553867n847113O962620R105672
37700B838394l941931j3115200m509366R357502J0022473Q66217k068735K804118
37692B253472L329241l381702p184387l741109n39326j921147k591147N36851
37684a3239254K900597K483427L342328N056394J164690o902167p461354K671717
37676i983622R859105L686375o257575n535680K882452N363410l07106m447480
$$ plain form
37668 -4740121 -8058919 -10809934 -15616709 -19874551 -19462829 -15529390 -11613581 -8079549
37660 -8079549 -4858335 -5149539 -10149346 -14140728 -11455362 -4853593 -303615 2942463
37652 2942463 9138719 15646207 14929895 6648405 -725696 -1531233 982256 1411816 -1780932
37643 -1780932 -8503528 -18316624 -27029172 -28457302 -22688797 -16883109 -14879093 -12260973
37635 -12260973 -5820587 -1346716 -5334181 -13332540 -14288673 -5017141 6374257 11405823
37627 11405823 9688241 5543834 1546552 -1826904 -3466160 -2007215 1719053 4650238
37619 4650238 4324393 1340610 -1148334 -571413 2443093 5089374 5956855 6500289 8571238
37610 8571238 11634144 13183741 11266785 6345346 1415386 -126751 1748098 2685578
$$ packed form
37668d740121l318798k751015m806775m257842M11722L933439L915809L534032
37660h079549L221214k91204m999807l991382K685366O601769M549978L246078
37652B942463O196256O507488p16312q281490p374101q05537K513489M29560l192748
37643a780932o722596r813096q712548j428130N768505N805688K004016K618120
37635a2260973O440386M473871l987465p998359r56133R271532J1391398N031566
37627A1405823j717582m144407l997282l373456j639256J458945L726268K931185
37619D650238l25845k983783k488944N76921L014506K646281Q67481N43434K070949
37610H571238L062906J549597j916956m921439m929960j542137J874849R37480
$$ plain form
37602 2685578 -758219 -5181866 -3521245 4946655 12149248 11292753 5506725 2827176
37594 2827176 5778990 10399919 13232402 14157160 13499666 11440358 9805062 9443398 6280913
37585 6280913 -3997266 -16643722 -20118634 -10658603 1596719 5598788 3100036 3135838
37577 3135838 7051232 7497123 1265652 -5669676 -7933124 -7877451 -8819868 -7616881 -424586
37568 -424586 7987627 8090930 -1975201 -14009994 -20164181 -20238790 -17665168 -14013125
37560 -14013125 -10157005 -8085908 -7995466 -7240315 -5583935 -7624822 -15588714 -23224593
37552 -23224593 -22610913 -14825989 -7699143 -4390887 -1303465 2608685 2343406 -4576640
37544 -4576640 -12561165 -15108251 -12737387 -9751324 -7375257 -4736154 -3235656 -4853196
$$ packed form
37602B685578l443797m423647J660621Q467900P202593q56495n786028k679549
37594B827176K951814M620929K832483R24758o57494k059308j635296l61664l162485
37585F280913j0278179j2646456l474912R460031J2255322M002069k498752L5802
37577C135838L915394M45891o231471o935328k263448N5673r42417J202987P192295
37568d24586Q412213J03303j0066131j2034793o154187p4609K573622L652043
37560a4013125L856120K071097R0442P55151J656380k040887p963892p635879
37552b3224593O13680P784924P126846L308256L087422L912150k65279o920046
37544d576640p984525k547086K370864K986063K376067K639103J500498j617540
$$ plain form
37536 -4853196 -8123842 -10149246 -10828786 -11177759 -9592005 -4260891 2455522 6688863
37528 6688863 8529566 9983490 9239943 3160876 -5183797 -8505934 -5918926 -4631120
37520 -4631120 -8413250 -11109500 -6339837 1762301 3979497 -757595 -4441178 -1931038
37512 -1931038 2302768 1204891 -5414151 -11276231 -11158534 -5406660 1823810 6321125
37504 6321125 6122070 2549023 -122170 2111965 8219109 11506859 6163935 -5362687
37496 -5362687 -13840793 -13043413 -5977279 -110206 1068796 -687266 -3180560 -5745540
37488 -5745540 -6911606 -4178720 2576144 9999056 14700957 15842033 13518860 7001885
37480 7001885 -3401278 -13738185 -17824579 -12513472 -1849137 5163739 3305946 -2040978
$$ packed form
37536d853196l270646k025404o79540l48973J585754N331114O716413M233341
37528F688863J840703J453924p43547o079067q344673l322137K587008J287806
37520d631120l782130k696250M769663Q102138K217196m737092l683583K510140
37512a931038M233806j097877o619042n862080J17697N751874P230470M497315
37504F321125j99055l573047k671193K234135O107144L287750n342924j1526622
37496e362687q478106P97380P066134N867073J179002j756062k493294k564980
37488e745540j166066K732886O754864P422912M701901J141076k323173o516975
37480G001885j0403163j0336907m086394N311107J0664335P012876j857793n346924
$$ plain form
37472 -2040978 -173922 11068570 20920452 19280497 10731054 8137807 14244425 18282429
37464 18282429 12113266 1300828 -3848038 -1477383 2793284 4784202 3898546 224820
37456 224820 -4553766 -6039077 -2533654 609264 -2314078 -8141543 -8472657 -1652013
37448 -1652013 5194313 6462571 4431322 3887410 5724822 8300264 10947068 13237798
37440 13237798 13564152 10966836 6465188 891650 -6523553 -15565349 -22682735 -23353718
37432 -23353718 -16691827 -7082087 -1143996 -2023506 -5683530 -4483088 3558520 11030760
37424 11030760 9826491 1639016 -4755133 -5369589 -4316189 -5336681 -6888317 -7560549
37416 -7560549 -9489306 -12563711 -11453211 -3820493 3558849 3429223 -883072 -357580
$$ packed form
37472b040978J867056J1242492R851882j639955q549443k593247O106618M038004
37464A8282429o169163j0812438n148866K370655M270667J990918q85656l673726
37456B24820m778586j485311L505423L142918k923342n827465l31114O820644
37448a652013O846326J268258k031249n43912J837412K575442K646804K290730
37440A3237798L26354k597316m501648n573538p415203r041796p117386o70983
37432b3353718O661891R609740N938091q79510l660024J200442Q041608P472240
37424A1030760j204269q187475o394149o14456J053400j020492j551636o72232
37416g560549j928757l074405J110500P632718P379342j29626m312295N25492
$$ plain form
37408 -357580 6033378 10542271 9203028 7007924 8582805 10850438 8725183 2803007
37400 2803007 -2809592 -6344038 -7893580 -6476308 -2176034 1253388 776969 -553280
37392 -553280 2266063 7495065 7875226 1480017 -4359623 -2937218 2598805 4350067
37384 4350067 1001798 -1496289 296556 2744784 1911419 -177369 344756 2169158
37376 2169158 685664 -4422145 -8253706 -7641050 -4576198 -1350652 3322876 10346800
37368 10346800 15917744 15562055 10788067 7251600 6859139 6176441 3095199 448979
37360 448979 1082540 3171221 3320114 1598848 392738 137659 -738935 -2951994 -6244773
37351 -6244773 -10785314 -15556407 -16626598 -11085606 -2685299 399307 -5465814 -15551145
$$ packed form
37408c57580O390958M508893j339243k195104J574881K267633k125255n922176
37400B803007n612599l534446j549542J417272M300274L429422m76419j330249
37392e53280K819343N229002L80161o395209n839640J422405N536023J751262
37384D350067l348269k498087J792845K448228q33365k088788N22125J824402
37376B169158j483494n107809l831561O12656L064852L225546M673528P023924
37368A0346800N570944l55689m773988l536467l92461o82698l081242k646220
37360D48979O33561K088681J48893j721266j206110k55079q76594k213059l292779
37351f244773m540541m771093j070191N540992Q400307L084606n865121j0085331
$$ plain form
37343 -15551145 -22609705 -23392114 -18462082 -9480759 642535 7605321 8983393 6724595
37335 6724595 4521127 3861708 3946056 3546261 1310281 -3517247 -8618984 -9371894 -4771167
37326 -4771167 43917 678345 254315 4452177 11565942 13636195 7801282 677950
37318 677950 -417392 4191479 9292622 11584020 10846722 8069461 5887391 7996280
37310 7996280 14333224 18803320 15564523 6462044 -1132129 -3059475 -1583753 -118960
37302 -118960 1673204 6081912 12625654 17075897 15474136 8757104 2618039 1838321
37294 1838321 5271613 8004544 7772028 6268656 4049312 -1501187 -10666635 -17436377
37286 -17436377 -15131417 -4755239 5466812 8421043 3969136 -2444151 -4927914 -1740874
$$ packed form
37343a5551145p058560p82409M930032Q981323J0123294O962786J378072k258798
37335F724595k203468o59419Q4348l99795k235980m827528n101737p52910M600727
37326d771167M815084O34428m24030M197862P113765K070253n834913p123332
37318F77950j095342M608871N101143K291398p37298k777261k182070K108889
37310G996280O336944M470096l238797r102479p594173j927346J475722J464793
37302a18960J792164M408708O543742M450243j601761o717032o139065p79718
37294A838321L433292K732931k32516j503372k219344n550499r165448o769742
37286a7436377K304960J0376178J0222051K954231m451907o413287k483763L187040
$$ plain form
37278 -1740874 3596180 6597992 7614270 10732489 16121756 17877908 12369942 4394231
37270 4394231 654112 889517 841927 664461 3582081 8048836 8491324 3678340 -1951977
37261 -1951977 -5161744 -5951901 -3261671 4158434 12246585 14564082 11672702 9688551
37253 9688551 8511361 1427715 -10367736 -14034604 -2972762 11094880 13506242 6787006
37245 6787006 4189293 8167587 8279768 -449999 -9634627 -10913697 -7493509 -7495121 -12200046
37236 -12200046 -15649297 -12230870 -1623487 10883598 17337300 13631376 4480022 -1022092
37228 -1022092 717208 5742787 10026912 13736282 17059611 17543725 14348834 10509319
37220 10509319 7895647 4069482 -2512892 -8058153 -8215385 -4315279 -754836 1486568
$$ packed form
37278a740874N337054L001812J016278L118219N389267J756152n507966p975711
37270D394231l740119K35405m7590j77466K917620M466755M42488m812984n630317
37261a951977l209767p90157K690230P420105Q088151K317497k891380j984151
37253I688551j177190p083646j1795451l666868J1061842J4067642K411362o719236
37245F787006k597713L978294J12181q729767r184628j279070L420188j612m704925
37236a2200046l449251L418427J0607383J2507085O453702l705924r151354n502114
37228a022092J739300N025579M284125L709370L323329M84114l194891l839515
37220A0509319k613672l826165o582374n545261j57232L900106L560443K241404
$$ plain form
37212 1486568 4563683 8776844 12185911 14409670 16890703 19455236 19918017 17487378
37204 17487378 14016408 11395714 9555542 7398260 4494975 1831644 1300845 3340910
37196 3340910 4678383 989341 -6531236 -10356566 -5631277 2681167 6112059 4133979
37188 4133979 3507853 6906219 9292876 7552507 6713216 11785632 18539989 18827649 12371380
37179 12371380 6527089 5100461 4175943 324863 -3227016 -1929532 2964614 6597479
37171 6597479 7147165 6522127 6278010 6523145 7811040 10703064 13919836 15696753 16336926
37162 16336926 16927164 16836767 15574846 15379102 17663952 18498559 13454567 6326525 5753929
37153 5753929 11969812 15039714 9809355 4285147 6811025 12298570 10373398 2235300
$$ packed form
37212A486568L077115M213161L409067K223759K481033K564533M62781k430639
37204A7487378l470970k620694j840172k157282k903285k663331n30799K040065
37196C340910J337473l689042p520577l825330M725289Q312444L430892j978080
37188D133979o26126L398366K386657j740369q39291N072416O754357K87660o456269
37179A2371380n844291j426628r24518l851080l551879J297484M894146L632865
37171F597479N49686o25038k44117K45135J287895K892024L216772J776917O40173
37162A6336926N90238r0397j261921j95744K284850Q34607n043992p128042n72596
37153E753929O215883L069902n230359n524208K525878N487545j925172q138098
$$ plain form
37145 2235300 -1480755 2262424 5231981 2274467 -1207036 352907 3758131 3692939
37137 3692939 1418685 1214140 3278956 5432451 7515578 9078845 6793164 -406980
37129 -406980 -6887092 -6376492 96215 6983510 11771536 14458780 12813220 5076930
37121 5076930 -4130525 -7480679 -4372488 -863162 -385150 -506259 853631 2249699
37113 2249699 2941194 4387747 5731642 3438455 -2064178 -4701074 -1099196 3726502
37105 3726502 2815277 -3896307 -10687009 -13185599 -10965253 -5528264 550126 3970082
37097 3970082 3400040 919023 -1234195 -3512701 -6386338 -7213306 -3308544 3199518
37089 3199518 7197305 6910515 5349223 5446190 6566369 6585128 5453157 5387132 7744881
$$ packed form
37145B235300l716055L743179K969557k957514l481503J559943L405224o5192
37137C692939k274254k04545K064816K153495K083127J563267k285681p200144
37129d06980o480112N10600O472707O887295M788026K687244j645560p736290
37121E076930r207455l350154L108191L509326M78012j21109J359890J396068
37113B249699O91495J446553J343895k293187n502633k636896L601878M825698
37105C726502r11225o711584o790702k498590K220346N436989O078390L419956
37097C970082n70042k481017k153218k278506k873637q26968L904762O508062
37089C199518L997787k86790j561292R6967J120179J8759j131971o6025K357749
$$ plain form
37080 7744881 10159191 7886624 -337646 -8554712 -9036688 -2092658 3570327 2111804
37072 2111804 -2292684 -2928191 -528096 -166120 -1501788 571953 6440706 10209713
37064 10209713 8612481 5076907 3117731 1613730 -872560 -2721389 -3386751 -5572245
37056 -5572245 -9383593 -9378884 -2318005 6620600 10957000 12118363 14730881 16138578 9395008
37047 9395008 -4053369 -13608184 -13170991 -7936353 -5041520 -4807216 -5041097 -6900645
37039 -6900645 -10726760 -11707558 -6601101 -936694 -2402492 -9600849 -14485728 -14185864
37031 -14185864 -12793374 -12157713 -9229681 -3700150 -249347 -557801 -461776 1473054 82291
37022 82291 -6462211 -9947497 -3040206 8000716 10469581 2815875 -3793310 -1500220
$$ packed form
37080G744881K414310k272567q224270q217066m81976O944030N662985j458523
37072B111804m404488o35507K400095L61976j335668K073741N868753L769007
37064A0209713j597232l535574j959176j504001k486290j848829o65362k185494
37056e572245l811348M709P060879Q938605M336400J161363K612518J407697o743570
37047I395008j3448377r554815M37193N234638K894833K34304k33881j859548
37039f900645l826115r80798N106457N664407j465798p198357m884879K99864
37031a4185864J392490O35661K928032N529531L450803l08454R6025J934830j390763
37022H2291o544502l485286O907291J1040922K468865p653706o609185K293090
$$ plain form
37014 -1500220 4859615 6349225 1245969 -5198460 -7495177 -3698216 3786790 9042836
37006 9042836 7645494 2314469 24680 2525873 4359897 1860541 -1412952 -1368565
36998 -1368565 -175112 -1687639 -4314289 -4067042 -1992464 -2740868 -6959310 -10278081
36990 -10278081 -9425481 -5003447 1295331 7803546 11307963 8900056 2453866 -2194679
36982 -2194679 -1793623 1038343 1880107 -179472 -1977774 227292 6609433 12360596
36974 12360596 11886426 5692609 664045 1356314 4209805 3828460 1292766 818664 1231428
36965 1231428 -2024345 -7802806 -10108935 -8156818 -7507382 -9899260 -10394049 -7389387
36957 -7389387 -6803778 -11614609 -15367375 -12549375 -8245530 -9360288 -12028785 -7562310
$$ packed form
37014a500220O359835J489610n103256o444429k296717L796961P485006N256046
37006I042836j397342n331025k289789K501193J834024k499356l273493M4387
36998a368565J193453j512527k626650K47247K074578p48404m218442l318771
36990a0278081Q52600M422034O298778O508215L504417k407907o446190m648545
36982b194679M01056K831966Q41764k059579j798302K205066O382141N751163
36974A2360596m74170o193817n028564O92269K853491l81345k535694m74102M12764
36965A231428l255773n778461k306129J952117O49436k391878m94789L004662
36957g389387N85609m810831l752766K818000M303845j114758k668497M466475
$$ plain form
36949 -7562310 2460903 7541474 4043631 -326477 622727 3259166 2223550 -672831
36941 -672831 -860959 866931 485582 -1771988 -1449964 3366206 9489929 13062366 13418322
36932 13418322 11742586 8352427 3108299 -2546336 -6039689 -6569134 -6071009 -6467664
36924 -6467664 -7514867 -8823392 -11782887 -16095108 -16078003 -5929064 10733323 22373278
36916 22373278 22882668 18002045 15396997 14521837 11488213 8006520 7700053 7526388 1948889
36907 1948889 -6028417 -7237403 -66737 6872708 7476379 5457436 6085182 8014536
36899 8014536 7564375 5368401 4209908 4280745 4235741 3581397 1574057 -2291361 -4652118
36890 -4652118 -178968 9957174 16650188 13695767 5507271 93648 -1074097 -1658148
$$ packed form
36949g562310J0023213N080571l497843m370108R49204K636439j035616k896381
36941f72831j88128J727890l81349k257570L22024M816170O123723L572437L55956
36932A3418322j675736l390159n244128n654635l493353n29445M98125l96655
36924f467664j047203j308525k959495m312221J7105J0148939J6662387J1639955
36916B2373278N09390m880623k605048q75160l033624l481693l06467j73665n577499
36907A948889p977306j208986P170666O939445O03671k018943O27746J929354
36899H014536m50161k195974j158493P0837m5004o54344k007340l865418k360757
36890d652118M473150J0136142O693014k954421q188496n413623j167745n84051
$$ plain form
36882 -1658148 -3235395 -4792108 -6192252 -6985919 -4326890 3148816 11590447 16194308
36874 16194308 16609376 14349815 8671102 187743 -5104645 -2068356 5373634 8553863
36866 8553863 5082235 -402906 -4805139 -8967518 -11902118 -9579814 -976431 9464009
36858 9464009 16358396 16973925 11390879 3620333 1071686 7246725 15893422 18176919
36850 18176919 14322325 11370739 10913566 8092080 3145059 3647819 11731676 18281455
36842 18281455 15398675 7329314 2847091 2801341 1945890 -1395999 -4265506 -4690569 -2662538
36833 -2662538 1833775 6698775 6738561 393663 -5382943 -3068790 4896941 10060124
36825 10060124 10595943 12255590 16670407 17041524 8640855 -2851500 -8312123 -6453539
$$ packed form
36882a658148j577247j556713j400144p93667K659029P475706Q441631M603861
36874A6194308M15068k259561n678713q483359n292388L036289P441990L180229
36866H553863l471628n485141m402233m162379k934600K322304Q603383J0440440
36858I464009O894387O15529n583046p770546k548647O175039Q646697K283497
36850A8176919l854594k951586m57173k821486m947021N02760Q083857O549779
36842A8281455k882780q069361m482223m5750q55451l341889k869507m25063K028031
36833b662538M496313M865000L9786o344898n776606K314153P965731N163183
36825A0060124N35819J659647M414817L71117q400669j1492355n460623J858584
$$ plain form
36817 -6453539 -3049677 -1156601 2214687 9125873 15275271 14914587 9253333 5960996
36809 5960996 9651389 16189122 18643179 16208917 13548281 12814007 11179583 6668214
36801 6668214 1708375 -861633 -1271482 -23182 4453507 12051291 18032364 17791346
36793 17791346 12704349 7708177 4716662 2223087 308632 1723483 7405525 14141744
36785 14141744 18118188 19210076 20551030 24181230 27721169 26267001 18457245 9377191
36777 9377191 4960230 4379289 1818673 -4179436 -8035181 -5331575 1283566 7167120
36769 7167120 12056225 17896524 24594174 31867700 40987076 49986378 51637909 42386613
36761 42386613 29813893 24271607 25592493 25464776 21102385 17996838 19010823 19386608
$$ packed form
36817f453539L403862J893076L371288O911186O149398l60684n661254l292337
36809E960996L690393O537733K454057k434262k660636p34274j634424m511369
36801F668214m959839k570008m09849J248300M476689P597784N981073k41018
36793A7791346n086997m996172k991515k493575j914455J414851N682042O736219
36785A4141744L976444J091888J340954L630200L539939j454168p809756r080054
36777I377191m416961n80941k560616n998109l855745K703606O615141N883554
36769G167120M889105N840299O697650P273526R119376Q999302J651531r251296
36761D2386613j2572720n542286J320886j27717m362391l105547J013985L75785
$$ plain form
36753 19386608 15021978 8700716 4819228 3303804 1889594 12353 -2310533 -5494914
36745 -5494914 -7860255 -5946425 188145 5527072 6307548 4417903 3554854 4430366 6017226
36736 6017226 8147258 10266853 10451650 8069524 4980650 2365566 -652264 -3445042
36728 -3445042 -2570214 3145308 9163162 10051822 5794990 831271 -1205910 408315
36720 408315 4379550 7799097 7419175 3006841 -1678119 -2858557 -456060 2956544
36712 2956544 4827065 3484454 -822160 -4360487 -2213677 6110908 15572484 20942055
36704 20942055 20504295 14420204 4163658 -5169345 -7605827 -4237867 -3289907 -8967310
36696 -8967310 -15742161 -17858196 -18186606 -21188878 -22757743 -15941154 -3562211 4444397
$$ packed form
36753A9386608m364630o321262l881488j515424j414210j877241k322886l184381
36745e494914k365341J913830O134570N338927P80476j889645q63049Q75512J586860
36736F017226K130032K119595J84797k382126l088874k615084l017830k792778
36728c445042Q74828N715522O017854Q88660m256832m963719k037181J614225
36720D08315L971235L419547l79922m412334m684960j180438K402497L412604
36712B956544J870521j342611m306614l538327K146810Q324585R461576N369571
36704B0942055m37760o084091j0256546r333003k436482L367960R47960n677403
36696h967310o774851k116035l28410l002272j568865O816589J2378943Q006608
$$ plain form
36688 4444397 5407155 6347979 11214458 14716420 11968660 6726682 5465472 8595688
36680 8595688 12095351 13917335 14411524 13221011 9923280 6262121 4666454 5563010
36672 5563010 8024821 11442155 14707149 15528066 12601240 7204061 1384793 -3542517
36664 -3542517 -5612131 -2413418 4748147 9654872 7809870 2468915 5803 637630
36656 637630 -945739 -5544758 -6432725 248466 7333048 5020040 -4988840 -10844137
36648 -10844137 -6395391 1435555 3986142 2855141 4857767 9871222 11541291 8139983
36640 8139983 4637737 3785830 2872049 841212 854023 2716701 434613 -7797358 -14008512
36631 -14008512 -11239974 -4284850 -2244752 -4888653 -4987718 -1302746 287284 -1889253
$$ packed form
36688D444397R62758R40824M866479L501962k747760n241978j261210L130216
36680H595688L499663J821984M94189j190513l297731l661159j595667Q96556
36672E563010K461811L417334L264994Q20917k926826n397179n819268m927310
36664c542517k069614L198713P161565M906725j845002n340955k463112O31827
36656F37630j583369m599019q87967O681191P084582k313008j0008880n855297
36648a0844137M448746P830946K550587j131001K002626N013455J670069l401308
36640H139983l502246q51907r13781k030837J2811J862678k282088q231971o211154
36631a4008512K768538O955124K040098k643901r9065L684972J590030k176537
$$ plain form
36623 -1889253 -2077348 3025345 8818061 9965811 6899195 2405780 -2779881 -7807596
36615 -7807596 -9779972 -7594288 -4562968 -4271972 -6159192 -7143202 -5340865 -893407
36607 -893407 4351400 7075728 5321246 1967362 2351145 7493227 12543950 12562343 7118741
36598 7118741 -557875 -5626319 -3776231 4061038 10093264 8451341 4567319 8285095
36590 8285095 17900318 20852640 12590347 3958963 4352411 7910681 5109956 -629440
36582 -629440 704028 8203349 11202215 5954175 -393216 -2851762 -5066760 -10295800
36574 -10295800 -14865213 -14766331 -12381966 -12347757 -14959545 -17147778 -16926669 -14275811 -9997001
36565 -9997001 -5597518 -2601814 -1099683 -282979 174914 1100011 4375783 9448187 11484393
$$ packed form
36623a889253j88095N102693N792716J147750l066616m493415n185661n027715
36615g807596j972376K185684L031320K90996j887220r84010J802337M447458
36607h93407N244807K724328j754482l353884L83783N142082N050723J8393n443602
36598G118741p676616n068444J850088P837269O032226j641923l884022L717776
36590H285095R615223K952322q262293q631384L93448L558270k800725n739396
36582f29440J333468P499321K998866n248040o347391k458546k214998n229040
36574a0295800m569413R8882K384365L4209k611788k188233K21109K650858M278810
36565i997001M399483K995704J502131Q16704M57893R25097L275772N072404K036206
$$ plain form
36556 11484393 7464092 2180135 2633847 7804886 10430367 8313827 6387215 6774529
36548 6774529 4875850 -1892926 -8851607 -11572351 -12198992 -13563113 -12902728 -7253037
36540 -7253037 -394474 2040334 1223670 2614249 6938839 9747889 8692269 5526166
36532 5526166 1557947 -3248472 -6560459 -4670071 1429024 5677067 4864169 3275212
36524 3275212 6723403 14443739 20028596 19498468 15584126 13307241 13240264 11364295 5738079
36515 5738079 673213 1556892 6639746 8045772 2094174 -5117760 -5158889 2246336 9401419
36506 9401419 9837401 4091684 -3076872 -8084939 -10468645 -11303295 -10839763 -8030329 -2996456
36497 -2996456 848107 -230837 -4801473 -7021800 -4255134 -354849 892052 1620734
$$ packed form
36556A1484393m020301n283957M53712N171039K625481k116540j926612L87314
36548F774529j898679o768776o958681k720744o26641j364121O60385N649691
36540g253037O858563K434808q16664J390579M324590K809050j055620l166103
36532E526166l968219m806419l311987J890388O099095M248043q12898j588957
36524C275212L448191P720336N584857n30128l914342k276885o6977j875969n626216
36515E738079n064866Q83679N082854J406026n951598p211934m1129P405225P155083
36506I401419M35982n745717p168556n008067k383706q34650M63532K809434N033873
36497b996456L844563j078944m570636k220327K766666L900285J246901P28682
$$ plain form
36489 1620734 5450200 10571266 12031330 8606139 2557582 -5335297 -14901809 -22177534
36481 -22177534 -22224412 -16362738 -10756535 -7554011 -3641445 1017443 1017412 -5583694 -12343174
36472 -12343174 -12709597 -8366347 -4887469 -3325295 -1143848 1760914 3366425 3806886
36464 3806886 4342694 3448193 -1249420 -7899217 -11884490 -12143591 -11751605 -12001957 -10205612
36455 -10205612 -4596030 2124587 6064921 6751066 6778544 8204029 10482683 11283347 8865748
36446 8865748 4082873 -381961 -3515089 -7608369 -14701417 -22263340 -24883278 -20575587
36438 -20575587 -13651051 -10663547 -14094301 -19743726 -19948692 -10769697 2799686 10367149
36430 10367149 6579095 -3645660 -12082389 -16595988 -20140075 -23273713 -23593981 -21944651
$$ packed form
36489A620734L829466N121066J460064l425191o048557p892879r566512p275725
36481b2177534m6878N861674N606203L202524L912566M658888l1o601106o759480
36472a2343174l66423M343250L478878J562174K181447K904762J605511M40461
36464C806886N35808q94501m697613o649797l985273k59101L91986k50352J796345
36455a0205612N609582O720617L940334O86145K7478J425485K278654Q00664k417599
36446H865748m782875m464834l133128m093280p093048p561923k619938M307691
36438b0575587O924536K987504l430754n649425k04966R178995J3569383P567463
36430A0367149l788054j0224755q436729m513599l544087l133638l20268J649330
$$ plain form
36422 -21944651 -22599479 -25545760 -24406084 -15413804 -4104354 958353 -1742432 -6539883
36414 -6539883 -8101203 -5226996 1003041 8461283 13631431 13794091 10464089 8495685
36406 8495685 11057062 16545581 20276692 18316229 10642969 2063207 -879535 4282748
36398 4282748 13517571 20649086 22985362 21395137 16834315 9661755 1563909 -4799554
36390 -4799554 -8242533 -9169519 -7607875 -3422261 1633572 4512240 3995046 1543357
36382 1543357 -918015 -2294526 -1868224 -30637 659681 -1943556 -5500377 -4830060 1120884
36373 1120884 6946042 7482980 4374144 3175785 5592452 7923766 6938964 4155348
36365 4155348 3227104 5181180 7835776 8827524 7472829 4044959 -615162 -3824923
$$ packed form
36422b1944651o54828k946281J139676Q992280J1309450N062707k700785m797451
36414f539883j561320K874207O230037P458242N170148J62660l330002j968404
36406H495685K561377N488519L731111j960463p673260q579762k942742N162283
36398D282748R234823P131515K336276j590225m560822p172560q097846o363463
36390d799554l442979r26986J561644M185614N055833K878668n17194k451689
36382A543357k461372j376511M26302J837587O90318k603237l556821O70317N950944
36373A120884N825158N36938l108836j198359K416667K331314r84802k783616
36365D155348r28244J954076K654596R91748j354695l427870m660121l209761
$$ plain form
36357 -3824923 -1403198 7982792 19055298 23533147 18874944 11198850 7783406 8979262
36349 8979262 10184087 9558601 9397096 10366846 9248664 4045967 -2175623 -4723259 -2145633
36340 -2145633 4026213 11723627 18170860 19692881 15075798 8264143 4889737 6319612
36332 6319612 9186323 10221009 9034510 6164894 1251293 -5329007 -10502348 -10089546
36324 -10089546 -2752189 7954267 15648367 15646355 8125576 -2588271 -11355924 -14860178
36316 -14860178 -12327624 -5577663 1514420 5359240 5313200 3169467 201061 -3332861
36308 -3332861 -5606871 -3280482 3916817 10963814 12525455 8815248 4261493 1884640
36300 1884640 1702217 3185426 5609048 6521878 3888436 288008 1182243 7568370 13571673
$$ packed form
36357c824923K421725R385990J1072506M477849m658203p676094l415444J195856
36349H979262J204825o25486j61505R69750j118182n202697o221590k547636K577626
36340b145633O171846P697414O447233J522021m617083o811655l374406J429875
36332F319612K866711J034686j186499k869616m913601o580300n173341M12802
36324a0089546P337357J0706456P694100k012p520779j0713847q767653l504254
36316a4860178K532554O749961P092083L844820m6040k143733k968406l533922
36308c332861k274010K326389P197299P046997J561641l710207m553755k376853
36300A884640j82423J483209K423622R12830k633442l600428Q94235O386127O003303
$$ plain form
36291 13571673 13253761 7184668 274508 -4346309 -6759805 -7822761 -8485343 -10250178
36283 -10250178 -13177595 -14205918 -10622215 -4896816 -2721967 -5708708 -9019382 -7297957
36275 -7297957 -426220 7760407 13986351 17139462 17473973 16149274 14245071 11097340
36267 11097340 5536713 -134211 -523416 5825127 12563133 12500876 6629734 2148384
36259 2148384 2946253 6660569 10187996 12675091 13020243 10232897 7322423 8950401
36251 8950401 13480126 13613145 7620109 3197870 5937300 10735458 10682076 8191008 9390538
36242 9390538 12588694 11989099 9657753 12908518 20433814 22077608 14426313 6741634
36234 6741634 7643075 14140389 18210042 17088828 12367904 5271115 -1964466 -5167153
$$ packed form
36291A3571673l17912o069093o910160m620817k413496j062956o62582j764835
36283a0250178k927417j028323L583703N725399K174849k986741l310674J721425
36275g297957O871737Q186627O225944L153111L34511j324699j904203l147731
36267A1097340n560627n670924l89205O348543O738006o2257n871142m481350
36259B148384P97869L714316L527427K487095L45152k787346k910474J627978
36251H950401M529725J33019n993036m422239K739430M798158n3382k491068J199530
36242I390538L198156n99595k331346L250765P525296J643794p651295p684679
36234F741634R01441O497314M069653j121214m720924p096789p235581l202687
$$ plain form
36226 -5167153 -3604804 -2036795 -3502347 -4674726 -2005630 2803110 7360634 12575838
36218 12575838 17313768 15753143 6770163 23119 4499965 15309843 20306145 16541569
36210 16541569 11416333 9838651 9434139 7781158 5750320 3148183 -1518738 -6273947
36202 -6273947 -7248055 -5277955 -4545818 -4850169 -2221968 2714512 4587345 2428492 1507923
36193 1507923 4349078 6945056 5955897 3047868 59493 -3463490 -5724147 -2653102
36185 -2653102 4602409 8732299 6084987 1297449 -893475 -1705491 -2462977 107150
36177 107150 7365435 13744980 14456068 13256036 16132573 21254316 21908770 16816943 11215975
36168 11215975 9014891 9037632 8312345 5308828 866761 -1564478 1282942 7211219
$$ packed form
36226e167153J562349J568009j465552j172379K669096M808740M557524N215204
36218A2575838M737930j560625q982980o747044M476846J0809878M996302l764576
36210A6541569n125236j577682m04512j652981k030838k602137m666921m755209
36202f273947r74108J970100P32137l04351K628201M936480J872833k158853r20569
36193A507923K841155K595978r89159k908029k988375l522983k260657L071045
36185b653102P255511M129890k647312m787538k190924q12016p57486K570127
36177A07150P258285O379545P11088j200032K876537N121743O54454n091827n600968
36168A1215975k201084K2741p25287l003517m442067k431239K847420N928277
$$ plain form
36160 7211219 9409232 5542044 2068842 5480141 12952717 16596773 13989252 9247238
36152 9247238 5864994 3854666 2818738 2991034 3438384 2713072 1058362 -79863 503136
36143 503136 4013609 10520664 16254218 16289854 12019460 10683142 14436477 16204879 11061795
36134 11061795 4817563 4382183 6006293 2217926 -4418116 -5145337 -65064 1694923
36126 1694923 -3291676 -8017128 -6432839 -804649 4146086 6635789 5574167 419551
36118 419551 -4739574 -4037464 1355076 4303332 3212191 4496630 10987035 16370465
36110 16370465 15604133 13133618 14995560 19166149 20189640 18242019 16689695 14396935
36102 14396935 7710433 -1623508 -6956846 -5025917 924410 6257383 9288260 10288740
$$ packed form
36160G211219K198013l867188l473202L411299P472576L644056k607521m742014
36152I247238l382244k010328j035928J72296M47350p25312j654710j138225N82999
36143E03136L510473O507055N733554L5636m270394j336318L753335J768402n143084
36134A1061795o244232m35380J624110l788367o636042p27221N080273J759987
36126A694923m986599m725452J584289N628190M950735K489703j061622n154616
36118D19551n159125P02110N392540K948256j091141J284439O490405N383430
36110A6370465p66332k470515J861942M170589J023491j947621j552324k292760
36102A4396935o686502r333941n333338J930929N950327N332973L030877J000480
$$ plain form
36094 10288740 9631740 8305498 8533001 12245693 18466407 22634645 20330119 12933028
36086 12933028 7476544 8366015 11677418 11665504 10284728 13830612 21261610 23915354
36078 23915354 18342520 11572421 10080502 10368467 5460100 -4427709 -12856676 -14983826
36070 -14983826 -10040007 168741 10655805 14582769 10075899 3405496 1504946 3894942
36062 3894942 5562954 4661248 3121664 2383111 2822230 5157014 8566757 9847259 8053247
36053 8053247 7018844 9258367 10650080 6108015 -2157877 -7280863 -6677696 -3570383
36045 -3570383 -1571929 -2423576 -6870530 -12752065 -14422928 -9412861 -3496090 -3462988 -7147427
36036 -7147427 -7136502 -2340199 1703974 2897398 4557713 7117604 6544566 2878221 1989980
$$ packed form
36094A0288740o57000j326242K27503L712692O220714M168238k304526p397091
36086A2933028n456484Q89471L311403j1914j380776L545884P430998K653744
36078B3915354n572834o770099j491919K87965m908367r887809q428967k127150
36070a4983826M943819J0208748J0487064L926964m506870o670403j900550K389996
36062C894942J668012r01706j539584p38553M39119K334784L409743J280502j794012
36053H053247j034403K239523J391713m542065q265892n122986O03167L107313
36045c570383J998454q51647m446954n881535j670863N010067N916771L3102l684439
36036g147427J0925M796303M044173J193424J660315K559891n73038l666345q88241
$$ plain form
36027 1989980 5646432 7560329 3666581 -713850 525176 4538162 5076052 3435937
36019 3435937 6509827 15975546 26168509 32132410 33930440 32662054 27565095 18860516
36011 18860516 9943105 4838569 5152860 9722918 15077733 16609972 12686125 8112050
36003 8112050 9738879 17074748 21218042 16146174 7455822 5052038 9560675 12634926
35995 12634926 10635849 10101399 16138971 22705813 21564045 16194665 17387268 26009304
35987 26009304 29971780 21026613 6402399 -1176670 898796 5102972 5173497 1711097
35979 1711097 -1255793 -393742 4730499 9954575 9109058 1649189 -5001803 -4395991 818601
35970 818601 4032494 4400286 5792743 8934379 11192609 12484840 14657922 15947163
$$ packed form
36027A989980L656452J913897l893748m380431J239026M012986N37890j640115
36019C435937L073890R465719J0192963N963901J798030j268386n096959q704579
36011A8860516q917411n104536L14291M570058N354815J532239l923847m574075
36003H112050J626829P335869M143294n071868q690352k403784M508637L074251
35995A2634926j999077n34450O037572O566842j141768n369380J192603Q622036
35987B6009304L962476q945167j4624214p579069K075466M204176P0525l462400
35979A711097k966890Q62051N124241N224076q45517p459869o650992O05812N214592
35970H18601L213893L67792J392457L141636K258230J292231K173082J289241
$$ plain form
35962 15947163 12902079 7583755 6003301 9017508 11535868 11540668 12768790 16662541
35954 16662541 18719650 15881420 11499090 9583918 9372131 8780450 8080381 6782804
35946 6782804 2147498 -5177402 -9002918 -5795407 -711273 -299108 -2889710 -2067448
35938 -2067448 2881279 6267095 5052092 3203290 6193244 14517867 23311609 26544250
35930 26544250 22127517 14484492 10797471 13078157 15902480 13964372 9233357 7537949
35922 7537949 10380634 14119622 15956207 16604673 17234998 17356807 16330602 14533906 12508835
35913 12508835 10473839 8635035 6994535 5675844 6203608 10496600 17136210 21145650
35905 21145650 19827800 16356806 14812166 14615465 13830227 14798733 20360967 26070962
$$ packed form
35962A5947163l045084n318324j580454L014207K518360M800J228122L893751
35954A6662541K057109k838230m382330j915172k11787n91681p00069j297577
35946F782804m635306p324900l825516L207511N084134M12165k590602Q22262
35938b067448M948727L385816j215003j848802K989954Q324623Q793742L232641
35930B6544250m416733p643025l687021K280686K824323j938108m731015j695408
35922G537949K842685L738988J836585O48466O30325J21809j026205j796696k025071
35913A2508835k034996j838804j640500j318691N27764M292992O639610M009440
35905B1145650j317850l470994j544640j96701p85238R68506N562234N709995
$$ plain form
35897 26070962 23727685 13724530 6583574 8934567 14408634 13686526 8463356 8112522
35889 8112522 14917772 20879230 20087258 16763177 17385656 20643269 20772028 17323100 15047790
35880 15047790 15265281 14160342 10785185 10339737 16030684 22499948 22168446 15342022
35872 15342022 9190412 8128200 9804096 10296369 9225885 9044559 11857078 17251517
35864 17251517 21685004 21041924 15744637 11535566 12646650 16549686 18778471 19885320
35856 19885320 22630086 25023029 22836380 17772938 16066662 19058671 21962604 22071457
35848 22071457 21063471 19061265 14619237 11381180 15298628 23069966 23712559 15646593
35840 15646593 11311324 18482392 27881259 28352975 24329949 26263487 31505418 29124746
$$ packed form
35897B6070962k343277j0003155p140956K350993N474067p22108n223170l50834
35889H112522O805250N961458p91972l324081O22479L257613J28759l448928k275310
35880A5047790K17491j104939l375157m45448N690947O469264l31502o826424
35872A5342022o151610j062212J675896M92273j070484j81326K812519N394439
35864A7251517M433487o43080n297287m209071J111084L903036K228785J106849
35856A9885320K744766K392943k186649n063442j706276K992009K903933J08853
35848B2071457j007986k002206m442028l238057L917448P771338O42593q065966
35840A5646593m335269P171068R398867M71716m023026J933538N241931k380672
$$ plain form
35832 29124746 19743289 15665912 21398533 27537839 26446311 22307520 21464997 22499504
35824 22499504 21308567 18788153 17830151 17522570 15222740 11532120 9875964 12754136
35816 12754136 19442430 25533075 25615230 19721627 15639982 20216361 29828489 35049598
35808 35049598 33328472 30300411 29497940 28855658 27901248 29860926 34517889 36972868
35800 36972868 36394581 38439275 45532407 52015967 52934684 50704783 48725365 45346288
35792 45346288 39368356 34944335 35041920 35909221 34277738 34320035 40289234 47451581 48706570
35783 48706570 46433763 48804268 56486580 62033073 61844890 59908328 58646049 54481081
35775 54481081 45700868 38180978 38740516 46499688 54626477 58443622 58864973 59313302
$$ packed form
35832B9124746r381457m077377N732621O139306j091528m138791q42523J034507
35824B2499504j190937k520414r58002l07581k299830l690620j656156K878172
35816A2754136O688294O090645Q2155n893603m081645M576379R612128N221109
35808C5049598j721126l028061q02471o42282r54410J959678M656963K454979
35800C6972868n78287K044694P093132O483560R18717k229901j979418l379077
35792D5346288n977932m424021R7585Q67301j631483M2297N969199P162347J254989
35783D8706570k272807K370505P682312N546493j88183j936562j262279m164968
35775E4481081q780213p519890N59538P759172Q126789L817145M21351M48329
$$ plain form
35767 59313302 61953048 66755942 72538552 78185254 83043629 86757892 89585498 92699054
35759 92699054 96847467 100689640 102126416 101315088 100241874 99426481 98077021 97642016
35751 97642016 101124223 107837048 113471362 117260317 123872757 135037853 144845137 148493258
35743 148493258 151037993 160688995 176084793 187289853 188849755 185972443 187506233 197295508
35735 197295508 212353051 225505525 230259035 227005841 224040756 229133710 241321818
35728 241321818 254224056 264633305 272859148 277580498 277554149 277210292 282826527 292660531
35720 292660531 298026266 295348071 290434063 289426536 292377934 297485065 304129421 308731179
35712 308731179 305186197 293951587 283966991 280308141 276353626 264770354 250613118
$$ packed form
35767E9313302K639746M802894N782610N646702M858375L714263K827606L113556
35759I2699054M148413L842173J436776q11328j073214q15393j349460m35005
35751I7642016L482207O712825N634314L788955O612440J1165096R807284L648121
35743A48493258K544735R651002J5395798J1205060J559902k877312J533790R789275
35735A97295508J5057543J3152474M753510l253194k965085N092954J2188108
35728B41321818J2902238J0409249Q225843M721350k6349l43857N616235R834004
35720B92660531N365735k678195m914008j007527K951398N107131O644356M601758
35712C08731179l544982j1234610r984596l658850l954515j1583272j4157236
$$ plain form
35705 250613118 245079341 249386492 253455056 249796124 241014538 232892966 226836757 221244221
35697 221244221 215145813 207738945 197693654 185295135 173219398 163813945 157278017
35690 157278017 152980230 150405320 148254969 144825188 140039452 135300993 130932508 125727224
35682 125727224 119318062 112667612 105747541 97574375 89790192 87093186 91322122 97206613
35674 97206613 97732539 93155056 90626693 93772935 96632043 91396866 79904239 72629645
35666 72629645 75988769 85027274 90498855 89222591 84266709 78316882 71806531 66063513
35658 66063513 62949958 61117295 57140811 51072509 46717614 45757657 46167489 47331372
35650 47331372 51095667 55471491 53403740 42273682 29709218 24466619 25333534 25051878
$$ packed form
35705B50613118n533777M307151M068564l658932q781586q121572o056209n592536
35697B21244221o098408p406868j0045291j2398519j2075737r405453o535928
35690A57278017m297787k574910k150351l429781m785736m738459m368485n205284
35682A25727224o409162o650450o920071q173166p784183k697006M228936N884491
35674I7206613N25926m577483k528363L146242K859108n235177j1492627p274594
35666G2629645L359124R038505N471581j276264m955882n949827o510351n743018
35658F6063513l113555j832663l976484o068302m354895r59957M09832J163883
35650D7331372L764295M375824k067751j1130058j2564464n242599Q66915k81656
$$ plain form
35642 25051878 22030061 21001595 23687170 26433633 27454058 29471755 33699005 37299530
35634 37299530 38857081 40752142 43565162 43423548 38318114 32587357 31178337 32801376
35626 32801376 32592097 28960048 24377863 21709420 22832718 28372005 35523674 38769417
35618 38769417 36530511 34700433 39191748 46928632 49344692 43922141 36823370 33605498
35610 33605498 32581168 29486063 24620688 22016796 23456108 26428871 27906615 28096578
35602 28096578 29324147 31667601 31577483 26708001 21076169 21835588 30216665 39537656
35594 39537656 43771826 43436917 40249170 31994562 18734889 8987125 10857927 19355596
35586 19355596 21950157 16202837 11886615 14465866 17366656 14684220 11221600 13152017
$$ packed form
35642B5051878l021817j028466K685575K746463J020425K017697M227250L600525
35634C7299530J557551J895061K813020j41614n105434n730757j409020J623039
35626C2801376k09279l632049m582185k668443J123298N539287P151669L245743
35618C8769417k238906j830078M491315P736884K416060n422551p098771l217872
35610C3605498j024330l095105m865375k603892J439312K972763J477744J89963
35602B8096578J227569K343454r0118m869482n631832P59419Q381077R320991
35594C9537656M234170l34909l187747q254608j3259673r747764J870802Q497669
35586A9355596K594561n747320m316222K579251K900790k682436l462620J930417
$$ plain form
35578 13152017 17154691 16986901 14324631 14381075 15857147 14354413 11994618 14277690
35570 14277690 19833040 22538606 22186800 23536316 25436273 21045009 10272046 2465549
35562 2465549 3504303 8144332 9052268 6829937 6846940 11164412 17266655 20910677 18097867
35553 18097867 8692698 -277580 -251205 7906464 14102039 12400606 8216156 9221335
35545 9221335 15212791 20938709 23609998 23440689 21350975 19741998 21027645 22697302
35537 22697302 19454334 12772985 10894236 15524228 17283012 10492987 3647378 6616200
35529 6616200 15205477 18697904 16359347 15006000 15287997 13163029 11688212 17527352
35521 17527352 26559942 26802788 17161851 10236537 13320328 18886170 18616861 15450405
$$ packed form
35578A3152017M002674j67790k662270N6444J476072j502734k359795K283072
35570A4277690N555350K705566l51806J349516J899957m391264j0772963p806497
35562B465549J038754M640029R07936k222331J7003M317472O102243L644022k812810
35553A8097867r405169q970278K6375Q157669O195575j701433m184450J005179
35545I221335N991456N725918K671289j69309k089714j608977J285647J669657
35537B2697302l242968o681349j878749M629992J758784o790025o845609K968822
35529F616200Q589277L492427k338557j353347K81997k124968j474817N839140
35521A7527352R032590K42846r640937o925314L083791N565842k69309l166456
$$ plain form
35513 15450405 15273625 16389286 14771239 12370937 12984534 15655067 18292184 22279088
35505 22279088 27765360 30012602 26370945 21628563 20568253 20584324 17935701 15748330
35497 15748330 18309607 22105335 20780470 15549030 12334502 11332444 8312544 4596141
35489 4596141 6006252 11304804 11076951 1398967 -8520818 -6775501 7411764 23669575
35481 23669575 31212502 27145239 16867947 8742660 6898770 8153922 7339655 5162390
35473 5162390 7520627 16526798 26121750 28892440 24543850 18865668 16122913 15839965
35465 15839965 16782504 20375025 27771040 35369281 37065840 31922176 26322870 25907523
35457 25907523 27987402 25974802 19560039 15138501 16406681 20389660 23717776 26541884
$$ packed form
35513A5450405j76780J115661j618047k400302O13597K670533K637117L986904
35505B2279088N486272K247242l641657m742382j060310J6071k648623k187371
35497A5748330K561277L795728j324865n231440l214528j002058l019900l716403
35489D596141J410111N298552k27853r677984r919785J745317J4187265J6257811
35481B3669575P542927m067263j0277292q125287j843890J255152q14267k177265
35473E162390K358237R006171R594952K770690m348590n678182k742755k82948
35465A5839965R42539L592521P396015P598241J696559n143664n599306m15347
35457B5907523K079879k012600o414763m421538J268180L982979L328116K824108
$$ plain form
35449 26541884 28082320 25122626 18914807 17059934 22889947 28727209 26602588 20613800
35441 20613800 20015120 23535169 20847538 9340479 -343908 2008465 14176845 25823034
35433 25823034 29123959 23179131 13500509 9230666 15397896 25606649 27655994 18702646
35425 18702646 9215617 9018075 15557310 20509951 22297871 25414422 30637732 33051208
35417 33051208 29363080 21818091 14420531 9315350 7395136 8894591 12189743 14444752
35409 14444752 14619693 14371508 15447215 17705652 20355468 23600952 27619409 30599898
35401 30599898 29803621 25471716 22071075 23292715 26329300 24553760 16984076 11230995
35393 11230995 14020097 22065197 26750232 25405834 22421150 20678333 18666642 16483113
$$ packed form
35449B6541884J540436k959694o207819j854873N830013N837262k124621n988788
35441B0613800n98680L520049k687631j1507059r684387K352373J2168380J1646189
35433B5823034L300925n944828r678622m269843O167230J0208753K049345q953348
35425A8702646r487029j97542O539235M952641J787920L116551N223310K413476
35417C3051208l688128p544989p397560n105181j920214J499455L295152K255009
35409A4444752J74941k48185J075707K258437K649816L245484M018457K980489
35401C0599898p96277m331905l400641J221640L036585j775540p569684n753081
35393A1230995K789102Q045100M685035j344398k984684j742817k011691k183529
$$ plain form
35385 16483113 17625758 22390096 25633281 24476198 22692517 23358096 22578910 16322076
35377 16322076 9375758 10388531 19587140 28010391 28892253 24155982 19145996 16598833
35369 16598833 17712281 24039207 34462545 43078220 44202400 39031700 34484914 35074823
35361 35074823 37987569 37227681 31247804 24603469 22096506 23295782 24244619 23292061
35353 23292061 23018140 26523094 33689688 41235827 44847580 41541140 32260579 22450784
35345 22450784 17761664 18678316 21484518 24279261 28450654 33487581 34918542 30381667
35337 30381667 24381643 23145762 26598876 29040669 26722214 21473179 17305310 16316707
35329 16316707 18043640 20747027 23076186 25505647 29612017 35165613 39256415 39450506
$$ packed form
35385A6483113J142645M764338L243185j157083j783681O65579p79186o256834
35377A6322076o946318J012773R198609Q423251Q81862m736271n009986k547163
35369A6598833J113448O326926J0423338Q615675J124180n170700m546786N89909
35361C5074823K912746p59888n979877o644335k506963J199276R48837r52558
35353B3292061k73921L504954P166594P546139L611753l306440r280561r809795
35345B2450784m689120R16652K806202K794743M171393N036927J430961m536875
35337C0381667o000024j235881L453114K441793k318455n249035m167869r88603
35329A6316707J726933K703387K329159K429461M106370N553596M090802J94091
$$ plain form
35321 39450506 36449530 32698309 30225410 30637772 34286544 37853686 36316482 29974700
35313 29974700 25915459 28868312 34105697 34035937 28624431 23617359 21234647 19696785
35305 19696785 20292874 26392549 34776321 36631982 30275999 25294507 29358581 37212417
35297 37212417 38618858 32556447 27003662 27448365 31845267 35405497 34699842 28008803
35289 28008803 17265834 9514600 10940349 18587445 22795648 19018965 12574661 10040983
35281 10040983 10888439 10767998 8902368 7720368 7660422 7182400 7094555 10413996 17478331
35272 17478331 24643615 28579328 28970428 26390690 20931879 14579702 11725696 14377137
35264 14377137 18738117 19613888 17211888 16528946 20239813 25172797 26597844 23865184
$$ packed form
35321C9450506l000976l751221k472899M12362L648772L567142j537204o341782
35313B9974700m059241K952853N237385o9760n411506n007072k382712j537862
35305A9696785N96089O099675Q383772J855661o355983m981492M064074P853836
35297C7212417J406441o062411n552785M44703M396902L560230p05655o691039
35289B8008803j0742969p751234J425749P647096M208203l776683o444304k533678
35281A0040983Q47456j20441j865630j182000n9946m78022q7845L319441P064335
35272A7478331P165284L935713L91100k579738n458811o352177k854006K651441
35264A4377137M360980Q75771k402000o82942L710867M932984J425047k732660
$$ plain form
35256 23865184 20704010 21086554 25336903 29467448 28489478 21629084 13986019 11467125
35248 11467125 14445506 18315323 19650035 18880949 17053308 13947578 10859376 11398508
35240 11398508 16701099 22612405 24715570 23932770 23850257 24615627 23717022 21591009 21510857
35231 21510857 23552245 23455184 19333629 15514957 16594163 20239433 19669190 12593344
35223 12593344 4427930 1947641 5910956 11162932 12752432 10507571 8043110 8756469
35215 8756469 13176092 19070677 23198425 23574502 21139233 19008606 19158210 20085358 18746446
35206 18746446 14506718 9975144 8203223 10355083 15614609 21490342 24534864 23157150
35198 23157150 19889812 18491000 18751130 17185463 13197896 10622525 11646907 13280902
$$ packed form
35256B3865184l161174L82544M250349M130545r77970o860394p643065k518894
35248A1467125K978381L869817J334712p69086j827641l105730l088202N39132
35240A1398508N302591N911306K103165p82800q2513P65370q98605k126013q0152
35231B1510857K041388r7061m121555l818672J079206L645270n70243p075846
35223A2593344q165414k480289L963315N251976J589500k244861k464461P13359
35215H756469M419623N894585M127748L76077k435269k130627J49604R27148j338912
35206A8746446m239728m531574j771921K151860N259526N875733L044522j377714
35198B3157150l267338j398812K60130j565667l987567k575371J024382J633995
$$ plain form
35190 13280902 12533643 11379977 12932362 15703643 16063510 14405297 14255827 16189297
35182 16189297 16966124 14637187 10920071 8371523 8063469 9846600 12274142 12846918
35174 12846918 10999327 9819164 11717563 13695099 10933631 4406547 453449 2519250
35166 2519250 7429242 10592306 11184992 11154357 12156181 14309055 15554586 12518778 4991204
35157 4991204 -1356749 -830313 4454218 7647976 7698070 10380325 17698096 23377698 22438483
35148 22438483 19194474 20784457 27067884 32044809 32131899 28112194 21479587 14039621
35140 14039621 9572634 10825636 15188120 17339102 15912002 14007396 13559433 13257594
35132 13257594 12703078 14849844 22106372 31845387 37972894 36840878 30545112 24103980
$$ packed form
35190A3280902p47259j153666J552385K771281L59867j658213j49470J933470
35182A6189297P76827k328937l717116k548548l08054J783131K427542N72776
35174A2846918j847591j180163J898399J977536k761468o527084l953098K065801
35166B519250M909992L163064N92686l0635J001824K152874J245531l035808p527574
35157D991204o347953N26436N284531L193758N0094K682255P317771N679602r39215
35148B2438483l244009J589983O283427M976925Q7090m019705o632607p439966
35140A4039621m466987J253002M362484K150982j427100j904606m47963l01839
35132A3257594n54516K146766P256528R739015O127507j132016o295766o441132
$$ plain form
35124 24103980 20167108 17677145 15486395 14674824 15541109 14983320 10597458 5769369
35116 5769369 5919169 10171458 12150262 9655002 7697350 9994657 13284621 13363027 11543763
35107 11543763 10983329 11073799 10129007 9851391 12184824 14811323 14711676 13588995 14920771
35098 14920771 18014219 19806738 20243413 20848622 20148093 15874659 9993756 6270809
35090 6270809 4572738 2999921 3639226 9669823 17963517 21649553 19982356 18795845
35082 18795845 20730326 22181741 21343477 21904519 25657081 27678053 22929505 13165012
35074 13165012 3766391 -2328055 -4337373 -1320645 5809264 12526453 14476188 11643009
35066 11643009 7040512 3621286 3990042 9860661 19134390 25995305 26507086 22377247
$$ packed form
35124B4103980l936872k489963k190750q11571Q66285n57789m385862m828089
35116E769369J49800M252289J978804k495260j957652K297307L289964P8406j819264
35107A1543763n60434R0470r44792k77616K333433K626499r9647j122681J331776
35098A4920771L093448J792519M36675O05209p00529m273434n880903l722947
35090F270809j698071j572817O39305O030597Q293694L686036j667197j186511
35082A8795845J934481J451415q38264N61042L752562K020972m748548r764493
35074A3165012r398621o094446k009318L016728P129909O717189J949735k833179
35066A1643009m602497l419226L68756N870619R273729O860915N11781m129839
$$ plain form
35058 22377247 17560308 13562104 10016046 7413153 6758781 7877563 9549104 10091819
35050 10091819 7658709 2452778 -1304250 759393 6663624 9493442 6330284 1199375
35042 1199375 -2234509 -5256459 -8625073 -8464381 -2253048 5969414 11634088 16480851
35034 16480851 23246235 27397863 21977481 9244896 -44941 522100 6921046 12047659
35026 12047659 13469250 12484132 10601169 9324716 10058810 12398809 14712387 16645193
35018 16645193 18363514 18037595 14159576 10007283 10730524 15376765 17261860 13854402
35010 13854402 10632831 12389799 16330566 17878040 18058960 19453951 19132768 13088322
35002 13088322 5598154 5865779 14568625 21280578 18139467 9896114 6264072 9296308
$$ packed form
35058B2377247m816939l998204l546058k602893o54372J118782J671541N42715
35050A0091819k433110n205931l757028K063643N904231K829818l163158n130909
35042A199375l433884l021950l368614J60692O211333Q222462N664674M846763
35034A6480851O765384M151628n420382j2732585r289837N67041O398946N126613
35026A2047659J421591r85118j882963j276453P34094K339999K313578J932806
35018A6645193J718321l25919l878019m152293P23241M646241J885095l407458
35010A3854402l221571J756968L940767J547474J80920J394991l21183o044446
35002A3088322p490168K67625Q702846O711953l141111q243353l632042L032236
$$ plain form
34994 9296308 13629611 15596680 15723947 13927312 9051181 3609807 2767584 6760221
34986 6760221 9754230 8713657 7905964 10803393 12932061 8721594 1531079 -445082
34978 -445082 3750411 7566558 8165698 9669069 13963003 16724419 16034329 17167288 23575694
34969 23575694 29742836 29446493 25530919 23973543 23112834 18139222 13230240 17942262
34961 17942262 30881895 37895354 30512208 17272524 10997613 12108036 12014301 7886770
34953 7886770 5049224 6372038 7868407 6239279 4191781 5380302 8713482 11026957
34945 11026957 12132170 13599737 14721843 13658871 11681089 12203498 15225343 16655068
34937 16655068 14875392 14446312 20037496 29030272 34348206 33695537 31362689 30557413
$$ packed form
34994I296308M333303J967069J27267j796635m876131n441374q42223L992637
34986F760221K994009j040573q07693K897429K128668m210467p190515j976161
34978d45082M195493L816147N99140J503371M293934K761416o90090J132959O408406
34969B3575694O167142k96343l915574j557376q60709m973612m908982M712022
34961A7942262J2939633P013459p383146j3239684o274911J110423r3735m127531
34953G886770k837546J322814J496369j629128k047498J188521L333180K313475
34945A1026957J105213J467567J122106j062972j977782N22409L021845J429725
34937A6655068j779676m29080N591184Q992776N317934o52669k332848q05276
$$ plain form
34929 30557413 29124689 25252887 22780003 26325298 33578068 37136144 33320306 25312957
34921 25312957 17872260 12765616 9934600 9620778 11637404 14502073 16718992 18181572
34913 18181572 20119927 24318350 31438175 38716488 40790983 35276529 26461079 20704848
34905 20704848 19252059 18853697 18157639 18635899 19244926 15870618 8251716 2772212 5016546
34896 5016546 12671027 19106741 21741900 23590687 27768628 33138107 35044543 29381913
34888 29381913 17253275 6092947 3550375 9011410 14137356 13582894 11708665 15637053
34880 15637053 24836018 32052720 32976047 30299771 28236770 27096977 24705937 20771213
34872 20771213 18088712 19753245 25514001 31250302 33191492 32434840 32958047 34919639
$$ packed form
34929C0557413j432724l871802k472884L545295P252770L558076l815838q007349
34921B5312957p440697n106644k831016l13822K016626K864669K216919J462580
34913A8181572J938355M198423P119825P278313K074495n514454q815450n756231
34905B0704848j452789l98362o96058M78260O09027l374308p618902n479504K244334
34896E016546P654481O435714K635159J848787M177941N369479J906436n662630
34888B9381913j2128638j1160328k542572N461035N125946n54462j874229L928388
34880A5637053R198965P216702R23327k676276k063001j139793k391040l934724
34872B0771213k682501J664533N760756N736301J941190p56652N23207J961592
$$ plain form
34864 34919639 33593272 26714015 18943555 15728849 16073572 15618451 14092791 14532707
34856 14532707 16876416 18095167 18318246 21298511 28033784 34633067 37649731 37594031
34848 37594031 36353640 35090223 35392582 38154476 40191479 36594772 28332170 23053668
34840 23053668 25663436 31881484 34167622 30847773 26202286 24070503 24554782 25361701
34832 25361701 23940883 19719309 15704272 15880999 20112730 24639382 28380400 33954804
34824 33954804 40306147 40218420 30021556 17130712 11913397 15396265 21268623 26786224
34816 26786224 33631918 39506925 38205996 29805690 22910324 23539389 28076862 30680979
34808 30680979 31611192 33450772 34129445 29929779 22895274 19428817 22105324 27091912
$$ packed form
34864C4919639j326367o879257p770460l214706L44723m55121j525660M39916
34856A4532707K343709J218751K23079K980265O735273O599283L016664n5700
34848C7594031j240391j263417L02359K761894K037003l596707q262602n278502
34840B3053668K609768O218048K286138l319849m645487k131783M84279Q06919
34832B5361701j420818m221574m015037J76727M231731M526652L741018N574404
34824C3954804O351343q7727j0196864j2890844n217315L482868N872358N517601
34816B6786224O845694N875007j300929q400306o895366O29065M537473K604117
34808C0680979R30213J839580O78673m199666p034505l466457K676507M986588
$$ plain form
34800 27091912 29348652 27000537 21151177 14991723 13204075 18817548 29458007 38748710
34792 38748710 42330338 41154684 38637802 36495130 34405382 32341622 31413780 32281330
34784 32281330 33960471 35177879 36382164 38865645 41726008 41899914 38522262 34859281
34776 34859281 33512053 32274585 28654748 26102369 29705013 36532921 37769816 31985840
34768 31985840 28481612 33531856 40491024 39402405 30537664 21571279 16315511 14016046
34760 14016046 15548852 21209181 25152837 21831999 16449431 18681958 26531284 27998142
34752 27998142 20287438 14900879 19353531 26051686 26386172 24608697 27938573 32224488
34744 32224488 29368686 22423314 20460861 22526340 19998790 13250474 12487862 20866367
$$ packed form
34800B7091912K256740k348115n849360o159454j787648N613473J0640459R290703
34792C8748710L581628j175654k516882k142672k089748k063760r27842Q67550
34784C2281330J679141J217408J204285K483481K860363J73906l377652l662981
34776C4859281j347228j237468l619837k552379L602644O827908J236895n783976
34768C1985840l504228N050244O959168j088619q864741q966385n255768k299465
34760A4016046J532806N660329L943656l320838n382568K232527P849326J466858
34752B7998142p710704n386559M452652O698155L34486j777475L329876M285915
34744C2224488k855802o945372j962453K065479k527550o748316p62612Q378505
$$ plain form
34736 20866367 29178180 30414187 28441025 27894778 25908680 19966693 15059319 15748712
34728 15748712 18173208 17508713 17430475 23780455 33066966 36052220 30756187 23965808
34720 23965808 20613449 18872179 16104699 13367782 12690075 14502770 18695136 24378880
34712 24378880 28319427 27534200 23757630 21565884 21999389 22081776 20735798 20430724 21932850
34703 21932850 22157825 19356141 16473782 16709009 18776472 19322423 17813497 16528794
34695 16528794 17311821 20285572 24257033 26747802 25339011 20861864 17821995 19710043
34687 19710043 24812827 28266547 27553944 24711443 23617839 25878319 28969214 28540971
34679 28540971 23588424 18685449 18963706 23420172 26383385 25607342 24671218 26097207
$$ packed form
34736B0866367Q311813J236007j973162n46247j986098n941987m907374O89393
34728A5748712K424496o64495p8238O349980R286511K985254n296033o790379
34720B3965808l352359j741270k767480k736917o77707J812695M192366N683744
34712B4378880L940547p85227l776570k191746M33505Q2387j345978l05074J502126
34703B1932850K24975k801684k882359K35227K067463N45951j508926j284703
34695A6528794P83027K973751L971461K490769j408791m477147l039869J888048
34687A9710043N102784L453720p12603k842501j093604K260480L090895m28243
34679B8540971m952547m902975K78257M456466K963213p76043r36124J425989
$$ plain form
34671 26097207 26858855 23788838 19347291 17768510 18536899 18486352 18128621 20503936 24859285
34662 24859285 27034985 26171568 25780441 27485203 28973998 29625354 32659849 38657700
34654 38657700 41808466 37287147 29228818 26028476 28971039 30831967 26268931 18746247
34646 18746247 14737742 14627733 13469100 9627491 8002469 12754855 20125848 22409161
34638 22409161 18064923 13454324 13694863 16414244 17336830 17714173 21181552 26043242
34630 26043242 27266851 25754527 28822331 39369768 50045503 51527964 43051928 31985850
34622 31985850 26076548 28285826 35651957 40580949 36873981 27399265 22010003 24687505
34614 24687505 27379015 21327610 10077274 4722960 9234929 17602311 23637238 25936811
$$ packed form
34671B6097207P61648l070017m441547j578781P68389n0547l57731K375315M355349
34662B4859285K175700q63417l91127J704762J488795O51356L034495N997851
34654C8657700L150766m521319q058329l200342K942563J860928m563036p522684
34646A8746247m008505j10009j158633l841609j625022M752386P370993K283313
34638B2409161m344238m610599K40539K719381R22586L77343L467379M861690
34630B6043242J223609j512324L067804J0547437J0675735J482461q476036j1066078
34622C1985850n909302K209278P366131M928992l706968r474716n389262K677502
34614B4687505K691510o051405j1250336n354314M511969Q367382O034927K299573
$$ plain form
34606 25936811 23825623 16689539 8724703 6905042 11754310 16415722 17107278 17771496
34598 17771496 21270483 23155213 19421084 14667944 16132582 23340903 29797784 32370133
34590 32370133 33306267 34767055 36560032 37995448 37571762 32576303 23524658 16807104
34582 16807104 17470739 21196642 19778628 13468739 10448305 13456195 14988436 9106761
34574 9106761 1164064 265965 6346851 10834544 8355921 2191647 -2047025 -3518482
34566 -3518482 -4933672 -6876870 -6288278 -861175 6805730 11335932 11075790 10511607 14512308
34557 14512308 21528619 25155165 22127846 15996904 12366791 13018648 15743479 17684756
34549 17684756 17153117 13605426 7762632 1634284 -2355078 -2369413 2178548 9939174
$$ packed form
34606B5936811k111188p136084p964836j819661M849268M661412O91556O64218
34598A7771496L498987J884730l734129m753140J464638P208321O456881K572349
34590C2370133R36134J460788J792977J435416m23686m995459r051645o717554
34582A6807104O63635L725903j418014o309889l020434L007890J532241n881675
34574I106761p942697q98099O080886M487693k478623o164274m238672j471457
34566c518482j415190j943198N88592N427103P666905M530202k60142n64183M000701
34557A4512308P016311L626546l027319o130942l630113O51857K724831J941277
34549A7684756n31639l547691n842794o128348l989362j4335M547961P760626
$$ plain form
34541 9939174 17853403 23246862 25462263 24444415 19015672 9136832 -678654 -3800053
34533 -3800053 1235709 8149343 9232742 2926816 -5787827 -10973168 -10540830 -6724880
34525 -6724880 -3065608 -701578 2356565 7643208 12814764 13756262 9831026 4789888
34517 4789888 2326750 2981979 5595092 9022705 11469990 10764293 7044229 3558710
34509 3558710 3295913 5812200 8312037 9045893 9150597 11537278 17328228 22761671 21734267
34500 21734267 13565867 5630891 4383145 6187596 2824613 -5331968 -9162656 -4532544
34492 -4532544 1943379 3948494 4660981 9819280 17890863 23422370 25437837 25953430
34484 25953430 24011411 18270583 12703521 12193454 13963737 10922437 3245588 -837640
$$ packed form
34541I939174P914229N393459K215401j017848n428743r878840r815486l121399
34533c800053N035762O913634J083399o305926q714643n185341M32338L815950
34525f724880L659272K364030L058143N286643N171556R41498l925236n041138
34517D789888k463138O55229K613113L427613K447285p05697l720064l485519
34509C558710k62797K516287K499837P33856J04704K386681N790950N433443j027404
34500B1734267q168400p934976j247746J804451l362983q156581l830688M630112
34492d532544O475923K005115P12487N158299Q071583N531507K015467N15593
34484B5953430j942019n740828n567062n10067J770283l041300p676849m083228
$$ plain form
34476 -837640 2987025 9133152 10559547 7594607 4983269 4375810 3757582 2001127 205828
34467 205828 -908881 -2073513 -3114195 -1065433 7265124 19933399 28901717 27494535
34459 27494535 18458381 10959508 9398785 9981349 9305204 9721521 12687196 13679481 9776743
34450 9776743 6439221 9072462 12683473 9132684 1230483 -918743 3906390 6784119
34442 6784119 4147419 3029961 7708130 11824296 9299551 4403069 4477078 9297612
34434 9297612 14116216 17936285 22316437 25798302 25317803 20608664 13225031 4298226
34426 4298226 -3572174 -6441536 -4661321 -3831970 -6184787 -6117491 741097 9095752 10826463
34417 10826463 6238664 1808328 -279767 -3383675 -8812569 -13292485 -13520511 -8721872
$$ packed form
34476h37640L824665O146127J426395k964940k611338o07459o18228j756455j795299
34467B05828j114709j164632j040682K048762Q330557J2668275Q968318j407182
34459B7494535r036154p498873j560723N82564o76145M16317K965675R92285l902738
34450I776743l337522K633241L611011l550789p902201k149226M825133K877729
34442F784119k636700j117458M678169M116166k524745m896482P4009M820534
34434I297612M818604L820069M380152L481865m80499m709139p383633q926805
34426D298226p870400k869362J780215Q29351k352817O7296O858588Q354655J730711
34417A0826463m587799m430336k088095l103908n428894m479916k28026M798639
$$ plain form
34409 -8721872 -33201 8520105 10747910 4901464 -2391823 -3438854 1525235 7122051
34401 7122051 11210269 14671634 16243428 14811624 14353786 18622362 22586905 17884164
34393 17884164 6273655 -1477158 -914846 1158562 -841656 -3312197 -2198730 -1237783
34385 -1237783 -5160302 -10630912 -10701875 -4812042 1342550 3690783 3057919 2313699 3828598
34376 3828598 8333810 13732693 16565890 16192998 15193282 14608864 12447534 8532917 6427211
34367 6427211 7796230 9147554 7571603 5561926 6067930 6858817 5015228 3683336
34359 3683336 8030460 16033458 19575957 14911576 6969948 2526486 3270299 6567967
34351 6567967 9450782 10437906 9908515 9754313 11113872 12534740 12246969 11545651 13064864
$$ packed form
34409h721872Q688671Q553306K227805n846446p293287j047031M964089N596816
34401G122051M088218L461365J571794j431804m57838M268576L964543m702741
34393A7884164j1610509p750813N62312K073408k000218k470541J113467R60947
34385a237783l922519n470610p0963N889833O154592K348233o32864p44220J514899
34376C828598M505212N398883K833197l72892r99716n84418k161330l914617k105706
34367F427211J369019J351324j575951k009677N06004P90887j843589j331892
34359C683336M347124Q002998L542499m664381p941628m443462P43813L297668
34351F567967K882815R87124n29391j54202J359559J420868k87771p01318J519213
$$ plain form
34342 13064864 15780413 14849510 7443456 -3265094 -10794523 -10943925 -4979170 1218669
34334 1218669 1776201 -3424283 -8121795 -6751085 -1170425 2218617 862942 -2062001
34326 -2062001 -3490282 -3612495 -2658850 547293 4799143 5670067 1558845 -2893835 -2882450
34317 -2882450 6552 1186537 500405 1593078 5292853 8519228 9445484 9102061 7619788
34308 7619788 3570879 -2002682 -5528584 -6515702 -8759322 -13708719 -17142112 -15552461
34300 -15552461 -11402265 -7876397 -2729997 6842022 16422978 18549206 13412296 8474914
34292 8474914 7788199 8839204 10233852 14065262 18265169 15332309 3815516 -6188870
34284 -6188870 -5615584 1116778 3328263 -1110519 -6367536 -10266547 -15660448 -21550478
$$ packed form
34342A3064864K715549r30903p406054j0708550p529429j49402N964755O197839
34334A218669N57532n200484m697512J370710N580660L389042j355675k924943
34326b062001j428281j22213R53645L206143M251850Q70924m111222m452680J1385
34317b882450K889002J179985o86132J092673L699775L226375R26256l43423j482273
34308G619788m048909n573561l525902r87118k243620m949397l433393J589651
34300a5552461M150196L525868N146400R572019R580956K126228n136910m937382
34292H474914o86715J051005J394648L831410M199907k932860j1516793j0004386
34284f188870N73286O732362K211485m438782n257017l899011n393901n890030
$$ plain form
34276 -21550478 -22591689 -18418727 -14804766 -13635720 -10012448 -2347399 2673264 -29522
34268 -29522 -5659864 -6692168 -3046919 652219 3398113 6542558 7276463 1070595 -9599484
34259 -9599484 -15520512 -11412465 -1959305 4625149 5823955 5559766 7863107 12314234
34251 12314234 15668008 16368355 16019526 16195427 15539811 11952223 6550706 2584547 805208
34242 805208 -602740 -1271754 1989727 9712233 17679986 22412607 24917193 26560995
34234 26560995 25330308 19763470 13181295 9966944 10213070 11595284 13480229 15052871
34226 15052871 12717647 4872743 -3064341 -4426439 -740894 760927 -1619803 -2145544
34218 -2145544 2064144 5541044 2433817 -4710928 -7949591 -3467515 4493304 8068861
$$ packed form
34276b1550478j041211M172962L613961J169046L623272P665049N020663k702786
34268b9522n630342j032304L645249L699138K745894L144445P33905o205868j0670079
34259i599484n921028M108047R453160O584454J198806k64189K303341M451127
34251A2314234L353774P00347l48829J75901o55616l587588n401517l966159j779339
34242H05208j407948o69014L261481P722506P967753M732621K504586J643802
34234B6560995j230687n566838o582175l214351K46126J382214J884945J572642
34226A5052871k335224p844904p937084j362098L685545J501821k380730n25741
34218b145544M209688L476900l107227p144745l238663M482076P960819L575557
$$ plain form
34210 8068861 3170203 -6202189 -11110916 -7018999 878526 4358386 2599451 1363677
34202 1363677 2846473 2906408 -314757 -1902179 1840665 6379587 5233161 -280112
34194 -280112 -3213146 -993407 2204277 2539507 951125 -167920 -506562 -295466 1695282
34185 1695282 6119335 10461665 10919276 6953940 2338091 719350 1029974 -863163
34177 -863163 -5604238 -7886724 -3009411 5476572 8437574 2015765 -7693113 -12439520
34169 -12439520 -10984330 -7590964 -4113615 1674634 9992532 15878570 14677248 8531424
34161 8531424 4376693 5568560 7855613 4790733 -4270961 -13267137 -15929565 -11296628
34153 -11296628 -2910427 4847911 8584648 6875415 2097421 -376245 2033436 4804814
$$ packed form
34210H068861m898658r372392m908727M091917P897525L479860j758935j235774
34202A363677J482796N9935l221165j587422L742844M538922j146426n513273
34194b80112k933034K219739L197684L35230j588382j119045l38642K11096J990748
34185A695282M424053M342330M57611l965336m615849j618741L10624j893137
34177h63163m741075k282486M877313Q485983K961002o421809r708878m746407
34169a2439520J455190L393366L477349N788249Q317898N886038j201322o145824
34161H531424m154731J191867K287053l064880r061694q996176k662428M632937
34153a1296628Q386201P758338L736737j709233m777994k473666K409681K771378
$$ plain form
34145 4804814 1005998 -9547850 -18778177 -18858078 -10074307 536337 6337765 5979377
34137 5979377 2976919 1752050 3415276 5130876 4138926 1501311 306736 1157079
34129 1157079 1880296 1281639 486495 460466 592660 -160885 -2800759 -8304792 -15360806
34120 -15360806 -18906824 -14711454 -5334931 2367870 5840834 8690181 13572061 18181554
34112 18181554 19830984 19209816 17272624 12690676 5126108 -2582576 -7974326 -11341069
34104 -11341069 -12767014 -10993424 -7317989 -5800132 -6786511 -5251492 1053145 7030175
34096 7030175 7743770 4969553 1692376 -3638264 -11119534 -14076109 -8293869 -1552226
34088 -1552226 -3936414 -12019118 -13676174 -6989830 -2445171 -5573303 -9459891 -7970059
$$ packed form
34145D804814l798816j0553848r230327p9901Q783771J0610644N801428l58388
34137E979377l002458j224869J663226J715600r91950k637615j194575Q50343
34129A157079P23217n98657p95144k6029J32194p53545k639874n504033p056014
34120a5360806l546018M195370R376523P702801L472964K849347M881880M609493
34112A8181554J649430o21168j937192m581948p564568p708684n391750l366743
34104a1341069j425945J773590L675435J517857r86379J535019O304637N977030
34096G030175P13595k774217l277177n330640p481270k956575N782240O741643
34088a552226k384188q082704j657056O686344M544659l128132l886588J489832
$$ plain form
34080 -7970059 -5370356 -7040478 -9769570 -8449900 -5517388 -6188745 -9229251 -9728020
34072 -9728020 -7574274 -6303024 -5844363 -2961372 2076575 4919647 3328523 -254992
34064 -254992 -2575994 -2865209 -2067881 -1088912 -128607 1143465 2295973 1251391 -3162195
34055 -3162195 -7933405 -8593082 -5517363 -2953604 -919223 5628741 16534704 22210059
34047 22210059 15635536 3527116 -1702895 2163272 6859941 7098449 5915699 6485653
34039 6485653 6782548 5096189 4669665 8846078 15056554 17168289 12571180 5205537
34031 5205537 2005869 6098935 12606515 12755587 4034651 -6003745 -8905463 -5416051
34023 -5416051 -2192624 -1432690 37641 3177048 5611165 7885256 13181177 19620064
$$ packed form
34080g970059K599703j670122k729092J319670K932512o71357l040506m98769
34072i728020K153746J271250M58661K882991N037947K843072j591124l583515
34064b54992k321002k89215P97328R78969R60305J272072J152508j044582m413586
34055c162195m771210o59677L075719K563759K034381O547964J0905963N675355
34047B2210059o574523j2108420n230011L866167M696669K38508j182750N69954
34039F485653K96895j686359m26524M176413O210476K111735m597109p365643
34031E205537l199668M093066O507580J49072q720936j0038396k901718L489412
34023e416051L223427P59934J470331L139407K434117K274091N295921O438887
$$ plain form
34015 19620064 20434495 14212877 7798271 5899849 5053797 2041805 900621 5404958
34007 5404958 10709442 9908217 4686964 1988190 3149055 3858085 2882077 3354024 6277216
33998 6277216 9620079 13253914 17906398 19552588 12548947 -332896 -8208075 -4965248
33990 -4965248 4107914 10944723 13702685 13877362 10781444 4290255 -1249182 -1662443
33982 -1662443 873717 1134389 -1526755 -3205352 -1387232 3454584 10550688 18212243
33974 18212243 21449267 15764657 4195485 -4092683 -3952139 609833 3033878 2243305
33966 2243305 1553414 2734038 4814937 7126156 9655872 10656433 7523464 1119461
33958 1119461 -3596244 -3178480 -177736 120934 -3719122 -8437221 -11175994 -12238513
$$ packed form
34015A9620064Q14431o221618o414606j898422q46052l011992j141184M504337
34007E404958N304484q01225n221253k698774J160865P09030r76008M71947K923192
33998F277216L342863L633835M652484J646190p003641j2881843p875179L242827
33990d965248R073162O836809K757962J74677l095918o491189n539437m13261
33982a662443K536160K60672k661144j678597J818120M841816P096104P661555
33974A8212243L237024n684610j1569172q288168J40544M561972K424045p90573
33966B243305o89891J180624K080899K311219K529716J000561l132969o404003
33958A119461m715705M17764L000744K98670l840056m718099k738773j062519
$$ plain form
33950 -12238513 -12176126 -9665801 -4622747 -603764 -512892 -1573507 1166873 6888338 9320986
33941 9320986 5778089 999618 -190255 465799 -1233362 -5025398 -7763572 -8891814
33933 -8891814 -9101376 -5617041 4922461 19074719 27959774 26978774 19307060 9524549
33925 9524549 240200 -3670009 4030904 20472424 31127848 25667564 11953039 5554012
33917 5554012 8412389 8424711 -219426 -8239344 -6592409 259992 3605789 4234861 7221752
33908 7221752 9226417 3040020 -7529851 -9830663 -965931 7020171 4659353 -2102547
33900 -2102547 -2769005 2330756 5708721 5711542 6409186 7839974 6020878 1969131 1901317
33891 1901317 7290024 12136337 12083265 9832323 9131566 9223296 8335141 7806202 9358813
$$ packed form
33950a2238513O2387K510325N043054M018983R0872j060615K740380N721465K432648
33941I320986l542897m778471j189873O56054j699161l792036k738174j128242
33933h891814k09562L484335J0539502J4152258Q885055r81000p671714r782511
33925I524549r284349l910209P700913J6441520J0655424n460284j3714525o399027
33917E554012K858377J2322q644137q019918J646935O852401L345797O29072K986891
33908G221752K004665o186397j0569871k300812Q864732P986102k360818o761900
33900b102547o66458N099761L377965K821O97644J430788j819096m051747o7814
33891A901317N388707M846313n3072k250942p00757R1730q88155n28939J552611
$$ plain form
33882 9358813 11969108 14185036 16069823 16637841 13429517 7335813 3747249 5614005
33874 5614005 8994861 8840191 5648020 2869187 1326612 223146 270661 1315494 -137471
33865 -137471 -6196856 -12823269 -14513015 -11463297 -7426133 -3092654 2833019 8183322
33857 8183322 9278081 7266914 6472082 7036687 5320136 1529325 810842 5823963 13303660
33848 13303660 18722102 19983630 16797703 11282810 8368121 9848471 9185030 -550447
33840 -550447 -14175790 -18678168 -11119075 -2904088 -3295116 -8017864 -8866127 -5630582
33832 -5630582 -2095973 1855981 6437581 6964297 1433870 -2020657 5277187 18620325
33824 18620325 24861639 19775833 11743553 8427802 8263111 6755909 4098247 3405708
$$ packed form
33882I358813K610295K215928J884787N68018l208324o093704l588564J866756
33874E614005L380856j54670l192171k778833j542575j103466M7515J044833j452965
33865a37471o059385o626413j689746L049718M037164M333479N925673N350303
33857H183322J094759k011167p94832N64605j716551l790811p18483N013121P479697
33848A3303660N418442J261528l185927n514893k914689J480350o63441r735477
33840e50447j3625343m502378P559093Q214987l91028m722748q48263L235545
33832e630582L534609L951954M581600N26716n530427l454527P297844J3343138
33824A8620325O241314n085806q032280l315751j64691j507202k657662o92539
$$ plain form
33816 3405708 5831488 10052904 14044076 16015702 15261096 12179967 6499682 -2626774
33808 -2626774 -12976266 -18823884 -17416552 -12940710 -10282099 -8057243 -2423817 5476270
33800 5476270 11444041 14747224 16692064 15424038 9109114 2215365 1031146 4114885
33792 4114885 4801763 2137625 987276 1922514 596659 -1966397 1278343 10835150
33784 10835150 17194651 14391213 8186983 5385556 3583001 -1404107 -5500703 -2681497
33776 -2681497 3812288 5844392 3127943 2841654 7703454 12562943 13282957 11939699
33768 11939699 11507209 10990637 8306579 4149091 616168 -1564567 -2663447 -2533696
33760 -2533696 -1002300 1321894 3595463 5650578 7863535 10145042 11275479 10007616
$$ packed form
33816C405708K425780M221416L991172J971626p54606l081129n680285r126456
33808b626774j0349492n847618J407332M475842K658611K224856N633426P900087
33800E476270N967771L303183J944840j268026o314924o893749j184219L083739
33792D114885O86878k664138j150349R35238j325855k563056L244740R556807
33784A0835150O359501k803438o204230k801427j802555m987108m096596K819206
33776b681497O493785K032104k716449k86289M861800M859489P20014j343258
33768A1939699m32490n16572k684058m157488l532923k180735j098880J29751
33760b533696J531396K324194K273569K055115K212957K281507J130437j267863
$$ plain form
33752 10007616 7447973 7007781 10011829 12408072 8904596 228127 -7010286 -8074569
33744 -8074569 -4538136 -618422 1264286 553355 -1869381 -2994123 -436222 3031373
33736 3031373 2051679 -3023360 -5735060 -3512720 -2021919 -5737944 -9908219 -7308031
33728 -7308031 1349727 9512055 13809369 15051576 13161450 7775147 2438798 1802358
33720 1802358 4752225 5540901 1695004 -3829386 -8042669 -10477954 -9959196 -3764373
33712 -3764373 8000351 20091657 25871689 22319676 11740652 156322 -6854074 -8522315
33704 -8522315 -8138049 -7030803 -2448062 6094479 12402821 10650070 4438439 2976485
33696 2976485 8945793 15703152 16834645 13313501 9728502 7615928 5081927 1125056
$$ packed form
33752A0007616k559643m40192L004048K396243l503476q676469p238413j064283
33744h074569L536433L919714J882708p10931k422736j124742K557901L467595
33736C031373r79694n075039k711700K222340J490801l716025m170275K600188
33728g308031Q657758Q162328M297314J242207j890126n386303n336349o36440
33720A802358K949867P88676l845897n524390m213283k435285N18758O194823
33712c764373J1764724J2091306N780032l552013j0579024j1584330p010396j668241
33704h522315L84266J107246M582741Q542541O308342j752751o211631j461954
33696B976485N969308O757359J131493l521144l584999k112574k534001l956871
$$ plain form
33688 1125056 -1670742 826670 8834769 15681410 13570866 3675274 -3535566 -828178
33680 -828178 7047673 10828277 8399516 3876293 -426576 -4142391 -4388322 765229
33672 765229 6202167 5267481 330813 -547584 2882109 2209887 -5492438 -11861352 -9197602
33663 -9197602 -727575 5448361 6755824 6178597 6590346 9050524 13248355 16701499
33655 16701499 16602059 14193462 13726951 15911998 16675233 13611344 9165009 6373756 6089338
33646 6089338 8757578 13292679 14057908 6145440 -5379964 -9536581 -4418890 803666
33638 803666 1372955 3713840 11544156 16414163 10947016 2314043 1550345 6172577 5527366
33629 5527366 -695965 -1930892 6221291 15715506 18058150 13422324 6091012 -1168078
$$ packed form
33688A125056k795798K497412Q008099O846641k110544r895592p210840K707388
33680h28178P875851L780604k428761m523223m302869l715815k45931N153551
33672G65229N436938r34686m936668q78397L429693o72222p702325o368914K663750
33663i197602Q470027O175936J307463n77227M11749K460178M197831L453144
33655A6701499r9440k408597m66511K185047P63235l063889m446335k791253k84418
33646F089338K668240M535101P65229p912468j1525404m156617N117691N222556
33638H03666N69289K340885P830316M870007n467147q632973p63698M622232o45211
33629E527366o223331j234927Q152183R494215K342644m635826p331312p259090
$$ plain form
33621 -1168078 -5748352 -4814381 818008 6670159 9806317 10441514 8873071 5727904
33613 5727904 4676888 8916260 14670734 14453354 7952273 3492110 6546812 12515083
33605 12515083 13976341 10438656 7320529 8565083 13486622 18613837 20173149 16711907
33597 16711907 11237103 9125503 12650535 19198072 25220582 29255513 30422045 27460761
33589 27460761 21229659 15417174 12567989 11542024 10928888 12576126 18638596 26445179
33581 26445179 29915895 26670653 21135198 19085508 20697668 21195478 17950555 14101500
33573 14101500 13630346 15150848 13706888 7980817 2297450 1070713 4278360 9048083
33565 9048083 12626626 13062081 10546859 9330658 14344276 23908208 29693106 26514520
$$ packed form
33621a168078m580274R33971N632389N852151L136158O35197j568443l145167
33613E727904j051016M239372N754474k17380o501081m460163L054702N968271
33605A2515083J461258l537685l118127J244554M921539N127215J559312l461242
33597A6711907n474804k111600L525032O547537O022510M034931J166532k961284
33589B7460761o231102n812485k849185j025965o13136J647238O062470P806583
33581B6445179L470716l245242n535455k049690J612160M97810l244923l849055
33573A4101500m71154J520502j443960n726071n683367j226737L207647M769723
33565I048083L578543M35455k515222j216201N013618R563932N784898l178586
$$ plain form
33557 26514520 18536552 13079223 12189877 13526114 15463543 17272293 17773437 17822363 20520071
33548 20520071 25097213 25203715 18286031 11719044 13087749 18876841 20647160 18701734
33540 18701734 20382337 26824251 31092236 29380715 25292041 22444797 20909192 21423341
33532 21423341 24943554 27430344 23697833 17398453 17960657 25873241 30811021 27282768
33524 27282768 21916641 20677293 19198450 12782116 6997397 9316485 16337074 18350065
33516 18350065 12887836 6057752 3285697 5374458 11098519 17635427 20862308 20558587
33508 20558587 22310914 28891889 33569123 28847019 18860521 15109561 20937895 27912873
33500 27912873 28077807 22871426 18000197 15078148 11661963 6812842 3840207 7488226
$$ packed form
33557B6514520p977968n457329q89346J336237J937429J808750N01144M8926K697708
33548B0520071M577142J06502o917684o566987J368705N789092J770319j945426
33540A8701734J680603O441914M267985j711521m088674k847244j535605N14149
33532B1423341L520213K486790l732511o299380N62204P912584M937780l528253
33524B7282768n366127j239348j478843o416334n784719K319088P020589K012991
33516A8350065n462229o830084k772055K088761N724061O536908L226881l03721
33508B0558587J752327O580975M677234m722104r986498l750960N828334O974978
33500B7912873J64934n206381m871229k922049l416185m849121k972635L648019
$$ plain form
33492 7488226 18213934 29258014 31746027 24160870 14141106 9012144 7851323 5677796
33484 5677796 1721924 -714255 225516 4086858 10514575 18128256 23000299 22650976
33476 22650976 19886065 18791019 19187147 19170007 20206042 24455512 29573389 32018925
33468 32018925 33365042 36889304 39657530 35395956 24902019 16317397 14292476 15527978
33460 15527978 16097935 16433027 17094881 16011355 12891940 11234173 12997573 15601999
33452 15601999 16642771 17267081 18450790 18311948 15988594 14263550 15392188 17837966
33444 17837966 19889755 22816979 27162400 29298516 25697190 18606050 14018035 15247352
33436 15247352 20859371 27220445 30777690 29650714 25458147 22191345 21439338 20610378
$$ packed form
33492G488226J0725708J1044080K488013p585157j0019764n128962j160821k173527
33484E677796l955872k436179R39771L861342O427717P613681M872043l49323
33476B2650976k764911j095046L96128j7140J036035M249470N117877K445536
33468C2018925J346117L524262K768226m261574j0493937q584622k024921J235502
33460A5527978N69957L35092O61854j083526l119415j657767J763400K604426
33452A5601999J040772O24310J183709j38842k323354j725044J128638K445778
33444A7837966K051789K927224M345421K136116l601326p091140m588015J229317
33436A5247352N612019O361074L557245j126976m192567l266802p52007q28960
$$ plain form
33428 20610378 17683918 14984125 15174981 15835358 12241583 4762986 -730650 -453614
33420 -453614 2837643 4465668 3948369 3782626 3852324 998557 -4967288 -8332552 -3849452
33411 -3849452 5415689 10548928 7377784 926042 -1613209 1613698 8180837 15110492
33403 15110492 18312281 13257432 1540557 -6939518 -4590956 3743436 7821471 6582527
33395 6582527 7591338 13246930 16999380 14457304 9291575 5595111 2811160 1350233
33387 1350233 4430473 9833571 8701109 -1121467 -8691528 -4720521 4616195 7991040
33379 7991040 6605079 9704934 16193677 14486642 1792989 -8929533 -6255320 4387415
33371 4387415 8914350 2527794 -6511754 -8124420 -630866 9255018 13811059 11804933
$$ packed form
33428B0610378k926460k699793J90856O60377l593775p478597n493636K77036
33420d53614L291257J628025n17299j65743O9698k853767n965845l365264M483100
33411c849452R265141N133239l171144o451742k539251L226907O567139O929655
33403A5110492L201789n054849j1716875q480075K348562Q334392M078035j238944
33395F582527J008811N655592L752450k542076n165729l696464k783951j460927
33387A350233L080240N403098j132462r822576p570061L971007R336716L374845
33379G991040j385961L099855O488743j707035j2693653j0722522K674213J0642735
33371D387415M526935o386556r039548j612666P493554R885884M556041k006126
$$ plain form
33363 11804933 9001901 10391491 13598613 13210218 9808823 9044788 11853310 12408320
33355 12408320 7984220 4170972 5887032 8694997 5217877 -3086623 -7283301 -3238016
33347 -3238016 3352977 4999951 976367 -3661098 -4441322 -1345523 1593195 -311717
33339 -311717 -7405974 -13621011 -11978556 -3276594 3403353 942937 -7165168 -11178907
33331 -11178907 -6789398 927780 5045068 4473289 2517040 909677 -1358750 -4370193
33323 -4370193 -5892194 -4395942 -1257886 1171754 2367965 3434214 4849031 5320670
33315 5320670 2948360 -2308975 -7170900 -7164461 -1451403 5540263 9155193 10048708 12056484
33306 12056484 15725977 18084648 18674281 20602103 24045187 24205986 19131618 14547597
$$ packed form
33363A1804933k803032J389590L207122l88395l401395p64035K808522N55010
33355A2408320m424100l813248J716060K807965l477120q304500m196678M045285
33347c238016O590993J646974m023584m637465p80224L095799K938718j904912
33339c11717p094257o215037J642455Q701962O679947k460416q108105m013739
33331a1178907M389509P717178M117288n71779j956249j607363k268427l011443
33323d370193j522001J496252L138056K429640J196211J066249J414817M71639
33315E320670k372310n257335m861925O439N713058O991666L614930Q93515K007776
33306A2056484L669493K358671N89633J927822L443084J60799n074368m584021
$$ plain form
33298 14547597 15836142 19127010 16742389 9211199 4848249 7739065 12734841 13334127
33290 13334127 8780082 2030179 -3655350 -4140034 3873182 17263629 27096864 28143669
33282 28143669 24039737 20307494 17115156 12883968 9902655 10288516 10125286 4801106
33274 4801106 -1906913 -1752194 5432968 10956053 10297278 9121661 12881691 17438386
33266 17438386 15813845 9601345 6748132 9685515 11933900 7191929 -2438117 -8658282
33258 -8658282 -5255551 6207816 17530915 21237102 18065815 15586630 17999060 20684428
33250 20684428 18297973 14200876 15187099 19186190 17182250 8092211 2118155 5479419
33242 5479419 11021945 10663412 8862755 13791928 20943025 18121624 5228657 -3667526
$$ packed form
33298A4547597J288545L290868k384621p531190m362950K890816M995776N99286
33290A3334127m554045o749903n685529m84684Q013216J3390447R833235J046805
33282B8143669m103932l732243l192338m231188k981313L85861j63230n324180
33274D801106o708019J54719P185162N523085o58775j175617L760030M556695
33266A7438386j624541o212500k853213K937383K248385m741971r630046o220165
33258h658282L402731J1463367J1323099L706187l171287k479185K412430K685368
33250B0684428k386455m097097R86223L999091k003940r090039n974056L361264
33242E479419N542526l58533j800657M929173P151097k821401j2892967q896183
$$ [...]
##END NTUPLES=NMR SPECTRUM
##END=
