##TITLE=31Pdec_BAU-j-3.06
 DMSO-d6, 24 sc
 3.7.2019
##JCAMPDX= 6.0         $$ Bruker NMR JCAMP-DX V2.0
##DATA TYPE= NMR SPECTRUM
##DATA CLASS= NTUPLES
##ORIGIN= UXNMR, Bruker Analytische Messtechnik GmbH
##OWNER= root
$$ XWIN-NMR		Version 3.5
$$ Wed Jul  3 16:10:29 2019 Russian Standard Time (UT+4h)  she@DPX200
##.OBSERVE FREQUENCY= 81.013821
##.OBSERVE NUCLEUS= ^31P
##.ACQUISITION MODE= SIMULTANEOUS
##.ACQUISITION SCHEME= undefined
##.AVERAGES= 24
##.DIGITISER RES= 17
##SPECTROMETER/DATA SYSTEM= spect
##.PULSE SEQUENCE= zgpg30
##.SOLVENT NAME= DMSO
##.SHIFT REFERENCE= (INTERNAL, DMSO, 0, 182.463)
##AUDIT TRAIL= $$ (NUMBER, WHEN, WHO, WHERE, WHAT)
$$ ##TITLE= Audit trail, XWIN-NMR		Version 3.5
$$ ##JCAMPDX= 5.01
$$ ##ORIGIN= Bruker BioSpin GmbH
$$ ##OWNER= she
$$ F:/spectra/data/she/nmr/P31/1/pdata/1/auditp.txt
$$ ##AUDIT TRAIL=  $$ (NUMBER, WHEN, WHO, WHERE, WHAT)
(   1,<2019-07-03 16:08:04.73 +0400>,<she>,<DPX200>,
      <created by zg, POWCHK disabled, PULCHK disabled
       configuration hash MD5:
       00 E9 B6 7A A2 85 ED C7 34 08 36 98 17 FE 4E 26
       data hash MD5: 32K
       81 4E 65 A9 24 43 C2 FF E2 9A 4D 01 D3 D6 41 F1>)
(   2,<2019-07-03 16:08:21.81 +0400>,<she>,<DPX200>,
      <Start of raw data processing
       efp BC_mod = 2 LB = 1 FT_mod = 6 PKNL = 1 PHC0 = -2484.59 PHC1 = -41.40123 SI = 64K 
       data hash MD5: 64K
       0B 9A 96 DD 38 D9 03 C5 01 DA 45 0C 52 7C E9 55>)
(   3,<2019-07-03 16:08:44.82 +0400>,<she>,<DPX200>,
      <pk PHC0 = 18.68993 PHC1 = -79.6 
       data hash MD5: 64K
       FA 7B 14 76 DA CC 8A 5B CC E0 A7 65 70 D9 64 E7>)
(   4,<2019-07-03 16:08:49.31 +0400>,<she>,<DPX200>,
      <abs ABSG = 5 
       data hash MD5: 64K
       AE 4E 76 09 FA 9B 5E 99 5E A0 CB 8E 5B B3 94 98>)
$$ ##END=
$$ 
$$ hash MD5
$$ 1D 0E 65 2C F0 C1 45 13 F3 36 A7 62 6F 74 BA C0
##$RELAX= 
##$RELAX= 
##$RELAX= 
##$RELAX= 
##$RELAX= 
##$RELAX= 
##$RELAX= 
##$RELAX= 
$$ Bruker specific parameters
$$ --------------------------
##$DU= <F:/spectra>
##$EXPNO= 1
##$NAME= <P31>
##$PROCNO= 1
##$TYPE= <nmr>
##$USER= <she>
##$AMP= (0..31)
100 100 100 100 100 100 100 100 100 100 100 100 100 100 100 100 100 100 
100 100 100 100 100 100 100 100 100 100 100 100 100 100 
##$AQSEQ= 0
##$AQ_mod= 1
##$AUNM= <au_zg>
##$AUTOPOS= <>
##$BF1= 81.014009
##$BF2= 200.13
##$BF3= 200.13
##$BF4= 200.13
##$BF5= 200.13
##$BF6= 200.13
##$BF7= 200.13
##$BF8= 200.13
##$BYTORDA= 1
##$CFDGTYP= 0
##$CFRGTYP= 5
##$CHEMSTR= <none>
##$CNST= (0..31)
1 1 145 1 1 1 1 1 1 1 1 1 1 1 1 1 1 1 1 1 1 1 1 1 1 1 1 1 1 1 1 1 
##$CPDPRG= <waltz16>
##$CPDPRG1= <>
##$CPDPRG2= <waltz16>
##$CPDPRG3= <>
##$CPDPRG4= <mlev>
##$CPDPRG5= <mlev>
##$CPDPRG6= <mlev>
##$CPDPRG7= <mlev>
##$CPDPRG8= <mlev>
##$CPDPRGB= <>
##$CPDPRGT= <>
##$D= (0..31)
0 1 0 0 0 0 0 0 0 0 0 0.03 2e-05 3e-06 0 0 0 0 0 0 0 0 0 0 0 0 0 0 0 0 
0 0 
##$DATE= 1562155684
##$DBL= (0..7)
120 120 120 11 120 120 24 19 
##$DBP= (0..7)
150 150 150 150 150 150 150 150 
##$DBP07= 0
##$DBPNAM0= <>
##$DBPNAM1= <>
##$DBPNAM2= <>
$$ [...]
##$SUBNAM3= <"">
##$SUBNAM4= <"">
##$SUBNAM5= <"">
##$SUBNAM6= <"">
##$SUBNAM7= <"">
##$SUBNAM8= <"">
##$SUBNAM9= <"">
##$SW= 369.568048894756
##$SWIBOX= (0..15)
0 1 3 0 0 0 0 0 0 0 0 0 0 0 0 0 
##$SW_h= 29940.119760479
##$TD= 32768
##$TD0= 1
##$TE= 0
##$TE2= 300
##$TE3= 300
##$TEG= 300
##$TL= (0..7)
0 120 53 12 22 120 120 120 
##$TP= (0..7)
150 150 150 150 150 150 150 150 
##$TP07= 0
##$TPNAME0= <>
##$TPNAME1= <>
##$TPNAME2= <>
##$TPNAME3= <>
##$TPNAME4= <>
##$TPNAME5= <>
##$TPNAME6= <>
##$TPNAME7= <>
##$TPOAL= (0..7)
0.5 0.5 0.5 0.5 0.5 0.5 0.5 0.5 
##$TPOFFS= (0..7)
0 0 0 0 0 0 0 0 
##$TUNHIN= 0
##$TUNHOUT= 0
##$TUNXOUT= 0
##$USERA1= <user>
##$USERA2= <user>
##$USERA3= <user>
##$USERA4= <user>
##$USERA5= <user>
##$V9= 5
##$VALIST= <valist>
##$VCLIST= <CCCCCCCCCCCCCCC>
##$VD= 0
##$VDLIST= <DDDDDDDDDDDDDDD>
##$VPLIST= <PPPPPPPPPPPPPPP>
##$VTLIST= <TTTTTTTTTTTTTTT>
##$WBST= 1024
##$WBSW= 4
##$XGAIN= (0..3)
0 0 0 0 
##$XL= 0
##$YL= 0
##$YMAX_a= 13749
##$YMIN_a= -14437
##$ZGOPTNS= <>
##$ZL1= 120
##$ZL2= 120
##$ZL3= 120
##$ZL4= 120
##$ABSF1= 182.463
##$ABSF2= -187.1042
##$ABSG= 5
##$ABSL= 3
##$ALPHA= 0
##$AQORDER= 0
##$ASSFAC= 0
##$ASSFACI= 0
##$ASSFACX= 0
##$ASSWID= 0
##$AUNMP= <proc_1d>
##$AZFE= 0.1
##$AZFW= 0.5
##$BCFW= 0
##$BC_mod= 2
##$BYTORDP= 0
##$COROFFS= 0
##$CY= -3
##$DATMOD= 1
##$DC= 0
##$DFILT= <>
##$DTYPP= 0
##$F1P= 0
##$F2P= 0
##$FCOR= 1
##$FTSIZE= 65536
##$FT_mod= 6
##$GAMMA= 0
##$GB= 0
##$INTBC= 1
##$INTSCL= 5.30512e-09
##$ISEN= 30
##$LB= 1
##$LEV0= 0
##$LPBIN= 0
##$MAXI= 10000
##$MC2= 0
##$MEAN= 0
##$ME_mod= 0
##$MI= 50
##$NCOEF= 0
##$NC_proc= -5
##$NLEV= 6
##$NOISF1= 182.463
##$NOISF2= 159.3651
##$NSP= 0
##$NTH_PI= 0
##$NZP= 0
##$OFFSET= 182.463
##$PC= 4
##$PHC0= -2465.9
##$PHC1= -121.0012
##$PH_mod= 1
##$PKNL= yes
##$PPARMOD= 0
##$PSCAL= 0
##$PSIGN= 0
##$REVERSE= no
##$SF= 81.0140089999434
##$SI= 65536
##$SIGF1= 159.3651
##$SIGF2= -187.1042
##$SINO= 113.3802
##$SIOLD= 16384
##$SREGLST= <1H.CDCl3>
##$SSB= 0
##$STSI= 65536
##$STSR= 0
##$SW_p= 29940.119760479
##$SYMM= 0
##$S_DEV= 0
##$TDeff= 32768
##$TDoff= 0
##$TI= <>
##$TILT= no
##$TM1= 0
##$TM2= 0
##$TOPLEV= 0
##$USERP1= <user>
##$USERP2= <user>
##$USERP3= <user>
##$USERP4= <user>
##$USERP5= <user>
##$WDW= 1
##$XDIM= 65536
##$YMAX_p= 367638250
##$YMIN_p= -11200624
$$ End of Bruker specific parameters
$$ ---------------------------------
##NTUPLES= NMR SPECTRUM
##VAR_NAME=  FREQUENCY,     SPECTRUM/REAL,   SPECTRUM/IMAG
##SYMBOL=    X,             R,               I
##VAR_TYPE=  INDEPENDENT,   DEPENDENT,       DEPENDENT
##VAR_FORM=  AFFN,          ASDF,            ASDF
##VAR_DIM=   65536,         65536,           65536
##UNITS=     HZ,            ARBITRARY UNITS, ARBITRARY UNITS
##FACTOR=    0.456856943014862, 1,           1
##FIRST=     14782.0589164792, 0,            0
##LAST=      -15158.0608439998, 0,           0
##MIN=       -15158.0608439998, -11200624,   0
##MAX=       14782.0589164792, 367638250,    0
$$ Real data points
##PAGE= N=1
##DATA TABLE= (X++(R..R)), XYDATA
$$ [...]
38663E40707Q3881m8783k63790k01984O4388J11557j24677k45863n6812J31000
38653a0376L2911j31007L4053M59632N95710R0572o60515q38458j34516Q08837
38643B46843J088758N53262j73742o00049q48228j119457j154307o02129L19520
38634b289529R31205Q31760L09732L800K29748O31289N62750q0495o15432m48032
38624F6796O0377J48580j23470k3679M83679N36199j46691o57013l99482j49875
38614b04579o58160j133675m47200P88276R12945j99303q71989j64884Q26551
38605a152018Q04218J15034j23546J91316K76837j34771m94730l78974r107J85179
38595g20562R0005l5438J55831O59856R34148M46226n31421j081284p13499J46440
$$ y = [540707, 624588, 575805, 312015, 110031, 174419, 285976, 161299, -84564, -141376, -10376, 22535, -108472, -74419, 385213, 980923, 1071495, 410980, -427478, -561994, 246843, 1335601, 1888863, 1715121, 1115072, 266844, -852613, -2006920, -2609049, -2289529, -1358324, -526564, -216832, -213032, 16716, 648005, 1210755, 1130260, 514828, 66796, 127173, 275753, 152283, 128604, 612283, 1148482, 1001791, 344778, -54704, -204579, -862739, -1996414, -2443614, -1655338, -742393, -941696, -1813685, -1978569, -1152018, -347800, -232766, -356312, -164996, 111841, -22930, -517660, -896634, -905741, -720562, -630557, -665995, -510164, 149692, 1083840, 1530066, 998645, -82639, -796138, -649698]
38585f49698Q22366R96195N55347m33815j305725j131459K3687Q95720O77731
38576D50349J48637L52244Q60936M94725o34983j125853l77536N33421M64702
38567A166642k81543o49066l14140K13103N29608O51403N43445J2109q00625j285074
38557b14138j015182k98813K26457M22001O66593J007058Q49556p9624r44302
38548F19606p58184N9522R1666r51856j608047p39385P43336J170185M04007k89492
38538a258642k25187Q9199J95971L08932N23231M85433J77715J11140L75504L53639
38528A136935k06129o64896n35279k46572k62806k04187L58788Q52799M03035
38519F31688p32751j361661r14543l0348M48584M00244K27952K72878N72926Q45512
$$ y = [-649698, 172668, 1168863, 1724210, 1290395, -15330, -1146789, -1123102, -227382, 450349, 598986, 951230, 1812166, 2306891, 1671908, 546055, 168519, 701940, 1166642, 885099, 236033, -78107, 134996, 664604, 1316007, 1859452, 1871561, 1070936, -214138, -1229320, -1528133, -1301676, -879675, -213082, 793976, 1643532, 1563908, 619606, -138578, -79056, 12610, -939246, -2547293, -3286678, -2543342, -1373157, -969150, -1258642, -1483829, -1394630, -1198659, -889727, -366496, 118937, 296652, 407792, 783296, 1136935, 930806, 265910, -269369, -515941, -778747, -982934, -624146, 228653, 631688, -101063, -1462724, -2377267, -2407615, -1959031, -1558787, -1330835, -1057957, -485031, 360481]
38509C60481O62706k8026o10496m46345K09357M29703j54458q22569o91362J78483
38499i12526Q97189P94449J07115l65469j93063J72122m6749q72135j395032r24269
38489b738368O5141O12324N78307N68135P20679N10600r1897k56263L99741R93060
38479A361459O34124j73736l59152l1803k25993j029627j254349k96200Q04833
38470e70444Q21011Q065m85126k87798n559q5152l53254n66687o45126l82548
38460b552618L38572J001660Q59697L2101n17528l36387p3757l07636n03162J55317
38450a903741J339264J800248R48553m25190j100836o90356J44160M61262l5752
38441E37612p11669o96472N6415O61159M26901k68513n95464m10802k27187k63183
$$ y = [360481, 1023187, 995161, 384665, -61680, 147677, 577380, 422922, -399647, -1091009, -912526, -15337, 779112, 886227, 520758, 327695, 499817, 453068, -419067, -1814099, -2738368, -2673227, -2060903, -1482596, -914461, -193782, 316818, 224921, -31342, 368399, 1361459, 1995583, 1821847, 1462695, 1430892, 1204899, 175272, -1079077, -1375277, -570444, 250567, 258632, -226494, -514292, -519851, -605003, -958257, -1524944, -2170070, -2552618, -2214046, -1212386, -352689, -320588, -838116, -1174503, -1248260, -1555896, -2059058, -1903741, -564477, 1235771, 2184324, 1759134, 658298, -32058, 112102, 573364, 537612, -174057, -870529, -814114, -152955, 273946, 5433, -590031, -1000833, -1228020, -1491203]
38431a491203j91859J54174M34030L11896j26015n91559q36297o05864J83887
38422b758810J081391J354336Q22083Q3621k37204j01162K14895N20282O03824
38413A583256K02445n46411r84817o78994k2957K89097J70989J20511M30923Q24258
38403A388300Q49776L74237l21299p81456p72544n07021l29042j98814J60255
38394a37608N74193M54687k08967n31422M9352P80356N82142l48289q34638m61064
38384h1258j5195q8966k37163O6945M86139M36651L6410k19167k75894l47250
38374b38748k85185J34335N22358K80814l42423m19210K78520Q41101N15823k49765
38364A037620n76433l79940j41754R5739O08075J043589O20934n36524j214033
$$ y = [-1491203, -1683062, -1528888, -1094858, -782962, -908977, -1500536, -2336833, -2942697, -2758810, -1677419, -323083, 499000, 582621, 345417, 244255, 459150, 979432, 1583256, 1785701, 1239290, 254473, -424521, -447478, -158381, 12608, 133119, 564042, 1388300, 2238076, 2612313, 2291014, 1509558, 737014, 229993, -99049, -297863, -137608, 436585, 891272, 682305, 150883, 200235, 980591, 1562733, 1214444, 379806, -81258, -96453, -185419, -422582, -355637, 130502, 567153, 603563, 384396, 108502, -238748, -523933, -389598, 132760, 413574, 71151, -348059, -69539, 771562, 1287385, 1037620, 461187, 81247, -60507, 35232, 643307, 1686896, 2307830, 1771306, 557273]
38355E57273p38114R166q8341p07020o85051J01476O04441L23135l801K19752
38345d07084M18356j01949q36430p20078L12649J277408J487685J156417O72191
38336C259165O1957o14354r72552p80121l44688j08255j08544r3674M7308K12116
38326E58358K85821K04803n9034l97008n44506l36204O7477L32591K90740L9913
38316D42951k31050m06539m51016l56083j38719J13644K44054J53048m2779o6339
38306g38828K10814N58013N86497J63708m21899o92281l70146L65655R63982R49494
38296A575009L65816l11438p14422q48610p94542m87569r020K41191M4231j99013
38286a138367K1530N34139P20750M63649K51918K78704R9336n13706r65731n91379
$$ y = [557273, -180841, -171675, -260016, -967036, -1652087, -1550611, -946170, -623035, -626836, -407084, 11272, -90677, -927107, -1647185, -1334536, -57128, 1430557, 2586974, 3259165, 3321122, 2706768, 1734216, 954095, 609407, 501152, 392608, 298934, 346242, 558358, 844179, 1048982, 989948, 592940, 48434, -287770, -220293, 112298, 403038, 442951, 211901, -194638, -645654, -1001737, -1140456, -1026812, -782758, -629710, -672489, -738828, -528014, 29999, 616496, 780204, 358305, -333976, -704122, -338467, 625515, 1575009, 1940825, 1629387, 914965, 66355, -728187, -1215756, -1224776, -983585, -939354, -1138367, -1116837, -582698, 138052, 601701, 853619, 1132323, 1231659, 717953, -247778, -839157]
38276h39157L58966J004632Q86618K69738l95489p77590n74361K28248R49320
38267A110925P23006l22849r84230n00514L51221L04166n95982j049716l40971
38258a304944P21568J002586M84296l993l169K50615M15726L27371j36786q54477
38248H98793j225710p72223P6762M44730K18357N2306J51661j1997n21589n75459
38238a264369K04043R29415O89532j12494n27406m98405n30611m94182N2522O92319
38228h59636N74508j00166k72716K49128N12086P6743k82541N5428O26467Q29578
38218A408879P63979N68086k0337p84056p90874J04715N63217l53368j516109
38209e5868j270448N7175P18422K35470j04872M96766J170657R15872M6659n75538
$$ y = [-839157, -480191, 524441, 1411059, 1680797, 1285308, 507718, -66643, 161605, 1110925, 1833931, 1511082, 526852, 26338, 377559, 681725, 85743, -963973, -1304944, -583376, 419210, 903506, 899513, 896344, 1146959, 1562685, 1890056, 1753270, 898793, -326917, -1099140, -1022378, -577648, -359291, -306985, -155324, -167321, -688910, -1264369, -1060326, -130911, 558621, 446127, -81279, -579684, -1110295, -1604477, -1551955, -859636, -285128, -385294, -658010, -408882, 103204, 179947, -102594, -47166, 579301, 1408879, 2172858, 2740944, 2720607, 1936551, 1145677, 1250392, 1813609, 1460241, -55868, -1326316, -1269141, -550719, -315249, -420121, 76645, 1247302, 2163174, 2209833, 1634295]
38199A634295p86123q48908o84637j71010K63857J15430l71135m81835k2453M86082
38189h66437N50876K23663j36842k89441k32498j06697m1441k5485M4096J60784
38179g19422J95991J59344K65135N53375O29185R5713p87969j218144p50314J50883
38169a426223O73580N82304K73726L2414k85643p01268p58724j39026P12162J080518
38159D3820Q82801N22051Q0930n77519j006329m70004P09472J114100J23728j012674
38149D10376q11781L98938J030613M07848o09552r93832n91077J83155Q40947
38140B65635R34556L96672j39224P930N66287O22057n9252p57265r21712p93952
38130A21732p03805n02159l3882M34923O06995M93911J58388l53947o70575l32602
$$ y = [1634295, 848172, -736, -685373, -856383, -592526, -477096, -848231, -1330066, -1352519, -866437, -315561, -91898, -228740, -518181, -750679, -857376, -898817, -924302, -880206, -719422, -523431, -364087, -98952, 454423, 1083608, 1179321, 391352, -826792, -1577106, -1426223, -752643, -170339, 103387, 135801, -149842, -851110, -1609834, -1748860, -1036698, 43820, 926621, 1448672, 1529602, 952083, -54246, -524250, 185222, 1299322, 1423050, 410376, -401405, -2467, 1028146, 1435994, 826442, -167390, -758467, -575312, 265635, 1200191, 1596863, 1457639, 1465569, 2031856, 2653913, 2594661, 1837396, 915684, 121732, -582073, -1084232, -1118114, -683191, -76196, 417715, 576103, 222156, -448419, -781021]
38120g81021L78173N42327j22448p61390n78389J14113N34833N08281L13310L392
38110A51181m37244o54389l35407J82596L19977Q2349m7234J34910L95893N06189
38100B98821L97322N7777l15599k83274K69618P45698N06685k29180o56938m46525
38090C44405n2495J097k84740n39571m68165r7711K77461M53327O06691R35107
38080A175406J044273L14847r30967j428928o57430K61658J44247m78911k67678
38071h23483P20718J082988K65546o59416p45040m70979o27122q60694k97253
38062b414735Q66311J371243N53424o63105p81951M39577J552391J066365o23237
38053A366283j548112o23299R16371J190084J72663n36737j63210L36866L4557
$$ y = [-781021, -402848, 139479, 17031, -744359, -1322748, -1208635, -673802, -165521, 147789, 151181, -286063, -940452, -1275859, -1093263, -773286, -690937, -738171, -603261, -207368, 298821, 696143, 753920, 438321, 155047, 424665, 1170363, 1677048, 1447868, 790930, 344405, 291910, 293007, 8267, -531304, -999469, -1097180, -819719, -366392, 240299, 1175406, 2219679, 2534526, 1603559, 174631, -482799, -221141, -76894, -555805, -823483, -102765, 980223, 1245769, 586353, -158687, -629666, -1256788, -2117482, -2414735, -1548424, -177181, 376243, -286862, -1068813, -629236, 923155, 1989520, 1366283, -181829, -805128, 111243, 1301327, 1473990, 937253, 774043, 1110909, 1145466]
38044A145466n52521m66166J70928M86473J87929k31230l48758k23554o1245L8711
38034A46033L2280o8304j83279k86809l94864l95533j76915N1558k4407k28282
38024a528522l7271N28172P51953K41965m63007o59196l23829J69221O21826Q70251
38014A71563O41693O6841k06118L8770J05806m74941r48265l80879P55285J119753
38004H89508M12744l40887m06966j62927r7564n943L51789N67025J51272o60354
37994F97697j143115q55499N7784J009808J270439N57491m65066p20877J0077
37985D18739P91709P41911N4805n10388o47859n32063k59023J21453K70079r1001
37975C58362n71055m81199J31617M29253j0722m86604j31939P72641J085925L75879
$$ y = [1145466, 592945, 126779, 297707, 784180, 972109, 740879, 392121, 168567, 107322, 146033, 178313, 110009, -73270, -360079, -754943, -1150476, -1327391, -1275833, -1300240, -1528522, -1565793, -1037621, -285668, -43703, -506710, -1165906, -1489735, -1320514, -698688, 171563, 813256, 880097, 673979, 712749, 818555, 343614, -604651, -985530, -230245, 889508, 1302252, 961365, 554399, 391472, 293908, 287965, 639754, 1206779, 1358051, 697697, -445418, -1300917, -1243133, -233325, 1037114, 1594605, 1129539, 408662, 418739, 1210448, 1952359, 2007164, 1496776, 848917, 316854, 57831, 179284, 449363, 358362, -212693, -693892, -562275, -133022, -143744, -630348, -762287, 10354, 1096279, 1472158]
37965A472158m52069m07192K32813M24045o8992m21389j46320J49362j06134l58185
37955C18097J60063R20313O44007p06404j634595j134165N987N03793L27519K84165
37945c11220M67770K02102n97348j010964l45930Q74262J524751J119985J48931
37936B072339n75944o32844j88003K75825L92327J50029k24002n10543o00960
37927A58224n08983l85494l82172m02347j80922K65908N47678M66235L44336M53135
37917C75598M71766M0156m45879l05200K83941M25221j26385n88024m30821j84111
37907d83738m19638o89514k61069O07471J002288O80979K23879K7043k1764M7632
37897G13569L20317M19931j62278r98406r75060K2362O81851J36194o82652m59771
$$ y = [1472158, 1020089, 612897, 845710, 1269755, 1200763, 779374, 633054, 782416, 676282, 318097, 478160, 1398473, 2042480, 1336076, -298519, -1432684, -1426697, -922904, -595385, -311220, 156550, 358652, -238696, -1249660, -1595590, -721328, 803423, 1923408, 2072339, 1496395, 863551, 675548, 951373, 1343700, 1493729, 1269727, 759184, 158224, -350759, -736253, -1118425, -1520772, -1701694, -1435786, -888108, -421873, -77537, 375598, 847364, 887520, 441641, 136441, 420382, 845603, 719218, 131194, -299627, -483738, -903376, -1592890, -1853959, -1246488, -244200, 436779, 660658, 687701, 665937, 713569, 1033886, 1453817, 1291539, 293133, -681927, -659565, 22286, 158480, -524172, -983943]
37887i83943M94082Q01800J48515m10631j99300K26359K09141m8654q2546P5412
37877B30235K08156L49079M60196K47627k50579m38129k0730M11565K19116l25396
37867A091140n40553m13534m38657o20894m40179K03801P26862O81832K93279
37858E43097N676n9461l8195p7095k68641n30593n29156p3707M45419M84239K13655
37847A15238L54747R87004J198839L44518r15670j420323r64765k95590R4100
37838e01902L80591O36135M76121j77856o28506k55729N37028Q33193M64708J14084
37828A877867J71724K02240j90675o17430n44135k11044k11847m13127j24231
37819f0658O29356Q66837M8242r89145j071789k25269M63847K91767l68326p72019
$$ y = [-983943, -489861, 311939, 460454, 49823, -149477, 76882, 286023, 237369, 154823, 230235, 438391, 787470, 1247666, 1495293, 1244714, 806585, 785855, 1197420, 1416536, 1091140, 550587, 137053, -301604, -922498, -1362677, -1158876, -432014, 249818, 543097, 548773, 489312, 451117, 374022, 105381, -425212, -954368, -1028075, -582656, -98417, 115238, 469985, 1456989, 2655828, 3000346, 2084676, 664353, -300412, -596002, -501902, -121311, 514824, 990945, 813089, 184583, -71146, 465882, 1299075, 1763783, 1877867, 2049591, 2251831, 2061156, 1443726, 899591, 688547, 476700, 63573, -60658, 568698, 1435535, 1483777, 494632, -577157, -802426, -338579, -46812, -415138, -1187157]
37809a187157o79304m01070k78340k60740L4510P58726J357905J052108m1044
37800C55594p68113l42772N75613P97223K13491k51185n8230M16012O99180P01295
37790B338108K99497o58025j659093j675961m74502Q71265J260961Q12688L27359
37781A442297N0935l54635r22739j183232q55591k53197J23529J59609J88157
37772a604867N04505Q44412N72002l72553j041344n87535M10036O01958j50337
37763h23723n35013J30954P67096K54018p45422q37431n8684L45983l5783l27391
37753a865396L7946M97688M21574J727k79400k83056j0160N04094Q17297L68840
37743B11154n22213p39052R4608R22030O96662j77282n92729l47028r2931n5740
$$ y = [-1187157, -1866461, -2267531, -2545871, -2806611, -2772101, -2013375, -655470, 396638, 355594, -412519, -755291, -179678, 617545, 831036, 579851, 521621, 937633, 1636813, 2338108, 2637605, 1979580, 320487, -1355474, -1829976, -958711, 302250, 1114938, 1442297, 1493232, 1138597, 215858, -967374, -1822965, -2076162, -1952633, -1793024, -1604867, -1100362, -255950, 316052, -56501, -1097845, -1685380, -1275344, -673386, -823723, -1358736, -1227782, -460686, -206668, -952090, -1789521, -1848205, -1502222, -1538005, -1865396, -1827450, -1329762, -908188, -906461, -1185861, -1468917, -1479077, -974983, -157686, 211154, -311059, -1050111, -955503, -33473, 663189, 485907, -106822, -453850, -546781, -602521]
37733f02521J73009O18597O88397J86803k42181p3140L30520L60124O1090j47887
37723A352811k50172m84499o75819m43845k2349r2529o43161p87191j11685N42071
37713a616368L15179k79786j50936N72889P04224m1452m86592J65611J019053
37704B01822Q05141k68391r42847p15786k37665q2170m6324K25792O30039Q29775
37694C99386O56569J58060m32035p54710o50919l70002j82292L7634M77441Q55546
37684A94678P18538J54171k82574l00612j03901K7926r261j95362l23747r9291
37674b19435L36164L57235j69959l95161K67506R45692M61316p04605r63159m7397
37664a31803O02666J30087n66299n16928j38046j61575l17215j02658J10078j77875
$$ y = [-602521, -429512, 189085, 877482, 1064285, 822104, 748964, 1079484, 1439608, 1500698, 1352811, 1102639, 618140, -57679, -501524, -523873, -616402, -1259563, -2046754, -2158439, -1616368, -1301189, -1580975, -1731911, -1159022, -454798, -496250, -982842, -817231, 201822, 1006963, 738572, -204275, -920061, -1157726, -1239896, -1286220, -1060428, -430389, 399386, 1055955, 1214015, 781980, 27270, -623649, -993651, -1175943, -1138309, -660868, 194678, 913216, 1067387, 784813, 484201, 380300, 408226, 398965, 203603, -120144, -219435, 116729, 473964, 304005, -91156, 176350, 1122042, 1583358, 878753, -84406, -131803, 470863, 600950, 34651, -482277, -620323, -781898, -1099113, -1201771, -1091693, -1269568]
37654a269568n30796l40909L7298l956j31756K48087O89993L71906l53685m23584
37644a706970J64584M29747J71655K17490P57701Q67062J12934o42003o44261
37635b72061l31468l00424k15859L58919Q66876N40893k31353l77337K56437P30490
37625A025113M30294j76431l76995j53489K7837n3032k01212j90586m3219O4109
37615C52389K5948j33173l88911p58186j094549j005727k86073O01691Q73319
37606a813272L76847j81109j84828J02405P6121k05308j21212M84514R66466P49210
37596B49834Q9249l47758l73364l37143m25290l56528R0811N97417O62899L15605
37586A65732J21308M20035Q21501O60290j59988r90893j128517n38809J83037
$$ y = [-1269568, -1800364, -2141273, -2103975, -2107931, -2239687, -1991600, -1301607, -929701, -1283386, -1706970, -1542386, -1112639, -940984, -723494, 34207, 901269, 1014203, 372200, -272061, -603529, -903953, -1119812, -760893, 105983, 646876, 415523, 38186, 294623, 1025113, 1455407, 1278976, 901981, 748492, 776329, 723297, 522085, 331499, 288280, 352389, 378337, 245164, -143747, -901933, -1996482, -3002209, -3288282, -2686591, -1813272, -1436425, -1617534, -1802362, -1699957, -1623836, -1829144, -1950356, -1465842, -499376, 249834, 339083, -8675, -382039, -719182, -1144472, -1501000, -1410189, -812772, -149873, 165732, 287040, 707075, 1528576, 2188866, 2028878, 1037985, -90532, -629341, -446304]
37577d46304M94823L97768K02673k145l61586p41868o30831J35818Q44669O20068
37567E13085l77354r93660m66273O65595J253714P94450k42216j014983r77268
37558h44910k23599N39886N87537k3842m76139k16886L59379N46249K85700N9012
37548E92387P7113Q9450q8687k93841k62940J10464O90756J049668P05035k76976
37538B392429j118971j128557m85704R9364K77656J98099M9k94134m95278l71296
37528i26343k8391K27403L12688K82511L7528m12915o29561k66559K73167L45444
37518g85028O4719P6352M37250N32285J19574l63077o27761q31016q73677l09839
37508b560218O99952J196342O85385j07005k80249O1467K56867J74401J77601
$$ y = [-446304, 48519, 446287, 648960, 646815, 285229, -456639, -1087470, -951652, -106983, 513085, 135731, -857929, -1324202, -658607, 595107, 1389557, 1147341, 132358, -844910, -1068509, -528623, 58914, 35072, -441067, -657953, -298574, 247675, 533375, 592387, 669500, 758950, 670263, 376422, 113482, 223946, 914702, 1964370, 2669405, 2392429, 1273458, 144901, -340803, -241439, 36217, 234316, 234365, -59769, -555047, -926343, -954734, -727331, -414643, -132132, -94604, -507519, -1137080, -1403639, -1130472, -785028, -720309, -643957, -206707, 325578, 445152, 82075, -545686, -1376702, -2250379, -2560218, -1860266, -663924, 21461, -85544, -365793, -304326, -47459, 126942, 304543]
37499C04543L42127L51852O3370k68464l04599J8114L38264J22737o16104j008140
37489f56300l43518O95120P21208l17854q94342j42026Q09955N87844l46965n51319
37479d38197J33076N13767Q046o07189n26254K8897L89230L48515J49838J0765
37469A0494o7310j98525l64259k38667M11331J024788N95061q07408j583784n37818
37459a756097J279173J740560L99268j078287j218155l41105L81705M59484J98655
37450F5201O863N8039K30995J52789l06664n94844j23394O81615P73190K4046
37440I67836n29777k62782J69870M6937k25621Q1922O75832O27901j83925q77957
37430D90236p77968j57659L08641L46446J70399P6641J29638J77131J08463M0356
$$ y = [304543, 646670, 998522, 1061892, 793428, 488829, 506943, 845207, 967944, 351840, -656300, -999818, -304698, 416510, 98656, -795686, -937712, -127757, 460087, 113122, -438197, -305121, 208646, 216692, -390497, -916751, -887854, -498624, -150109, -271, 10494, -56816, -255341, -619600, -858267, -446936, 577852, 1172913, 365505, -1218279, -1756097, -476924, 1263636, 1662904, 584617, -633538, -974643, -592938, -133454, 65201, 72064, 130103, 361098, 513887, 207223, -387621, -511015, 170600, 943790, 967836, 438059, 175277, 345147, 392084, 166463, 248385, 924217, 1552118, 1368193, 490236, -287732, -445391, -136750, 209696, 380095, 456736, 586374, 763505, 871968, 912324]
37420I12324J31700K59341J08344l78705q67144j000363p19289k21573J82042
37411a593323K26609l0723j85535k6638R5606j35160l09585J21511P38338N38883
37401e60017m61402r72412j67252J126849J508288O64466n45178j149652p65773
37392a322083K60467J009965P89191P2650o50O49551P59854k97121j314071r75217
37382c67464J35397M74987j64567o53649m16503M6760L41909N49839M72192j72036
37372B46865p52452k78355Q78794J186394K07529p30546o38138k30275m15684
37363e25868p39014m02931K17557K96033N268L9230K98486K55098J36989N15270
37353I6118J064210R81752M26166K74496N44327L48503m95246j086342r37540
$$ y = [912324, 1044024, 1303365, 1411709, 1033004, 165860, -834503, -1553792, -1775365, -1593323, -1366714, -1397437, -1582972, -1609610, -1514004, -1649164, -1958749, -1837238, -1098900, -560017, -1021419, -1993831, -2161083, -1034234, 474054, 1138520, 593342, -556310, -1322083, -1061616, -51651, 737540, 810190, 809540, 1459091, 2218945, 1921824, 607753, -367464, -232067, 242920, 78353, -575296, -991799, -945039, -603130, -53291, 418901, 246865, -505587, -783942, 94852, 1281246, 1488775, 758229, 120091, -110184, -525868, -1264882, -1667813, -1450256, -1154223, -1148955, -1109725, -811239, -556141, -419152, 96118, 1160328, 2142080, 2568246, 2842742, 3387069, 3735572, 3240326, 2153984, 1216444]
37344A216444o53720p17755p17373l06758Q4236J17650J92199N43381N85567n3794
37334B90077o38971l68785L41225N61451K67956O5669j2552l27859o11249l01377
37324g34415K59229J59427n42756p80701j24675O45139Q51302P12641N00444K8327
37314I73962n25007m01018M40849Q39939R6225q21542p33486o9964j3598m73230
37304f86870l57793M27024P68562K29694k51620N4141N72623N13342R0666o6042
37294A293727R363q6259k69160k03297q1387l94439j014087j185588n21317N05179
37284a947265J187489J299452J013774M88994j33650n27373l97860M3059J84795
37275A211415j73586m23065K9803P26312N90984n01280j326311r18222O5922L12650
$$ y = [1216444, 562724, -155031, -872404, -1179162, -1094926, -977276, -785077, -241696, 343871, 290077, -348894, -717679, -376454, 184997, 452953, 518622, 506070, 178211, -433038, -734415, -475186, -315759, -858515, -1639216, -1763891, -1118752, -267450, 445191, 945635, 973962, 448955, 47937, 488786, 1328725, 1424950, 603408, -130078, -200042, -213640, -686870, -1044663, -617639, 150923, 380617, 128997, 183138, 755761, 1269103, 1359769, 1293727, 1303090, 1216831, 947671, 744374, 662987, 268548, -745539, -1931127, -2452444, -1947265, -759776, 539676, 1553450, 2042444, 1908794, 1381421, 983561, 1026620, 1211415, 1037829, 614764, 644567, 1370879, 1961863, 1460583, 134272, -783950, -718028, -405378]
37265d05378k61344n33781L8764O79383N81474O2704r9113J17007P6126m49787
37255a93945q93216o07444L05566R79675O21240n54997j357554q69635M25890
37246b144420J183476Q29202J32943K9416M44890O53816L73006O345l8695J45944
37236A615923J94369l4068l13011m00785m00415n27622n58331k0326Q29279Q94142
37226A279155k48411j328848q87826N69948J158864K59964p95759r10642o07946
37217a511501o06760m23898N15423J429280J155027j9354p14448l33906M41944
37208f8193Q01728N31896k10934j024635j295263q05457j27712J71514L39831
37199a687225P73548J059398O15588j19745k19172K61245M44312J16562j01306
$$ y = [-405378, -666722, -1200503, -1161739, -482356, 99118, 161822, 62709, 179716, 255842, -193945, -1087161, -1694605, -1389039, -409364, 211876, -343121, -1700675, -2570310, -2144420, -960944, -131742, 1201, 30617, 475507, 1129323, 1502329, 1508674, 1469979, 1615923, 1810292, 1776224, 1463213, 1062428, 662013, 134391, -423940, -444266, 385013, 1279155, 1030744, -298104, -1185930, -615982, 542882, 802846, 7087, -903555, -1511501, -2118261, -2542159, -2026736, -597456, 557571, 538217, -176231, -510137, -68193, 733535, 1265431, 1054497, 29862, -1265401, -2070858, -2198570, -2027056, -1687225, -913677, 145721, 761309, 641564, 422392, 683637, 1127949, 1244511, 1143205]
37190A143205k4732j32737m13438k26783L70752L90000m55491r78382j58087J273756
37180G88063J742674Q05706n36597j158313q04588o026M70967K05954m95874r09576
37170A02390p28513l55561k44619l20188k63408l4240J60195K01238J69030K36543
37160a077133M66308N91985K24483m41832n38744K60703Q70252J18102j282000
37151h07876j382601J91445J472082Q39991p27458j136120m1196J005173Q61499
37142B74939L6757m02656k04253J09074R9618j17304j21764K37454N88446M92292
37132I92603N5192k58112l40200m35222m40504L5870P50108Q16803L4689o27157
37122E84070m43792l620j02583l66660o112O49230N84854j95557o09951j50192
$$ y = [1143205, 1118473, 985736, 572298, 345515, 716267, 1106267, 650776, -327606, -485693, 788063, 2530737, 3336443, 2799846, 1641533, 836945, 830919, 1301886, 1507840, 1011966, 102390, -626123, -981684, -1226303, -1546491, -1809899, -1844139, -1683944, -1482706, -1313676, -1077133, -610825, -18840, 205643, -236189, -774933, -514230, 356022, 474124, -807876, -2190477, -1999032, -526950, 313041, -414417, -1550537, -1591733, -586560, 274939, 311696, -90960, -295213, -186139, -86521, -203825, -325589, -88135, 500311, 992603, 1047795, 789683, 449483, 14261, -426243, -390373, 359735, 1176538, 1211227, 584070, 140278, 136658, 34075, -332585, -338697, 310533, 895387, 699830, 89879, -60313]
37112f0313M90508O14042L68847J05576k50488p28510q89444m16775K86769N64994
37102H5206L22400K0568L9850L21344N35730M21695K2917l25954l20619j1941
37092A111196K66032K45371q1742m86138n83086r7622O99665J022378L97663o46875
37082A846842j122678p65138k56952k22525m54963l82332L7364K89211R6519j52722
37072a087374J3598L71561K26123n07878r22868k34424J026634J548203Q74281
37063A307856j56291o70100p24609p36769o58006k41828L55188P84313R78753
37054B38507R60002N34849k87011q67412n35376M75531J160042Q30362k05185
37045B304309j032203j046155n32075l12201o55594p81333N2193J216548J347838
$$ y = [-60313, 430195, 1044237, 1413084, 1518660, 1268172, 539662, -349782, -766557, -479788, 85206, 407606, 428174, 468024, 789368, 1325098, 1746793, 1769710, 1443756, 1123137, 1111196, 1377228, 1622599, 1540857, 1054719, 471633, 374011, 1073676, 2096054, 2493717, 1846842, 724164, -40974, -297926, -520451, -975414, -1357746, -1320382, -1031171, -934652, -1087374, -1073776, -702215, -476092, -983970, -1906838, -2141262, -1114628, 433575, 1307856, 1151565, 481465, -243144, -979913, -1637919, -1879747, -1524559, -740246, 238507, 1198509, 1733358, 1446347, 578935, 43559, 519090, 1679132, 2509494, 2304309, 1272106, 225951, -306124, -618325, -1273919, -2055252, -2003059, -786511, 561327]
37036E61327K96130o16748n16190q451J44277J63828L65716L14651k05543m67480
37026C1517p7364J00932n35456r94224k70394P93697Q55248L00710K70405L54688
37016H29759n19469j541733r09986R01133J426064O5471r71272l03743N77340
37007d46436Q8369q92697q12685K0271L63703J34325k954l9177k00388j05383
36997a893052L86994M76766k17655o42679P3195J029811R59022K36393K6765L06512
36987G42072K72658k9683l1639N5596k45313m87796j04079K71445j66121p42971
36977d65831l99715K58688n0274q18702m61391Q06131J158422K55713k68076K34991
36967B49956M22074l55877p44247J01488Q58904L60123l25992J40811R20737M78226
$$ y = [561327, 857457, 240709, -275481, -283932, -139655, 24173, 389889, 704540, 498997, 31517, -45847, 55085, -480371, -1474595, -1744989, -951292, -96044, 204666, 475071, 829759, 310290, -1231443, -2141429, -1240296, 185768, 251239, -720033, -1023776, -446436, -358067, -1250764, -2063449, -2043178, -1679475, -1545150, -1548104, -1587281, -1787669, -1893052, -1506058, -1029292, -1246947, -1889626, -1816431, -786620, 172402, 408795, 435560, 742072, 1014730, 985047, 953408, 1009004, 763691, 275895, 171816, 443261, 277140, -465831, -865546, -606858, -657132, -1475834, -1937225, -1131094, 27328, 283041, 14965, 249956, 672030, 316153, -428094, -326606, 532298, 892421, 566429, 707240, 1627977, 2106203]
36957B106203o79774q63657n5272K18676m42716q02174k51740K34196j14219o21931
36947a272408m13353K33848N51532M83792M59214N10500L45251j2224k53841l03159
36937C29152l19629k83382m224M54482P22671N81170K01754j78312n51368q94458
36927E7856q70760j87220P68668J094831L91058o85759j122841n79985M77979
36918f56173J357030J536870Q38128l37659j125595j013200m04432J0972J76261
36909C82202M27411O41081L93297j44341l08378j1609J11314j96626l96279j59268
36899G38804n769m30773j013515r75138k11996P07512J229145J101263L58196
36890A497729n51594r25198m95133K51852O80059O19633K11102l72367p54474
$$ y = [2106203, 1426429, 562772, 507500, 726176, 283460, -518714, -770454, -536258, -650477, -1272408, -1685761, -1451913, -900381, -416589, 42625, 553125, 898376, 886152, 632311, 329152, 9523, -273859, -278083, 176399, 899070, 1480240, 1681994, 1503682, 952314, 57856, -812904, -1000124, -231456, 863375, 1254433, 568674, -554167, -1134152, -656173, 700857, 2237727, 3075855, 2738196, 1612601, 599401, 194969, 205941, 382202, 809613, 1450694, 1843991, 1699650, 1391272, 1379663, 1490977, 1294351, 898072, 738804, 733035, 302262, -711253, -1686391, -1898387, -1190875, 38270, 1139533, 1497729, 946135, 20937, -474196, -222344, 457715, 1077348, 1288450, 916083, 161609]
36881A61609m42565M73073J142666R28958J67488m42512p27477q27709o13888
36872a80357j365N11484L55221k47073n74658m10066j27752O2887K96156N32578
36862B17055N20019L15278K61073L52927J64566m31881r08468o73281K06706R96153
36852A020147R21532q1229j125016j154047k13860M41639p8692j060034j149683
36843b479243k07554O66037P88810O01476O08078N94686L04221O7946J78322K30705
36833A353484k50423r10785r59322l04304K86373J89383l28121n02299P4O96492
36823g29448Q37861L00364k42729j93419J73041J99512m5315J43623Q08299R61342
36813B213131L6290j010501q98875R2739M77847k68465r83715n97359L56733P07339
$$ y = [161609, -280956, 192117, 1334783, 2263741, 2431229, 1988717, 1261240, 433531, -180357, -181722, 329762, 684983, 437910, -136748, -546814, -674566, -611679, -315523, 217055, 737074, 1052352, 1313425, 1666352, 1830918, 1399037, 490569, -182712, 23994, 1020147, 1941679, 1860450, 735434, -418613, -632473, -190834, -269526, -1329560, -2479243, -2686797, -2020760, -1231950, -630474, -22396, 572290, 876511, 944457, 1122779, 1353484, 1103061, 192276, -767046, -1071350, -784977, -595594, -923715, -1426014, -1425940, -729448, 108413, 408777, 166048, -27371, 145670, 345182, 299867, 443490, 1251789, 2213131, 2249421, 1238920, 340045, 432784, 910631, 642166, -341549, -938908, -582175, 125164]
36803A25164L67965J10379N5565m15793j242616j398944m93312L92526K40908
36794b258158l56800k10837N16665O33712p0473n14264j33599L49711L67860M00609
36784a275574P52168O94824j61118p42044o1957R42799O67657n90565j011812
36775g85622o2669Q09286N52042p7659j08303J10178r1672l40863n622M79969
36765D79065K61012m68716p49402l27201J49080K54540K04784J84272Q2934k9963
36755D0405J13533L97278L40008j28149m35207j34949M84910P59260L43075n36691
36745A243473j268633j269756n01922L82025O61874L22007m4780l9798J63041
36736c52469K19120M6310j83176k06279J66294P67862J025175N51808k48683n81055
$$ y = [125164, 493129, 603508, 659073, 243280, -999336, -2398280, -2891592, -2499066, -2258158, -2614958, -2825795, -2309130, -1675418, -1745891, -2260155, -2393754, -2044043, -1676183, -1275574, -523406, 171418, 10300, -731744, -793701, 149098, 816755, 226190, -785622, -848291, -39005, 513037, 435378, 327075, 437253, 345581, 4718, -904, 479065, 740077, 271361, -478041, -805242, -656162, -401622, -196838, -12566, 70368, 40405, 153938, 551216, 891224, 763075, 327868, 192919, 677829, 1437089, 1780164, 1243473, -25160, -1294916, -1796838, -1414813, -752939, -430932, -475712, -515510, -352469, -133349, -87039, -270215, -476494, -310200, 457662, 1482837, 2034645, 1785962, 1204907]
36726A204907k54944J55173J63686j14177l86446n58357m86081N3558P94513R30734
36716A502566J48411p09474o23210K17112O54347J01089p97730j106116o51968
36707a264973M1795M52704M40511K02094M2491M6816l8031l75126n89458j98114
36697a239291N03816O03454j39429p99187n59404J05940K51047m128K32763R45330
36687i9089J017604M4187p95292m11854N24787O29398o1102k59832M10656P89568
36677A789031P5162q39823p24607J27765M19412j89131p18522m63723M1459O887
36667d76090l97565l88679K38517Q55746Q69077L90397n1148j71114j25752j79963
36657E63426l65514m97723m45613l00186k52532l52369m44254l37892p64M12414
$$ y = [1204907, 949963, 1105136, 1268822, 1154645, 768199, 209842, -276239, -222681, 571832, 1502566, 1650977, 941503, 318293, 535405, 1189752, 1290841, 493111, -613005, -1264973, -1223178, -770474, -329963, -127869, -85378, -38562, -76593, -451719, -1041177, -1239291, -735475, -132021, -271450, -1070637, -1630041, -1524101, -1273054, -1277182, -1044419, -99089, 918515, 962702, 167410, -244444, 280343, 909741, 848639, 588807, 999463, 1789031, 1864193, 1024370, 299763, 427528, 846940, 657809, -60713, -524436, -482977, -476090, -873655, -1262334, -1023817, -168071, 701006, 1091403, 1040255, 869141, 743389, 563426, 197912, -299811, -745424, -1045610, -1298142, -1650511, -2094765, -2432657, -2433421, -2021007]
36647b021007O81047O78040M62976K36421J76934L05565M93308N61831L82588
36638A957703k8310m53462o04273m19376j71285j40309k33525j19492K53592N11258
36628E52521L38642r2710l80781m21530m08072l77689j20551L54056N86616J83514
36618B14016n80934r65718n60838L04307R45257R61408N06375O5584m0611k16
36608H48630k27383o45254n87568K14065Q93211M16790q10943j227494k39332
36599a365278Q74128P66252j25177m33833P5022M45772K01781j57352k87957m17694
36589d24336m59253Q0607R15706Q88810k89416j270373q70829K70017Q09293O64193
36579C14419O71196Q77736N55058k85779p19993l61631J30142K09094J10744R1547
$$ y = [-2021007, -1339960, -661920, -198944, 37477, 214411, 519976, 1013284, 1575115, 1957703, 1929393, 1475931, 871658, 452282, 280997, 140688, -92837, -212329, 41263, 552521, 891163, 798453, 417672, -3858, -411930, -789619, -910170, -556114, 30502, 214016, -366918, -1332636, -1893474, -1589167, -643910, 317498, 823873, 889457, 848846, 848630, 621247, -24007, -611575, -397510, 495701, 912491, 101548, -1125946, -1365278, -491150, 275102, 149925, -283908, -208886, 236886, 438667, 281315, -6642, -424336, -883589, -802982, 112724, 1001534, 712118, -558255, -1429084, -1159067, -349774, 314419, 985615, 1863351, 2418409, 2132630, 1412637, 1051006, 1181148, 1390242, 1500986, 1592533]
36569A592533o8960m34006n92307l78913j96129k43169j53926J91427K62568j81768
36559b02650m89654j23583L77297K43842k28877j56806M56976O82371Q0122o81207
36549d2169p97332k74792L25041O04540N35862K70921j2596j99085k55720j39105
36539A5565J77635M80997L97596o7137l95342k95081j79900m14182n10705J46216
36529f44338J061847J102640J91157n28037m49009l21658p55817r84605j04366
36520a432186J210806J475231N49916k20303n3825K88464o6800p54190r13415
36511H3698n08943j02082J77447N62595Q41048N21886k25188o31548m53560k59460
36501E893l58893k42000M50865J102781R40539J90591l25941m03127m50995n17473
$$ y = [1592533, 1523573, 1089567, 497260, 118347, -77782, -320951, -474877, -283450, -20882, -202650, -692304, -815887, -438590, -194748, -423625, -580431, -123455, 558916, 639038, -42169, -839501, -1114293, -789252, -184712, 351150, 622071, 609475, 410390, 154670, 15565, 193200, 674197, 1071793, 1004656, 609314, 314233, 134333, -279849, -790554, -644338, 417509, 1520149, 1711306, 1183269, 734260, 412602, -343215, -1327820, -1432186, -221380, 1253851, 1803767, 1583464, 1529639, 1818103, 1751303, 997113, 83698, -425245, -527327, -349880, 212715, 1053763, 1575649, 1350461, 718913, 265353, 5893, -353000, -595000, -144135, 958646, 1899185, 2089776, 1763835, 1360708, 909713, 392240]
36491C92240k20033L55118N84940L09028P0987J20051J1784m34286o40181k73409
36481B76239O3025j62248m56013k03153J45616j63891p35077n36026L71245Q67192
36471e33091N32099J40621K29283L76233K61761K78809N45623M01831l93659r42106
36461H97404n48684O4420j04900o89520n98313J60124N46074J97245j57812p7659
36451c11621o5410n11673r18503o97347q8590K52777J71222L6216J02547K37508
36441a792874K03368j7647j86440p2612K26590L82536L42750M35093P23167O82332
36431I26263P252o56891n02437J89686M34246M9732j72312J49013M52920L38818
36421A216290J80424K05858m4236p12744r95749l32868N31238N93623P1683j59835
$$ y = [392240, 172207, 527325, 1112265, 1421293, 1492280, 1612331, 1624115, 1189829, 549648, 276239, 339264, 177016, -278997, -482150, -336534, -500425, -1235502, -1771528, -1400283, -533091, -992, 139629, 368912, 745145, 1006906, 1285715, 1831338, 2233169, 1839510, 897404, 348720, 413140, 308240, -381280, -979593, -819469, -273395, -76150, -233962, -311621, -377031, -888704, -1807207, -2504554, -2593144, -2340367, -2169145, -2132929, -2030382, -1792874, -1589506, -1607153, -1793593, -1866205, -1639615, -1257079, -914329, -479236, 243931, 926263, 933515, 276624, -225813, -36127, 398119, 447851, 275539, 424552, 877472, 1216290, 1396714, 1602572, 1558336, 845592, -150157, -483025, 48213, 641836, 713519, 553684]
36411E53684n6444j64345k81122K79319J124798R11855n67263j659588r46127
36402h05233Q25855J753675J136187n4860p25373p73876o40507n02641k57262
36393d4035P0860K57566J53871j30255l22791k25349J27187M83768N28397R3176
36383I92395o31353j094276q07296J01159R22978J100784P38409K55851j49536
36374A429115m21806l82770k9116J61284j92328o46990m68725J66331L15136k42304
36364c12173n43726O9477Q00700M88340o53866j265615o52350M34490R22617O70065
36354d2041L11621K84154L85844J95824l23275p31547o09771p4007L51607L71442
36344A19851K03939J62739K32559K38524J78068J35045O0604j11328k94142l98444
$$ y = [553684, 497240, 332895, 51773, 331092, 1455890, 2367745, 1800482, 140894, -805233, 20622, 1774297, 2910484, 2855624, 2130251, 1356375, 715868, 213227, -44035, 26825, 284391, 438262, 308007, -14784, -240133, -112946, 370822, 899219, 992395, 361042, -733234, -1540530, -1439371, -516393, 584391, 1322800, 1578651, 1429115, 1007309, 624539, 595423, 756707, 564379, -82611, -551336, -385005, -69869, -312173, -855899, -786422, 14278, 502618, -151248, -1416863, -2069213, -1634723, -712106, -42041, 269580, 553734, 939578, 1135402, 812127, 80580, -529191, -603198, -251591, 119851, 323790, 486529, 719088, 957612, 1135680, 1270725, 1331329, 1220001, 925859, 527415]
36334E27415m42840l27392J69634Q55433R76058J42657q67242r08192J1756P06719
36324H44006M03633l27216n18215r4684K43921O6010l77897o50163o11556l77439
36314a399600n6900L34540P40450R11021N47176k33703p23700k93394P28388J252583
36304A806861P07665k30342m98974J8533M41397R3612o72991j003382n97812L6731
36294A01298L18267K56947K20938K62378P1857l81458o29840l86471l1121J6252
36284a80953M6244N44517J140794R06605k12121j092995r07652j73682J52923
36275B23680P149k3142J87919K03288j36863m64385m73106k41473M6258K81330
36265c89345L45336K06666N2963J4986q7334l60848m45827k5344M78241L68654
$$ y = [527415, 84575, -242817, -73183, 782250, 1758308, 1900965, 1033723, 125531, 137287, 844006, 1247639, 920423, 402208, 307524, 551445, 617455, 239558, -410605, -1022161, -1399600, -1456500, -1121960, -381510, 529511, 1076687, 842984, 119284, -174110, 554278, 1806861, 2514526, 2284184, 1785210, 1803743, 2245140, 2338752, 1665761, 662379, 64567, 101298, 419565, 676512, 897450, 1159828, 1231685, 850227, 220387, -166084, -197205, -180953, -134709, 409808, 1550602, 2457207, 2245086, 1152091, 244439, 70757, 223680, 230829, 207687, 395606, 598894, 462031, -2354, -475460, -716933, -670675, -389345, -44009, 162657, 215620, 230606, 143272, -217576, -663403, -688747, -210506, 158148]
36255A58148k46510n46317j97817K49150L06067J65751J22965O3195r3370l9861
36245e8599L67711O91009N01574Q148l08664l11406r5842K91348O09657L74827
36235B069763m21458r64079n86909K45556N45936J08480m22446n35676k48391
36226b09224K70605P84398Q44107K46960m68564o31883l78889k73569k24870K90670
36216B49741J029993J090735L52105k64773k69536k70857p22463j051039o94480
36207e50574q9301J50003K26067M81587M75601k46329j020481q17179J77306P78879
36197d34421M65009j37804l70807k49938j0035K52672L49952O2751m36799p00906
36187a210326n36441l1047O97655J263461R42802l61315j452892j131681R2934
$$ y = [158148, -88362, -634679, -832496, -583346, -277279, -111528, 11437, 74632, -18738, -58599, 309112, 1000121, 1501695, 1509843, 1201179, 889773, 793931, 1085279, 1694936, 2069763, 1648305, 684226, 97317, 342873, 888809, 997289, 574843, 39167, -209224, 61381, 845779, 1689886, 1936846, 1468282, 836399, 457510, 183941, -40929, 249741, 1279734, 2370469, 2722574, 2457801, 2188265, 1917408, 1194945, 143906, -550574, -639875, -489872, -263805, 217782, 693383, 447054, -573427, -1390606, -1213300, -434421, 30588, -107216, -478023, -727961, -737996, -485324, -135372, -72621, -509420, -1210326, -1746767, -1777814, -1080159, 183302, 1126104, 764789, -688103, -1819784, -1726850]
36178a726850O72918K34606j58963M5737J55195k22907l63275J71401O12270L38608
36168b41260P666L24177O81319K00228o47778p17583J1760N33477M26547K55893
36158H34446M61495P85590Q01434L32083n31667j279836j190242k96412L28058
36149B44949k8326o16738m27320J82920K51106p195L19329R39753O79228l34653
36139A203053o31540J34734N14858k57965q89177k08683Q06921O28794l79248
36130I21747p29690k51798o5225m70924n35270J35311O51997K93293l97580n17807
36120i65946m3611L96437M79300L83562K89961J39806j23974l29511k21520J61054
36110A65558L94781J79871j56957q4151K16846m772p84504j078044k51286P78132
$$ y = [-1726850, -1053932, -819326, -978289, -932552, -777357, -1000264, -1363539, -1192138, -579868, -241260, -233594, 90583, 771902, 972130, 324352, -393231, -381471, 152006, 578553, 834446, 1295941, 2081531, 2882965, 3215048, 2683381, 1403545, 213303, -83109, 244949, 216623, -400115, -827435, -644515, -393409, -400604, -81275, 858478, 1537706, 1203053, 571513, 706247, 1221105, 963140, 73963, -134720, 672201, 1300995, 921747, 192057, -59741, -124966, -595890, -1131160, -995849, -343852, -50559, -448139, -965946, -1009557, -613120, -133820, 249742, 539703, 679509, 555535, 226024, 4504, 165558, 560339, 740210, 583253, 499102, 715948, 711176, -73328, -1151372, -1402658, -624526]
36100f24526P58686o0255l94363N3853K92958j55731m41892J13819P91703N87703
36090I21955j88579m30378K3190J90269m81456j233916j061544r1548O14513M25899
36080a311595j72800l25621J20174N56701N03012J95315J59070M54206O41014
36071H19476M17794r436k50122j92896l0694L3179k0043o1378K7679K02984K56131
36060A192674L7566l01625l83345M020O02183Q45378M06289l97156q43071n67791
36050E95122Q082K12377j6107j47908M9384J47580j57426l96751j5029N91784
36040H71108M52778n40754j282011q53400K38908P29815K08701m97463n29041
36031a201359m5075J80039j38229n11974m36264k3834K69849K71251J63850Q2665
$$ y = [-624526, 134160, 73905, -320458, -266605, 26353, -129378, -571270, -457451, 334252, 921955, 733376, 302998, 326188, 516457, 35001, -1198915, -2260459, -2352007, -1737494, -1311595, -1484395, -1810016, -1689842, -1133141, -630129, -434814, -275744, 178462, 819476, 1237270, 1227834, 977712, 784816, 754122, 787301, 767258, 705880, 733559, 936543, 1192674, 1230240, 928615, 545270, 549290, 1151473, 1996851, 2403140, 2005984, 1162913, 595122, 603204, 815581, 799474, 651566, 700950, 848530, 691104, 294353, 279324, 871108, 1323886, 783132, -498879, -1352279, -1113371, -383556, -174855, -672318, -1201359, -1246434, -1066395, -1204624, -1716598, -2152862, -2176696, -1906847, -1635596, -1471746, -1389081]
36021a389081m7502k61238l95001k62781J43067O34644Q98074O72903P6952l32717
36011b62680j06965N25632R16910P58687K58507l18732q04737q91368l58139L77351
36001I4466N67930J67873r6883Q5445J15960m11338q73812n31545L22049Q27789
35991B67934P18877L34102q9901m31949l91546Q4404M33599K47911P265K77023
35981A457719O39626L66339k56841l61873K8740J18509k51150m99661n02606o24429
35971A14373o28175K9582P66839L52134q87517j086025K75384J282095M73842
35962F92532q38089o73651N29928Q24214q9397o48058j22123M30413J68030k41640
35952C2159J0976M56682J70537o98475j063987l39562Q22166J269844O16288l63295
$$ y = [-1389081, -1436583, -1697821, -2092822, -2355603, -2212536, -1577892, -679818, -6915, 70037, -262680, -369645, 155987, 1072897, 1831584, 2090091, 1771359, 966622, 75254, -282885, 94466, 662396, 830269, 733386, 818831, 934791, 523453, -350359, -881904, -559855, 267934, 986811, 1320913, 1231012, 799063, 407517, 491921, 925520, 1173431, 1180696, 1457719, 2097345, 2463684, 2206843, 1844970, 1873710, 1992219, 1741069, 1241408, 738802, 114373, -513802, -484220, 282619, 634753, -252764, -1338789, -1063405, 218690, 692532, -145557, -819208, -289280, 534934, 445537, -202521, -324644, 105769, 273799, 32159, 43135, 499817, 670354, -28121, -1092108, -1431670, -609504, 660340, 1276628, 913333]
35942I13333o74888l05592p1867k85702k95291L13619Q56589N68870j72793m91323
35932C54955l32832j93914L532O22750J179970P72705l54172q92960l33045L81105
35922A208094L75119k5684j55911o1590j03749k40068k73575k59444k32736p7424
35912A53032K5290l00321p44973l79528Q73168J697923J091793j28729m74645
35903A813010J10792L79175k60797j012744r85472l04032L11138M16843N8258
35894E26171l99979m68270M2218O71797P59192K91302r6756k2238K03721J67421
35884A674579o4974j89312j31435j2191R3028J27924J1803j61269q2352L82243
35874A648044R01045R75731M35103m71787j294893j569618j046423q600Q05161
$$ y = [913333, 238445, -67147, -139014, -424716, -720007, -406388, 450201, 1019071, 846278, 354955, 22123, -171791, -168259, 454491, 1634461, 2407166, 2052994, 1160034, 826989, 1208094, 1583213, 1557529, 1401618, 1340028, 1236279, 996211, 722636, 463192, 230456, 153032, 178322, -121999, -866972, -1246500, -373332, 1324591, 2416384, 2287655, 1813010, 1923802, 2302977, 2042180, 1029436, 43964, -260068, 51070, 467913, 526171, 126192, -342078, -299860, 371937, 1131129, 1422431, 1325675, 1303437, 1507158, 1674579, 1609605, 1420293, 1288858, 1276667, 1369695, 1497619, 1509422, 1348153, 1265801, 1648044, 2549089, 3524820, 3959923, 3488136, 2193243, 623625, -422798, -431398, 373763]
35865C73763Q94245N20745K85250L20918K72475p385k16524j50059l5409q9179
35855B168840j16953J16829L99104L37877k5670k42918m7738L63652O09597M71163
35845D033783M4733k84337j87696J26552R9173k67627j90992O69653J324206O94216
35835F061664o17655r75482n6735P72571O56705L76576O53022P83763Q4179n50156
35825G188452k2327Q95286O12476n95586q07748O02223K016483K013661J190380
35816A3093300P99858R22220J032746J378012K509845L929454M392217L551249
35808C1608901K460224K310076L233586M536618N717663O975904Q804974J1326399
35800G6974345J4233369J7374875K1073325K5697122L1221858L7237670M2504083
$$ y = [373763, 1268008, 1788753, 2074003, 2394921, 2667396, 2660011, 2443487, 2293428, 2258019, 2168840, 2051887, 2168716, 2567820, 2905697, 2880027, 2637109, 2589371, 2953023, 3562620, 4033783, 4078516, 3794179, 3606483, 3733035, 3832208, 3564581, 3373589, 4043242, 5367448, 6061664, 5444009, 4468527, 4411792, 5184363, 5841068, 6217644, 6870666, 7654429, 7738608, 7188452, 7166125, 8061411, 8673887, 8078301, 7270553, 7872776, 9889259, 11902920, 13093300, 13893158, 14815378, 15848124, 17226136, 19735981, 23665435, 28057652, 31608901, 34069125, 36379201, 39612787, 44149405, 49867068, 56842972, 65647946, 76974345, 91207714, 108582589, 129655914, 155353036, 186574894, 223812564, 266316647]
35793B66316647M3908619L7118561K0294423k581751k3552900l6574646m0993563
35786B63935390l9558900l4921669k8871297k3142949j8969283j6160819j3821497
35779H8488976j1704828j0038689q582582o939465n428970m602870m184458l515099
35771C3492015k781196k675711k982768k699879j669279r47461j225398j850281
35763A6660042j879206j334915q83361q13360q64546p56387m84285k35258k00872
35754I207852l51496l89367j31633J41378K7850l89126o44269n51211l88177m39032
35744F092769o76912q81559q18359m17029M448l5959m40777m27025L56602J064640
35734C820839P19769l13360p93796l58791J37555M9123k48396j95520J06211K39423
$$ y = [266316647, 310225266, 347343827, 367638250, 365056499, 341503599, 304928953, 263935390, 224376490, 189454821, 160583524, 137440575, 118471292, 102310473, 88488976, 76784148, 66745459, 58162877, 51223412, 45794442, 41191572, 37007114, 33492015, 30710819, 28035108, 25052340, 22352461, 20683182, 19735721, 18510323, 16660042, 14780836, 13445921, 12562560, 11749200, 10884654, 10128267, 9643982, 9408724, 9207852, 8856356, 8466989, 8335356, 8476734, 8504584, 8115458, 7471189, 6919978, 6531801, 6092769, 5415857, 4534298, 3715939, 3298910, 3303358, 3267399, 2826622, 2399597, 2756199, 3820839, 4540608, 4227248, 3433452, 3074661, 3212216, 3261339, 3012943, 2817423, 2923634, 3163057]
35724C163057Q6604j90075l69830k53230Q6576J84167k04473n43535k27263L59398
35714B091396L48493j83970l49339k1070p3192p58498j075380l48319O17993P32887
35704I81001J38369k62708j42149J60512L66116L83823J36407j70136m4007N24412
35694B071640Q01803L35018l09433l93433o5770L0128k60886n90676o58388l12413
35684F47590M10625R65583O69902j96508m89718Q8730L96386k95266r90231o02652
35674F04441J92950J77683k67269M1805P94115O35745l44644o15065J72882N38809
35664A931452l20233j184886q18984J87576N90535L07004J2953j30074l16273
35655B59070l74027j25697Q3590l4582j50487K8379J69389K8072N1560N26906
$$ y = [3163057, 3249661, 3059586, 2689756, 2436526, 2523102, 2707269, 2502796, 1959261, 1731998, 2091396, 2439889, 2255919, 1906580, 1885510, 1812318, 1053820, -21560, -369879, 248114, 981001, 1119370, 856662, 714513, 875025, 1241141, 1624964, 1761371, 1591235, 1547228, 2071640, 2873443, 3208461, 2899028, 2505595, 2439825, 2469953, 2209067, 1618391, 960003, 647590, 1058215, 2023798, 2693700, 2497192, 2007474, 2096204, 2492590, 2197324, 1207093, 604441, 797391, 975074, 707805, 749610, 1543725, 2179470, 1834826, 1219761, 1392643, 1931452, 1611219, 426333, -392651, -205075, 385460, 692464, 705417, 575343, 259070, -114957, -240654, -157064, -191646, -342133, -313754, -144365, -116293, -64733, 462173]
35645D62173Q26926L78867k43162j81577K61301J36068n25693p47332j97006L42977
35635E13542K50037j15288j62937O0508J40115l0835j81559m6755L44525O44086
35625A415439M86452n0769m69825n15040m91713o33261n80799K092O82006P87722
35615F32304M29797K70429M47893N02374K97787J93329K34823k134n60665q56874
35605A589063n82351j66319P852J87352O09560Q72927N10792k27412p21090p95360
35595A285014o79577m18798J09756P09307R03009M89929k51967q79935j050900
35586B15838o14017K00566P49353N19943k25632o51883l14032K97763L53000k76362
35576B54537p79042l36168P91618J395517P11827n87826j180734o75800J44337
$$ y = [462173, 1289099, 1667966, 1424804, 1243227, 1504528, 1640596, 1114903, 367571, 170565, 513542, 763579, 648291, 485354, 545862, 685977, 655142, 473583, 426828, 771353, 1415439, 1901891, 1851122, 1381297, 866257, 374544, -258717, -839516, -837424, -155418, 632304, 1062101, 1332530, 1780423, 2282797, 2580584, 2773913, 3008736, 3006602, 2445937, 1589063, 1006712, 840393, 848245, 1035597, 1645157, 2518084, 3028876, 2801464, 2080374, 1285014, 605437, 186639, 296395, 1005702, 1908711, 2398640, 2146673, 1266738, 215838, -398179, -197613, 551740, 1071683, 846051, 194168, -119864, 177899, 530899, 254537, -524505, -860673, -69055, 1326462, 2038289, 1450463, 269729, -406071, -261734]
35567b61734N79794P33347P79116L98376m55043r54764m37355M29721M83711k06534
35557A088635n09392m6259L24603M9679k57328j3595L11578J30309j83839q9996
35547H04395m0356o91704j415524r40729N62417J373516N49914p69519r93517
35538a561107j09119O86791P24884L43992J54k16983k51454j0561K72238J65365
35528D4200l10703n75478k04821N23877R41999O79665R54m35987k16402L26578
35518G73882M31088j18429o68047o41678l62453l68461l55195K96434J160106
35509A47247J083963K2083o55277j92995L59250j38392r98132p36219N92782J486553
35499I70863J190361M12821j98955q73631j591474j495420k63407R41793R20023
$$ y = [-261734, 318060, 1051407, 1830523, 2228899, 1773856, 819092, 381737, 811458, 1295169, 1088635, 579243, 532984, 857587, 907266, 649938, 636343, 947921, 1078230, 894391, 804395, 764039, 72335, -1343189, -2283918, -1721501, -347985, 201929, -567590, -1561107, -1670226, -983435, -258551, 85441, 85595, -131388, -382842, -393403, -121165, 44200, -266503, -841981, -1046802, -522925, 419074, 1098739, 1099693, 663706, 447304, 773882, 1204970, 1086541, 418494, -223184, -585637, -954098, -1309293, -1012859, 147247, 1231210, 1253293, 598016, 405021, 764271, 625879, -372253, -1108472, -515690, 970863, 2161224, 2574045, 2375090, 1501459, -90015, -1585435, -1848842, -907049, 12974]
35490A2974J48210k7120N43950P35315J4675p71946p51594k21080J1892j55638
35480d60362j65953K50264O92379O15863k4230o50247n58309K90155J011302P05408
35470A706270l28059q12773j95870M77374j3998j228727j547977m02997R66976
35461a379781J272423P76490N07750O07359M34203m6611j21877L30753M25656
35452B806365l56595j236282j238737n76115j28512l2468K60527P62711Q30263
35443A091157L20048j08041r7458j09561m40608n78315j20420M05271L69225R4338
35433H25636K51522O50822N58927l6739m22779l22988j52849j00380J18725M31705
35423A801602K57889m67396r33621n89351L6459J54366k15678n18567n12880l10127
$$ y = [12974, 161184, 134064, 678014, 1413329, 1428004, 656058, -95536, -316616, -304724, -460362, -626315, -376051, 316328, 932191, 907961, 257714, -300595, -10440, 1000862, 1706270, 1378211, 565438, 369568, 846942, 832944, -395783, -1943760, -2346757, -1379781, -107358, 669132, 1176882, 1784241, 2218444, 2171833, 2049956, 2380709, 2806365, 2449770, 1213488, -25249, -601364, -729876, -762344, -501817, 260894, 1091157, 1411205, 1303164, 1205706, 1096145, 655537, 77222, -43198, 362073, 731298, 825636, 1077158, 1727980, 2286907, 2250168, 1827389, 1504401, 1351552, 1251172, 1369897, 1801602, 2059491, 1592095, 658474, 69123, 105582, 259948, 44270, -474297, -987177, -1297304]
35413a297304Q651K96216K54602n6421n8476M59760P86487L04129m02058l32935
35403c7349L41352N08986j52083p34761n78356j82992k21925m71896l28387J92310
35393a665101N88480O41791N02226K59363q0448l46316l48263j89652j34520k45102
35383a017542l73262m02500l16511j51901j5058J3809P3320L72332P65356Q03660
35373b48297L47259k25340n54320o11532l24892M90627J459189J576503M73629
35364B382826p73346q93022r8198L68118Q5247j93840O502K12021L8298j31912
35354A002694O404L6234l76429p71125o63475l92691m47676m99748N830O74940
35344a425042N66233l47043j034373q06877q9799L54584L26480J37859J89469
$$ y = [-1297304, -1288653, -992437, -737835, -794256, -852732, -392972, 393515, 697644, 295586, -37349, 304003, 812989, 660906, -73855, -652211, -835203, -1057128, -1529024, -1857411, -1665101, -1076621, -434830, 67396, 326759, 246311, -100005, -448268, -637920, -772440, -1017542, -1390804, -1793304, -2109815, -2261716, -2276774, -2262965, -2189645, -1817313, -1051957, -248297, 98962, -126378, -680698, -1292230, -1617122, -1126495, 332694, 1909197, 2382826, 1609480, 716458, 618260, 986378, 1071625, 877785, 884287, 1096308, 1134606, 1002694, 1009098, 1045332, 668903, -102222, -765697, -1158388, -1606064, -2105812, -2099982, -1425042, -858809, -1205852, -2240225, -3047102, -3136901, -2782317, -2455837, -2317978, -2128509]
35335b128509O89597J310053J206499N3987j059703p43389O27874J142034M3023
35326A141466j100960p39355L89587O09287m1737j73178M39516N47006l10856
35317G60776r78676n99007J41593L65449L04974M29804M26719M302k82689l5068
35307E38177Q3306m45446p74462j6279R98727Q77589K0057n602P86785P00591
35297B763443p11259j621631o77929R08724J198602J71573p45383q52625n61435
35288a27920k45142M1159Q6712j65028j80392L51376P14771K01325n21607k95470
35278a40216O02719P97719J454n84627k64930J67434m8118m20913k85736k9089
35268b04303k56594n13179N1412J142188J519662O90493m65879r00566n73137
$$ y = [-2128509, -1438912, -128859, 1077640, 1131627, 71924, -671465, -43591, 1098443, 1141466, 40506, -698849, -309262, 300025, 258288, 85110, 524626, 1071632, 760776, -217900, -816907, -675314, -309865, -4891, 424913, 851632, 855934, 573245, 538177, 621483, 176037, -598425, -614704, 384023, 1261612, 1281669, 1276067, 2062852, 2763443, 2052184, 430553, -247376, 661348, 1859950, 2031523, 1286140, 433515, -127920, -373062, -331903, -245191, -410219, -590611, -239235, 475536, 676861, 155254, -140216, 462503, 1260222, 1261676, 677049, 412119, 579553, 531435, 110522, -175214, -204303, -460897, -974076, -922664, 219524, 1739186, 2429679, 1963800, 1063234, 490097]
35259D90097j67581p6923n2480K39332O25282O14452J47008k04072o0779Q2888
35249A637224l97228j056274q10757L28028R68999K94216o48978m66904N08782
35240C57108Q14939J17281m34066j25413L39412K05177j04675J16512N46078L74639
35230B206992k89069n60566k04005M4631k59687n47479k15472L35122L04409k35191
35220E79685m33280K4521M17812N3415p07819r03934j75440Q75825J397545J039106
35210B167436J06148p05126p78589j10781O01389O61297J55835k37883k08164
35201A651562j77241n72106j098142j076872l64645L85688M36325k03600p44584
35192a763615m42021N46437J238291Q80368j79054q77554o23215J81462P61556
$$ y = [490097, 322516, 245593, 193113, 432445, 1057727, 1672179, 1819187, 1615115, 1554336, 1637224, 1239996, 183722, -627035, -299007, 669992, 964208, 315230, -151674, 357108, 1172047, 1289328, 855262, 729849, 1069261, 1274438, 1169763, 1286275, 1832353, 2206992, 1917923, 1357357, 1153352, 1197983, 938296, 390817, 175345, 510467, 814876, 579685, 146405, 170926, 588738, 642153, -65666, -969600, -1145040, -269215, 1128330, 2167436, 2273584, 1568458, 789869, 679088, 1280477, 1941774, 2097609, 1859726, 1651562, 1474321, 902215, -195927, -1272799, -1637444, -1251756, -815431, -1019031, -1763615, -2205636, -1659199, -420908, 459460, 280406, -597148, -1220363, -1038901, -277345]
35183b77345P44820K29803n10772j112156j178405o24839J23273N36941N37348
35174a531332M42551M52097M46385K77883n235k84160m92946n30885k81556J18673
35164a388525K50116p2661m02071j73218M18713N83466J37154r6711M30850R23428
35154F10541L24590q86694j139746l6900J058666J063792N50677L74777J58148
35145B077851p08392j514844j138083O0410P14656N07331K72613K56734j17136
35136D11140p10277n74034K66169N45195j71520p03440k74721K09590j02846m35758
35126a540502J69478J012865Q26693j30351n74331k38026K3973j66949l38548
35117i55698k22450l0976K04849N72375P05875K17288m78263o51407l36825n6950
$$ y = [-277345, 467475, 697278, 186506, -925650, -2104055, -2728894, -2605621, -2068680, -1531332, -1088781, -636684, -190299, 87584, 82349, -201811, -694757, -1225642, -1507198, -1388525, -1138409, -1211070, -1613141, -1786359, -1367646, -784180, -647026, -743737, -312887, 610541, 935131, 48437, -1091309, -1128209, -69543, 994249, 1544926, 1919703, 2077851, 1369459, -145385, -1283468, -1223058, -508402, -1071, 271542, 528276, 411140, -299137, -873171, -607002, -61807, -233327, -936767, -1211488, -1001898, -1104744, -1540502, -1371024, -358159, 468534, 338183, -236148, -474174, -450201, -617150, -955698, -1178148, -1209124, -1004275, -431900, 273975, 491263, 13000, -638407, -975232, -1032182]
35107a032182J86345O57228R60125M78417m66040r62928q38610n92533k79470
35098a889648L69922R34346O94949n1932l48097j53054k30879n39673k54230N16293
35088i52003O51423l8893m09925J6461K67720k09651n06259K8899N20826J32864
35078d98538m06432r6040N94591O00965M5083j75684L8075P3551j70407k66455
35068b61291j58515j29045j41216p009J01836n429q8101N705j08908o02476q25136
35057b219585k40491N83481P47972L00963o2675r6354k892J74686L83063K80434
35047a51398j24506j46146M84287R01275M00451k93086j56712M12685K82202n38082
35037A070970j019529p59649k46900K09152O05679O30127J20538k18511K14454
$$ y = [-1032182, -845837, -188609, 771516, 1249933, 783893, -179035, -1017645, -1610178, -1889648, -1519726, -585380, 109569, 57637, -290460, -443514, -674393, -1214066, -1468296, -952003, -300580, -339473, -749398, -732937, -465217, -674868, -1181127, -1152228, -631402, -498538, -904970, -1001010, -406419, 194546, 239629, 63945, 102020, 175571, 5164, -261291, -419806, -548851, -690067, -697076, -595240, -600669, -688770, -683065, -791973, -1394449, -2219585, -2460076, -1876595, -1128623, -827660, -890335, -986689, -989581, -814895, -431832, -151398, -275904, -422050, 62237, 963512, 1363963, 1070877, 914165, 1326850, 1609052, 1070970, 51441, -708208, -955108, -745956, -140277, 489850, 610388, 391877, 606331]
35028F06331O91773K63105m49967k10229N38522K78814q63027j147860j52375
35019d44913N08985o7144o86464k67679M65426N66822M45966O67641O85508O4014
35009A938162l71002M7288M46571j40020j012150r65367k97106q2376j90206K92675
34999c33531J110830J023040j37912j098348j004145m00462q2227j6076J86844
34990g51987M75651M77722M0001n76221q84926o10035m3108K83334L47779N62601
34980f79189Q39393N35100l25279p32088k34548J66366m33343j286367j107767
34971c257722k4521Q14670J004620R70753P61645J35328m50828l23338J20941
34962b48452k7064n21110l22075M59183O06645q1538m15018O4472K92111l24147
$$ y = [606331, 1298104, 1561209, 1111242, 901013, 1439535, 1718349, 855322, -292538, -444913, 64072, -3072, -689536, -957215, -491789, 75033, 520999, 1188640, 1874148, 1938162, 1567160, 1614448, 2061019, 1920999, 908849, -56518, -353624, -436000, -626206, -333531, 777299, 1800339, 1662427, 564079, -440066, -840528, -922755, -938831, -751987, -276336, 201386, 241387, -334834, -1219760, -1829795, -1872903, -1589569, -1241790, -679189, 160204, 695304, 370025, -362063, -596611, -430245, -863588, -2149955, -3257722, -3282243, -2467573, -1462953, -492200, 269445, 404773, -46055, -369393, -248452, -275516, -796626, -1118701, -659518, -52873, -134411, -549429, -484957, -192846, -516993]
34952e16993p76701k89276K43907j11138n66213K2390J025426R68869j1894l99374
34942d10997K16149N87696j7095o44005k84078N35040O81640J45230j50805J43095
34932H01870M29813K48912p4911r2281N4090l0012k85245k99974Q398K43241Q0274
34921A084175l78841q45643j081494q41239m0271Q28591R32223J15410p18741
34912i45830o70982P2370O85233Q34979P47003M60641j88273r34337j187344q28690
34902a955230k95761J28232M85313O35379L10707k37103l65898K1221L36637K53371
34892f83132R9475J41891K05878K23657M07521O13996L28329l83987p28395l89788
34882a64555m0486j42288j49610L96639Q48060M38323l81509o04136j88410Q0968
$$ y = [-516993, -1293694, -1582970, -1339063, -1450201, -2016414, -1994024, -968598, 271, -11623, -410997, -194848, 392848, 375753, -268252, -552330, -17290, 664350, 809580, 658775, 801870, 1231683, 1480595, 1405684, 1313403, 1367493, 1337481, 1052236, 752262, 760660, 1003901, 1084175, 705334, -140309, -1221803, -2063042, -2103313, -1274722, -342499, -227089, -945830, -1616812, -1544442, -859209, -24230, 722773, 1183414, 995141, 60804, -1126540, -1955230, -2250991, -2122759, -1637446, -1002067, -691360, -928463, -1294361, -1273140, -936503, -683132, -583657, -441766, -235888, -12231, 395290, 1009286, 1337615, 953628, 225233, -164555, -205041, -347329, -496939, -100300, 747760, 1186083, 804574, 200438, 12028, 92996]
34872I2996o6941j61868O7691L82512N45040M32184j44684j005487j292122m59589
34862a610268O75988Q42308R4539l50504K897L71596J73707j11701M187J55343
34852B48092n0368j70302L25298R86735Q54057k29970j367741j601210q11080
34843a816489K92280Q53894O31898J54160K1621J82951J92784j2998j25622j15387
34833B59092k04744k28163J88632P27289N64032k61730o13156J09088R91680R50936
34823B482956K44862j98660k69356m74778p52876o12757k21224k30825n57442
34814e90100m00307L76802Q93947O01877Q4781N7518L20557K95815J3023j09457
34804A544456q9080k91427o65154o92672j77959L74832L76046r3755l72898m0955
$$ y = [92996, 26055, -135813, -68122, 314390, 859430, 1291614, 1146930, 141443, -1150679, -1610268, -934280, -91972, 2567, -347937, -345040, 26556, 200263, 88562, 92749, 248092, 197724, 27422, 352720, 1339455, 2193512, 1963542, 595801, -1005409, -1816489, -1524209, -670315, -38417, 115743, 137364, 320315, 513099, 500101, 374479, 259092, 54348, -173815, 14817, 742106, 1306138, 1044408, 431252, 540340, 1532020, 2482956, 2727818, 2529158, 2259802, 1785024, 1032148, 419391, 198167, -32658, -590100, -990407, -613605, 280342, 882219, 967000, 1024518, 1345075, 1640890, 1653913, 1544456, 1455376, 1163949, 498795, -193877, -371836, 2996, 379042, 285287, -87611, -128566]
34794a28566N14193N24743j49979p14762l92674N18078R82626N73092o7357k44453
34784A414941j23413k32498n14726m65004j6141L15174J93156j19877k35782j24726
34774I1104N7621K78837M93215M40394p4775p63796j012241n41677K29544N88319
34764b13455K65459k83901l86425P0390N03168L98642L2989P5082N23455N80759
34754A566163j59453r34617p75883J05913O37836M48751K38495M47666N06755
34745B081626p7824p07503n67319M3435K02811j36965j84138K31276L11344l53366
34735H43377j037145r40671k43807L98243P46636Q13223M14790m18925j027174
34726d51453q16446j02802L63209M45313N48670P27407N98578J04732k95167k76991
$$ y = [-128566, 385627, 910370, 760391, 45629, -347045, 171033, 1153659, 1726751, 1659394, 1414941, 1291528, 1059030, 544304, 79300, 63159, 378333, 571489, 451612, 215830, 91104, 148725, 427562, 920777, 1361171, 1286396, 522600, -489641, -1031318, -801774, -213455, 52004, -231897, -618322, -547932, -44764, 353878, 386867, 461949, 985404, 1566163, 1406710, 472093, -303790, -197877, 439959, 888710, 1127205, 1574871, 2081626, 2003802, 1296299, 728980, 772415, 975226, 838261, 654123, 885399, 1196743, 843377, -193768, -1134439, -1378246, -980003, -233367, 579856, 994646, 575721, -451453, -1267899, -1370701, -1007492, -562179, -13509, 713898, 1312476, 1417208, 1122041, 845050]
34716H45050p827J84795J01252l11320q13837q69272k53495M56993N23134L7475
34706a07052k76150j14424J78263L07024K69128K1386l48704k77520N34821J170921
34696A357693M49633j103628j604897n02260N43208K14391m81622p792J142928
34687G654J300860K93900m79653l75389j97371m58153n11068J10858P61734P41922
34677A195294L41179J60800J32974j17092m69645n00593j47091K73833M52348
34668A322007K08134m28068r94078q70310j04384M33534J22272n07999m17627
34659a236519N66007J475670J334418K41239q04735j015240n49243q6177R4042
34650A9462K23665L21472J7315o20507p95831j28931N38411L18984k80887j71186
$$ y = [845050, 837223, 1022018, 1123270, 811950, -1887, -871159, -1124654, -667661, -144527, -107052, -383202, -497626, -319363, -12339, 256789, 278175, -70529, -348049, 186772, 1357693, 1807326, 703698, -901199, -1403459, -860251, -645860, -1127482, -1135274, 7654, 1308514, 1602414, 1122761, 747372, 550001, 91848, -419220, -308362, 453372, 1195294, 1536473, 1697273, 1830247, 1713155, 1243510, 742917, 595826, 869659, 1322007, 1530141, 1102073, 107995, -762315, -866699, -433165, -310893, -818892, -1236519, -670512, 805158, 2139576, 2380815, 1576080, 560840, 11597, -74580, 19462, 243127, 564599, 581914, -38593, -834424, -963355, -424944, -105960, -386847, -558033]
34640e58033M75660N06849k23319o04249j62410K78022K25742L15027Q06516P66381
34630A826186k89552j232793r58322o6737L20884L67520P19542Q59280l9306j229725
34620B76977j163259J11897R89021O71120m6632l67888l56101j09292M44249P54113
34610A204205J10431q93921q67471J49901N88484r9354n62964K5446M70687l43496
34600b18052j407519j128550K35818J207401J265600R10244K94419o47423j214560
34591g02622o29835N38309J015992O84495M93277P03218O02195l2413n28552n35595
34581A608469m53050m65147k82181l4285k69820p97637o93690J62875P09088L51112
34571a64266j21115P3001M43274K05554l47965m36070j32437j16443m39626m79895
$$ y = [-558033, -82373, 424476, 201157, -403092, -565502, -287480, -61738, 253289, 1059805, 1826186, 1536634, 303841, -654481, -721218, -400334, -32814, 686728, 1546008, 1506702, 276977, -886282, -774385, 214636, 885756, 839124, 471236, 115135, 5843, 450092, 1204205, 1314636, 420715, -446756, -296855, 291629, 192275, -370689, -345243, 125444, -218052, -1625571, -2754121, -2518303, -1310902, -45302, 864942, 1159361, 511938, -702622, -1332457, -794148, 221844, 906339, 1399616, 2102834, 2705029, 2672616, 2144064, 1608469, 1155419, 690272, 408091, 373806, 103986, -693651, -1387341, -1224466, -515378, -164266, -285381, -212380, 230894, 436448, 88483, -347587, -480024, -596467, -1036093, -1515988]
34561a515988r67N07177N53564J76940k41505l24227N5600N76960O77653K03780
34551F68987l77268o16920n83810m76921k11113K22298M46068K43826Q906J17780
34541e58167K64436L2858k56551j9620N36187O36139J15759l89653m20808j51160
34531b10580J53260M35624N43770L00874k2246K4615K27408j26853j037155j520029
34521a231312r34999J06291O29125N08890K71452J84116J39953J06396J40471
34512g9617J82020K27786M17907O10141L16897m72800r20581m26935L81113N40557
34502G76488K01935J84903L85147q5920j098166j251227p576J161585P50232n62261
34492D55140q98015J09161R41628N02973m85601p98632l94903p8143j11328k2730
$$ y = [-1515988, -1516955, -1009778, -456214, -279274, -520779, -845006, -789406, -212446, 465207, 668987, 291719, -325201, -909011, -1385932, -1597045, -1374747, -928679, -684853, -675947, -558167, -293731, -260873, -517424, -537044, -857, 635282, 751041, 361388, -59420, -210580, -57320, 378304, 922074, 1222948, 1200702, 1225317, 1452725, 1325872, 288717, -1231312, -2166311, -2060020, -1430895, -922005, -650553, -466437, -326484, -220088, -79617, 102403, 330189, 748096, 1358237, 1675134, 1202334, 281753, -145182, 235931, 776488, 978423, 1163326, 1548473, 1462553, 364387, -886840, -894416, 267169, 1017401, 455140, -442875, -333714, 607914, 1110887, 625286, -173346, -568249, -646392, -757720, -780450]
34482g80450M06041P16293M85364k0946k02031P2729K94478l0421p32782j140110
34472i31835q47082j26503N00145Q42203R46045O84478n5333q15921q15882p55
34462f20440O72325M11192l63761o64351k88551J34915K59735L69067N51426L78205
34452H39762k40212o05166j98648M44735M88485N297k94846k45574k81354m42485
34442e30006k72086J80854K25078k43557l05737N58453J415682J134127J13400
34433B276208l10096J07261K74759l71907r56916o09618J24201J12446o74735
34424b8397j162956o82162K47842P13340M84610J09033J77370O58797R40191N43816
34414B001484k35824o20995l02879K13573L42173J10055j27687k63382l31083
$$ y = [-780450, -374409, 341884, 827248, 806302, 604271, 677000, 971478, 941057, 208275, -931835, -1778917, -1905420, -1405275, -563072, 382973, 1067451, 1012118, 196197, -619685, -620440, 51885, 463077, 99316, -565035, -853586, -718671, -458936, -89869, 461557, 839762, 599550, -5616, -204264, 240471, 728956, 734253, 439407, 193833, -87521, -530006, -802092, -621238, -396160, -639717, -945454, -387001, 1028681, 2162808, 2276208, 1966112, 2073373, 2348132, 1976225, 1019309, 409691, 533892, 646338, -28397, -1191353, -1873515, -1625673, -912333, -427723, -318690, -141320, 517477, 1457668, 2001484, 1765660, 1144665, 841786, 1055359, 1397532, 1507587, 1379900, 1116518, 785435]
34405G85435j75992K52689N20551K02075l70950m62110q250K79059j0408m18187
34395E93912l75051j4448J23789j50786n70053q22553p77615m49136K1621M27174
34385a993146O59261P24658O06002L24251J17890K26115M57029L67968l5900k53690
34375A200438j12274p8328l91241m61922K34102J070963R12127k48740j123668
34366A001457q25341j2180J24727m86134q22900k93271M53340M57788k78861q79388
34356a560763p24033k7171O76314J097368J090990N27843l32381p62109m04884
34347d18826J10175J9652l71349j60123N87316P69434k0301p41687m59856K55505
34337d30060L09008k38549m75219j96606o0630l01466l42490J45421O77777P50378
$$ y = [785435, 609443, 862132, 1382683, 1584758, 1213808, 751698, 743448, 1022507, 1012099, 593912, 218861, 204413, 328202, 177416, -392637, -1215190, -1992805, -2441941, -2420320, -1993146, -1333885, -609227, -3225, 321026, 438916, 665031, 1122060, 1490028, 1454128, 1200438, 1088164, 1009836, 618595, 156673, 390775, 1461738, 2373865, 2125125, 1001457, 176116, 163936, 288663, -197471, -1020371, -1313642, -860302, -402514, -681375, -1560763, -2284796, -2311967, -1635653, -538285, 552705, 1080548, 748167, -13942, -418826, -308651, -288999, -660348, -820471, -233155, 536279, 515978, -225709, -685565, -430060, -121052, -359601, -834820, -1031426, -1092056, -1393522, -1736012, -1590591, -912814, -162436]
34327a62436N02620K50431m6320m48276o44961l56459J68465M52633L87273J96149
34317B99119j1083k74060m46300k22663L67531P67265M72053k56845n81258j39919
34307b6160L84689J23003p46669j177704o83098O4016K90663J29212J18367K86498
34297a237183L51173L81389N59390O19277K66960j00458R8631N68761M49992l28963
34287A628969q81968o73997j80223j773o1970j5323J48351K64393L08251K84705
34277H19415J68965Q3552J58517K28098J23029J12970M02257M00407n30480j664553
34267C02177j482791Q1361J259406Q78178q9961k58514Q8728j29967p41995o36158
34257g29536K74113Q40881M33113k80870m82973k06443P0963J39284J03003J63035
$$ y = [-162436, 340184, 590615, 544295, 96019, -548942, -905401, -736936, -284303, 102970, 299119, 288036, 13976, -432324, -654987, -287456, 479809, 951862, 695017, 113759, -26160, 358529, 481532, -265137, -1442841, -2125939, -2061923, -1771260, -1642048, -1523681, -1237183, -886010, -504621, 54769, 674046, 941006, 840548, 939179, 1507940, 1957932, 1628969, 747001, 73004, -107219, -108992, -170962, -186285, -37934, 226459, 534710, 819415, 988380, 1071932, 1230449, 1458547, 1581576, 1694546, 2096803, 2497210, 1966730, 302177, -1180614, -1099253, 160153, 1038331, 948370, 689856, 778584, 648617, -93378, -729536, -455423, 385458, 818571, 537701, 54728, -151715, -80752, 58532, 161535, 324570]
34247C24570M58087Q07470P35332J20923m44217m45837k63486n37162j015731
34238b60051q73622o0260N39675L74572j14466k75849m5193K40994L20736J45491
34228g973o4773Q0502N74779P23837K1492q73103q27687J44886Q33694M93046
34218A098700l18334p71007p55069m90395P326N69040O87704K48039j28413J3307
34208A60898K51235J7340m70533o11788l49105p5508P0552K17416L00502J62359
34198c26632l1532L0342L18363N47248O02018N15869K22280k73052o61378o72803
34188B70723m63921k86069k9865M28583P13887M17244j00283j00849L58267M28906
34178A636623j89863p05173m22414J88862K25632l13688o44514m29059j31823
$$ y = [324570, 782657, 1590127, 2325459, 2446382, 2002165, 1556328, 1292842, 755680, -260051, -1133673, -1193933, -654258, -279686, -394152, -670001, -715194, -474200, -153464, -7973, -72746, 7756, 582535, 1306372, 1327864, 454761, -372926, -228040, 605654, 1098700, 780366, 9359, -745710, -1236105, -1228779, -659739, 27965, 276004, 147591, 160898, 412133, 429473, -41060, -652848, -1001953, -1077461, -1006909, -789493, -488991, -326632, -358164, -327822, -9459, 537789, 1139807, 1655676, 1877956, 1604904, 943526, 270723, -193198, -479267, -509132, -80549, 633338, 1050582, 950299, 849450, 1207717, 1636623, 1446760, 741587, 319173, 508035, 733667, 419979, -224535, -653594, -785417]
34169g85417q4022R0213P35577J331534R81578l32651j472818j339631j33645
34160a009282Q51242O95630j30801m30443J79671Q10194N63358k00866m30917
34151H97786R337J42355n31534j134504p18212K37055N38170N4030k85907p3128
34141h64552J64342J82183M20892Q51255O54305l21928r39502m62823J82616p3608
34131b06820o31001k98034N45219N28668k96925m25347N81266J252870N00557
34122A550453o89779p71990J72090P77210L28912n60400r37596n05261K59943
34113c76418O12224K65884k70201l27760J3790J26435j39214l03177j49123J9250
34103e28310J21285M21366P04621L11874o22002r71687k32459O15871N49199q2112
$$ y = [-785417, -869439, -779226, -43649, 1287885, 2269463, 1936812, 463994, -875637, -1009282, -158040, 537590, 406789, -23654, 156017, 966211, 1529569, 1328703, 897786, 907123, 1049478, 517944, -616560, -1334772, -1097717, -559547, -505517, -791424, -864552, -700210, -518027, -97135, 754120, 1408425, 1086497, 146995, -315828, -133212, -206820, -837821, -1135855, -590636, -61968, -358893, -784240, -202974, 1049896, 1550453, 860674, 88684, 260774, 1037984, 1366896, 806496, -131100, -636361, -376418, 235806, 501690, 231489, -96271, -82481, 43954, -95260, -398437, -547560, -528310, -407025, 14341, 718962, 1030836, 408834, -562853, -795312, -179441, 369758, 287646]
34093B87646l83252l33758m08441m59603n2059N39430O94528M85200M09492M00605
34083A179788O4774l49730k44869J77622O7376p16458j292017r69193o6191O42509
34073a506389P16851K16020l93541m73060J41888P64501O23489r4778n22257l18952
34063h46228O554m1532l37819m25375k140Q01454J309511P93406m75177j150508
34053c67854m61981N83967N43361m09362q92435m34497J38028K96420L68122M07154
34043b29077k2855o13632l30954P79459J226257K75285q30410q14023k48018k73982
34033a081950n72537j31484P58815R51093M54801L23743O53527L75949p17090
34024A014867j340807o99019K57899L71157n5633j11719J14621r416k14608K83275
$$ y = [287646, -95606, -429364, -837805, -1297408, -1349467, -810037, -115509, 369691, 779183, 1179788, 1244562, 894832, 649963, 827585, 894961, 178503, -1113514, -2082707, -2148898, -1506389, -789538, -573518, -967059, -1440119, -1298231, -533730, 89759, -5019, -527276, -846228, -839674, -881206, -1219025, -1644400, -1646540, -845086, 464425, 1257831, 782654, -367854, -829835, -245868, 297493, -111869, -1004304, -1438801, -1300773, -1004353, -636231, -229077, -251932, -865564, -1196518, -417059, 809198, 1084483, 254073, -559950, -807968, -1081950, -1654487, -1785971, -1027156, -76063, 378738, 702481, 1356008, 1731957, 1014867, -325940, -1024959, -767060, -395903, -451536, -563255, -448634, -458050, -672658, -389383]
34014c89383J147885J086214j08413r72821m63186M65257L46752n23252o03295
34005a4242M26939J141041N47239m72875n76091J37386N31666J62155l66015n08621
33995A008582l77167k49186j78921j62917j94113j48432j5659q9263m54458n42376
33985a403910J28069R39691P56617m33751j306871q87357K82202J019924R35665
33976C0279N43570L92880N21466N32526j0085j007235j609666j054414J98912
33967a461767Q03051K45553m52883k22413N32124O27482r4478n67327r8034O47112
33957d1580O11544k00139p80716n10755N4401N1253m13897m31053L04440R39392
33947d17110O51060k00794o55123m21853Q3782N82821R95121R28539N9116j014102
$$ y = [-389383, 758502, 1844716, 1736303, 763482, 300296, 765553, 1112305, 589053, -14242, 412697, 1553738, 2100977, 1628102, 1052011, 1189397, 1721063, 1883218, 1517203, 1008582, 631415, 382229, 203308, 40391, -153722, -302154, -317813, -407076, -861534, -1403910, -1275841, -336150, 420467, -13284, -1320155, -2207512, -1925310, -905386, 30279, 573849, 966729, 1488195, 2020721, 2010636, 1003401, -606265, -1660679, -1461767, -658716, -413163, -866046, -1088459, -556335, 71147, -23331, -590658, -688692, -41580, 569964, 369825, -410891, -921646, -867245, -815992, -1229889, -1660942, -1356502, -417110, 233950, 33156, -621967, -1043820, -960038, -377217, 617904, 1546443, 1605559, 591457]
33937E91457j225508m74599K38534K50432m7305j31295r5701j17572K1068M16235
33927e74254O90807N74868K86996L8219k57435n31546m74158j46719j041p6414
33917d70677N0009L13598R7590n70882p88582k08913L28968J85940j06294M0288
33907a128955K27670j7258k72016q4378J20821l0240J8283O17793Q87116J14323
33897D53159p28406l86171N28560N08329k69520k62894O95499R83740j27746j170904
33887B23646o47242Q14595J411188M88355q87227j289669l77374Q42292J067636
33878A646200J57737p26722p03642k84426l05791n14144k55092R3786k36564p50297
33868a878955k43763J090207J713137J040338J62417k1773R4910K8146O1625L08675
$$ y = [591457, -634051, -1108650, -870116, -619684, -666989, -798284, -893985, -1011557, -990489, -574254, 116553, 691421, 978417, 1016636, 759201, 227655, -246503, -393222, -394263, -470677, -420668, -107070, -9480, -580362, -1368944, -1577857, -1248889, -1062949, -1169243, -1128955, -901285, -918543, -1190559, -1274937, -1154116, -1184356, -1166073, -548280, 338836, 453159, -275247, -661418, -132858, 375471, 105951, -156943, 538556, 1522296, 1394550, 223646, -423596, 390999, 1802187, 2290542, 1403315, 113646, -263728, 578564, 1646200, 1803937, 1077215, 373573, 89147, -216644, -730788, -985880, -892094, -1128658, -1878955, -2122718, -1032511, 680626, 1720964, 1883381, 1861608, 1956518, 1984664, 2046289, 2354964]
33858B354964K20969l00345m93827r0665J08390k98426n04442o825K92878m03394
33848H79277j232935r19100J76943O18009Q8554k88723K19086R11145O99343m56078
33838F95521j461638j243788P6055J193334J019125n0980p09636m19152J78093
33829g23066M29281L40230M7666l45831k98469O32890J582916J100905n02303
33820B264219j120415O4913J131967K77629j400801j645157l90562N36567L57731
33811G6091M443J06346J64996j42633l59659k17492k1607J12240L66639M94920
33801E84284L2224o86621p56413p3803M97651M63674K43857K18576J66623r3199
33791E96853k98209k25404N2391M63747Q62343P60113p2743q70240o75950J76584
$$ y = [2354964, 2575933, 2275588, 1781761, 1691096, 1799486, 1501060, 996618, 989793, 1282671, 879277, -353658, -1272758, -1095815, -477806, -389252, -677975, -458889, 452256, 1151599, 695521, -766117, -2009905, -1933850, -740516, 278609, 227629, -482007, -901159, -723066, -293785, 46445, 94111, -251720, -550189, 82701, 1665617, 2766522, 2264219, 1143804, 1208717, 2340684, 2618313, 1217512, -427645, -818207, -281640, 76091, 80534, 186880, 351876, 209243, -150416, -367908, -389515, -277275, 89364, 584284, 616508, -70113, -826526, -900329, -402678, 60996, 304853, 523429, 690052, 596853, 298644, 73240, 125631, 589378, 1451721, 2211834, 2139091, 1268851, 592901, 769485]
33781G69485M34531j93175o64345k99142L19207N05164M21672L62905J10845l58876
33771A408271m22260K20186Q27942N91241k40257q26958q31949m63539Q7810O46771
33761I97258Q57996N42843k893m19760o55056o67841k75255L51333N76653J30444
33751A435722m43363n96506n03633m94128l35181K65394R05077R62804N21676
33742A717862J41447l1062k59688n47449o44461n78447n35456l53327J99671P66589
33732a24321P63839L53645K39956M25148R5037r22509j502067p06437P36302J305823
33722F64416O67423j39363l42484k70761l79225m26314j57310j9336m13884p82709
33712a599547l68853M31429N30849j09899l61539K22739O26459M2781p50079o29134
$$ y = [769485, 1204016, 1010841, 346496, 47354, 366561, 871725, 1293397, 1656302, 1767147, 1408271, 986011, 1206197, 2034139, 2625380, 2385123, 1558165, 726216, 262677, 350487, 997258, 1855254, 2398097, 2395204, 1975444, 1320388, 652547, 377292, 728625, 1305278, 1435722, 992359, 395853, -107780, -601908, -937089, -671695, 233382, 1196186, 1717862, 1859309, 1828247, 1568559, 1021110, 376649, -201798, -737254, -1090581, -890910, -124321, 639518, 993163, 1233119, 1658267, 1753304, 830795, -671272, -1377709, -641407, 664416, 1331839, 1192476, 849992, 579231, 200006, -226308, -383618, -402954, -816838, -1599547, -1968400, -1536971, -1006122, -1116021, -1477560, -1254821, -628362, -585581, -1335660, -1964794]
33702a964794Q5621K55831j75374j99347M91996J004935O78083l8917m65692n71843
33692h99501n72595l67943J41252O73383Q82259P02138K08637m27582p49073l44817
33682g53842M38705P04564J80368l69580k08379M15625P25025L99762k27354o30404
33672F74490n06019k2808K47112p340k91495M1400O85310P16891P3119k71519
33662A339141J28952M70682N7559n80984o39427k77909r9026q3419O6512J03319
33652D85400k97940o85197l94159L27952O52144L91491N7471r0503j97632j80857
33642F8170J73951N37611L08118m02959q17824o06903k63704k59734m44543m15905
33632b123722N419P07313J262249J102753K42542m00854p8766O24216N43614l15939
$$ y = [-1964794, -1879173, -1623342, -1798716, -1998063, -1506067, -501132, 176951, 138034, -327658, -899501, -1472096, -1840039, -1698787, -1025404, -143145, 558993, 767630, 340048, -409025, -753842, -315137, 389427, 569795, 200215, -8164, 407461, 1132486, 1532248, 1304894, 674490, 168471, 145663, 392775, 385435, 93940, 135340, 820650, 1537541, 1610660, 1339141, 1468093, 1938775, 1996334, 1415350, 775923, 498014, 398988, 315569, 382081, 485400, 187460, -497737, -891896, -563944, 88200, 479691, 537162, 446659, 249027, 68170, 242121, 779732, 1087850, 684891, -132933, -739836, -1003540, -1263274, -1707817, -2123722, -2118303, -1410990, -148741, 954012, 1196554, 795700, 716934, 1341150, 1884764, 1568825]
33622A568825q20549n06133j59736l00968k79539M48505J144269Q06310k83999
33613A616985r72287p91401k51114J69630M61487N89049L58306q1817k27348N9498
33603I30988K66228p0113o79824q49958k70963N91991R55009M86804l63709q35538
33593A60915o66036l11765k73331l95319j18177O38899J214048R81802J43946
33584A374982n23098n93234l56602k59793l30640l54078l34220m13816m46799
33575b237298q2176O41491J151267R94251L94347n4946q0523P9109M2066l12672
33565E34916p09074o80880r4347N09357M16311k92532o72158r3835Q60965J093322
33555H72045L38865o05726q84276m20533J76143K22537m43512j194553j069985
$$ y = [1568825, 748276, 242143, 82407, -218561, -498100, -49595, 1094674, 1900984, 1616985, 644698, -146703, -397817, -228187, 233300, 822349, 1180655, 1098838, 871490, 930988, 1197216, 1127103, 447279, -402679, -673642, -81651, 873358, 1360162, 996453, 160915, -505121, -816886, -1090217, -1485536, -1603713, -964814, 249234, 1231036, 1374982, 851884, 258650, -97952, -357745, -688385, -1042463, -1376683, -1790499, -2237298, -2319474, -1677983, -526716, 467535, 861882, 806936, 726413, 805522, 847588, 534916, -174158, -855038, -949385, -440028, -23717, -316249, -988407, -1082242, -221277, 872045, 1210910, 605184, -279092, -699625, -523482, -300945, -744457, -1939010, -3008995]
33546c008995J62332J512556J722223O85793m32537n36563K36740P73592K42176
33537A357317r70168j588614q34083N89312J234402O59096j05833n8258M53553
33528G36724M35985k56020q57775q34449l65529J63758N12703N08255J74201j34402
33518H3451j67537j55816l16044l47256o359K44294n8396m30861j49454M26330
33508h77648L59718k21059k50285M71631R12148N07997k9192n1539N1930k03392
33498F70309n27169n51272m59365l26703K08052R77694J014131K8516q18144n43794
33488c27745J73144J87547k86295k73595J96039K78924j07807k32473P2217J88952
33478a31092j05468k87593q667M83553Q66743R23593L19600r21336j818177j297385
$$ y = [-3008995, -2846663, -1334107, 388116, 1073909, 641372, 104809, 341549, 1115141, 1357317, 387149, -1201465, -2035548, -1446236, -211834, 447262, 341429, 283171, 736724, 1172709, 916689, 58914, -775535, -1141064, -977306, -464603, 43652, 217853, 83451, -84086, -239902, -555946, -903202, -909561, -665267, -723663, -1154524, -1303978, -877648, -517930, -738989, -989274, -517643, 394505, 902502, 873310, 821771, 873701, 670309, 143140, -408132, -867497, -1194200, -986148, -8454, 1005677, 1034193, 216049, -327745, -154601, 32946, -253349, -526944, -330905, -51981, -159788, -392261, -320044, -131092, -236560, -524153, -532820, -49267, 817476, 1741069, 2060669, 1139333, -678844, -1976229]
33468a976229K83504J407268J300945O56455L10473J93926n9161l48143m55739
33459A313299n02371n87278n02023j78211P2944R4667J53821L49190K82999k52244
33449B44793p19958m88512K49806O98395M66283m6060k58590r9290M7207n4684
33439C9390j72799m0477J13540p8533l14494Q9581Q91784Q49730m13754j427987
33429d64019q23602N31802P66453j72419o47637q9641L17065k2280p8164P24924
33419D2482J246744O08187j88653m9376K22014n48240j526919j061283M47199
33410h07845J016127K03876l90061O0626L98424k23586p17917Q2977J329401J327230
33400B279252J809j154677j201958o32022k35986j11204Q797J41815J18361o1626
$$ y = [-1976229, -1692725, -285457, 1015488, 1671943, 1982416, 2176342, 2117181, 1769038, 1313299, 810928, 223650, -278373, -456584, -383640, -288973, -135152, 214038, 497037, 244793, -475165, -963677, -713871, -15476, 450807, 404747, 146157, 46867, 94074, 39390, -133409, -173886, -60346, -138879, -453373, -363792, 527992, 1377722, 963968, -464019, -1287621, -755819, 10634, -161785, -809422, -899063, -581998, -604278, -682442, 42482, 1289226, 1897413, 1708760, 1659384, 1881398, 1333158, -193761, -1255044, -807845, 208282, 412158, 22097, 82723, 481147, 257561, -460356, -377379, 952022, 2279252, 2281061, 1126384, -75574, -707596, -943582, -1054786, -1045989, -904174, -785813, -847439]
33390h47439j79328l9615K88385M92354L72850J29321Q0225J65352P5693j52246
33380C85552j61397K6019q1724n82705q27055l72232K24050J71246l54405m77067
33370b049718O8164N91334M63292j19434n58425n71062k39164L04092R10007J292785
33360I1871J165222N43448j83550n51279m18302o9513J11195K8764j51651l09023
33350B57182l90055k10479L36383Q12691N27391m27172r80640m05963O39651J015132
33340A174121O30068K94632L23504K55100p8372k29060r3908k06303o54589o52351
33330G62842J80399R39172O65623j96052n22603k04637m0269k16132r9624L97721
33320A666440M37761l56802j118338r57887k27711J58433J14357K64897P37639
$$ y = [-847439, -1026767, -1066382, -777997, -285643, 87207, 216528, 296753, 462105, 537798, 385552, 224155, 250174, 168450, -414255, -1241310, -1613542, -1389492, -1218246, -1572651, -2049718, -1981554, -1390220, -926928, -1046362, -1604787, -2175849, -2415013, -2110921, -1200914, 91871, 1257093, 1800541, 1616991, 1065712, 647410, 577897, 689092, 717856, 566205, 257182, -132873, -343352, -6969, 805722, 1333113, 905941, -74699, -480662, 158989, 1174121, 1804189, 2098821, 2422325, 2677425, 2599053, 2369993, 2276085, 2069782, 1415193, 762842, 943241, 1882413, 2548036, 2351984, 1829381, 1624744, 1584475, 1368343, 1268719, 1666440, 2104201, 1747399, 629061, -328826, -556537, -398104, -283747, -18850, 718789]
33311G18789R33825N25562l9418k48021k04299k89994n13016n72301l84418j66383
33301b39674k0233K19567N96693P60124L68197l15658n67690q0846N43554M49060
33291A713094m10126j146343r63238r1165M96615K42131l51341l79020K79378
33282f10015P59008L47112m96994o88771L6375P80014O85870o6349p32122r31495
33272i17367p10919j82881L57977L93159j09494l26643L36671J138375R01626
33263H80504j70624o65432L974Q50317Q95940M27043J45142K8414k52530n38749
33253A603999n56853n07727n92216m88728K5956M78188M15695J71015J66660O6026
33243G82015m84977q64781l47250M72615M08979l71679n20980L14671Q90353L22489
$$ y = [718789, 1652614, 2178176, 2138758, 1890737, 1686438, 1396444, 883428, 311127, -73291, -239674, -259907, -40340, 556353, 1316477, 1684674, 1369016, 801326, 720480, 1264034, 1713094, 1302968, 156625, -806613, -897778, -401163, -159032, -510373, -889393, -610015, 148993, 496105, -889, -689660, -653285, 126729, 812599, 746250, 14128, -917367, -1628286, -1811167, -1453190, -1060031, -1169525, -1496168, -1159497, -21122, 880504, 709880, 44448, 48422, 898739, 1794679, 2221722, 2366864, 2395278, 2142748, 1603999, 1047146, 539419, -52797, -541525, -515569, -37381, 378314, 549329, 715989, 782015, 297038, -567743, -914993, -442378, -33399, -405078, -926058, -611387, 278966, 601455]
33233F01455o22067q44765m60851j97053n4143M62552J224396J510429J053337
33224B673290L90017J39859L74899P83607J196692J788734K667950L252951K443390
33215A5711389q9919k992937m324906l619765k172047j202991o23297N3376N31183
33206A270086K59061m43679o73579j67470M37022N09382Q7603l60743m69921k41834
33196B05928K9008J10424J05905J88788J90480r5923k98812J35250Q60941Q39086
33186B271075p2905p08715l33421K02492q6370o42723l42154N29356P11021O0680
33176A588336l06451r877k3154q66068j514783r11557L92605J016038N79071j02652
33166a58492l25449j93942o4892O0438L75087P84321Q40744K56303n64649p90463
$$ y = [601455, -20612, -865377, -1326228, -1523281, -1577424, -1114872, 109524, 1619953, 2673290, 3063307, 3203166, 3578065, 4361672, 5558364, 7347098, 10015048, 13267999, 15711389, 15621470, 12628533, 8303627, 4683862, 2511815, 1308824, 685527, 738903, 1270086, 1529147, 1085468, 411889, 244419, 681441, 1190823, 1278426, 917683, 447762, 205928, 234936, 345360, 451265, 640053, 830533, 734610, 435798, 571048, 1431989, 2271075, 2198170, 1489455, 1156034, 1358526, 1272156, 629433, 287279, 816635, 1527656, 1588336, 1281885, 1272008, 1248854, 382786, -1131997, -2043554, -1650949, -634911, -55840, -158492, -483941, -677883, -742775, -682337, -307250, 477071, 1317815, 1574118, 1009469, 219006]
33156B19006j87781M28860K22488m65398o12393p4148K23531k13005o60946l46797
33146a466583L59822N66529J69715j40883P2593N37506P48845M76699j33124o80322
33136E10797q23866o18181l48740k7710N01865R08411N42773m00267o97707K58921
33126a93704J329919J050129k97776j092694o20208K12049M24325J30515j31863
33117H10692k82515m36098m75599l71267l78982n27601m39578k6019K12304j443
33107a916106j93659N8929L78879K83357J13636M60129J001173Q28667j46843
33098H68162r65651q94337k10777M50258Q56862R98697P39578R3558n05030o20659
33088H10661l34416o6043k8436j01525j45756j98816l20698l64319n5245N77961
$$ y = [219006, 31225, 460085, 682573, 217175, -395218, -469366, -245835, -458840, -1119786, -1466583, -1106761, -540232, -370517, -511400, -438807, 98699, 847544, 1324243, 1191119, 510797, -313069, -931250, -1279990, -1307700, -805835, 102576, 645349, 245082, -452625, -193704, 1136215, 2186344, 1888568, 795874, 175666, 387715, 812040, 942555, 810692, 528177, 92079, -383520, -754787, -1133769, -1661370, -2100948, -2126967, -1914663, -1916106, -2109765, -2050836, -1671957, -1388600, -1274964, -814835, 186338, 1015005, 868162, -97489, -991826, -1202603, -752345, 104517, 1103214, 1842792, 1936350, 1431320, 810661, 476245, 410202, 381766, 280241, 134485, -64331, -385029, -749348, -804593, -226632]
33078b26632R72159N91116k27702m99808N7349M97594J1883p75630p31711K3595
33068c07787L88349Q1559j08439Q9602m866n24574n34863L16783R41673N09562
33058H46999j64963k1990M97207L52467l14335o43616n89338o09051m67259J96641
33048i17238O96524K67834l34188N7573Q03970L65442q71566r81104K32275Q33846
33038A53368R3862l57354L64337P19850l66281j340949o71353M19182J28937p47376
33028a603777l72021P60594P78693j46834k35638N24889M13470o21746n99383
33019a101753Q99662J624518K57250j352809j070140M04486J007594L94110k35194
33010H27724l30972l06080k92759q7568M1257k76938o26873l33173L75063O47548
$$ y = [-226632, 745527, 1336643, 1108941, 609133, 666482, 1164076, 1175959, 400329, -331382, -307787, 80562, 162121, 53682, 143284, 138418, -386156, -921019, -604236, 337437, 846999, 682036, 660046, 1157253, 1509720, 1195385, 551769, -37569, -646620, -1113879, -917238, -220714, 47120, -287068, -229495, 574475, 939917, 68351, -912753, -680478, 153368, 247230, -110124, 254213, 974063, 607782, -733167, -1404520, -985338, -856401, -1603777, -1975798, -1215204, -436511, -583345, -818983, -294094, 119376, -502370, -1101753, -202091, 1422427, 1679677, 326868, -743272, -338786, 668808, 1062918, 827724, 496752, 190672, -102087, -189655, -148398, -425336, -1052209, -1385382, -1010319, -362771]
33000c62771K59308k16680k95936J7490M82020O94176K35684o82208j109247n16111
32990a494275L44163M34846r5740k60437K23391O32214M39083Q728p1658K18567
32980C78882M22107J72663l94768o50290o7081R70810J300517L28982j049548
32971A412274j403839m56036O91996R33896K83011l86178l55429K45276O12315
32962A577286J86380o07815q48710l69268L4506j43827l64351m1295L71565Q9082
32952a16447o52819q59540k21389N39384P40073M20153p9440n21951o41046k37821
32942a630843L72443N24567O8341l30798l6916O72862Q65783N8043j098034j375953
32932a910505l37517J020445J343834N71378q2871J15311M91348K05929m16644
$$ y = [-362771, -103463, -320143, -616079, -598589, -116569, 577607, 813291, 131083, -978164, -1494275, -1150112, -715266, -811006, -1071443, -848052, -215838, 223245, 231973, 160315, 378882, 800989, 973652, 578884, -71406, -138487, 832323, 2132840, 2461822, 1412274, 8435, -447601, 244395, 1178291, 1461302, 1075124, 719695, 964971, 1577286, 1763666, 1155851, 307141, -62127, -27621, -171448, -535799, -577094, -205529, -116447, -769266, -1628806, -1850195, -1310811, -570738, -150585, -230025, -751976, -1393022, -1630843, -1258400, -733833, -665492, -996290, -1033206, -360344, 505439, 563482, -534552, -1910505, -2248022, -1227577, 116257, 687635, 604764, 720075, 1211423, 1417352, 1000708]
32923A000708n80300l60256l52727m40854n3343N48122M39577m30031j001293
$$ y = [1000708, 420408, 60152, -292575, -733429, -786772, -238650, 200927, -229104, -1230397]
$$ [...]
##END NTUPLES=NMR SPECTRUM
##END=
