##TITLE=31Pdec_BAU-j-28-2
 CDCl3, 24 sc
 28.6.2019
##JCAMPDX= 6.0         $$ Bruker NMR JCAMP-DX V2.0
##DATA TYPE= NMR SPECTRUM
##DATA CLASS= NTUPLES
##ORIGIN= UXNMR, Bruker Analytische Messtechnik GmbH
##OWNER= root
$$ XWIN-NMR		Version 3.5
$$ Fri Jun 28 15:46:57 2019 Russian Standard Time (UT+4h)  she@DPX200
##.OBSERVE FREQUENCY= 81.013821
##.OBSERVE NUCLEUS= ^31P
##.ACQUISITION MODE= SIMULTANEOUS
##.ACQUISITION SCHEME= undefined
##.AVERAGES= 24
##.DIGITISER RES= 17
##SPECTROMETER/DATA SYSTEM= spect
##.PULSE SEQUENCE= zgpg30
##.SOLVENT NAME= CDCl3
##.SHIFT REFERENCE= (INTERNAL, CDCl3, 0, 182.463)
##AUDIT TRAIL= $$ (NUMBER, WHEN, WHO, WHERE, WHAT)
$$ ##TITLE= Audit trail, XWIN-NMR		Version 3.5
$$ ##JCAMPDX= 5.01
$$ ##ORIGIN= Bruker BioSpin GmbH
$$ ##OWNER= she
$$ F:/spectra/data/she/nmr/P31/1/pdata/1/auditp.txt
$$ ##AUDIT TRAIL=  $$ (NUMBER, WHEN, WHO, WHERE, WHAT)
(   1,<2019-06-28 15:45:44.68 +0400>,<she>,<DPX200>,
      <created by zg, POWCHK disabled, PULCHK disabled
       configuration hash MD5:
       00 E9 B6 7A A2 85 ED C7 34 08 36 98 17 FE 4E 26
       data hash MD5: 32K
       D2 00 2B 1B 8C 0B E0 05 D3 C9 68 41 CD FC E1 FC>)
(   2,<2019-06-28 15:45:47.53 +0400>,<she>,<DPX200>,
      <Start of raw data processing
       efp BC_mod = 2 LB = 1 FT_mod = 6 PKNL = 1 PHC0 = -2570.271 PHC1 = 159.1996 SI = 64K 
       data hash MD5: 64K
       95 3B 12 69 EE EC 7E 64 DB CD 84 A0 0F 36 31 B5>)
(   3,<2019-06-28 15:46:00.43 +0400>,<she>,<DPX200>,
      <pk PHC0 = -7.203546 PHC1 = 0 
       data hash MD5: 64K
       9C 96 81 F1 1E BC 78 C1 66 BC 6E C3 B1 35 73 C9>)
$$ ##END=
$$ 
$$ hash MD5
$$ 55 22 52 4C 87 F8 2F 87 E5 82 9F 9E 7C C0 79 86
##$RELAX= 
##$RELAX= 
##$RELAX= 
##$RELAX= 
##$RELAX= 
##$RELAX= 
##$RELAX= 
##$RELAX= 
$$ Bruker specific parameters
$$ --------------------------
##$DU= <F:/spectra>
##$EXPNO= 1
##$NAME= <P31>
##$PROCNO= 1
##$TYPE= <nmr>
##$USER= <she>
##$AMP= (0..31)
100 100 100 100 100 100 100 100 100 100 100 100 100 100 100 100 100 100 
100 100 100 100 100 100 100 100 100 100 100 100 100 100 
##$AQSEQ= 0
##$AQ_mod= 1
##$AUNM= <au_zg>
##$AUTOPOS= <>
##$BF1= 81.014009
##$BF2= 200.13
##$BF3= 200.13
##$BF4= 200.13
##$BF5= 200.13
##$BF6= 200.13
##$BF7= 200.13
##$BF8= 200.13
##$BYTORDA= 1
##$CFDGTYP= 0
##$CFRGTYP= 5
##$CHEMSTR= <none>
##$CNST= (0..31)
1 1 145 1 1 1 1 1 1 1 1 1 1 1 1 1 1 1 1 1 1 1 1 1 1 1 1 1 1 1 1 1 
##$CPDPRG= <waltz16>
##$CPDPRG1= <>
##$CPDPRG2= <waltz16>
##$CPDPRG3= <>
##$CPDPRG4= <mlev>
##$CPDPRG5= <mlev>
##$CPDPRG6= <mlev>
##$CPDPRG7= <mlev>
##$CPDPRG8= <mlev>
##$CPDPRGB= <>
##$CPDPRGT= <>
##$D= (0..31)
0 1 0 0 0 0 0 0 0 0 0 0.03 2e-05 3e-06 0 0 0 0 0 0 0 0 0 0 0 0 0 0 0 0 
0 0 
##$DATE= 1561722344
##$DBL= (0..7)
120 120 120 11 120 120 24 19 
##$DBP= (0..7)
150 150 150 150 150 150 150 150 
##$DBP07= 0
##$DBPNAM0= <>
##$DBPNAM1= <>
##$DBPNAM2= <>
##$DBPNAM3= <>
##$DBPNAM4= <>
##$DBPNAM5= <>
##$DBPNAM6= <>
##$DBPNAM7= <>
##$DBPOAL= (0..7)
0.5 0.5 0.5 0.5 0.5 0.5 0.5 0.5 
##$DBPOFFS= (0..7)
0 0 0 0 0 0 0 0 
$$ [...]
##$SUBNAM2= <"">
##$SUBNAM3= <"">
##$SUBNAM4= <"">
##$SUBNAM5= <"">
##$SUBNAM6= <"">
##$SUBNAM7= <"">
##$SUBNAM8= <"">
##$SUBNAM9= <"">
##$SW= 369.568048894756
##$SWIBOX= (0..15)
0 1 3 0 0 0 0 0 0 0 0 0 0 0 0 0 
##$SW_h= 29940.119760479
##$TD= 32768
##$TD0= 1
##$TE= 0
##$TE2= 300
##$TE3= 300
##$TEG= 300
##$TL= (0..7)
0 120 53 12 22 120 120 120 
##$TP= (0..7)
150 150 150 150 150 150 150 150 
##$TP07= 0
##$TPNAME0= <>
##$TPNAME1= <>
##$TPNAME2= <>
##$TPNAME3= <>
##$TPNAME4= <>
##$TPNAME5= <>
##$TPNAME6= <>
##$TPNAME7= <>
##$TPOAL= (0..7)
0.5 0.5 0.5 0.5 0.5 0.5 0.5 0.5 
##$TPOFFS= (0..7)
0 0 0 0 0 0 0 0 
##$TUNHIN= 0
##$TUNHOUT= 0
##$TUNXOUT= 0
##$USERA1= <user>
##$USERA2= <user>
##$USERA3= <user>
##$USERA4= <user>
##$USERA5= <user>
##$V9= 5
##$VALIST= <valist>
##$VCLIST= <CCCCCCCCCCCCCCC>
##$VD= 0
##$VDLIST= <DDDDDDDDDDDDDDD>
##$VPLIST= <PPPPPPPPPPPPPPP>
##$VTLIST= <TTTTTTTTTTTTTTT>
##$WBST= 1024
##$WBSW= 4
##$XGAIN= (0..3)
0 0 0 0 
##$XL= 0
##$YL= 0
##$YMAX_a= 32437
##$YMIN_a= -36205
##$ZGOPTNS= <>
##$ZL1= 120
##$ZL2= 120
##$ZL3= 120
##$ZL4= 120
##$ABSF1= 0
##$ABSF2= 0
##$ABSG= 0
##$ABSL= 0
##$ALPHA= 0
##$AQORDER= 0
##$ASSFAC= 0
##$ASSFACI= 0
##$ASSFACX= 0
##$ASSWID= 0
##$AUNMP= <proc_1d>
##$AZFE= 0.1
##$AZFW= 0.5
##$BCFW= 0
##$BC_mod= 2
##$BYTORDP= 0
##$COROFFS= 0
##$CY= -3
##$DATMOD= 1
##$DC= 0
##$DFILT= <>
##$DTYPP= 0
##$F1P= 0
##$F2P= 0
##$FCOR= 1
##$FTSIZE= 65536
##$FT_mod= 6
##$GAMMA= 0
##$GB= 0
##$INTBC= 1
##$INTSCL= 5.30512e-09
##$ISEN= 30
##$LB= 1
##$LEV0= 0
##$LPBIN= 0
##$MAXI= 10000
##$MC2= 0
##$MEAN= 0
##$ME_mod= 0
##$MI= 50
##$NCOEF= 0
##$NC_proc= -4
##$NLEV= 6
##$NOISF1= 182.463
##$NOISF2= 159.3651
##$NSP= 0
##$NTH_PI= 0
##$NZP= 0
##$OFFSET= 182.463
##$PC= 4
##$PHC0= -2577.475
##$PHC1= 159.1996
##$PH_mod= 1
##$PKNL= yes
##$PPARMOD= 0
##$PSCAL= 0
##$PSIGN= 0
##$REVERSE= no
##$SF= 81.0140089999434
##$SI= 65536
##$SIGF1= 159.3651
##$SIGF2= -187.1042
##$SINO= 113.3802
##$SIOLD= 16384
##$SREGLST= <1H.CDCl3>
##$SSB= 0
##$STSI= 65536
##$STSR= 0
##$SW_p= 29940.119760479
##$SYMM= 0
##$S_DEV= 0
##$TDeff= 32768
##$TDoff= 0
##$TI= <>
##$TILT= no
##$TM1= 0
##$TM2= 0
##$TOPLEV= 0
##$USERP1= <user>
##$USERP2= <user>
##$USERP3= <user>
##$USERP4= <user>
##$USERP5= <user>
##$WDW= 1
##$XDIM= 65536
##$YMAX_p= 532040942
##$YMIN_p= -2439179
$$ End of Bruker specific parameters
$$ ---------------------------------
##NTUPLES= NMR SPECTRUM
##VAR_NAME=  FREQUENCY,     SPECTRUM/REAL,   SPECTRUM/IMAG
##SYMBOL=    X,             R,               I
##VAR_TYPE=  INDEPENDENT,   DEPENDENT,       DEPENDENT
##VAR_FORM=  AFFN,          ASDF,            ASDF
##VAR_DIM=   65536,         65536,           65536
##UNITS=     HZ,            ARBITRARY UNITS, ARBITRARY UNITS
##FACTOR=    0.456856943014862, 1,           1
##FIRST=     14782.0589164792, 0,            0
##LAST=      -15158.0608439998, 0,           0
##MIN=       -15158.0608439998, -2439179,    0
##MAX=       14782.0589164792, 532040942,    0
$$ Real data points
##PAGE= N=1
##DATA TABLE= (X++(R..R)), XYDATA
$$ [...]
39001h8891J67850J64166q4778k20456j16846l6195q0609o534K27257K46134j00349
38990G0749l54358j13475L04503L34982J5784j56984l5325O7604N203o425J16698
38979B48956J30083o6116j76160j400J39294j45478o21135o15727L0660O13980
38969d63043M63728q1041j03617N15207Q06442J22811p76977p39746P8481M46501
38959B68746p9866n59273k10820M14505M13497q0086k77161p972K13002J30964
38949B25536k463j5113p790j7298k091o9773k63259l00956j3899K09211j0697
38938b68592l07944j13455L06771K19637k69174k60494M51928R16014M23911m47033
38928F51569p23832l36912M6901M5920j45325k34240j48608M162M4264q6549j55595
$$ y = [-88891, 78959, 243125, 158347, -62109, -178955, -215150, -295759, -302293, -75036, 171098, 70749, -283609, -397084, -92581, 242401, 258185, 101201, 65876, 133480, 138683, 132258, 248956, 379039, 312923, 136763, 135363, 274657, 129179, -491956, -1107683, -1077023, -463043, 685, -80356, -183973, 331234, 1137676, 1260487, 483510, -256236, -177755, 268746, 188880, -370393, -581213, -166708, 246789, 166703, -110458, -118430, 94572, 225536, 223073, 207960, 200170, 182872, 180781, 111008, -152251, -453207, -467106, -257895, -268592, -576536, -689991, -383220, -163583, -432757, -693251, -241323, 674691, 1098602, 651569, -72263, -409175, -362274, -316354, -461679, -695919, -844527, -840365, -796101, -882650, -1038245]
38917a038245R2430M76997N52884K66156j778p8939j57448k34427l8611L13372
38907A52391K87299j48830k93533J79427N90197K96196k75536l35430M8661K19159
38897G20001M9961j4074J50075J76400r3683l67058l78067j59304J26526K62001
38887D72778M1210l67839l93106J52449N79272K19712m86557n62921L2960L74677
38877F2635J2659m26810l10479J15686K85641J44117j6316j00309j72861j89052
38867e95089j04468k0727J9551J33737L08785L13785J10696K0538K12747L51913
38857G51468J00427k88486k98000P4037K97313O5665l16832m21294k57667j34749
38847d28118j44069p7048J56290L11018J60393j28456k07784l2779J40254J79175
$$ y = [-1038245, -945815, -468818, 84066, 350222, 348444, 269505, 112057, -122370, -160981, 152391, 439690, 290860, -2673, 176754, 766951, 1063147, 787611, 452181, 500842, 720001, 769962, 755888, 905963, 1082363, 988680, 621622, 243555, 84251, 210777, 472778, 513988, 146149, -246957, -94508, 484764, 704476, 217919, -345002, -312042, 62635, 75294, -351516, -661995, -546309, -260668, -116551, -132867, -233176, -406037, -595089, -699557, -720284, -700733, -566996, -258211, 55574, 166270, 186808, 399555, 751468, 851895, 563409, 265409, 339446, 636759, 702424, 385592, -35702, -293369, -428118, -572187, -649235, -492945, -181927, -21534, -149990, -357774, -390553, -250299, -71124]
38837g1124J71064J04799j31180l54623j70188L42358N16361L2622m97899l72960
38827d30770J76969M03480J78603K4026J57020K34497O1001j12924j12555r4326
38817D85021j49084j43585o5007o3484r2407J4617R8889j24263m03656j70846
38807f13805M67009P04127K50172j99073p9512K06988R3974k06446k10840l8693
38797C73901n8080j21480P9850K67572j802m19512k82740L32104N93462J57382
38787I20657l82611m37806j32022J49520L07675L42864J40939k23446l68751j10139
38777B06880K23348K40348j1471k24521k59830j81805r1287j09111l03662m80326
38767i91437l02231K06190N56140M08994K1346j71306j42378j32863j55895k7053
$$ y = [-71124, 99940, 204739, 73559, -281064, -451252, -108894, 407467, 440089, -57810, -430770, -253801, 149679, 328282, 352308, 509328, 743825, 804826, 691902, 579347, 485021, 335937, 192352, 127345, 63861, -28546, -13929, 84960, -39303, -442959, -613805, -146796, 557331, 807503, 608430, 528918, 735906, 829880, 623434, 412594, 373901, 315821, 194341, 274191, 541763, 539961, 120449, -162291, 169813, 763275, 920657, 538046, 100240, -31782, 117738, 425413, 768277, 909216, 685770, 317019, 206880, 430228, 670576, 659105, 434584, 174754, -7051, -98338, -207449, -511111, -991437, -1293668, -1087478, -531338, -122344, -100998, -272304, -414682, -547545, -703440, -730493]
38757g30493K31611L85301L46482K42710J55393N4777m4801j14533k28656l86685
38747h8894l26431J27204N98597M94182j62788o84018o12483k06915J27868L68567
38737c65111N35107L67971j67422m97286j72542L41121K96525j47966j81750L02468
38727C11115N14428P6393l78709k92761l6248j19059k67782j4117L51772K47444
38717C92476j51807k01132Q0292O0532l47118m67981O315M59444K76777k68162
38707a60364m80545j98558J24324P0514l05062n82492l96968J42038M85612K97267
38697a004234o1426l4405K95350L70934O9106j65238j10878l8153o7333N1619
38687f94658L00643K42397j64074k95879J43746N31579K69449k74786m02776j38837
$$ y = [-730493, -498882, -113581, 232901, 475611, 631004, 685781, 640980, 526447, 297791, -88894, -415325, -288121, 310476, 804658, 641870, -42148, -654631, -861546, -733678, -365111, 169996, 537967, 370545, -126741, -299283, 41838, 338363, 190397, 8647, 311115, 825543, 901936, 523227, 230466, 194218, 75159, -192623, -206740, 145032, 392476, 240669, 39537, 119829, 180361, -166757, -634738, -628423, -168979, 107798, -160364, -640909, -839467, -715143, -644629, -949691, -1532183, -1929151, -1787113, -1301501, -1004234, -1065660, -1100065, -804715, -433781, -364675, -529913, -640791, -678944, -746277, -694658, -394015, -151618, -315692, -611571, -467825, 63754, 333203, 58417, -344359, -483196]
38677d83196M7461J17854K96260L77475K9417m33480l96016N6027K66427P8934
38667d2837k3481J26324J06048k41367m38089j60423K29410K93621J50305J27484
38657A26995K00045J51309R20p2754m6946l0028n8873r6927j22500j21814r6721
38646a67294q9614q2344M5475K81082L61427J56291l7275N0478J52159q6264l71009
38635B13112j51385L76159M55160n856k59804K8942K51574m5626l88358k64826
38625B09092k5537j86698m63209k95130J40441K77638J65932K74037N33741M45530
38615A075837K1418k17746j62891k25809m84395n18964k28829l0796m4070J37991
38605f78254N64095O09194J1804m93516k15055L91789L96144k21918o45663m80807
$$ y = [-483196, -435735, -317881, -21621, 355854, 385271, -48209, -444225, -388198, -121771, -42837, -66318, 60006, 166054, -75313, -513402, -673825, -444415, -150794, -489, 126995, 327040, 478349, 479269, 406515, 359569, 329541, 270668, 173741, 51241, -70573, -167294, -256908, -339252, -293777, -12695, 348732, 505023, 467748, 518226, 670385, 584121, 213112, 61727, 437886, 893046, 887190, 627386, 656328, 907902, 862276, 473918, 209092, 183555, -3143, -466352, -761482, -621041, -343403, -177471, 96566, 630307, 1075837, 1097255, 879509, 716618, 490809, 6414, -512550, -741379, -772175, -816245, -678254, -114159, 495035, 506839, 13323, -201732, 190057, 586201, 364283, -281380, -762187]
38595g62187j46131j6840O9268K66685L22289N8915j96603o6949K70660L18306
38585A17413l7073l85520l40493J9549K93207J98388j64865m31133l45479l0344
38575a106350J83884J83683J70891K82906L29616R5377k56468l47780r6473K00654
38565c60060K92398K14426O8046j45511l35844k48866J71979N34161M01329j20261
38555D71797m74027l27994Q9728L67510L73593K21616j8289l45720o28783o08402
38545h78971k05319K81297M26736J49193j85481k02085L3239J40197m7637k79177
38535g68008k45793M3895L36962M23201K52459o9829k87873j69321J80933L52371
38525D8997J36480j83423k40318o8931O6152J04894J22287K1918k83871n15396
$$ y = [-762187, -908318, -925158, -855890, -589205, -266916, -208001, -404604, -471553, -200893, 117413, 80340, -305180, -645673, -626124, -332917, -134529, -299394, -730527, -1076006, -1106350, -922466, -738783, -567892, -284986, 44630, 140007, -116461, -464241, -560714, -360060, -67662, 146764, 214810, 69299, -266545, -515411, -343432, 190729, 592058, 471797, -2230, -330224, -240496, 127014, 500607, 722223, 703934, 358214, -270569, -878971, -1084290, -802993, -376257, -227064, -412545, -614630, -581391, -441194, -488831, -768008, -1013801, -969906, -632944, -209743, 42716, -27113, -314986, -484307, -303374, 48997, 185477, 2054, -238264, -307195, -241043, -136149, -13862, 8056, -275815, -791211]
38515g91211l13166J63898M02574K91952K06402K85754K10304j24782k87084R085
38505E3726L75631L12888p6379l53248m06512m06237l44110r1449K27388L43339
38495c64963K43443J26690O7377K9324O3065J61099R7239k17301m12835j41174
38485c48036K98291L38213K8462o9341J45819J32549l38898p13581m83345M0259
38475i69608K35015O6875j4019J54840K72683J09519j79281l12485k04870J1799
38465h29532J38584P4131q5159j51453q5944j0631M6238J96202L92482L63253
38455D8171L6024k36297j48058Q5991O6378j59103k00024L0579K09599J60938
38445a05802R6713J82694K36964P0008j54682j46595Q9552K62746J33430k69231
$$ y = [-791211, -1104377, -940479, -537905, -245953, -39551, 246203, 456507, 331725, 44641, 53726, 429357, 742245, 665866, 312618, -93894, -500131, -844241, -935690, -708302, -364963, -121520, 5170, 72547, 101871, 164936, 326035, 423274, 205973, -206862, -348036, -49745, 288468, 316930, 247589, 393408, 525957, 187059, -526522, -1009867, -969608, -734593, -667718, -681737, -526897, -254214, -144695, -323976, -636461, -841331, -829532, -690948, -616817, -701976, -853429, -939373, -950004, -903766, -707564, -315082, 48171, 84195, -152102, -300160, -214169, -147791, -306894, -506918, -476339, -266740, -105802, -9089, 173605, 410569, 480577, 325895, 179300, 268852, 531598, 665028, 395797]
38435C95797o45748n83585O5277Q46055J000062L17748n27028p50103l53056O6136
38425a68445J81886J64411J34842m7389l42678l86293m6982K72761K23919O4700
38415E0732K19399N26382M23856j77006o84216n94728j11992J85989O3711j85492
38405b83365j75196J01699K72741O7254k62577k04661K69471N41825J81448l76655
38395A31984m20497J2231K78053J76710J46874L47883L19776j37377m66463k27654
38385A61520J39797M5348k65906j83636J79642J97311j63572l00361l0542J43915
38375g6484k9758j42894P0597K27307q81k71706j58404J14389O6201k31464k94378
38364g27475Q030L20006L49680J47450j06960k48026j15732K61550N14511K85823
$$ y = [395797, -249951, -833536, -768259, 77796, 1077858, 1395606, 868578, 118475, -234581, -168445, 13441, 177852, 312694, 265305, -77373, -463666, -510648, -237887, -13968, 50732, 270131, 796513, 1220369, 1043363, 359147, -235581, -347573, -161584, -97873, -283365, -458561, -356862, -84121, -16867, -279444, -484105, -214634, 327191, 508639, 131984, -288513, -276282, 1771, 178481, 325355, 673238, 993014, 855637, 389174, 161520, 301317, 346665, 80759, -102877, 76765, 274076, 110504, -189857, -220399, -76484, -106242, -249136, -178539, 48768, 47887, -223819, -382223, -267834, -201633, -433097, -727475, -719445, -399439, -49759, 97691, -9269, -257295, -373027, -111477, 403034, 688857]
38354F88857k65360n95268m24627o600K62940K59175J17314K2571P3036K06473
38344C38511K33752N1941j99386l03746k29364j04655k6351l8399j78912l55203
38334h11812l03023P9122M58866M19380J6666l01671k83772p3000J37086K97875
38324c64283L49983K31936R4330J60741L21510K31819j20888l60928l41687l51022
38314a48489n07993m57597M468M59793M48137J45513m741N62p8855j15011J63834
38303i0379N02763L60182j97875m99999k51228J06369J72395J22657K03004K40468
38293F68357K8350k33286k77551k14861k53458k62969j9506L25083M19469K37610
38283D17238Q3045J35224K62039K40847j1473l51541m59487j58815K36578K04456
$$ y = [688857, 423497, -171771, -596398, -602998, -340058, -80883, 36431, 59002, 132038, 338511, 572263, 624204, 424818, 121072, -108292, -212947, -239298, -277697, -456609, -811812, -1114835, -1035713, -576847, -157467, -140801, -442472, -726244, -799244, -662158, -364283, -14300, 217636, 311966, 472707, 794217, 1026036, 905148, 544220, 202533, -148489, -656482, -1114079, -1109611, -649818, -201681, -56168, -60909, -60347, -139202, -254213, -90379, 412384, 772566, 574691, 74692, -176536, -70167, 102228, 224885, 427889, 668357, 696707, 463421, 185870, -28991, -282449, -545418, -564924, -239841, 179628, 417238, 500283, 635507, 897546, 1138393, 1126920, 775379, 315892, 157077, 393655, 598111]
38273E98111k14427l38202J81969P43831N89613j38996o68757o44210l36010j0416
38263b37494K74644L46818M2601l37672k94972J01669K86219R2583k3573K07855
38253D58678M42870L25627r612k82772m35600m25853j37383K54689L08862k1547
38243D77959k28119l0253J88366O1431j67822j57377o2791j16813p8938K96412
38233A82055O25074L99360j31268k77620L7736K34977M5851j48727n2616Q1880
38223I96702l6196k28379j71691M5585K5519l48560o63454m31193K56702P13770
38213A58805M51458j75822m29550j65120J21211J71408K39557L64237J29973m85870
38203C80287p73783l34241K25430K70583J31910L38224N34922J75362k64743K9079
$$ y = [598111, 383684, 45482, 227451, 971282, 1560895, 1421899, 753142, 108932, -227078, -237494, 37150, 383968, 426569, 88897, -206075, -104406, 181813, 274396, 250823, 458678, 901548, 1227175, 1217563, 934791, 499191, 73338, -64045, 190644, 499506, 477959, 249840, 219587, 407953, 469384, 301562, 144185, 81394, -35419, -114357, 182055, 807129, 1206489, 1075221, 797601, 835337, 1070314, 1116165, 967438, 914822, 996702, 960506, 732127, 560436, 606021, 631540, 282980, -380474, -811667, -554965, 158805, 610263, 434441, 4891, -160229, -39018, 132390, 371947, 736184, 866157, 380287, -393496, -727737, -502307, -231724, -99814, 238410, 773332, 948694, 683951, 713030]
38193G13030O58373M72966n05816r84747l95629L06966K42779j75658j99092P5446
38183B08618J57102L1084p1049j64528k38309n9763K89803K90628j53733l77980
38173h8127J8750M62665L04166j80082l30724j31061k0116j00456j64113j62315
38163c91413j06118J41649M91823M75663l5101m29649k19773J98653K33805K4050
38153C83589R025Q6654n2076k05920o9956O6888j49266l35661N129M65548L31875
38142E35829j42230j65190J44210k6901n97810n49044L37622R61328N60152k13260
38132H44706m32827j70512J3995N9632J67567J74933j30561m67000m25072r6963
38122d62102J19375R0566l4164j18723p5969J19778K59674P6817k50479k09192
$$ y = [713030, 1371403, 1844369, 1338553, 353806, -41823, 265143, 507922, 332264, 133172, 208618, 365720, 396804, 325755, 161227, -77082, -136845, 152958, 443586, 289853, -88127, -69377, 393288, 697454, 517372, 186648, 55587, 35471, -64985, -229098, -391413, -497531, -355882, 135941, 611604, 576503, 146854, -72919, 125734, 359539, 383589, 392614, 479268, 427192, 221272, 151316, 218204, 68938, -266723, -261594, 203954, 535829, 393599, 228409, 372619, 345718, -252092, -801136, -463514, 497814, 1057966, 844706, 411879, 241367, 255362, 314994, 482561, 657494, 526933, 59933, -365139, -462102, -342727, -252161, -286325, -405048, -481017, -361239, -101565, -24748, -275227, -484419]
38112d84419K43267M88556J42386l57413m11267o4775K22474K33511N9352j51131
38102g9459j96630P6540M28107L88504L033j13177K31966L82371j26821p15107
38092B79327n81173J09737N68634N21815K71939m8038m72963o72126k69958L56160
38082F3354M08677j48726m99122j87217K97306L72219J34718l6902r3869j52427
38072A58011j50603m6138l2419k20232l68258k31026N2375J89747J51203R7596
38062c99744P6283L3166k3960q6860k16870l60917k87676N8359L27942J88967
38052f91310j56892k09264J42671N00766N27608L09128Q5949o0135j13670k834
38042C32017K17414K70776L57l33516l56055r1046R7802L1671j08257j40075j09288
$$ y = [-484419, -241152, 247404, 389790, 32377, -378890, -443665, -221191, 12320, 71672, -79459, -276089, -199549, 228558, 617062, 620095, 506918, 738884, 1121255, 994434, 279327, -301846, -192109, 376525, 898340, 1170279, 1122241, 649278, -22848, -292806, 63354, 472031, 323305, -175817, -363034, -65728, 306491, 441209, 404307, 310438, 158011, 7408, -38730, -71149, -291381, -659639, -890665, -838290, -648543, -497340, -399744, -323461, -290295, -314255, -401115, -617985, -978902, -1266578, -1208219, -880277, -691310, -848202, -1057466, -914795, -414029, 113579, 422707, 508656, 448521, 334851, 332017, 549431, 820207, 820564, 487048, 130993, 39947, 137749, 169420, 61163, -78912, -188200]
38031a88200p5597L2866K01535K25139J8206j84101j45379M2095J59563J91949
38021B78076K05886J05883j68221l69162k35448N7344J23693l6164q7173L6064
38011h9222M6407j27358j71216O2855K70881J85089j2673j3290J76201L46319
38001F73993L87719K68021m2143m02744n03804k57602K3925N6819l1319K4764
37991A97629J84348J99246Q504k10337k88723j91279R04J06701j2639k30904k65851
37980e02401r2702R995o2040m1245K36599M90382M04773J03053r6476j49854j85852
37969A14232j54104O0218L17145L68944K38934J49941J46369O6291j50567l60284
37959G97119m09575k93158j53874j72651l39590l56136j5700L55633K55148j68533
$$ y = [-188200, -263797, -230931, -29396, 195743, 213949, 29848, -115531, -73436, 86127, 278076, 483962, 589845, 421624, 52462, -182986, -125642, -1949, -38113, -125286, -89222, -42815, -170173, -341389, -278534, -7653, 177436, 164763, 151473, 327674, 673993, 1061712, 1329733, 1287590, 884846, 381042, 123440, 147365, 204184, 172865, 197629, 381977, 581223, 589727, 379390, 90667, -100612, -99708, 6993, -5646, -236550, -502401, -595103, -585108, -647148, -688393, -451794, 38588, 443361, 546414, 449938, 300084, 114232, -39872, 20346, 337491, 706435, 945369, 1095310, 1241679, 1307970, 1157403, 797119, 387544, 94386, -59488, -232139, -571729, -927865, -943565, -587932, -332784, -501317]
37949e01317k13230K66151N09056J4309n94544m81673J50287M61419K46666N758
37939a37118k3533q0948k15756j71647L9949J22438P5835J64149K94932J01540
37929A69841l01782l43781Q3611L98547K32396o8931j10542k7774o9824j17376
37919a55615M362J32730N9113r0438q8291K3434O2912J0855k9637j2652N1684
37908c1543J32960J59752J17566J29945K39500K31218k9090k46589r3839K08276
37898H18156K03138n8159j70220j31944k46000l41652N4268O98825P02770j16534
37888A412648q24053o95282j44293J32024J44294J78382J04773j99368l33167
37879b24042K0753M49729M27403J35446L8927Q4856j8911j47892o9081j4567k48474
$$ y = [-501317, -714547, -448396, 60660, 74969, -519575, -1001248, -850961, -389542, -142876, -137118, -160651, -241599, -457355, -629002, -589053, -466615, -390780, -226631, 68301, 169841, -131941, -475722, -392111, 6436, 238832, 169901, 59359, 31585, -38239, -155615, -151253, -18523, 40590, -49848, -138139, -114705, -51793, -40938, -70575, -83227, -31543, 101417, 261169, 378735, 508680, 748180, 979398, 950308, 703719, 609880, 818156, 1021294, 963135, 792915, 660971, 414971, 73319, 127587, 826412, 1529182, 1412648, 588595, -106687, -250980, -118956, 25338, 203720, 308493, 109125, -224042, -203289, 246440, 673843, 809289, 848216, 933072, 914161, 766269, 697188, 682621, 434147]
37868D34147m35023j67763K28969K03501n3116J9306K95914K08762j52886j69081
37858D12730J50014J36502l26122n54084k39267N7956o5277j81869J46709N82128
37848A19420N72678J83988j33906k16907j92988j36031p5575r0220j29586j9192
37838a18319J73973J35403j50137k62020N472K91445K63907J22260J31451Q8321
37828F81756k58927o04343m68818J0553K49695R2338m4360P4729J50930n7672
37818a74119k56022o3659L35268M00583J2948l48003k91244m4549m9499k61276
37808g39572k41407J16492M02745L40256J75890J77931J61457r7343l28568j64028
37798a96147J76998J78677j27493k27534L303J45060J9795l7808J06431O6575
$$ y = [434147, -876, -168639, 60330, 263831, 210715, 230021, 525935, 734697, 581811, 412730, 562744, 699246, 373124, -180960, -420227, -362271, -427548, -609417, -462708, 119420, 692098, 876086, 742180, 525273, 332285, 196254, 120679, 30459, -99127, -118319, 55654, 191057, 40920, -221100, -215628, 75817, 339724, 461984, 593435, 681756, 422829, -181514, -650332, -639779, -390084, -297746, -342106, -267377, -116447, -174119, -430141, -493800, -158532, 242051, 254999, -93004, -384248, -428797, -478296, -739572, -980979, -864487, -461742, -121486, 54404, 232335, 393792, 296449, -32119, -196147, -19149, 159528, 32035, -195499, -192196, -47136, -27341, -65149, 41282, 107857]
37788A07857l23860n46505j51913M74978O35775K87755l8140p0056j6367n9682
37778B99842j22722j43353j84397k19699j20700R1056K25835K03218J44775J60562
37768C34417K17557K42292K05780R0337j05009l13761m41188m42131l09895n8447
37758e80048K12014L25885K17006L6056k2574N9190J50354J40734P742k04310
37748C42049l86974m10130k29797P3146L52836M37754J91570k99752o58993n60564
37738a148855j31585K10333K83926K36650J62281L265j48064p9382J22165J26411
37728c62855m4415J1209L17172L37872j01867l48249P7996N74758L03715m57839
37718C07497o85716j47365L38913K21537p6880j5261K44476K64955L9723j40061
$$ y = [107857, -216003, -762508, -914421, -439443, 196332, 484087, 445947, 375891, 359524, 299842, 177120, 33767, -150630, -370329, -491029, -399973, -174138, 29080, 173855, 334417, 551974, 794266, 1000046, 1090383, 985374, 671613, 230425, -211706, -521601, -580048, -368034, -42149, 174857, 210913, 188339, 247529, 397883, 538617, 546359, 342049, -44925, -455055, -684852, -611706, -258870, 178884, 370454, 70702, -588291, -1148855, -1280440, -1070107, -786181, -549531, -387250, -383985, -532049, -611431, -489266, -362855, -407270, -396061, -78889, 258983, 157116, -191133, -113137, 461621, 765336, 307497, -378219, -525584, -186671, 34866, -42014, -57275, 187201, 452156, 491879, 351818]
37708C51818j46431p27K81776N39963M60790O814m19945m90166l43629k35722
37698D541j14798J33383L19451K10412o0548k15479k72005l76691l78796l1787
37688g82317M63726O01450K83150m8549q1230j9529j36160l14637k92578q1263
37678d07937J26120K52486K81460R9840k97113n83722m32759m652K40134K01871
37668e24272K20133M12863L84902j19431o30054m73474K60570P53695N10541l9539
37658G55934j82932J50050M00387J83858k37798l43381j9851L02563J77975k88578
37648H98227n29576k12688L01971L88082m5170m49765l67592L0224K78735K35079
37638E27527J08038L6560m9742j72273j87392k7685J15670L126l06694m54472
$$ y = [351818, 205387, 204660, 486436, 1026399, 1487189, 1494003, 1074058, 583892, 240263, 4541, -110257, 23126, 342577, 552989, 492441, 276962, 4957, -371734, -750530, -782317, -318591, 282859, 566009, 517460, 436230, 416701, 280541, -34096, -326674, -407937, -281817, -29331, 252129, 351969, 54856, -528866, -961625, -966277, -726143, -524272, -304139, 108724, 493626, 374195, -255859, -729333, -468763, 284932, 795473, 755934, 573002, 723052, 1123439, 1307297, 1069499, 726118, 706267, 1008830, 1186805, 898227, 368651, 155963, 457934, 846016, 800846, 351081, -16511, 13713, 292448, 527527, 635565, 672125, 622383, 450110, 262718, 235033, 350703, 353829, 47135, -407337]
37628d07337j96088K34623L31383m8921m24126k57065L29231O97418N21503J19183
37618H99804r8045j26642j51159j78307j56492j75179k51159j63459J84146M65141
37608B48649L44188r385j90602j50232j03966l3675K12417M20955J87923l70580
37598E55692o34639l47877L6858Q9797J0659J87209N15394N48744J42859l65160
37588G39536n49685k93883J27421K83253K7827k83675k18733J26823K64594M9176
37578B72654j55708j34060j26588k52515j59993L36453P30704M85920r8515k86314
37568F12038J4731J99823n3110l70578l56829j46772o9576j54086k09712j31903
37558f65974O7365L29859N15101M79252K81542J24585M4546j01478k99127l34507
$$ y = [-407337, -603425, -368802, -37419, -86340, -510466, -767531, -438300, 259118, 780621, 899804, 801759, 675117, 523958, 345651, 189159, 13980, -237179, -400638, -216492, 248649, 592837, 583452, 392850, 242618, 138652, 104977, 317394, 738349, 926272, 555692, -78947, -426824, -389966, -300169, -289510, -102301, 413093, 961837, 1104696, 739536, 189851, -104032, 23389, 306642, 334469, 50794, -167939, -41116, 223478, 272654, 116946, -17114, -143702, -396217, -556210, -219757, 510947, 996867, 898352, 612038, 626769, 826592, 773482, 402904, 46075, -100697, -170273, -324359, -534071, -665974, -598609, -268750, 246351, 725603, 1007145, 1131730, 1176276, 1074798, 775671, 441164]
37548D41164j86574j26063k51625k69414J0012K84709K27858O2014J99297M82620
37538H73998L53290k21899n83185l33798P6006Q5278j12786J6180L65957L13941
37528H32982k05341m69954n9349M39469K66595m05612p63832m97213m9162J78377
37518g33040K62509L38180L06615J62215J39734K78342K35218j76898o06249o25469
37508d18843k91232N6089K63669L20840J47474j86891l07025k6373K56174J35914
37498e0204p9362J61755O56351O67239J25264k00431P7442L75498J60638j76803
37488A717387o4661K30044Q7018l31059k80854L31487P51996N36549J78131K67313
37478C423351O07562O14092K10809j62589k41982j73479j17179l7124N1011k9522
$$ y = [441164, 254590, 128527, -123098, -392512, -382500, -97791, 130067, 192081, 391378, 873998, 1227288, 1005389, 422204, 88406, 164412, 249690, 136904, 153084, 519041, 832982, 627641, 157687, 98338, 537807, 804402, 398790, -365042, -862255, -911417, -733040, -470531, -132351, 174264, 336479, 476213, 754555, 989773, 812875, 206626, -418843, -710075, -653986, -390317, -69477, 77997, -108894, -415919, -442292, -186118, -50204, -129566, 32189, 688540, 1355779, 1481043, 1280612, 1358054, 1733552, 1894190, 1717387, 1652726, 1882770, 1969788, 1638729, 1357875, 1689362, 2441358, 2977907, 3156038, 3423351, 4030913, 4645005, 4855814, 4693225, 4451243, 4277764, 4160585, 4123461, 4174472, 4144950]
37468D144950l19504n55000m83158j94880L5871J18359J37613P2258j89895n21773
37458B244841n39244r0666M35438N23487J42230k87364m60295m52523m19475l25079
37448G71350r4212J79290L42085L70518L18928K00049N4321J7122J31098J62874
37438B453423j70571p61869j088014p51959K6300N94320N56857J68412m8592K1580
37428I99887J2250k97372n64997l42877K25162N25914K81844j23073k22408n1507
37418D42823M1905p0558k05524j84932l1689J11122J34810O9668N9849J50297
37408E17771J53775o5931k49190l5863L90090M34160J6054j96142J88816N84233
37398A737773K92621l86454o19777l07249q6775k05398k28794O4062L05629K65832
$$ y = [4144950, 3825446, 3270446, 2787288, 2592408, 2628279, 2746638, 2884251, 2956509, 2766614, 2244841, 1705597, 1614931, 2050369, 2573856, 2716086, 2428722, 1968427, 1515904, 1096429, 771350, 677138, 856428, 1198513, 1569031, 1887959, 2088008, 2142329, 2159451, 2290549, 2453423, 2282852, 1520983, 432969, -318990, -292690, 301630, 858487, 1026899, 978307, 999887, 1012137, 714765, 149768, -193109, 32053, 557967, 839811, 716738, 494330, 442823, 484728, 414170, 208646, 23714, -7975, 103147, 237957, 307625, 367474, 517771, 671546, 605615, 356425, 320562, 710652, 1144812, 1160866, 964724, 1153540, 1737773, 2030394, 1643940, 1024163, 716914, 630139, 424741, 195947, 260009, 565638, 831470]
37388H31470K21193L08423J93365k37378m83618j95444K12596K20272m557k4626
37378A041696Q0324k8001k25713j29213J80610K74389R7185k0796N195m0562j41858
37367A093256n3313J51774J17621j45638k21058n891R9452q8305j86645Q6236
37357H47489L83187K47238j98613m72507m02864k17428j17623p8181j1672P7476
37347E6502R4987l7553k09620j30326K69339N42834K17754m51336p08363l41513
37337f97295O1202Q3880O8555L52305N49320J98083l52182m26263r4177L157k56142
37326e09557l45928n8159J73438Q5790K1654K46852M32407K36818n9676L836K98156
37315E25631K93881j05180m00660k14163K06294L49632R0031k33692l15736k40326
$$ y = [831470, 1052663, 1361086, 1554451, 1317073, 833455, 638011, 850607, 1070879, 1066322, 1041696, 1122020, 1094019, 868306, 739093, 919703, 1194092, 1291277, 1270481, 1275676, 1235114, 1093256, 1039943, 1191717, 1309338, 1163700, 942642, 936751, 1036203, 947898, 761253, 847489, 1230676, 1477914, 1279301, 806794, 403930, 186502, 68879, -9302, -20974, 56502, 151489, 113936, -95684, -226010, 43329, 586163, 803917, 352581, -355782, -697295, -636093, -552213, -483658, -131353, 417967, 616050, 263868, -162395, -256572, -253415, -509557, -855485, -913644, -740206, -654416, -632762, -385910, 46497, 283315, 223639, 227475, 525631, 819512, 714332, 313672, 99509, 305803, 655435, 745466, 511774, 196038, -44288]
37305d4288k35800k33400M1139N18852O96182L25016j29068j13111J71011Q5380
37295A081913l97894o19161k82058R1926M2395j20591N3341L33275K22425j54760
37285B50811k53600j2911J22667K8898O1621L03132L22483o2300l76084k12745
37275A71972J16847J14887j11428j14432J03571J44660o2551j81253j12258j48312
37265g8297l56824l59128J0361L06245J16763k63708k62626J22209L91450L14706
37255e8849J28504J9473p3061r6372J49066N21695N09642l3945n36723m32123
37245I7307Q9201M28469M02293K81557J99890J3845k88989m82953m58771l41451
37235e9602k00415M1547L35487M39400K46405m2290j81042j42253m0581M3742
$$ y = [-44288, -280088, -513488, -472349, 46503, 742685, 1067701, 938633, 825522, 996533, 1081913, 684019, 64858, -217200, -125274, -82879, -203470, -150129, 183146, 405571, 250811, -2789, -15700, 106967, 135865, 197486, 500618, 823101, 760801, 384717, 171972, 288819, 403706, 292278, 177846, 281417, 426077, 363526, 182273, 70015, -78297, -435121, -794249, -783888, -477643, -360880, -624588, -887214, -765005, -373555, -58849, 69655, 89128, 16067, -80305, 68761, 590456, 1100098, 1066153, 529430, 97307, 186508, 614977, 1017270, 1298827, 1498717, 1512562, 1223573, 740620, 281849, -59602, -260017, -218470, 117017, 556417, 802822, 760532, 579490, 437237, 396656, 440398]
37225D40398R9995J63846K69478L25742J35938k77325n11722k58309J68738J79770
37215G36549k32109m44345j14133L34891L56900Q941k66846k67135j07871P6733
37205H1575J89176R8943j77883l56782k06409J18740K95592K60546J93980J93602
37195F91080J92788J22311l1758k42914l82395k91011m3572P2375K496O1836L73809
37184E25045N04976P2884n38374o03758r3051K81618R8058k38012j89852J21665
37174e8801J68711j87374n07925l59798J40594M55073K46291k18360l85785j11192
37164h18566J81999J25138q1902k5343K69760L92914J58248j89524l61515l07765
37154f56556j08021J34329K61260J70659j5976r3808m8354J4643J14493L00422
$$ y = [440398, 540393, 704239, 973717, 1299459, 1435397, 1158072, 646350, 388041, 556779, 736549, 504440, 60095, -54038, 280853, 637753, 646694, 379848, 112713, 4842, 81575, 270751, 369694, 191811, -164971, -371380, -252640, 42952, 303498, 497478, 691080, 883868, 1006179, 974421, 731507, 349112, 58101, 14529, 86904, 89400, 151236, 525045, 1030021, 1102905, 564531, -39227, -132278, 149340, 247398, 9386, -180466, -58801, 109910, -77464, -585389, -945187, -804593, -349520, -103229, -321589, -707374, -818566, -636567, -511429, -593331, -618674, -348914, 44000, 202248, 12724, -348791, -656556, -764577, -630248, -368988, -198329, -214305, -308113, -356467, -341824, -227331, 73091]
37144G3091M15907K85608N5175p205L8453n1752k03424j44080K8135m8418l00092
37133A41398k34475K21961N23694L55860P2144P071k1722j59455j08443K21126
37123A019159K64955l36234r32652o87463J43196N58525K32326k30688l60910
37114c29786l09601k19532O6511M45544M29254p5926m53289k34669K03913K31038
37104b46543j31367l43546j53369J60396K40675K3183k85791l81491q9970M01160
37094h06663O43083M10097k9653k58206j75761J9898J53407J76375Q1121p8032
37084A35666j44315j3224K09493L18452K24394p374k27725k50427O630L21079
37074E72649K96907j38225n38129m46866L4601M11797M12079J91056j164r3629
$$ y = [73091, 488998, 774606, 829781, 822576, 861029, 809277, 605853, 461773, 489908, 441490, 141398, -93077, 128884, 652578, 1008438, 1080582, 1087653, 1065931, 906476, 798033, 1019159, 1284114, 947880, 15228, -672235, -529039, 29486, 261812, 31124, -329786, -639387, -858919, -792408, -346864, 82390, 6464, -446825, -681494, -477581, -246543, -377910, -721456, -874825, -714429, -473754, -450571, -736362, -1117853, -1207823, -806663, -163580, 246517, 216864, -41342, -217103, -197205, -43798, 132577, 213698, 135666, -8649, -21873, 187620, 506072, 730466, 723092, 495367, 244940, 251570, 572649, 869556, 731331, 193202, -253664, -219063, 192734, 604813, 795869, 794705, 701076]
37064G01076j27576j26771q2217L9115K43158L85324K26195k30375o01416n57065
37054a30552k58201q5527o5025O4595K90369K99456O5431l0230J57768K41268
37044E49352n8872l91740l01290O2296K35303J92997K51191L60562J44501l21630
37034G22670m29130K6821M13355J65859l39943l55881J10601L66449J20339j58775
37024F42365q0329P7824o2492k92606j75476J76560K29130j16147l20866k9994
37014D7969L38548J63965m55480p57734k80050N62899R78401O60522L979m15224
37004H47795l92437j52539n750k2967l5867Q8755K47951K34499J8574k19507l31087
36993B77420l33370k73704j25270R0737K23281J59006k8921j99280k87150k36774
$$ y = [701076, 573500, 446729, 364512, 403627, 646785, 1032109, 1258304, 1027929, 426513, -130552, -388753, -474280, -539305, -474710, -184341, 115115, 180546, 150316, 308084, 549352, 490480, 98740, -202550, -140254, 95049, 288046, 539237, 899799, 1044300, 722670, 293540, 320361, 733716, 899575, 559632, 203751, 314352, 680801, 801140, 642365, 562036, 639860, 577368, 284762, 109286, 285846, 514976, 398829, 77963, 47969, 386517, 550482, 95002, -662732, -942782, -379883, 598518, 1259040, 1263019, 847795, 455358, 302819, 297069, 274102, 238235, 326990, 574941, 809440, 828014, 608507, 277420, -55950, -329654, -454924, -364187, -140906, 18100, -10821, -210101, -497251, -734025]
36983g34025J9883L54986M32619J58404o6657J12331L92664K16130l06661m61007
36973A18667j2379L81785J42083l79235m74011j29466N0130k05555n00126l94235
36963a402342N3826M58887N48619L55977J35786J09679K08969J58588j04705k96038
36953B27246k08775k5586J3936j8076J9947K8167n2476K6558L55765M76987N3505
36942H97198l76398q4684N91211N94472k26822q21073n16151N6607J00939j52645
36932F2654q4080J81952J12001k17350k79356k5642J18690N4505R2541K87346
36922C03261L37942J72969N7744P0989J140j78221k31852j34715j28841k09064
36912F1352m8108L97787O71995M43622k8139l00536k91384j68441K642J99845
$$ y = [-734025, -714142, -359156, 73463, 231867, 165210, 277541, 670205, 886335, 579674, 118667, 106288, 488073, 630156, 250921, -223090, -352556, -302426, -507981, -1008107, -1402342, -1348516, -889629, -341010, 14967, 150753, 260432, 469401, 627989, 523284, 227246, 18471, -7115, 6821, -11255, 8692, 36859, -15617, 10941, 366706, 843693, 897198, 520800, 436116, 1027327, 1621799, 1394977, 573904, 57753, 114360, 215299, 62654, -21426, 160526, 272527, 55177, -224179, -249821, -131131, -76626, 15915, 303261, 641203, 814172, 871916, 942905, 944045, 765824, 533972, 399257, 270416, 61352, 13244, 411031, 1083026, 1526648, 1498509, 1197973, 906589, 738148, 740790, 940635]
36902I40635K50011N377l83161o05774n48449l38218j04724J25393L14543L51699
36892G332J73008r8640k08302k6825K62078L41154J46012p8875j55826j76284
36882A84832k00902m7968L43420N91778L08863k88694o20400n12170k97612k03397
36872g42250j17968n71n109n8568J87940P44300J044951O45230j57386p01968
36862H38601p15016m06173n0685K09992K97845K12459O5929l9557q0791j4393
36852C18211J85249L34696J84486j39061j89228J25698L16448M0689l36658l01415
36842E39115K7497J45334n6515k61206l08932k91371j74236J40484M18089K95974
36832D74233r2799k30342j0725J29719J0551L4016M27163P17556M14939j97907
$$ y = [940635, 1190646, 1196023, 812862, 207088, -341361, -679579, -784303, -658910, -344367, 7332, 180340, 81700, -126602, -153427, 108651, 449805, 595817, 516942, 361116, 184832, -16070, -64038, 279382, 871160, 1180023, 891329, 270929, -241241, -538853, -742250, -860218, -860789, -865898, -924466, -736526, 7774, 1052725, 1697955, 1540569, 838601, 123585, -282588, -333273, -123281, 174564, 387023, 452952, 413395, 332604, 318211, 503460, 838156, 1022642, 883581, 694353, 820051, 1136499, 1177188, 840530, 539115, 566612, 711946, 655431, 394225, 85293, -206078, -380314, -239830, 178259, 474233, 381434, 151092, 140367, 270086, 280637, 314653, 741816, 1459372, 1874311, 1676404]
36822A676404m69197l00417j42855k32299l48096k97000j62489k2740J71170L42061
36812B14542K72387k6138k37014j75022j8435M1790R4429K43880L21603J43270
36802H75292j28928j82020r130J06090R429j62928k15112q0649J75255L59448
36792G46747K49262r3677k38266Q1782M69056L12716l03370o38105l24525J55124
36782D16744K41890M3284m7172l3296j47786l14297k91911j58611j48525j50258
36772e89938J09946M63118M31546q65k88723j26969J30869O4041k19629l46669
36762c73273k20485k0334J19166J72911J23703M788o1507p542R7422J82928K53899
36751B71676K78487J84223L3672K369J00550J28224O75j06801o0978N847o6394
$$ y = [1676404, 1207207, 906790, 763935, 531636, 183540, -113460, -275949, -298689, -127519, 214542, 486929, 460791, 223777, 48755, 30320, 72110, 166539, 410419, 732022, 875292, 746364, 564344, 555214, 661304, 670733, 507805, 292693, 212044, 387299, 746747, 996009, 902332, 664066, 745848, 1214904, 1527620, 1224250, 586145, 261620, 416744, 658634, 701918, 654746, 621450, 473664, 159367, -132544, -291155, -439680, -589938, -479992, -16874, 414672, 413807, 125084, -1885, 128984, 193025, -26604, -373273, -593758, -614092, -494926, -322015, -198312, -193524, -255031, -262573, -165151, 17777, 271676, 550163, 734386, 768058, 770427, 870977, 999201, 999876, 893075, 832097, 837944, 771550]
36740G71550j92531j81251j2458J67767K19449Q0348k04778m42524m16451j33659
36730c44538J77630L47761L82674K96537N9790k29421l56920k65300j18255l7679
36720h7721J2767N3227M6621N7631J70471K31131J2050l29219l56541j0454K72282
36709G2245K28686R7886Q9943K3576k18984l53331j71840O6285J05807J26934
36699F7207K77937K30882k39110o24096l12856L91167N97098Q9330m18782l44889
36689b86112N8106K27931M7054j64077j14933J82545M64008M73809K55465R3703
36679A237499P9947k4377l05771m16712j20487K08126J02831k32492k44348O0993
36669C45209J55758j10244k82962o2894K70728L59871K31237P9081l6803j07569
$$ y = [771550, 579019, 397768, 385310, 553077, 772526, 852874, 648096, 205572, -210879, -344538, -166908, 180853, 563527, 860064, 919854, 690433, 333513, 68213, -50042, -87721, -74954, -21727, 24894, 82525, 252996, 484127, 496177, 166958, -189583, -200037, 72245, 300931, 398817, 488760, 512336, 293352, -59979, -231819, -165534, -59727, 67207, 345144, 576026, 336916, -287180, -600036, -208869, 388229, 477559, 58777, -286112, -228006, -75, 46979, -117098, -232031, -49486, 414522, 888331, 1143796, 1237499, 1317446, 1293069, 987298, 570586, 450099, 658225, 761056, 528564, 284216, 345209, 500967, 390723, 107761, 44867, 315595, 675466, 906703, 985784, 948981, 841412]
36659H41412r9319q8873k08843l83612l80014j57319R0656K39488L13611L03253
36649D70440J92917J10772J44432J07138j71314m56129m15160j71317p8919r2910
36639c60050Q3507L31783K47264p9368r9468K80554N00323K37798j39348k42776
36629G60219j69397o4689K13671O30152P02850J42379o18763r26029o51599j62242
36619a43448J74592K15667M5169o8663L1180J03273j26357l62020o9204N59678
36609C59867O76201J4121o58647o50075k19571O3235J67176K92967L08664P9620
36599D33558j00157L3219K16507J22277p3864o4967N2485P6427J00859J69212
36589I65556K5126l01766k48499L29920N92418r4967r56884p98960J73118O29947
$$ y = [841412, 742093, 653220, 444377, 60765, -319249, -476568, -385912, -146424, 167187, 470440, 663357, 774129, 918561, 1025699, 854385, 398256, -16904, -188221, -267140, -360050, -276543, 55240, 302504, 223136, 123668, 404222, 904545, 1142343, 1002995, 760219, 590822, 526133, 739804, 1369956, 2072806, 2215185, 1596422, 670393, 18794, -143448, 31144, 246811, 291980, 223317, 254497, 357770, 231413, -130607, -199811, 359867, 1036068, 1050189, 391542, -258533, -478104, -414869, -247693, 45274, 353938, 433558, 333401, 366620, 583127, 705404, 631540, 566573, 619058, 695485, 796344, 965556, 990682, 688916, 440417, 770337, 1362755, 1267788, 310904, -488056, -314938, 315009]
36579C15009Q5022n19229l22294L32910O21405L41526r8925l16920k40391m1723
36569A56390M1045j7389J4633J94197J83745j79650m29035j25794L29794K39371
36559D07307k50027l37434J65066N81607M63099J34087l9062j86903m47378n68792
36549g8430l60322n4658J01203K14349M25286N72835M43502R4836k45521l89808
36539G23272k50660N0812J61818j03816m13571l32702J8905J81829J06698J29547
36529B72132K73125K07829p9193k23267j52839j70581k76759j00356L37980M89351
36519E77422J35150k66134l36013k43136j63792N5981L87464M25891P4237j94021
36509D53049j15835n1621k32217k65444J19136M72552L41529J5757l4662N0155
$$ y = [315009, 400031, -119198, -441492, -108582, 512823, 854349, 755424, 438504, 198113, 156390, 197435, 180046, 194679, 388876, 572621, 392971, -36064, -161858, 167936, 407307, 157280, -180154, -15088, 566519, 1029618, 1163705, 1124643, 937740, 490362, -78430, -438752, -493410, -392207, -177858, 247428, 820263, 1263765, 1358601, 1113080, 723272, 472612, 523424, 685242, 581426, 167855, -164847, -145942, 35887, 142585, 272132, 545257, 753086, 673893, 450626, 297787, 127206, -149553, -249909, 88071, 577422, 712572, 446438, 110425, -132711, -296503, -240522, 146942, 572833, 647070, 453049, 337214, 285593, 53376, -212068, -92932, 379620, 721149, 736906, 702244, 752399]
36499G52399p8497k53102j37591Q0521J3124k14989k03054L4866J95422K42327
36489D31426K79228J46471k68278n73927l37708K04043M72933L77702K43712J37445
36479A113047j14255l95428m10786k12848o8302M4357K49237L05890k6004l60046
36469A24862j57872L11628K97067k00714l89886K0588L70095J57199j99781j26740
36459B06446K34076L92354K55536M3646j59556l42021l51705j40166J7660j11132
36449D5138l32108l12430q0118O9517M4472L7258J69075K96459K35088M5137k4959
36438A92529J05556J74904o1062l67255k78243J33794K28709j99513m42719P4730
36428d38570P64621O56825j11993n07918j79507J62092L8426j25678M9549K07321
$$ y = [752399, 673902, 420800, 283209, 363730, 376854, 161865, -41189, -6323, 189099, 431426, 710654, 857125, 588847, 14920, -322788, -118745, 354188, 731890, 975602, 1113047, 998792, 603364, 192578, -20270, -88572, -44215, 205022, 510912, 484908, 124862, -33010, 278618, 575685, 374971, -14915, 5673, 375768, 532967, 333186, 206446, 440522, 832876, 1088412, 1132058, 972502, 630481, 278776, 138610, 156270, 45138, -286970, -599400, -679518, -610001, -565529, -528271, -359196, -62737, 172351, 217488, 192529, 298085, 472989, 411927, 44672, -233571, -99777, 128932, -70581, -513300, -438570, 326051, 982876, 870883, 362965, 183458, 345550, 383976, 258298, 307847, 515168]
36418E15168J6062j61987M1701L00992K07845J1074Q1736J59837j35892m82032
36408E54504l30558J04227J67926j27640j72011J41346K34457j44124n15542m90454
36398e77869l00966k22152p2673L23854O58392N44806R1679k98716m54092m37783
36388g45520k60593P4725L79784M27305K29996j3747j58894j55018K867J91591
36378b7504J77967q2502k96623j92618Q8988J93412N0285q0221k4876R2986R3784
36367f922j7935j23958j54346j07283o092J12092K24001L37376M18695L53135
36357A028763R1955k03213l14106k45005j85751k08691k00486j15921p2685j16918
36347e42058j17989j3042O4820N3549J20467L33891M09125J02971l03608l09551
$$ y = [515168, 531230, 369243, 410944, 711936, 919781, 930855, 1012591, 1172428, 1036536, 554504, 223946, 328173, 496099, 368459, 196448, 337794, 572251, 428127, -87415, -577869, -878835, -1100987, -1173660, -849806, -191414, 353392, 445071, 146355, -307737, -745520, -1006113, -931388, -551604, -124299, 105697, 91950, -66944, -221962, -219095, -27504, 150463, 67961, -228662, -421280, -332292, -138880, -88595, -168816, -193692, -100706, -6922, -24857, -148815, -303161, -410444, -416536, -304444, -80443, 256933, 675628, 1028763, 1120718, 917505, 603399, 358394, 172643, -36048, -236534, -352455, -425140, -542058, -660047, -673089, -608269, -554720, -434253, -100362, 308763, 411734, 108126, -201425]
36337b01425Q3682L66397K57968K3776n2382p1617j62223j24696J95974M78337
36327G93791L15392j18474k58820K5409K58414Q8433k32934l01567j47933q7913
36317C33798k12649l38365l40714k38735j1118L55812O27308M62213p2651m17628
36307A47271j79354L31069N02054K22414o9048q3955k5823j34874k85630k70665
36297A53459j67577j18772l259L00967N17927K79971k37517m36594r4497L50081
36287E44189L98356M1935l79275n50384l27766J56372M43937J65631l80078m67653
36277c54736O3926N12411K96246k04563k35010K32561N22860K50055k32042m12961
36267D38747k61837j31488k36713l83370k17120K71576O01910L56381k02699m22414
$$ y = [-201425, -117743, 248654, 506622, 530398, 478016, 406399, 244176, 119480, 315454, 793791, 1109183, 990709, 731889, 757298, 1015712, 1104145, 871211, 569644, 421711, 333798, 121149, -217216, -557930, -796665, -807783, -451971, 175337, 637550, 564899, 147271, -32083, 298986, 801040, 1023454, 954406, 870451, 844628, 709754, 424124, 153459, -14118, -132890, -136149, 164818, 682745, 962716, 725199, 288605, 194108, 544189, 942545, 984480, 605205, 54821, -272945, -116573, 327364, 492995, 112917, -354736, -290810, 221601, 517847, 313284, 78274, 310835, 833695, 1083750, 851708, 438747, 176910, 45422, -191291, -574661, -791781, -520205, 81705, 438086, 235387, -187027]
36257a87027j64232N2322p1080j54183J36319M61071L83087J10386J05315L10837
36247I82815L49697J97564O5167j11535m31830n47421j31178L72628K42525l81477
36237F06955o49856k67935K01928L46807L74099M29481K81731m4867j01423J87406
36227A364326K76877p8035l60743j81574N7522q7438l11085j32723K52836L63572
36217A163535K75033L94988O59764O18831J95614k04922l02141k05486j14904
36208B480312j14194k08967k94650j95952L4794N9274k48637m96407k89168J81090
36198I07495M23767L24713J51862M8365q2156k61552l49120k52907k6000J80375
36188A064842J61519j40297l95800j91255K93092L77213r5393l98334k3311M52997
$$ y = [-187027, -351259, -298937, -370017, -524200, -387881, 73190, 456277, 566663, 671978, 982815, 1332512, 1530076, 1595243, 1483708, 1051878, 504457, 373279, 745907, 988432, 606955, -42901, -310836, -108908, 237899, 611998, 1041479, 1323210, 1278343, 1176920, 1364326, 1641203, 1563168, 1202425, 1020851, 1078373, 990935, 679850, 547127, 799963, 1163535, 1438568, 1833556, 2493320, 3112151, 3307765, 3102843, 2800702, 2595216, 2480312, 2366118, 2157151, 1862501, 1666549, 1701343, 1760617, 1511980, 1015573, 726405, 907495, 1331262, 1655975, 1807837, 1856202, 1774046, 1512494, 1163374, 910467, 884467, 1064842, 1226361, 1086064, 690264, 499009, 792101, 1169314, 1073921, 675587, 652276, 1105273]
36178A105273K69477k53205k19454L63517N95216J27571l66778l50547j54875
36169A116195j93310k20025R0296M09068K43161j93233k41416K04722N46673L61704
36159B123835m9708j76845p755O4043j38897l85838m60306m46535m44580k86821
36149b09407J57029N76803N33844J30453o9943J47286L63172K06266j18504k39557
36139A477442j79091j82998k74498k86712j34769J59142M81531N42842J36470
36130A739359l76257l26108K86541O40196K66982k41255k00200J22528J05173
36121B016959j44030j20833Q5389K8959j69939o0442J95086N8884l31054l25214
36111A233765O4096J64556j16811r9299M11174O89380K98045j91625j68187J28750
$$ y = [1105273, 1374750, 1121545, 902091, 1265608, 1860824, 1988395, 1621617, 1271070, 1116195, 922885, 702860, 793156, 1202224, 1445385, 1252152, 1010736, 1215458, 1762131, 2123835, 2074127, 1897282, 1889527, 1953570, 1814673, 1428835, 968529, 521994, 77414, -209407, -52378, 524425, 1058269, 1188722, 1118779, 1266065, 1629237, 1835503, 1716999, 1477442, 1298351, 1115353, 840855, 554143, 419374, 578516, 1060047, 1602889, 1739359, 1363102, 1036994, 1323535, 1963731, 2230713, 1989458, 1789258, 1911786, 2016959, 1872929, 1752096, 1837485, 1866444, 1696505, 1636063, 1831149, 1890033, 1558979, 1233765, 1297861, 1462417, 1345606, 1246307, 1657481, 2346861, 2644906, 2453281, 2285094, 2413844]
36101B413844K10893J36290J46995J11400j09958k44654q4128O8115p8182k50591
36091B320024q8209K22878K92645J69652J44110J90269Q4514j36374k58798k51251
36081B689460j86904j0486K84247M49236K84188k3407j38867n010J86056K65015
36071C793528J68777l0195p0820K31120N89460N14931P5487j09898J82246M11408
36061E756044J59543j90331j06020K62069M21796L20414K55675L08135L55075
36052G542400M04204M84574M53481K90517K87943N75157Q06949P34989O82517
36043A2262731R49039J162955Q64624L96749M74657J056185J400691J223279J063513
36034B0854423J380341J912940K210669K342033K729650L500609M306463M781244
$$ y = [2413844, 2624737, 2761027, 2908022, 3019422, 2909464, 2664810, 2580682, 2648797, 2570615, 2320024, 2231815, 2454693, 2747338, 2916990, 3061100, 3251369, 3335883, 3199509, 2940711, 2689460, 2502556, 2492070, 2776317, 3225553, 3509741, 3486334, 3347467, 3342457, 3528513, 3793528, 3962305, 3932110, 3861290, 4092410, 4681870, 5196801, 5272288, 5162390, 5344636, 5756044, 5915587, 5725256, 5619236, 5881305, 6303101, 6623515, 6879190, 7187325, 7542400, 7946604, 8431178, 8884659, 9175176, 9463119, 10038276, 10845225, 11580214, 12262731, 13211770, 14374725, 15239349, 15636098, 16110755, 17166940, 18567631, 19790910, 20854423, 22234764, 24147704, 26358373, 28700406, 31430056, 34930665, 39237128, 44018372]
36026D4018372N007150N405488O209289P290259Q635943J0647331J3598712J7158615
36018A17971159K0990998K5454451L1037611L7712616M5811019N6174257O6554342
36011D01706453O8124035N0196939J2013515l1982862o2393852p0729308o3499728
36004C03435192n2132969m2613638l5034215k8542985k3290889j9143808j5443710
35997H7232978j2105369r570835p869983o669244n886038n459345m953314m115190
35989C0603660l357121l032806k783194k250084j805643j822699j851406j376637
35981A2324070q19966q42419j133069r14395l01198r2256m08237n92550m10710
35972F809270l27371n14467n49724l03798k37267m94243m97669R9923P01377N43035
$$ y = [44018372, 49025522, 54431010, 60640299, 67930558, 76566501, 87213832, 100812544, 117971159, 138962157, 164416608, 195454219, 233166835, 278977854, 335152111, 401706453, 469830488, 520027427, 532040942, 500058080, 437664228, 366934920, 303435192, 251302223, 208688585, 173654370, 145111385, 121820496, 102676688, 87232978, 75127609, 65556774, 57686791, 51017547, 45131509, 39672164, 34718850, 30603660, 27246539, 24213733, 21430539, 19180455, 17374812, 15552113, 13700707, 12324070, 11504104, 10661685, 9528616, 8614221, 8313023, 8220767, 7812530, 7219980, 6809270, 6481899, 5967432, 5417708, 5113910, 4876643, 4382400, 3884731, 3984654, 4686031, 5229066]
35962E229066k33306q11558p55443l58635n6860P3439J60132J84932J2552k90634
35952C153685l92207j03406K58298J85260l21504o76037m69001j5600Q9939k58112
35942A451315o25988o11080k20152K25430L84188J89021n8211m0442J10860J1579
35932H16520k81084k52442K03041M59559R3327l86310k89804J94120L53950P6250
35922I87127j07034M6344K04848J05949j24442l27273m53333l44477R4677M95155
35912E77541L49168k05728m73217j59794K77879L56237J12656j97849m23611l73590
35902a60308J06626O98993P71422K28586k86128l04549j31114j93417l29919j98964
35892B01228M0545J8005j73086j48182R7959K19447J20966M4839Q5564O1650q8723
$$ y = [5229066, 4995760, 4184202, 3428759, 3070124, 3013264, 3086703, 3246835, 3431767, 3444319, 3153685, 2761478, 2658072, 2916370, 3101630, 2780126, 2104089, 1635088, 1619488, 1709427, 1451315, 825327, 214247, -5905, 219525, 603713, 792734, 734523, 694081, 804941, 816520, 535436, 282994, 486035, 945594, 1038921, 652611, 362807, 556927, 910877, 987127, 880093, 926437, 1131285, 1237234, 1112792, 785519, 332186, -12291, 82386, 577541, 926709, 720981, 247764, 87970, 365849, 722086, 834742, 636893, 213282, -160308, -53682, 645311, 1416733, 1645319, 1359191, 1054642, 923528, 730111, 400192, 201228, 241773, 259778, 86692, -61490, 36469, 255916, 376882, 421721, 507285, 568935, 480212]
35881D80212j62936l4002J52531K13502J49058O2885K0140J6513k4987j93122
35871F79794m10568m17021j01931K55424L03066Q6931n1387J4312P7474j7284
35861D18810j73143k67130k91955k03950P1316L61565K91609j74185n04889k35731
35851g07683L46843N25215R6955l89962m11064r1649J39752J91194K50711K88344
35841B38656O9407l22809m15373M236M91319M92899Q6118j72678l3080J88245
35831F26940J53854m2232j16236k0730Q0607R6710N8572j2593r5935r9092K3285
35820F53150J28182M7894j29696j48679K6158J26365j7423j85001o0220K99675
35810G40405N08920L53900N0522n5051J08896L21864L46179J20710k34761n00114
$$ y = [480212, 317276, 283274, 435805, 649307, 798365, 861250, 881390, 897903, 872916, 679794, 269226, -147795, -249726, 5698, 308764, 395695, 344308, 358620, 436094, 418810, 245667, -21463, -313418, -517368, -446052, -84487, 207122, 32937, -471952, -707683, -360840, 164375, 261330, -128632, -539696, -631345, -491593, -300399, -49688, 238656, 308063, -14746, -430119, -425883, 65436, 558335, 644453, 471775, 438695, 626940, 780794, 738562, 622326, 601596, 682203, 778913, 837485, 824892, 728957, 629865, 653150, 781332, 829226, 699530, 550851, 577009, 703374, 685951, 500950, 440730, 740405, 1249325, 1603225, 1653747, 1598696, 1707592, 2029456, 2375635, 2496345, 2261584, 1761470]
35800A761470m99337k71836o1095m7248j49860j89882j56909j64365k10827j81085
35790a70974o1471L9348P5767P4134k2857k65381m35518j95959L82442P49835
35780A69366N38761M3349k04823j20863l3460j25176k39689k02799m9142R3099
35770a31377J44378Q7856j6431n6399k2155n7788k31351l71794l04801j25267
35760a085129l0127j123J05478K51171K60581J17669k5401q4868p3246K3952J64074
35749c76969J53609q0737k45733m0623L37452M29910J91697N14P909m4514k81286
35738E1229m24936k39321J29037M06379M60227K18650k92966p21644o23011r3076
35728a129432K66452J91016P8753K43427L95000K38700N2375J50023K37064o2747
$$ y = [1761470, 1262133, 990297, 929202, 881954, 732094, 542212, 385303, 220938, 10111, -170974, -232445, -193097, -117330, -43196, -66053, -331434, -766952, -962911, -580469, 169366, 708127, 751476, 546653, 425790, 392330, 267154, 27465, -175334, -224476, -131377, 13001, 100857, 84426, 28027, 5872, -51916, -283267, -655061, -959862, -1085129, -1115256, -1116379, -1010901, -759730, -499149, -381480, -406881, -491749, -564995, -541043, -376969, -223360, -304097, -549830, -590453, -253001, 176909, 368606, 369120, 377029, 332515, 51229, -373707, -613028, -483991, -77612, 382615, 601265, 308299, -413345, -1036356, -1129432, -862980, -671964, -593211, -349784, 45216, 283916, 336291, 486314, 723378, 660631]
35718F60631l94684j31834N26675O84199J0338p89535r24118m01723K15734M89537
35708e4780L28990q4071l77961k75583N0699J58681m7194j87302N021L08969L88855
35697B14324K19139n0935l42995n26942l52702J83087O14965M92680k0503l33901
35687I6217j63270J85590K66586Q145k75727k69080k481J69562r202l20156l01676
35676f15492R3305L45584O6736m15487m91701j09973K26418K28552J35584J96483
35666c39991K83195K15138R5712N9554o764j85337k44405l543K51614J61592p4510
35655B12255J2420L24078K73564k15715m60542o2633M06934K40872l65337o76206
35645c10310m67168j02086J76085L69453L15917j22048n17782k75060L91607O27953
$$ y = [660631, 265947, 134113, 660788, 1344987, 1355325, 565790, -358328, -760051, -544317, -54780, 274210, 190139, -187822, -463405, -412706, -254025, -301219, -488521, -483500, -174531, 214324, 433463, 382528, 39533, -487409, -840111, -657024, -42059, 450621, 430118, 96217, -67053, 118537, 385123, 393268, 117541, -151539, -154020, 15542, 6340, -313816, -615492, -522187, -176603, -109867, -525354, -1017055, -1127028, -900610, -672058, -536474, -339991, -56796, 158342, 254054, 313608, 306844, 121507, -122898, -126441, 125173, 286765, 212255, 224675, 548753, 822317, 606602, 146060, 83427, 490361, 731233, 365896, -310310, -777478, -879564, -703479, -334026, -18109, -140157, -657939, -932999, -541392, 86561]
35635H6561K16730j23914L5083J80249j20083l86167j06154K71329P7171l80243
35625b49438l04249K51335N14732K83073R1874J47669Q0765j49167q7220K48395
35615H27769K01736l35586n07434J83752R82298J021178O28975O18506Q27390
35606D448584M14585o29106j315553j073643m49459j66880k20530k46357k12977
35597E48664k96638m23663l61372j00143J49901K45932K15556J74643K49494M42916
35587H45290N05259J42233n33492r74400p90468j93405L14376N00114M38840J93992
35577D48339k05553n40146n03122j03859K85371L77515K52544R9927p2772k84593
35567b46349l45922p5989L29055M58644K35726O924L337K0278j68653l53527j78008
$$ y = [86561, 303291, 179377, 214460, 394709, 274626, -111541, -217695, 53634, 130805, -249438, -553687, -302352, 212380, 495453, 587327, 734996, 815761, 666594, 579374, 827769, 1029505, 693919, 186485, 370237, 1352535, 2373713, 3002688, 3621194, 4448584, 4863169, 4234063, 2918510, 1844867, 1395408, 1228528, 1007998, 761641, 548664, 252026, -171637, -533009, -633152, -483251, -237319, -21763, 152880, 402374, 845290, 1350549, 1492782, 959290, -15110, -805578, -998983, -684607, -184493, 254347, 448339, 242786, -297360, -800482, -904341, -618970, -241455, 11089, 111016, 38244, -246349, -592271, -668260, -339205, 119439, 355165, 362089, 365426, 385704, 217051, -136476, -314484]
35556c14484K48289M06466O3323m04316m90697j43753K54483L32033N5087k65643
35546b59212k51956J24926M20150K24161k31073l21703N3716K73088m7890l81298
35536c97091p3317N48202N44826k46758r25223p73072j43829K27019K41947K74515
35526g22781L75221K67477q351n6807K03900L45099R0957k20063j18023L17222
35516D73851N68825L46983j32435m72382m59598j31947K80435M44938J72892l21740
35506G69822n60595l12878J38071L46905K14039p880j27896k13396l43419l79928
35496d77155j50106K26143L78053J08321l27782m74863j94961J75927K44211K9059
35486d63153j26172n6705M6375K7393O0226L15304N35897L17825k37076n50656
$$ y = [-314484, -66195, 340271, 403594, -722, -491419, -635172, -380689, -48656, 6431, -259212, -511168, -386242, 33908, 258069, 26996, -294707, -240991, 32097, -15793, -397091, -470408, 77794, 622620, 375862, -549361, -1322433, -1466262, -1239243, -997296, -722781, -347560, -80083, -88434, -145241, 58659, 403758, 494715, 274652, 156629, 473851, 1042676, 1389659, 1257224, 784842, 325244, 193297, 473732, 918670, 1091562, 769822, 209227, -103651, 34420, 381325, 595364, 587484, 459588, 246192, -97227, -477155, -627261, -401118, -23065, 85256, -242526, -717389, -912350, -736423, -492212, -463153, -589325, -646030, -599655, -572262, -512036, -196732, 339165, 656990, 419914, -130742]
35476a30742l40693K2065J25893J16328L37896O56064O10749J58146k15950j89512
35466A150244O15J0974j19928j76411j77507k70774l81597l00569o4466N6639
35456b72780k5084q6611L0953J60104Q8138p0883k5077K23398L07204j2455m56790
35445a39883n17475q3452M01077M45622M5625l67141m02306n2944L50911M37060
35435A17094J26022k34723j90381K40804M79736J13113m65182n21763j1172L68265
35425B1813K23027q848J22239K91785j3827n27178n35199k2687K78676K9250k69317
35414d10266j80359R841o9543j82305K7688L13016K07471j66183l10531j83339
35404i44510j53993k21759K0974N74250Q50354N28144K0708j91503j90605k42447
$$ y = [-130742, -471435, -449370, -323477, -207149, 130747, 786811, 1397560, 1555706, 1339756, 1150244, 1150859, 1161833, 1041905, 865494, 687987, 417213, 35616, -264953, -329419, -272780, -297864, -384475, -353522, -193418, -105280, -176163, -201240, 22158, 329362, 316907, -139883, -657358, -740810, -339733, 105889, 151514, -215627, -617933, -670877, -319966, 117094, 243116, 8393, -181988, 58816, 538552, 651665, 186483, -335280, -346452, 21813, 244840, 235992, 358231, 650016, 636189, 109011, -426188, -448875, -170199, -140949, -410266, -590625, -580784, -650327, -832632, -804944, -491928, -284457, -450640, -761171, -944510, -1098503, -1320262, -1299288, -725038, 125316, 653460, 674168, 482665, 292060, 49613]
35394D9613k40058L3238L96546M76281K38289m9862k29610l00295k24717j6816
35384A32609J20839O0580q72J32293K63899J06224j98922k78228j16970p105r709
35373B04638M3827Q0315j39134m54983l92552P6554M06209K86388M6891J6303
35363A74456J3351j89104l73278k57263J3052J48421J57883J40969n36k47390
35353d19439k42669J50512M50718K56921k4741J95300O53275N95914J783l94506
35343A223068k50805O6007L60831Q71137J399588J137776j15986j328814j472250
35334A890552q13086l11491k35550j30487J77225L55163K28648j7805k69981n34483
35324C38705o05681k63834K00191K39139j23242k89284q804K77633K05206L2248
$$ y = [49613, -190445, -157207, 239339, 715620, 953909, 904047, 674437, 374142, 149425, 132609, 253448, 314028, 313156, 445449, 709348, 815572, 616650, 338422, 221452, 214347, 204638, 248465, 328780, 189646, -265337, -657889, -581335, -175126, 111262, 158153, 174456, 187807, -1297, -374575, -631838, -618786, -470365, -312482, -171513, -172049, -419439, -662108, -511596, -60878, 196043, 171302, 366602, 1019877, 1615791, 1617574, 1223068, 972263, 1038270, 1399101, 2270238, 3669826, 4807602, 4691616, 3362802, 1890552, 1077466, 765975, 530425, 399938, 577163, 932326, 1160974, 1143169, 873188, 338705, -266976, -530810, -330619, -91480, -214722, -504006, -512810, -235177, -29971, 2277]
35314B277J11863K84050J88064j37284l46127k78157n4864J54609K16203L7789
35304A78423k82870m55806l22206l2534K17557L99599M65240K62375j23760k66105
35294C9913L1562L31788J35504l61618n43297k58069O9265J58041J81507K89394
35284G3990L06810R0606j82549k74927j57469R9401M05670N18806J90780l81154
35274F89964o16597l05297M9510n2254l70944l11076J88078O04717N78479K70310
35264G24890o021j20112n1838J63312L24303J96780j40703l38661k56276j35073
35254C60601j78875k38571j01934J37791K39222J72833Q2891J3918p0746q1076
35244C36054J04686L43243L07543n0234l52228k59992Q2633K53842R5429j53982
$$ y = [2277, 114140, 398190, 586254, 448970, 102843, -175314, -230178, -75569, 140634, 178423, -104447, -560253, -882459, -914993, -697436, -297837, 167403, 429778, 306018, 39913, 71475, 403263, 538767, 177149, -366148, -624217, -554952, -396911, -215404, 73990, 380800, 471406, 288857, 13930, -143539, -44138, 361532, 880338, 1071118, 689964, 73367, -231930, -182420, -234674, -605618, -916694, -728616, -123899, 454580, 724890, 718869, 598757, 546919, 710231, 1034534, 1231314, 1090611, 751950, 495674, 360601, 181726, -56845, -158779, -20988, 218234, 391067, 473958, 487876, 417130, 336054, 440740, 783983, 1091526, 1041292, 689064, 429072, 511705, 765547, 860976, 706994]
35234G06994k29584j32094q868O5211P7471j0111j81933k78434j50349J13813
35224b7884K54443J39483j14101k99336k74397K158M05571O19801M04022o7075
35214A042685l58513l34348k83675l75588l45859Q529L62806L07369J3221n1520
35204a4893P7991m9966m16788m09004J90695P10739N17309m6855j95084J59610
35194E23754M16216K89361J46075K79386M32753K85766k2019j64636j39383j84340
35184A862933l55739m75763m18381k18615M5385K82164L47243J69143r8840k21830
35174I17700j69691j01456q4994l3993N5446L9922r8853j40388L4276J72599j7547
35163E73021l72111m27042p8683K37908J51708j53109k63073j22260K897J0796
$$ y = [706994, 477410, 345316, 336448, 401659, 479130, 469019, 287086, 8652, -141697, -27884, 226559, 366042, 251941, -47395, -321792, -319634, 85937, 705738, 1109760, 1042685, 684172, 349824, 66149, -309439, -655298, -646769, -283963, 23406, 36627, -14893, 63098, 13132, -403656, -812660, -621965, 88774, 606083, 559228, 364144, 523754, 939970, 1229331, 1375406, 1654792, 2087545, 2373311, 2351292, 2186656, 2047273, 1862933, 1507194, 1031431, 613050, 394435, 439820, 721984, 1069227, 1238370, 1139530, 917700, 748009, 646553, 561559, 527566, 583012, 622934, 524081, 383693, 417969, 590568, 573021, 200910, -226132, -304815, -66907, 84801, -68308, -331381, -453641, -450744, -439948]
35153d39948O8571K30888K81861P5800j97005k45245l9636J97880K78629K07481
35143D19276J18775J35752K47564K81027O6033l24573n82783m77676j02392K33043
35133A4046K92293P1004k39286l85930k32676J16503L89836L73569O5873l39395
35123A25837n61707m13086m773K86343K19863j135j7539J77512K95249K49927
35113C56491K22140K09458l0953m46476n64703j82188K41020K32647k3186r4107
35103g9857k3119j10062k46738j03044J74627J32347j50769j01031L59311N75623
35093D27288J89836k60273k00488R3228L8430k51951j99324K21320M06284Q9960
35083E54310k44578j25342K25970K86724q167k58598k06082j7395L9557m7733
$$ y = [-439948, -371377, -140489, 141372, 217172, 20167, -225078, -264714, -66834, 211795, 419276, 538051, 673803, 921367, 1202394, 1268427, 943854, 361071, -116605, -218997, 14046, 306339, 377343, 138057, -247873, -480549, -364046, 25790, 399359, 465232, 125837, -435870, -848956, -853729, -567386, -347523, -348658, -366197, -188685, 106564, 356491, 578631, 788089, 757136, 310660, -254043, -436231, -195211, 37436, 14250, -79857, -102976, -213038, -459776, -562820, -388193, -255846, -406615, -507646, -148335, 427288, 617124, 356851, 156363, 249591, 288021, 36070, -163254, 58066, 464350, 554310, 309732, 184390, 410360, 697084, 688917, 430319, 224237, 206842, 246399, 198666]
35073A98666j04015n4793j4197j01493k58137k91170q4551K54148M64294L64600
35063C73352L7962k30341k41221r1918k6204r4483j02300O2841K28778J93691
35053A10157L7559j2598O6588R7238Q571p8615p4481k7382N431J8283j1830q1394
35041E7527p5434P0185J67914L928k64932k68433j126J33168m2805j97513m1968
35030d59489K13055K30784N7293o3916j03752j23035k503K90964L98695K2785
35020D60881m63084m07287J46923M58295J56946k49112j86810J55197K02795j37487
35010A37257m32240l74076p5473K33349M50999N27148M17824J94535J7077n6640
35000A039760j02007j63086k05460k32464k72285k34583N250L09781L09410r9734
$$ y = [198666, 94651, 39858, 25661, -75832, -333969, -625139, -709690, -455542, 8752, 373352, 411314, 180973, -60248, -152166, -178370, -272853, -375153, -312312, -83534, 110157, 147716, 135118, 201706, 298944, 307515, 228900, 154419, 127037, 132468, 150751, 138921, 57527, -17907, 52278, 220192, 224120, -40812, -309245, -310371, -177203, -220008, -417521, -459489, -246434, -15650, 41643, -22273, -126025, -249060, -251563, 39401, 438096, 460881, -2203, -409490, -262567, 195728, 352674, 103562, -83248, 71949, 274744, 137257, -294983, -669059, -744532, -511183, -60184, 466964, 884788, 1079323, 1096400, 1039760, 937753, 774667, 569207, 336743, 64458, -170125, -164875, 144906, 454316, 354582]
34990C54582m89926l93543N6974K88107N9797k50936k25177N7061K42656K12967
34980h7438J00115k0547j46169j59745M9087L06752L02629K3711k34236k93126
34970a58967k30602r2629J54480L22898J01890l56197m11703J69365P15013N03589
34960G17137k00985n34480k54216O4542J4733j32324n9580O5511J4060l6891J29654
34949b12839K94559J48021j27271r8153K10579L24949M4637k74387k69279m9312
34939h496M9171p0757k33839k50255n1215K79155M77102K82185j91688m50690
34929a69327j99404K37877L33928N3390j99881k32327k31313k65200r6396L04268
34919d64385M92723J53982l42831m02803j0126L53374M43493M29345L99754K20463
$$ y = [354582, -135344, -528887, -471913, -183806, -124009, -374945, -600122, -543061, -300405, -87438, 12677, -7870, -154039, -313784, -264697, 42055, 344684, 368395, 134159, -158967, -389569, -482198, -327718, -4820, 97070, -259127, -670830, -501465, 213548, 717137, 516152, -18328, -272544, -208002, -193269, -325593, -385173, -319662, -305602, -342493, -212839, 81720, 229741, 102470, 4317, 214896, 539845, 584482, 310095, 40816, -8496, 40675, -30082, -263921, -514176, -565391, -286236, 190866, 473051, 281363, -169327, -368731, -130854, 203074, 256464, 56583, -175744, -407057, -672257, -768653, -464385, 28338, 182320, -160511, -563314, -573440, -220066, 223427, 652772, 1052526, 1272989]
34909A272989m6745r0597R8373P6802l76292q16548p15703k03461J50092J08280
34899e42810n1938l6829J34030K78172K59111M1372k55247l75341j90535Q9543
34889f50472J51073k0860j60614r8150R1632K90603M60115N33750L99104P4686
34879A070867k34727l47285k84898j85579j07211N105J72099K73410J62201j05967
34869D18015k70763j88571m2011n7441j28612K638K57080K78030J1314j80880
34859I8799j07643l0988j55480k59799j32241K2949k3019r0427L9538J69943P1265
34848c97103j5142J97139M18410K30890r4752J3156L68321K15709m86570q73039
34838d22981m98713m070k3175j96259J02736O39981O85933J89448j66886r618
$$ y = [1272989, 1226244, 1135647, 1234020, 1310822, 934530, 117982, -597721, -801182, -651090, -542810, -594748, -631577, -497547, -219375, 39736, 81108, -174139, -549480, -740015, -650472, -499399, -520259, -680873, -779023, -687391, -396788, 63327, 597077, 996181, 1070867, 836140, 488855, 203957, 18378, -88833, -83728, 88371, 361781, 523982, 418015, 147252, -41319, -83330, -140771, -269383, -266745, -9665, 268365, 279679, 98799, -8844, -39832, -195312, -455111, -587352, -564403, -587422, -677849, -638311, -468368, -397103, -412245, -215106, 203304, 434194, 339442, 352598, 720919, 936628, 450058, -422981, -921694, -925764, -948939, -1145198, -1042462, -402481, 283452, 472900, 306014, 296396]
34828B96396K76832K34310n1349k27716k22044k29237l07126k60073L0028L38744
34818a21235L45994J02689J015J90023L06140K0592m15314n34842l41405j59187
34808f05530K5631M59203Q93745O83914k00688r17477q35859l14976o023Q4482
34798g33578L09728N83798N01756O2289k96294l22631j68769j4201J34753K56908
34788C13759K47654R3226q7300j91460k03448j61451j39119j62594j04344J63847
34778b31230M84178N44737L43610J72140O5182k54645p02511o82707j3452N40713
34768B66015K49193m75388o39500r1272L69656K40657p2603m2643K08822K33934
34758B46871o0091l82602m87924l61908q2468K90176O46197P47739L76168l24103
$$ y = [296396, 573228, 807538, 756189, 528473, 306429, 77192, -229934, -490007, -459979, -121235, 224759, 327448, 328463, 518486, 824626, 845218, 429904, -104938, -446343, -605530, -579899, -120696, 773049, 1456963, 1256275, 338798, -497061, -812037, -818060, -733578, -423850, 159948, 661704, 723993, 427699, 105068, -63701, -77902, 56851, 313759, 561413, 654639, 567339, 375879, 172431, 10980, -128139, -290733, -395077, -231230, 252948, 797685, 1141295, 1313435, 1378617, 1123972, 421461, -261246, -274698, 266015, 515208, 39820, -599680, -690952, -321296, -80639, -153242, -195885, 12937, 246871, 186780, -195822, -683746, -1045654, -1128122, -837946, -191749, 555990, 932158, 608055]
34748F08055p87083n97842o7837J42866l7845n9931K60707L98571O9904j85915
34738b56350Q8772M31566K33587j94989j73698J55486J26917k29289k68088Q1983
34728d103K21515K670m4892K25659K50580k07018n55457l12731J78941L82175
34718A37339K73212N5654k13045l45839p720O20731P74108J50174n44273n74502
34708C25839j58893M7289o8350j89472k24192k41083j01711K67037N27741L89622
34698E73827J21076R9876J75175K7070j68478o8488J15652p3282m79376n11499
34688a88447j23463J02398r2889k87828j33771J41440K19299J59530J00985n5479
34678a58225l25574l67470O5623O17304O80124J84810l10486l45827p7544N3909
$$ y = [608055, -179028, -776870, -844707, -701841, -739686, -799617, -538910, -140339, -70435, -256350, -167578, 263988, 497575, 302586, 128888, 284374, 411291, 182002, -86086, -4103, 217412, 220082, 175190, 400849, 651429, 444411, -111046, -423777, -244836, 137339, 410551, 466205, 253160, -92679, -100399, 520332, 1294440, 1444614, 900341, 325839, 166946, 214235, 145885, -43587, -267779, -508862, -610573, -343536, 184205, 573827, 694903, 794779, 969954, 997024, 828546, 760058, 875710, 802428, 323052, -188447, -311910, -209512, -302401, -590229, -724000, -582560, -363261, -203731, -102746, -158225, -483799, -851269, -785646, -168342, 511782, 696592, 386106, 40279, -37265, 16644]
34668A6644o0788j65216j19303r2468j91772k08691J9659K40178J34939j12976
34658e39794n6973K53550K69120j94843n94559m10127J48602M91478L84094M0041
34648b09411k50486l03964q9178J71612J72431l6484p5253J51385K78187J33279
34638e7882P0170L02346M22131O8935l85774m03756j34353n4297r5492J23826
34628a44146M37534L24569j18763k26778J46614L68164N0530l65023l53843n3542
34618F5316R4825N272j09822j29296n3253J05723K29861J22089j92683m10826
34608b72794l42168j42168l3504k6709l9409o8621j10035q5072M5442K30224M16957
34597d27857N39126M50559R3234l00095m15140k44416l2113J01189K02155K40343
$$ y = [16644, -44144, -209360, -328663, -421131, -612903, -821594, -801935, -561757, -426818, -539794, -596767, -343217, -74097, -268940, -863499, -1273626, -1125024, -633546, -249452, -209411, -459897, -763861, -853039, -681427, -508996, -545480, -620733, -469348, -191161, -57882, 12288, 314634, 736765, 805700, 419926, 16170, -118183, -172480, -267972, -144146, 293388, 617957, 499194, 272416, 419030, 787194, 837724, 472701, 118858, 65316, 160141, 165413, 55591, -73705, -126958, -21235, 208626, 330715, 138032, -272794, -614962, -757130, -790634, -817343, -856752, -925373, -1035408, -1120480, -1075038, -844814, -427857, 111269, 561828, 655062, 354967, -60173, -304589, -336702, -235513, -33358, 206985]
34587B06985J52104N8713R0547Q0194j70446m16781k52865J88945L70881J86794
34577D95071O2552J44814N8503l13577m77672j22945L04268K72174m9009j49843
34567B24336L0856J64304J07952k7527j82358l16288k53481O4448L25948K05055
34557C43245j57939l53883k67736j40859j61672k67625k98308j45794J73221M59062
34547h18288M72706K45494N8858K7364k5281j60113j52213P1781K09914Q4016
34537A4238j7800J45631K84416N3944l01452k97404K8238K34881J91035J20113
34527D55840N6607j59777l83423k54344J38129K47472j11463m41633k96274J00933
34517f47933K60202J07027o7289r7831o1058k7507J8894O4584P2973P6874J15959
$$ y = [206985, 359089, 417802, 508349, 588543, 418097, 1316, -251549, -62604, 308277, 495071, 557623, 702437, 760940, 447363, -30309, -153254, 151014, 423188, 374179, 224336, 255192, 419496, 527448, 499921, 317563, 1275, -252206, -187758, 138190, 343245, 185306, -168577, -436313, -577172, -738844, -1006469, -1304777, -1450571, -1277350, -818288, -345582, -100088, -41230, -13866, -39147, -199260, -351473, -279692, -69778, 14238, -3562, 142069, 426485, 480429, 178977, -118427, -90189, 144692, 335727, 455840, 512447, 352670, -30753, -285097, -146968, 100504, -10959, -452592, -748866, -647933, -387731, -280704, -347993, -445824, -506882, -534389, -515495, -450911, -377938, -301064, -185105]
34506a85105J24641K7300q5663l8808J45160J96811n7449l98406m30660r4470
34496g96649K34336K46386R4783Q7242J64708K4602l02158l99374p3956L40194
34486c79886M41162K20850r5643l70005n03127l50634N9227M35045N61408N15494
34476E33891L83949P7022l40306m88700k00496J02409k1203l32364k56166K43138
34466b98826O25689N39588J59775k12824m58794n20060l55485q5681R8379J83104
34456c25135K47721K13455j7400k60750k46476n7904n618j05650q1363J20108
34446e19012K28410J21309O765L7823R1154M8921O755P1254J72328J75234L0096
34435D71037j95844l01950p5253L83636O26510M05898M3891o8417o4137k42566
$$ y = [-185105, -60464, -33164, -118827, -157635, -12475, 184336, 126887, -271519, -702179, -796649, -562313, -315927, -221144, -133902, 30806, 55408, -246750, -646124, -720080, -379886, 61276, 282126, 186483, -183522, -686649, -1037283, -978056, -543011, 18397, 533891, 917840, 994862, 654556, 165856, -34640, 67769, 46566, -285798, -541964, -298826, 326863, 866451, 1026226, 813402, 354608, -165452, -520937, -606618, -508239, -325135, -77414, 136041, 118641, -142109, -388585, -446489, -452107, -557757, -639120, -519012, -290602, -169293, -162528, -124705, -33551, 15370, 22125, 93379, 265707, 440941, 471037, 275193, -26757, -102010, 281626, 908136, 1314034, 1357925, 1289508, 1225371, 982805]
34425I82805m06546j80635K00254J55046k44401l14080J26202M51828K37010j78533
34415H28950l83980m42976m29905j38254L37848M13747r5676n15127k87219J68595
34405e43997J93796n0990O169L06836L34882P4631j0305J40526P7389l35352o28834
34394d35249m12712J20100N07208M96117J51323k26317k85874O404K50500J22285
34384B93785j47138j33304J10952J79145j440r0963N7264J78991P3784j00391
34374D20685j42627j05989j29302j91233j60292K5699K66442L21907K5434m18093
34364h7369n27478j25297L76875N05725L11473J37779O5254k4616n5501R5859
34354F72704K00376o6157n25145o51516l31187L014L1589q8926r1855N4676K42774
$$ y = [982805, 576259, 395624, 595878, 750924, 506523, 192443, 318645, 770473, 1007483, 828950, 444970, 1994, -427911, -566165, -228317, 185430, 89754, -425373, -712592, -543997, -350201, -401191, -395022, -88186, 246696, 321327, 311022, 451548, 528937, 193585, -435249, -847961, -727861, -220653, 275464, 426787, 200470, -85404, -79000, 171500, 293785, 146647, 13343, 124295, 303440, 302000, 211037, 268301, 447292, 521076, 420685, 278058, 172069, 42767, -148466, -308758, -283059, -16617, 305290, 330724, -87369, -614847, -740144, -363269, 142456, 453929, 591708, 656962, 632346, 576845, 672704, 873080, 806923, 281778, -369738, -700925, -697911, -666322, -755248, -847103, -792427, -549653]
34343e49653L50839K59431K4810m6986J70497K88023o0123n25252m75507N920
34333e58001K38358L2088q8702J62790M32243M62563M65251M76023J25230n46717
34323A201126q07610l00158K90912K49807j10142r4858K04839K03991j08160k33864
34313D95883p6613J2855k5998O7074K27294J13986j93264k50606o0662j22256
34303A87693n11413o01590k0510O73058O95083O7236m66303l78758J01825L52170
34293I8491P1584l92429m48882K097M15243L12744j00710l11850k27506j17328
34283f98546m5758J09352K00469k1474l07213j24571M37869O40563J74687l49487
34273A5891l00629J48995M59730M77157L38731P9650k22448k90620o8764N8447
$$ y = [-549653, -198814, 60617, 85427, 38441, 208938, 496961, 436838, -88414, -563921, -558001, -319643, -287555, -376257, -213467, 218776, 681339, 1146590, 1622613, 1747843, 1201126, 393516, 93358, 384270, 634077, 523935, 429077, 633916, 837907, 729747, 495883, 419270, 432125, 406127, 473201, 700495, 814481, 621217, 370611, 309949, 187693, -323720, -925310, -945820, -272762, 422321, 489557, 23254, -355504, -253679, 98491, 170075, -222354, -671236, -669139, -253896, 58848, -41862, -353712, -581218, -698546, -744304, -634952, -434483, -455957, -763170, -887741, -449872, 190691, 365378, 15891, -284738, -135743, 323987, 801144, 1139875, 1219525, 997077, 706457, 637693, 696140]
34263F96140j25681k49261o492K17732j9596l73156k32996K12387K71861o9992
34253C20946j80355M9793L5442l38709l71400K42250P50371M85212q9112j81501
34243G22937Q8715Q4166j72347j32213K04544K92307Q7216J70623O47310P68294
34233B761552M9173q94386j130239n81967O0510K70796O8228k76597m60958k35610
34223c69498L06522O30683L33594k67755n04641k52005l0435j89759m28283k90294
34213a061871J94277N94345N95059K42117j81856l73457k23093O4570J65849K1693
34203C7633j14454o9757J0975n5722j83171j79587o5857n229j9647l804M4753
34192f03867M1661L1641J50323L49207L84473J56409j25153k21661j68278j64368
$$ y = [696140, 570459, 321198, 314706, 532438, 512842, 139686, -93310, 119077, 390938, 320946, 140591, 190384, 225826, -112883, -484283, -242033, 508338, 993550, 904438, 722937, 811652, 895818, 723471, 591258, 795802, 1088109, 1175325, 1345948, 1993258, 2761552, 2810725, 1916339, 786100, 204133, 264643, 535439, 603667, 327070, -133888, -369498, -62976, 567707, 901301, 633546, 128905, -123100, -153535, -343294, -771577, -1061871, -867594, -273249, 321810, 563927, 382071, 8614, -214479, -149909, 15940, 37633, -76821, -146578, -135603, -191325, -374496, -554083, -619940, -625169, -644816, -648620, -603867, -562206, -530565, -380242, -31035, 353438, 509847, 384694, 163033, -5245, -169613]
34182a69613k55117k71803p7653K33543M18420L25900M1524j95975k16086n9527
34172b26387Q8851Q7816m7662j90639k24081j22407O3761K81945N02489O51159
34162H64845N86041K47285j86265m20800l61414j85651p0864k571O6763M5713
34152E83082j40707l41304l24829r3041J17094J19559o3053k78886l45440j35198
34142i02723K64870N28530M10307N5789j91548k35629k41620k47960q6791K40590
34132d06185M25350K59858n0837j82809j17860o5478r7697r6396j0339M8293q255
34121c02355r4122n0701J42067K98305K13211o8492k63974k11463q5510q6965
34111e09999p7381J71823M71281L87133m8909k78288k5570K97811K65594N6200
$$ y = [-169613, -424730, -696533, -774186, -540643, -122223, 203677, 245201, 49226, -166860, -226387, -137536, -49720, -97382, -288021, -512102, -634509, -570748, -288803, 213686, 864845, 1450886, 1698171, 1511906, 1091106, 729692, 544041, 473177, 470606, 537369, 583082, 442375, 101071, -223758, -316799, -199705, -80146, -143199, -422085, -767525, -902723, -637853, -109323, 300984, 356773, 165225, -70404, -312024, -559984, -646775, -406185, 19165, 279023, 228186, 45377, -72483, -137961, -235658, -332054, -342393, -294100, -302355, -396477, -447178, -305111, -6806, 206405, 137913, -126061, -337524, -423034, -509999, -587380, -415557, 55724, 442857, 393948, 115660, 90090, 387901, 653495, 709695]
34101G09695J5842J8738k14514m62694k85356J77104L06078p7923m58434l86704
34091f58168j4422K88802M13071L97370K10020j06159l21169k73677q0691L9473
34081a05550Q177j04544j43304N6729M39275O15035K76962l02912n41884k97617
34071i9633M2478K03807K68575K46998r350l17825k07182K91841N17812J81559
34061A119080j48199j9031J19628k45488o77599m59645J57453L24404l7523k24779
34051i1699k8458q165l64523n07431p5809M38691N09532L20122K31283J25870
34041E49413j82139l96037j84955J70205J44517k48369n33970m66283k07760M1579
34031a313799K09676K54746K20768K69449L93123K93581j44612m91297k90268
$$ y = [709695, 725537, 744275, 529761, 67067, -218289, -41185, 264893, 186970, -271464, -658168, -672590, -383788, 29283, 426653, 636673, 530514, 209345, -64332, -145023, -105550, -97373, -201917, -345221, -288492, 150783, 765818, 1042780, 739868, 197984, -99633, -57155, 146652, 415227, 662225, 652875, 335050, 127868, 419709, 937521, 1119080, 970881, 951850, 1071478, 825990, 148391, -311254, -153801, 170603, 133080, -91699, -120157, -128322, -492845, -1000276, -1076085, -637394, -127862, 192260, 423543, 549413, 367274, -28763, -213718, -43513, 101004, -147365, -681335, -1147618, -1355378, -1313799, -1104123, -849377, -628609, -359160, 33963, 327544, 182932, -308365, -598633]
34022e98633K20243L67473k7856m36235l89848o9683M7082j40906k65309N170
34012a288502N12059P36136L99166j68429m27568l06168j64156j20997J00440
34003g28019N17124O26776J74009l06474k25272J63311J96894j51479l46356k30435
33993c09921j49904j72972N0069N08792O32842J59770l87545m40125j21518J07469
33983a23043J23764P7095o964j53008k04469l5716J72137J71043J2653q0705n8721
33972a05934k4302k4380o5566j74680k63058j35958J73099L26531J73170L5029
33962h6049J94793L71486J24000m07718o33287l20531J60998M05780L76024J94169
33952C79665o9938k76770k18383Q0796L11294K80713J46823J03638P5209o4433
$$ y = [-598633, -378390, -10917, -38773, -475008, -864856, -934539, -887457, -1028363, -1293672, -1288502, -776443, -40307, 358859, 190430, -237138, -543306, -707462, -828459, -728019, -210895, 415881, 589890, 283416, 58144, 221455, 418349, 266870, -79486, -309921, -459825, -632797, -582728, -73936, 558906, 718676, 331131, -108994, -230512, -123043, 721, 77816, 70852, -82156, -286625, -322341, -150204, 20839, 33492, -47213, -105934, -130236, -154616, -220182, -394862, -657920, -793878, -620779, -294248, -121078, -86049, 108744, 480230, 604230, 196512, -436775, -757306, -596308, -190528, 185496, 379665, 309727, 32957, -185426, -104630, 206664, 487377, 634200, 737838, 813047, 748614]
33942G48614j69214j6657K55591K21161k62741p88061q48272m25371M5912K35953
33932a003085K34033K66070L11479J83824j03527k77454j44604J62721L45245
33923b5298K48113l0763k64708k88872j16593J11980K97013M24067M23206J63239
33913I41384k75934n26097l74250j09167j00958k03638k1943L36361L48622n0440
33903c6060l06201j23205J19504J09868J14095L28356L56393p6442m47224k05439
33893a66355K30672J00008l94530l74102K35893N40197J21270l21652j31675L44309
33883A84035M46350J87472o889m3032q7681j22989p7750j02145k58613k33824
33873a15066J77339N74940M44759o1570l50040k40726q0287q2093r1536l0502
$$ y = [748614, 579400, 562743, 818334, 1039495, 776754, -11307, -859579, -1284950, -1239038, -1003085, -769052, -502982, -191503, -7679, -111206, -388660, -533264, -370543, -25298, 222815, 192052, -72656, -361528, -478121, -366141, -69128, 354939, 778145, 941384, 665450, 139353, -234897, -344064, -445022, -648660, -670603, -334242, 14380, -36060, -342261, -465466, -345962, -236094, -121999, 206357, 562750, 486308, 39084, -166355, 64317, 164325, -230205, -604307, -368414, 171783, 293053, -28599, -160274, 184035, 630385, 817857, 810968, 767936, 680255, 557266, 479516, 377371, 118758, -115066, 62273, 637213, 1081972, 1020402, 670362, 429636, 349349, 267256, 175720, 145218]
33863A45218o8356k28226k53588m4839J25792M5357q4103L0746K99889L70349
33853C38239J27035j71140k53534j44977m5283l2710j9045L5035K4035r6017j35147
33842c73509J08799M94504O22304L24444j20125l40342k65173o9557P8870Q1162
33832E41377j04730l54293l92313j14391K07125K32955J76j41954r695J86838
33822E1095J28679k06689m80878l39928J61871N47518M37310J3300k28245j24153
33812d0120M3134N6339N567m3609j90176l47722k12285J79413L39308R5062n8299
33801a73388J82629K90869k13991p68919n35916J76943L13854k19693l91512K40209
33791a098915P86825M82889j27464j69150J93768K20525j24102k53144j9147J55151
$$ y = [145218, 76862, -151364, -404952, -449791, -323999, -278642, -362745, -331999, -32110, 338239, 465274, 294134, 40600, -104377, -149660, -182370, -201415, -166380, -142345, -238362, -373509, -264710, 229794, 852098, 1176542, 1056417, 716075, 450902, 381345, 460215, 541377, 436647, 82354, -309959, -424350, -217225, 15730, 15906, -126048, -135743, 51095, 179774, -26915, -507793, -847721, -685850, -138332, 298978, 312278, 84033, -40120, 3014, 59353, 64920, 21311, -168865, -516587, -728872, -549459, -210151, -115089, -173388, 9241, 300110, 86119, -682800, -1218716, -1041773, -727919, -947612, -1339124, -1098915, -312090, 170799, 43335, -125815, 67953, 288478, 164376, -88768, -107915, 47236]
33781D7236Q5477K7432R4743J09932M9125P5787J11578r1466m11971m21443o7924
33770c91494K13747J99279J75980L47872M20417R3238l86677n17118j89870K26398
33760A91772L25722N137m99783p74251n57530l9372L08113K69295Q1231K6815
33750f62851P1539M1689o1189j16131r6902n3577R172J03391K03686K93556L43254
33739G5637K31617r6575l84590k88528Q2006K29907K0149r2511J49093L01123
33729B27328l1762m10384j95947L43191L70790j77649m68358j04268K73381O6581
33719a07097l60132l74548q1665J5200p9523M818K23550J94494m8376n6612K58182
33708d11709M57980K79285l7398k34904l37019l13300Q115M50134M43687j54376
$$ y = [47236, 132713, 160145, 254888, 364820, 413945, 489732, 601310, 509844, 97873, -323570, -391494, -177747, 21532, 197512, 545384, 965801, 1059039, 672362, 155244, -34626, 191772, 517494, 522631, 22848, -751403, -1308933, -1348305, -1040192, -770897, -689666, -662851, -591312, -549623, -610812, -726943, -823845, -877422, -868250, -764859, -561173, -267617, 75637, 307254, 210679, -173911, -462439, -380433, -150526, -130377, -222888, -73795, 227328, 195566, -214818, -410765, -67574, 303216, 125567, -342791, -447059, -173678, -107097, -467229, -841777, -923442, -908242, -987765, -982947, -759397, -564903, -613279, -669891, -411709, 46271, 325556, 288158, 53254, -283765, -597065, -588950, -138816, 304871, 150495]
33698A50495o51491l90150L07090N73141J61585l48908m26297j61119O4905P2956
33688f47793o2181j73185j21398N4476J13703o7805k32390p0580K60545L09165
33678f37443O206k30772j36776P1435J51413K09393L72050M40833K03581j60919
33668B89001l25120k77121k25552k00005q7075M3376K652j62155k00778m6798
33658a189575J21291K11753L05816L69263K02871j85783m37767k71697J24778
33649g49050L35775K31459M2484j8790p031p3004j86644j61275M7459J93758L2686
33638c12173k75641k78046J51337N34055L71483j59524m25701j78334K03406L29732
33628c9406K49591J44560k3333k82923l87177j31053K51774L57234J61524k0193
$$ y = [150495, -500996, -891146, -584056, -10915, 150670, -198238, -624535, -785654, -720749, -647793, -709974, -883159, -1004557, -950081, -836378, -904183, -1136573, -1207153, -946608, -637443, -631237, -862009, -998785, -927350, -775937, -566544, -194494, 246339, 449920, 289001, -36119, -313240, -538792, -738797, -825872, -782496, -779844, -941999, -1142777, -1189575, -1068284, -856531, -550715, -181452, 21419, -164364, -602131, -873828, -749050, -413275, -181816, -139332, -158122, -165153, -238157, -424801, -586076, -538617, -344859, -312173, -587814, -865860, -714523, -180468, 191015, 31491, -394210, -572544, -369138, -39406, 210185, 354745, 331412, 48489, -338688, -469741, -217967, 139267, 300791, 280598]
33618B80598l8077l2315r0482j25115j21345j85423k75669j84804J02358L13187
33608c57087K90329K29221L26724M22627K36294j83644m87666m37040j14423J99809
33598A25144K16647j71504o92755q02429k41890N58075Q82691N27951m8767l49940
33588C223l07797r2342J92092M25765L82583J7769l20026k69809L2685J27807
33578A91950j10348l03422j27606K42528M17603L16490J77745J45723R0939j21965
33568I19637l70738m10707k13030k4887m1362j29685l4653J78185J32658k88058
33558b82640o37219m56056M1629K43787M6935j9434K98575N02922J45792l64914
33548d80623l36408J27589L01277p896k12313M3945L44308K64837L7763J0762
$$ y = [280598, 242521, 210206, 119724, -5391, -126736, -312159, -587828, -772632, -670274, -357087, -66758, 162463, 489187, 911814, 1148108, 964464, 476798, 39758, -74665, 125144, 341791, 170287, -522468, -1324897, -1566787, -1008712, -126021, 401930, 353163, 3223, -304574, -396916, -204824, 220941, 603524, 621293, 301267, 31458, 64143, 191950, 81602, -221820, -349426, -106898, 310705, 627195, 804940, 950663, 1041602, 919637, 548899, 138192, -74838, -99725, -141087, -270772, -305425, -127240, 5418, -282640, -919859, -1375915, -1334286, -1090499, -1043564, -1062998, -764423, -261501, -115709, -480623, -817031, -689442, -388165, -396061, -608374, -564429, -220121, 44716, 82479, 93241]
33538I3241k815k63874m41902j00478M37824M73337N5926o7170L19448N36328
33528A039865J39849l34332k32445J98548K53437j52684m77987m25792k33856
33519b25397j58969j82557k31758k57624q5081L87532Q07419O39661o1138n83304
33509D8784m61840n9076L7006j46458j25649K32894N13032L71520n292k14897
33499A90024j68302q5935p5058J6713K57305L79897J26649k61601k53438K05906
33489C32160N13774K33335k53556l13910r265P4878j85918k96399m1387J23865
33479A77577j38942m61901l89089j04040k8781p4680J09749L88029K84977j82049
33469d19150m39325j98771J63607K22156N2406l5320L1708J03238O1096j02523
$$ y = [93241, 90426, -173448, -615350, -715828, -278004, 195333, 251259, 184089, 503537, 1039865, 1179714, 845382, 612937, 811485, 1064922, 912238, 434251, 8459, -225397, -384366, -566923, -798681, -1056305, -1141386, -753854, 53565, 693226, 632088, 48784, -413056, -472132, -435126, -581584, -707233, -474339, 38693, 410213, 404921, 190024, 21722, -64213, -139271, -122558, 134747, 514644, 641293, 379692, 126254, 332160, 845934, 1079269, 825713, 511803, 502538, 577416, 391498, 95099, 53712, 177577, 38635, -423266, -812355, -916395, -945176, -1019856, -910107, -522078, -237101, -419150, -858475, -1057246, -893639, -671483, -619077, -654397, -622689, -519451, -458355, -560878]
33459e60878k87517k95614l6580K56214K71776Q9355P4935K75981L20611M7671
33449A55954j87318p6689J52397J45484L272N4171K43241J82781k26338n81788
33439a34833m60130Q7962N79358N61454O5796l76050k93240J37682K94493o1014
33429D01478m91031n59817m01922l27079k50784M5171L82042M27899K83531K98703
33419a91809M30349L37501N0686m6487P4911J7960k78143l30372P1412M12298
33409E48306K04388k68275m09487j73084J6427k0016o4242K7674J25552J04690
33399I1933J7854l9467l0145M6858J27823R3650o2417j84661j93935k05706k59667
33388e97880j66965J39474L51025K06835m4170p352J98551J32921j86211k43360
$$ y = [-560878, -848395, -1144009, -1180589, -924375, -652599, -563244, -488309, -212328, 108283, 155954, -31364, -108053, 44344, 189828, 193100, 247271, 490512, 673293, 446955, -134833, -594963, -507001, 72357, 633811, 699607, 323557, 30317, 167999, 462492, 401478, -89553, -649370, -1051292, -1378371, -1629155, -1583984, -1201942, -774043, -490512, -191809, 238540, 576041, 626727, 580240, 655151, 673111, 394968, 64596, 136008, 548306, 752694, 484419, 74932, -98152, -81725, -101741, -165983, -138309, -12757, 91933, 109787, 70320, 40175, 87033, 214856, 308506, 246089, 61428, -132507, -338213, -597880, -764845, -625371, -274346, -67511, -111681, -119033, 79518, 212439, 26228, -217132]
33378b17132J42551M68842K65662k50480n35281m19614j47874M3394O6380j14584
33368f98136l87016m14553N378N52555O73133K74224j65816k39737o7360K8031
33358d39297K2258J10467K86226L14834J16369r5020j26351m2942J8226P4659
33348B39429J76184K22558J16351k0099k3739k026j78032m59106m93265k06219
33338f27964N8071O3977K7601K24193N22245N72242K85860r7489k89190j56693
33328E82853J54985K05075l22582j024872j038077j85835O16458N60129M3899
33319d07967p6513J31094l5846n21034n16931R6691M54684J53053q3430K94240
33309e11959O85608M16091p0303j8434L06089J47172l34091l23576J77763L02812
$$ y = [-217132, -74581, 394261, 659923, 409443, -125838, -545452, -693326, -649932, -583552, -698136, -1085152, -1499705, -1494327, -941772, -268639, 5585, -160231, -399968, -467328, -439297, -417039, -306572, -20346, 294488, 410857, 315837, 189486, 146544, 164770, 239429, 415613, 638171, 754522, 734423, 710684, 708658, 530626, 71520, -421745, -627964, -569893, -505916, -478315, -254122, 268123, 840365, 1126225, 1028736, 739546, 582853, 737838, 942913, 620331, -404541, -1442618, -1628453, -1011995, -451866, -407967, -484480, -353386, -389232, -910266, -1427197, -1330506, -875822, -722769, -806199, -511959, 173649, 589740, 519437, 501003, 807092, 954264, 620173, 296597, 474360, 777172]
33299G77172k10784n75121k50765K44844K58102l7836j29881k8433o2903k05823
33289b21428j67638M0627J15523m9887k31912k01343M0124L11158M02018K40518
33279B77760j1387j16476m5042L2961K4224j4851o2531j44777j75124n7807O8191
33268b24859J3038o5856J34822M54815L73967j53398n10006k97800J11792K24455
33258F0970J17485R0421R0411k8693o8561J64585M03010L44225K17562L56297
33248A747712N52576N40525P81012J794028K805681K216827k05387k578408l006811
33239D647755j752990n70075l90987o02015m15312L3553K14386Q2693o2180j67483
33229A017345l34632l44916J52959R45928J250089O37546l76753r70328r58455
$$ y = [777172, 566388, -8733, -259498, -14654, 243448, 205612, 75731, 47298, -15605, -221428, -389066, -348439, -232916, -282803, -514715, -716058, -675934, -364776, 37242, 277760, 266373, 149897, 104855, 137816, 162040, 147189, 84658, -60119, -235243, -293050, -224859, -211821, -277677, -142855, 311960, 685927, 532529, 22523, -275277, -163485, 60970, 178455, 268876, 359287, 330594, 262033, 426618, 829628, 1173853, 1391415, 1747712, 2300288, 2840813, 3621825, 5415853, 8221534, 10438361, 10232974, 7654566, 4647755, 2894765, 2324690, 1933703, 1331688, 916376, 949929, 1164315, 1247008, 1184828, 1017345, 682713, 337797, 490756, 1436684, 2686773, 3324319, 2947566, 1977238, 1018783]
33220A018783p33443m96938r8034L95940N59887K40059j51797k42670j86144k38506
33210F7137k54451k2357K28031J42514j52105k46654j01728k4839j05252j43231
33200f12935p3806j0289P2992K56659L54061J49233j29675j09037M1731j42423
33190b03489n08255l75563L12976P24559L56030k07698k38015O8067P0152k56707
33180b57943m31674l23078k13598j71932J3367L12736M10132K22539L9693Q0034
33170c19724K32503K88973J83632j0104j27659j0281K70926M02073K20425n0943
33160A079821j73413k56677m49649n26378k11093K55992L62139N9376k13131k21982
33150b94995j75076k21891k01702k9579R3783N5435N3915K25432L51552J96784
$$ y = [1018783, 285340, -211598, -309632, 86308, 646195, 886254, 734457, 491787, 305643, 67137, -187314, -209671, 18360, 160874, 8769, -237885, -339613, -364452, -469704, -612935, -686741, -697030, -624038, -367379, -13318, 135915, 6240, -102797, -61066, -203489, -711744, -1087307, -774331, -49772, 306258, 98560, -139455, -71388, -1236, -257943, -689617, -1012695, -1226293, -1398225, -1384858, -1072122, -661990, -439451, -399758, -319724, -87221, 201752, 385384, 375280, 247621, 237340, 508266, 910339, 1130764, 1079821, 906408, 649731, 200082, -326296, -537389, -281397, 80742, 140118, -73013, -294995, -470071, -691962, -893664, -923243, -829460, -774025, -720110, -494678, -143126, 53658]
33140E3658r2138j90351n1167Q1642L5954j14843k09289j77958n8646P6780J78975
33129d67383K23729J85394O1948n7581m3546R1911J63867O0677q6363r9512r592
33118B3549L1995q420n9060r9089j39635j41790j04727j16291j65231p6812J67161
33107f88350K56946j1721l25973k34614J94238M73660L70255R5504j10522j92095
33097a72672j11707J25109K84880J39856j18942j06895J30686J78014m8038j60334
33087A39957L6010K46904K13541N9333o5844k14987l15583j09651L09077L91762
33077F90519q0988n56486m60311p561J83390j7191k09718j10415J84254M40827
33067E6320M65501J83716j92471k75675j7371J69238N8709O475L11245N83387
$$ y = [53658, -38480, -228831, -279998, -198356, -162402, -277245, -486534, -664492, -723138, -646358, -467383, -243654, -58260, 3688, -53893, -97439, -5528, 158339, 219016, 132653, 33141, 23549, 55544, 47124, -11936, -111025, -250660, -392450, -497177, -613468, -778699, -855511, -688350, -431404, -443125, -769098, -1003712, -809474, -335814, 34441, 129945, 19423, -172672, -284379, -159270, 125610, 265466, 146524, 39629, 170315, 348329, 300291, 139957, 175967, 422871, 636412, 695745, 629901, 414914, 99331, -10320, 298757, 690519, 609531, 53045, -407266, -414827, -231437, -248628, -458346, -568761, -384507, 56320, 521821, 705537, 513066, 237391, 220020, 389258, 447967, 454442, 765687, 1349074]
33057A349074K94850l33327o16321m11609k02766k40185k42442k8537J36423J5484
33047b79356k30313l48338l22811k25859m0440K00584L31084K47592L5824j43094
33037g75127j50699Q8026M35538N27678J82796k65126l54597j21171L0241k0797
33027d23238l3586N7441M0110q6683l5453K22661L22009J03195j12750p5587K1531
33016c50j2293l574J59018J72900j57053m06978q5191N27369O61655J26572m38215
33005E43860m51857r6702N1090j98637m74905l50043J38100N04243L63980q1371
$$ y = [1349074, 1643924, 1310597, 694276, 282667, 79901, -160284, -402726, -431263, -294840, -279356, -509669, -858007, -1180818, -1406677, -1447117, -1246533, -915449, -667857, -632033, -775127, -925826, -837800, -402262, 125416, 308212, 43086, -311511, -432682, -402441, -423238, -456824, -399383, -359273, -445956, -481409, -258748, 63261, 166456, 53706, -21881, -350, -12643, -16217, 142801, 315701, 158648, -248330, -333521, 193848, 855503, 982075, 543860, 92003, -4699, 46391, -152246, -627151, -977194, -839094, -334851, 29129, -52242]
$$ [...]
##END NTUPLES=NMR SPECTRUM
##END=
