##TITLE=31Pdec_BAU-j-28-1
 CDCl3, 24 sc
 28.6.2019
##JCAMPDX= 6.0         $$ Bruker NMR JCAMP-DX V2.0
##DATA TYPE= NMR SPECTRUM
##DATA CLASS= NTUPLES
##ORIGIN= UXNMR, Bruker Analytische Messtechnik GmbH
##OWNER= root
$$ XWIN-NMR		Version 3.5
$$ Fri Jun 28 15:54:37 2019 Russian Standard Time (UT+4h)  she@DPX200
##.OBSERVE FREQUENCY= 81.013821
##.OBSERVE NUCLEUS= ^31P
##.ACQUISITION MODE= SIMULTANEOUS
##.ACQUISITION SCHEME= undefined
##.AVERAGES= 24
##.DIGITISER RES= 17
##SPECTROMETER/DATA SYSTEM= spect
##.PULSE SEQUENCE= zgpg30
##.SOLVENT NAME= CDCl3
##.SHIFT REFERENCE= (INTERNAL, CDCl3, 0, 182.463)
##AUDIT TRAIL= $$ (NUMBER, WHEN, WHO, WHERE, WHAT)
$$ ##TITLE= Audit trail, XWIN-NMR		Version 3.5
$$ ##JCAMPDX= 5.01
$$ ##ORIGIN= Bruker BioSpin GmbH
$$ ##OWNER= she
$$ F:/spectra/data/she/nmr/P31/1/pdata/1/auditp.txt
$$ ##AUDIT TRAIL=  $$ (NUMBER, WHEN, WHO, WHERE, WHAT)
(   1,<2019-06-28 15:53:45.78 +0400>,<she>,<DPX200>,
      <created by zg, POWCHK disabled, PULCHK disabled
       configuration hash MD5:
       00 E9 B6 7A A2 85 ED C7 34 08 36 98 17 FE 4E 26
       data hash MD5: 32K
       FB D5 0C 53 5F 44 52 D4 5C 2C 8D 40 23 60 97 2B>)
(   2,<2019-06-28 15:53:48.07 +0400>,<she>,<DPX200>,
      <Start of raw data processing
       efp BC_mod = 2 LB = 1 FT_mod = 6 PKNL = 1 PHC0 = -2577.475 PHC1 = 159.1996 SI = 64K 
       data hash MD5: 64K
       2D 48 6E A6 0B E2 02 BE B7 B0 7F B3 AF 95 C8 BF>)
(   3,<2019-06-28 15:54:02.03 +0400>,<she>,<DPX200>,
      <pk PHC0 = 3.151403 PHC1 = 0 
       data hash MD5: 64K
       5E 0B 49 81 D4 C3 59 13 DF 79 E1 8C 79 E5 62 0D>)
(   4,<2019-06-28 15:54:04.96 +0400>,<she>,<DPX200>,
      <abs ABSG = 5 
       data hash MD5: 64K
       99 4E 2D 61 41 AF E7 11 7C 04 EF 1E 35 85 31 61>)
$$ ##END=
$$ 
$$ hash MD5
$$ B8 CC 4E 9B 85 B4 17 AF DA 31 0C D6 20 27 B4 62
##$RELAX= 
##$RELAX= 
##$RELAX= 
##$RELAX= 
##$RELAX= 
##$RELAX= 
##$RELAX= 
##$RELAX= 
$$ Bruker specific parameters
$$ --------------------------
##$DU= <F:/spectra>
##$EXPNO= 1
##$NAME= <P31>
##$PROCNO= 1
##$TYPE= <nmr>
##$USER= <she>
##$AMP= (0..31)
100 100 100 100 100 100 100 100 100 100 100 100 100 100 100 100 100 100 
100 100 100 100 100 100 100 100 100 100 100 100 100 100 
##$AQSEQ= 0
##$AQ_mod= 1
##$AUNM= <au_zg>
##$AUTOPOS= <>
##$BF1= 81.014009
##$BF2= 200.13
##$BF3= 200.13
##$BF4= 200.13
##$BF5= 200.13
##$BF6= 200.13
##$BF7= 200.13
##$BF8= 200.13
##$BYTORDA= 1
##$CFDGTYP= 0
##$CFRGTYP= 5
##$CHEMSTR= <none>
##$CNST= (0..31)
1 1 145 1 1 1 1 1 1 1 1 1 1 1 1 1 1 1 1 1 1 1 1 1 1 1 1 1 1 1 1 1 
##$CPDPRG= <waltz16>
##$CPDPRG1= <>
##$CPDPRG2= <waltz16>
##$CPDPRG3= <>
##$CPDPRG4= <mlev>
##$CPDPRG5= <mlev>
##$CPDPRG6= <mlev>
##$CPDPRG7= <mlev>
##$CPDPRG8= <mlev>
##$CPDPRGB= <>
##$CPDPRGT= <>
##$D= (0..31)
0 1 0 0 0 0 0 0 0 0 0 0.03 2e-05 3e-06 0 0 0 0 0 0 0 0 0 0 0 0 0 0 0 0 
0 0 
##$DATE= 1561722825
##$DBL= (0..7)
120 120 120 11 120 120 24 19 
##$DBP= (0..7)
150 150 150 150 150 150 150 150 
##$DBP07= 0
##$DBPNAM0= <>
##$DBPNAM1= <>
##$DBPNAM2= <>
$$ [...]
##$SUBNAM3= <"">
##$SUBNAM4= <"">
##$SUBNAM5= <"">
##$SUBNAM6= <"">
##$SUBNAM7= <"">
##$SUBNAM8= <"">
##$SUBNAM9= <"">
##$SW= 369.568048894756
##$SWIBOX= (0..15)
0 1 3 0 0 0 0 0 0 0 0 0 0 0 0 0 
##$SW_h= 29940.119760479
##$TD= 32768
##$TD0= 1
##$TE= 0
##$TE2= 300
##$TE3= 300
##$TEG= 300
##$TL= (0..7)
0 120 53 12 22 120 120 120 
##$TP= (0..7)
150 150 150 150 150 150 150 150 
##$TP07= 0
##$TPNAME0= <>
##$TPNAME1= <>
##$TPNAME2= <>
##$TPNAME3= <>
##$TPNAME4= <>
##$TPNAME5= <>
##$TPNAME6= <>
##$TPNAME7= <>
##$TPOAL= (0..7)
0.5 0.5 0.5 0.5 0.5 0.5 0.5 0.5 
##$TPOFFS= (0..7)
0 0 0 0 0 0 0 0 
##$TUNHIN= 0
##$TUNHOUT= 0
##$TUNXOUT= 0
##$USERA1= <user>
##$USERA2= <user>
##$USERA3= <user>
##$USERA4= <user>
##$USERA5= <user>
##$V9= 5
##$VALIST= <valist>
##$VCLIST= <CCCCCCCCCCCCCCC>
##$VD= 0
##$VDLIST= <DDDDDDDDDDDDDDD>
##$VPLIST= <PPPPPPPPPPPPPPP>
##$VTLIST= <TTTTTTTTTTTTTTT>
##$WBST= 1024
##$WBSW= 4
##$XGAIN= (0..3)
0 0 0 0 
##$XL= 0
##$YL= 0
##$YMAX_a= 34646
##$YMIN_a= -35448
##$ZGOPTNS= <>
##$ZL1= 120
##$ZL2= 120
##$ZL3= 120
##$ZL4= 120
##$ABSF1= 182.463
##$ABSF2= -187.1042
##$ABSG= 5
##$ABSL= 3
##$ALPHA= 0
##$AQORDER= 0
##$ASSFAC= 0
##$ASSFACI= 0
##$ASSFACX= 0
##$ASSWID= 0
##$AUNMP= <proc_1d>
##$AZFE= 0.1
##$AZFW= 0.5
##$BCFW= 0
##$BC_mod= 2
##$BYTORDP= 0
##$COROFFS= 0
##$CY= -3
##$DATMOD= 1
##$DC= 0
##$DFILT= <>
##$DTYPP= 0
##$F1P= 0
##$F2P= 0
##$FCOR= 1
##$FTSIZE= 65536
##$FT_mod= 6
##$GAMMA= 0
##$GB= 0
##$INTBC= 1
##$INTSCL= 5.30512e-09
##$ISEN= 30
##$LB= 1
##$LEV0= 0
##$LPBIN= 0
##$MAXI= 10000
##$MC2= 0
##$MEAN= 0
##$ME_mod= 0
##$MI= 50
##$NCOEF= 0
##$NC_proc= -2
##$NLEV= 6
##$NOISF1= 182.463
##$NOISF2= 159.3651
##$NSP= 0
##$NTH_PI= 0
##$NZP= 0
##$OFFSET= 182.463
##$PC= 4
##$PHC0= -2574.324
##$PHC1= 159.1996
##$PH_mod= 1
##$PKNL= yes
##$PPARMOD= 0
##$PSCAL= 0
##$PSIGN= 0
##$REVERSE= no
##$SF= 81.0140089999434
##$SI= 65536
##$SIGF1= 159.3651
##$SIGF2= -187.1042
##$SINO= 113.3802
##$SIOLD= 16384
##$SREGLST= <1H.CDCl3>
##$SSB= 0
##$STSI= 65536
##$STSR= 0
##$SW_p= 29940.119760479
##$SYMM= 0
##$S_DEV= 0
##$TDeff= 32768
##$TDoff= 0
##$TI= <>
##$TILT= no
##$TM1= 0
##$TM2= 0
##$TOPLEV= 0
##$USERP1= <user>
##$USERP2= <user>
##$USERP3= <user>
##$USERP4= <user>
##$USERP5= <user>
##$WDW= 1
##$XDIM= 65536
##$YMAX_p= 268852161
##$YMIN_p= -1890082
$$ End of Bruker specific parameters
$$ ---------------------------------
##NTUPLES= NMR SPECTRUM
##VAR_NAME=  FREQUENCY,     SPECTRUM/REAL,   SPECTRUM/IMAG
##SYMBOL=    X,             R,               I
##VAR_TYPE=  INDEPENDENT,   DEPENDENT,       DEPENDENT
##VAR_FORM=  AFFN,          ASDF,            ASDF
##VAR_DIM=   65536,         65536,           65536
##UNITS=     HZ,            ARBITRARY UNITS, ARBITRARY UNITS
##FACTOR=    0.456856943014862, 1,           1
##FIRST=     14782.0589164792, 0,            0
##LAST=      -15158.0608439998, 0,           0
##MIN=       -15158.0608439998, -1890082,    0
##MAX=       14782.0589164792, 268852161,    0
$$ Real data points
##PAGE= N=1
##DATA TABLE= (X++(R..R)), XYDATA
$$ [...]
##PAGE= N=2
##DATA TABLE= (X++(I..I)), XYDATA
39100B23412l3807K6162J01473Q0826n905n6449l3535L3877J09732J40728O1451
39089F47965j04904k10889j45341R203P3591J546q3879p6361r750K9806L1529
39078A62516M1140N8463K6407o9529j44762j04475K7980J26493J15160M8131J0133
39067B97657M580m373m560K5425M1973K166l5424Q806Q2573O3468l5807p3845
39055C72639r386L3305k3866q8145n9766J5401N0349N4788O5615M7579k1667o0065
39043C76781N13P8032N0659n2463r9395n5498p246n470p903J7925L9408K5055
39031C60398j2045n1150q2193q1883k9431M7880R2383Q1629M0287k098k6797j6688
39019C20292K4501N6516M5441Q059k0708m1693p2068r4548p4825k0456K0325J8176
$$ y = [223412, 189605, 215767, 317240, 398066, 392161, 335712, 302177, 336054, 445786, 586514, 647965, 543061, 332172, 186831, 196034, 269625, 271171, 187292, 110931, 101181, 130987, 162516, 203656, 262119, 288526, 218997, 74235, -30240, -2260, 124233, 239393, 287524, 297657, 302237, 297864, 293304, 318729, 360702, 362868, 327444, 336250, 418823, 482291, 446484, 372639, 363253, 396558, 372692, 284547, 224781, 240182, 290531, 345319, 410934, 458513, 436846, 376781, 377294, 455326, 505985, 453522, 354127, 298629, 291383, 285913, 278010, 295935, 335343, 360398, 348353, 297203, 215010, 133127, 103696, 151576, 243959, 325588, 365875, 363777, 336980, 320292, 344793, 401309, 446750, 454809, 434101, 392408, 320340, 225792, 150967, 130511, 150836, 169012]
39007A69012q967k7197k5318j8490j8839p639M1880J01398Q9956j3443j01781
38996A80572o2120O1097J18997O1786j6682l8244k6577j5361P699K8411m020o8466
38984B27092o9339P134N5585K8384J7209P9084J16009L5275q8616j32976j06903
38973A67938q7951p0340r787N4523N7491L0660M2268O6213L2060l9249o5732l1738
38961A46356J8056O5972J02245P4071l6180j32038j13553k1640L2097K7401K0668
38950A83455K5495K1167K6202N2955M9354n373k5851L5121O3467l8747j48260
38939B38985q7258P7849J24621J9579n9489l5414k0229o3118n5614L6810P4671
38928B51393j2314p7658P546J31411J10463k9934j05027l6901P3692J17485R8505
$$ y = [169012, 160045, 132848, 107530, 89040, 70201, 62562, 104442, 205840, 295796, 282353, 180572, 118452, 179549, 298546, 360332, 343650, 305406, 278829, 263468, 271167, 299578, 295558, 227092, 157753, 164887, 220472, 248856, 266065, 345149, 461158, 496433, 407817, 274841, 167938, 79987, 9647, -140, 54383, 111874, 142534, 184802, 251015, 283075, 243826, 178094, 146356, 164412, 230384, 332629, 406700, 370520, 238482, 124929, 103289, 135386, 162787, 183455, 208950, 230117, 256319, 309274, 358628, 353255, 327404, 362525, 425992, 387245, 238985, 151727, 229576, 354197, 373776, 314287, 278873, 258644, 195526, 139912, 176722, 251393, 239079, 161421, 168967, 300378, 410841, 380907, 275880, 238979, 312671, 430156, 528661]
38917E28661P5726O5171L4811k9603q2191o2698J2033M7628j821o0798m6817q46
38905D79256j3012o5633o4000K027M6089K5803j8066n6313r1086q7763j0467P2378
38893B19213M7904n9869r6981L361J30226J55838P7192l4844j19152j23666k8608
38882A70614Q9500J11761K6608o3579r7996j10353j12562n8599L3725N6512k4681
38871B0950r2597m2460O4940R6320K7469m4253l1881N0464J11274P7636j6336
38860B21526n6016N425P3217M9008j9249k3324K8850M8410K8405K7220K7025l1354
38848C79143r7081o4824K8720M2054l6431p4346k5417J7497J9341N2701J15209
38837C56566J00510K930m7953j3394l658n0253l6981O1706R5185p394j08303j00823
$$ y = [528661, 604387, 669558, 704369, 674766, 592575, 529877, 541910, 589538, 587717, 526919, 480102, 479256, 466244, 400611, 336611, 338638, 384727, 410530, 392464, 336151, 245065, 157302, 146835, 219213, 267117, 207248, 110267, 113628, 243854, 399692, 476884, 442040, 322888, 199222, 170614, 260114, 371875, 398483, 334904, 236908, 126555, 13993, -44606, -10881, 45631, 20950, -71647, -114107, -49167, 47153, 74622, 30369, -1512, 48952, 160226, 237862, 221526, 165510, 170935, 244152, 293160, 273911, 250587, 279437, 327847, 356252, 383472, 410497, 379143, 282062, 217238, 245958, 288012, 251581, 177235, 151818, 169315, 188656, 241357, 356566, 457076, 460006, 412053, 398659, 395001, 344748, 307767, 369473, 464658, 457264, 348961, 248138]
38825B48138o7344p8771n4506L8221O5656k8502p4531M2877J59927R6521m5546
38814C02140p3212j9652k8396o9991l2758K5784j6266q3956j7595J20753J21076
38803B27927k7067j15421m2229P1936J05638P1231R595p0734j28318j13479o6016
38792g6937n7793n7914Q557J02233J20492P3694N4643O4799L2285k6047k7445
38781B10567J4296J5413q556L1193J15918J35492P8441L6756K3798l9087j42898
38770D71333j67750p0809M5167P9607L3743m1176q4129l5439P3575R1607m8775
38759C46954j69179p6749J10310J12131o9508j42590Q544J45111O9460p2293n4561
38748B07630P4185J09165J8827n2358l4419N3p772k5714j5826M077K607j7765
$$ y = [248138, 180794, 102023, 47517, 85738, 151394, 122892, 48361, 91238, 251165, 347686, 302140, 228928, 209276, 180880, 110889, 78131, 103915, 87649, 3693, -13902, 106851, 227927, 200860, 85439, 43210, 115146, 220784, 292015, 301610, 230876, 102558, -10921, -76937, -134730, -192644, -184087, -81854, 38638, 112332, 166975, 231774, 264059, 238012, 210567, 224863, 240276, 231720, 262913, 378831, 514323, 592764, 629520, 653318, 614231, 471333, 303583, 232774, 277941, 357548, 391291, 350115, 265986, 230547, 304122, 395729, 346954, 177775, 101026, 211336, 323467, 253959, 111369, 119913, 265024, 334484, 262191, 207630, 281815, 390980, 409807, 357449, 323030, 323083, 315311, 289597, 273771, 277848, 280455, 262690]
38736B62690k8955j1913J5662J0272l6935o6600j8594Q2286J52963J44775O7450
38725E73101m0962j15234q8420J2516N6698k0762j08002p7313K0812N1730R079
38714B73243j8058k2506n0642n2397M6982J60645J31175o227o0911J1880O2609
38703D75793J9045j5853J8633M1411J0547O18K8197k186r8985j26549l8118K5918
38691C38471k2768o9004l917Q5328P3011l654l8642l0443l2961l8515k1741m287
38679B30878J1048O2422J13569N2634j08309j82524o7521Q6306Q8794l5803j32471
38668A19023j33804o9084L2201J19461J07102J700n6488J1960R9546Q8569K8703
38657C48889J3721J0452m1397p5616r934Q2654P6293o829m9861l0820j5610k0594
$$ y = [262690, 233735, 221822, 237484, 247756, 210821, 144221, 125627, 207913, 360876, 505651, 573101, 532139, 416905, 328485, 341001, 397699, 376937, 268935, 191622, 212434, 264164, 273243, 255185, 232679, 182037, 129640, 176622, 337267, 468442, 462215, 401304, 413184, 475793, 494838, 478985, 497618, 539029, 549576, 550194, 578391, 576205, 477220, 350671, 312553, 338471, 315703, 246699, 242782, 328110, 401121, 397467, 358825, 328382, 295421, 256906, 235165, 230878, 241926, 304348, 417917, 470551, 362242, 179718, 112197, 198503, 287297, 251494, 119023, -14781, -83865, -51664, 67797, 174899, 176599, 120111, 132071, 231617, 320186, 348889, 362610, 373062, 331665, 256049, 246115, 328769, 405062, 398233, 348372, 317552, 301942, 281348]
38645B81348j6021j2180k3093n526N7258Q7358L6620j2216J4572M5803L183l8635
38633D18471R996O4034k7j06253q5760L4964O6298m3429j40684j10837j4353M6621
38621A39041N2715K9887J117p042O664k549m3288l9366M3716J01911M4938l9115
38609B88629k3376L4823o255j12208j20159j7984M0166K218j0846N9516J00821
38598B35345K7920p2214p8800r17O9742P9139L2787k8530m7535r038K4621O172
38586B38692o953M4894Q5475R525j10625r6928O0742J76779J35809K1460n3506
38575E05364q5311r8614p4651k0105J2494J7488L6224M4182k5677j23298j03268
38564H4828M6642J56953J20776L1046m796k9419j05637j60286r4493M2730J17812
$$ y = [281348, 265327, 253147, 230054, 224528, 281786, 369144, 405764, 393548, 408120, 453923, 457106, 418471, 428467, 492501, 492474, 386221, 300461, 335425, 401723, 358294, 217610, 106773, 92420, 139041, 191756, 221643, 222760, 215718, 222382, 219833, 176545, 137179, 180895, 282806, 327744, 288629, 265253, 300076, 293821, 181613, 61454, 43470, 83636, 85854, 75008, 134524, 235345, 263265, 191051, 112251, 111334, 181076, 260215, 293002, 264472, 216937, 207899, 232520, 238692, 231739, 276633, 362108, 371633, 261008, 164080, 224822, 401601, 537410, 558870, 505364, 420053, 321439, 246788, 226683, 239177, 256665, 292889, 337071, 311394, 188096, 84828, 131470, 288423, 409199, 440245, 435449, 406030, 300393, 140107, 45614, 88344, 206156]
38553B06156Q7641J0812n6556q4700m4939N0503J22569J09901M4512n594k1160
38542D19145j6334J750J2345j7158o3907n3479J9758N3134j9551j15329j11590
38531A08784j3721O5827N8731j398m8315m7716n148M3345N3623J3974m2263p0399
38519A15324m5239L0353J12745J29904N8192k6766l5431J5424L7649P551k0838
38508C78868k6605m5189p7930p9805m7175j8934J3953Q8464J53364J05107l3678
38497D10440j08628n2227K6274K7173k92J5926L5128j598m5029j7679N3333Q1660
38485D24481M4478j5987n8711n5414k352L4620k7798j48508j77886p0771L7667
38474a6181M0855R791L3063M8950k1753r3962l8309R7438J56846J11275O4787
$$ y = [206156, 293797, 304609, 248053, 163353, 118414, 168917, 291486, 401387, 445899, 440305, 419145, 402811, 404561, 416906, 399748, 335841, 282362, 302120, 355254, 335703, 220374, 108784, 95063, 160890, 219621, 218223, 169908, 122192, 117044, 160389, 214012, 227986, 185723, 115324, 70085, 100438, 213183, 343087, 401279, 374513, 339082, 354506, 392155, 399706, 378868, 352263, 307074, 229144, 149339, 102164, 83230, 97183, 185647, 339011, 444118, 410440, 301812, 249585, 275859, 303032, 302740, 318666, 353794, 352196, 307167, 289488, 342821, 424481, 468959, 452972, 394261, 338847, 336495, 371115, 343317, 194809, 16923, -53848, -16181, 24674, 34465, 67528, 116478, 94725, 763, -37546, 59892, 216738, 328013, 392800]
38463C92800N8972L3792l0514p9176r0997r4700p9881j0737P3975R0051L7400
38452C00985o421j6802l6316o3576m4567J7477N3064L9362K2602K2685J6826J8796
38440C24115O3357J07575O8153k9004o3850j2265J2932m5510r3345n0919J3385
38429B94624R283k4714n691M4628N0677J9030R332J8085L983j0995J6914M1423
38417D66579j5253j04457r1713K8836J03573M9735k3982q300K8093k3732j01925
38406C07454o6315N3897Q8406k098o6029j4670M1346l829p0246m3781K0998R354
38394B54487l7037N023J02942J01337j7169r5899n6031k885k3152m6096L105N8816
38382B47441L7613r833Q716O9467Q5675N0490J6359q882l8238l4786K3542N9495
$$ y = [392800, 451772, 485564, 455050, 375874, 284877, 190177, 110296, 99559, 173534, 263585, 300985, 294564, 277762, 241446, 177870, 133303, 150780, 203844, 243206, 265808, 288493, 305319, 324115, 387472, 495047, 563200, 534196, 470346, 458081, 471013, 425503, 332158, 281239, 294624, 303907, 279193, 273502, 318130, 368807, 387837, 397169, 415254, 419237, 408242, 425156, 466579, 451326, 346869, 255156, 283992, 387565, 437300, 413318, 405018, 433111, 409379, 307454, 241139, 295036, 383442, 381344, 315315, 300645, 341991, 338162, 267916, 224135, 245133, 254487, 217450, 222473, 325415, 426752, 409583, 313684, 257653, 254768, 231616, 185520, 188625, 247441, 285054, 275221, 283937, 353404, 439079, 489569, 505928, 497046, 458808, 424022, 447564, 507059]
38370E07059k726r2913q1051J7364O2880J7191k460O8728J19826L0185j39747
38359E04336k24045j66087o2387r067Q075M9088J07880J17392N2808k0763k7492
38348C29738K1137M6963J3462l2711l4549N906M7283N7317K2092n1465j16557
38337C08616j09138k1421P6122J10097P2178j324p2569j04352p2403r058J3409
38326A90157k1917m5798k410P3239J17782J23130J09644P3309J7073j8628j8642
38315E96939l3768r2097j26276p1438J4672K6990k6912m8351j0309J4919l944
38304B40425k829N5195R9070N3096m2092q1070l6356J3617j565n0962m7843L2323
38292B31009J15362J18567M6744k7661n3779l2490J6859O3239N6161j7648p9358
$$ y = [507059, 504333, 411420, 330369, 347733, 410613, 427804, 425344, 494072, 613898, 644083, 504336, 280291, 114204, 51817, 42750, 50825, 99913, 207793, 325185, 377993, 357230, 329738, 350875, 397838, 411300, 378589, 344040, 349946, 397229, 454546, 476638, 425173, 308616, 199478, 178057, 254179, 364276, 436454, 435130, 362561, 258209, 185806, 176748, 190157, 168240, 122442, 120032, 193271, 311053, 434183, 543827, 617136, 634209, 615581, 596939, 563171, 471074, 344798, 273360, 288032, 315022, 288110, 239759, 229450, 244369, 240425, 237596, 292791, 391861, 444957, 402865, 321795, 285439, 299056, 297491, 246529, 198686, 231009, 346371, 464938, 511682, 484021, 430242, 397752, 414611, 477850, 534011, 516363, 437005]
38281D37005m2121N2029P4740k213p3070p0964m8632m6057j7472L9744K8073p5592
38269B55470j26332k4716J00449Q1780k0268k5914O6905J00323L3869p841K8936
38258D62661M1718l4144j13573j05113l3798L5077Q1583R3735N0572j3627k5088
38247D40003J4434K3425k2876n5563l8002j6246j1130J9078O3512L4806p1740
38236C79701j18868j9733J15809J34742N5163O474J6789m310q7466j35594o6235
38225B76472O3161J22637O2971m1454r1319o7949k5971n406N754J8916J1922j7737
38213C11997k0777K8369P1537N0383M558K506J6804k4546r0641p8318J2186O4629
38201C48687L0631o454P330N676n6423r2699j9660Q9297R8195J610q4839r3100
$$ y = [437005, 394884, 446913, 521653, 519440, 446370, 375406, 326774, 280717, 263245, 302989, 331062, 255470, 129138, 104422, 204871, 286651, 266383, 240469, 307374, 407697, 441566, 433725, 462661, 504379, 470235, 356662, 251549, 217751, 252828, 334411, 428146, 478718, 465091, 440003, 454437, 477862, 454986, 399423, 361421, 345175, 334045, 353123, 416635, 451441, 379701, 260833, 241100, 356909, 491651, 546814, 553288, 570077, 565767, 478301, 342707, 276472, 339633, 462270, 525241, 483787, 392468, 324519, 298548, 293142, 298896, 317812, 329734, 311997, 291220, 319589, 391126, 441509, 446067, 448573, 465377, 440831, 350190, 271872, 284058, 348687, 379318, 372864, 380194, 385870, 329447, 236748, 217088, 306385, 404580, 406190, 321351, 228251]
38189B28251n7341j4680M2800R6823P4878m7477j63600j29871N1493K04814J78943
38178D65033L2951m7399j244M3406j5816r6683p4570J3825L6152k2840n2204K983
38166B83594P8849J08205Q3811J0454r2730j48255r6921j1506p525n2558j5663
38155A39755R4635J22650K8159l6842J2196M6510m3603j38922p3761R1256J51684
38144C93717M7714q5731j23578p2829k638M1692N1658M9017O0036O3461O064r7133
38132C31450j45823q7084P457N3495O2380O9731M4967l2974q3688k0608J05075
38121C04378J56310Q0604m8600j31407j18440k8230N2968L7373m4333n5962N0011
38110B54672J37834P6413o3956j18014n9795M17P082Q954L4085M3386J7287j0921
$$ y = [228251, 170910, 156230, 199030, 295853, 370731, 323254, 159654, 29783, 81276, 286090, 465033, 497984, 450585, 449341, 492747, 476931, 380248, 305678, 319503, 355655, 332815, 280611, 283594, 362443, 470648, 554459, 564913, 472183, 323928, 227007, 215501, 207976, 155418, 139755, 234390, 357040, 385199, 348357, 360553, 407063, 363460, 224538, 150777, 242033, 393717, 441431, 355700, 232122, 159293, 156655, 198347, 250005, 299022, 359058, 422519, 428583, 331450, 185627, 98543, 106000, 159495, 221875, 291606, 336573, 303599, 219911, 199303, 304378, 460688, 541292, 492692, 361285, 242845, 214615, 267583, 304956, 260623, 204661, 254672, 392506, 468919, 404963, 286949, 227154, 227571, 234653, 243607, 277692, 321078, 338365, 327444]
38098C27444j7400p188K1682O1759O3862j944p7035q6590n3188n0049o9702m0679
38086G0972M0750R9043R7602P4749O1413N1173N1061P2819P1872j2953j46686
38075E31815k10170j45108j8322P2296R2637O4653K6006R200J3921J558m3938
38064C94548p5139n2108j5847k2279m3874k2054J9202R861m2845o7637m2375M817
38052D4270P4119J60254J79945P3983m8882l6116N6377L2558j09830j42650K2429
38041C06457J61808Q0231q2340q1624N0611R2686L085m9347K863K9982m3622j06053
38029C64737n6017L4005N1513J1355j3129k1395m0789l4517L1068Q6979M5333
38018D59143n4822r7194o0545k8377l5161k4180K1907K8919l5679p7365m493J20115
$$ y = [327444, 310044, 302856, 324538, 386297, 450159, 448215, 371180, 284590, 231402, 181353, 111651, 70972, 111722, 210765, 308367, 383116, 444529, 495702, 546763, 619582, 691454, 678501, 531815, 321645, 176537, 158215, 230511, 323148, 387801, 413807, 423007, 436928, 438486, 394548, 319409, 267301, 251454, 229175, 185301, 163247, 182449, 192310, 149465, 81828, 39453, 44270, 118389, 278643, 458588, 532571, 483689, 447573, 503950, 536508, 426678, 284028, 306457, 468265, 548496, 466156, 384532, 435143, 527829, 530914, 481567, 484430, 514412, 470790, 364737, 308720, 342725, 394238, 405593, 392464, 371069, 330280, 295763, 326831, 413810, 459143, 404321, 307127, 246582, 218205, 183044, 158864, 180771, 209690, 174011, 96646, 92153, 212268]
38006B12268J45889K7049j20901j50386k6204J45339K04864Q5782j02550j75768
37996B45382q2430M4589P3928L0638M632k967l6229n8096j764Q7141R5957J9967
37984D20748l9094m4815n8141q7889n7288M1149R6546M6679k5005k6102J6640
37973B83428L4039K3164J0427q593k9745k0467J0561R541j7286L25N4023L8991
37961C88408o0748j11939m2778L4882K6960K6863J28603K08453R4954j30274k15873
37950C47511q9989P0255J10860N9971m48n2031q4483o0604O367M1347J8063k993
37938C63826J9619M4578K5035j9043m2288l6461k0876o204R796K9812M7550M3867
37926D59211N909m4655o9786o2715l9001P654P4950R4686P872j06811j08408q920
$$ y = [212268, 358157, 385206, 264305, 113919, 87715, 233054, 437918, 523700, 421150, 245382, 162952, 207541, 281469, 312107, 316739, 313772, 277543, 219447, 217683, 304824, 400781, 420748, 381654, 336839, 278698, 190809, 133521, 174670, 271216, 317895, 292890, 266788, 283428, 317467, 340631, 351058, 342465, 312720, 292253, 302814, 312355, 295069, 295394, 349417, 388408, 327660, 215721, 172943, 207825, 234785, 261648, 390251, 598704, 693658, 563384, 347511, 257522, 327777, 438637, 498608, 498160, 446129, 361646, 301042, 307409, 348756, 366819, 363826, 383445, 428023, 453058, 434015, 391727, 355266, 334390, 328186, 337982, 367794, 415344, 459211, 465120, 420465, 350679, 287964, 248963, 256617, 331567, 426253, 434125, 327314, 218906, 209986]
37914B09986M0590N213J7083J09197J19777j7301j11736k3170Q2274P523j28954
37903C10482r2399O7874J18175M1609K2640Q2546N4345p7489j23622k1196O2974
37892D45939K8231j7320Q272K1296l3116n9058P903P6026N8387L549k2103l6616
37880D81390m9992j0351Q3425J40398J06614K2156p4052j65588j81458o0558R6550
37869C88534J16937R850n4868k8299k4055o0658j4217J14839J45865K1237q0108
37858E35057m1032K1454L310r419M4653M6903p0901j58056r1266R313J09l9730
37846B50395J6210R6275P4736P143R893M3745K2089l274K9881K5053r2613j70205
37834C09328m9347J30742J23009l1189q0809K2071Q2160J5533m2906j3757P080
$$ y = [209986, 250576, 255789, 272872, 382069, 501846, 484545, 372809, 349639, 431913, 439436, 310482, 218083, 285957, 404132, 445741, 468381, 550927, 605272, 527783, 404161, 382965, 445939, 474170, 456850, 465122, 486418, 453302, 394244, 402147, 478173, 536560, 540109, 518006, 481390, 431398, 421047, 504472, 644870, 751484, 773640, 699588, 534000, 352542, 291984, 388534, 505471, 515321, 460453, 432154, 408099, 347441, 333224, 448063, 593928, 615165, 535057, 494025, 515479, 518789, 509370, 554023, 600926, 530025, 371969, 280703, 290016, 290125, 250395, 266605, 362880, 437616, 444759, 454652, 498397, 520486, 517212, 547093, 572146, 479533, 309328, 259981, 390723, 513732, 482543, 401734, 423805, 505965, 521498, 478592, 464835, 471915]
37823D71915l5690m8981J7077O0302M694o4464m1777L5798N8683m03p3899r3401
37811B89854m9573J1849L5527J8138J2002M2767O0392J3254o8875j12381q4696
37800A68258q429O4249P2599P558m1557O520P3661J7144j12347r9162R1008K10832
37788D50334R6987p7528q5796J3949L1759k8193l6687q475m7650j08425o0414
37777A39861N8880R1890K8624N577N6655P5056K0597k4638j3994J1061K4170L4800
37765E08539K8229J697L674K5529l8486j82928j93449L9184K62717J89964m6735
37754E97935q8578Q5589J49368l0479k10447j86425o0288J1673M5819Q3654O6804
37743D64625j2112m1517J6961N5460K1376j08K4837J0981n3313n7742J0362J8079
$$ y = [471915, 436225, 387244, 404321, 464623, 469317, 404853, 363076, 398874, 457557, 457154, 383255, 289854, 240281, 252130, 287657, 305795, 317797, 360564, 420956, 434210, 365335, 252954, 168258, 159829, 224078, 296677, 304235, 262678, 269198, 342859, 360003, 247656, 148494, 239502, 450334, 547321, 469793, 383997, 397946, 429705, 401512, 364825, 356350, 308700, 200275, 139861, 198741, 290631, 319255, 324832, 381487, 456543, 477140, 452502, 438508, 449569, 473739, 508539, 536768, 538465, 542139, 567668, 529182, 346254, 152805, 191989, 454706, 644670, 597935, 509357, 594946, 744314, 713835, 503388, 316963, 256675, 268348, 314167, 397821, 464625, 452513, 410996, 427957, 483417, 504793, 504685, 529522, 540503, 487190, 429448, 439810, 457889]
37731D57889o0491p6442J2915M1160o3799j20948l456J24993P5380o1927q7821
37720B37453q674L3566J8122K4889N2957M7622L1557M5164L3966m8551j04664
37709C63407k0842J28783J64166M5350r8257j52576j16733m5379P767J2502l494
37698B84694J8439O4505M8731l6276p5435q462O5112N0918J2603M3438R1884N3752
37686F13903m2432q5588o1939m7568n7711l3512L3265P2609M0920k0970m2664
37675C68313L57N7754M3993n2932j13787k5127J28562J37005l9647j89970j36391
37664A78130L6072J33485J12600O7828N4553N0769L2772j3464j02549j92645j85764
37653A71787o0125P2132J11281Q9282P0096L3242m5648r3031l3668P6548J20388
$$ y = [457889, 397398, 320956, 333871, 375031, 311232, 190284, 186828, 311821, 387201, 325274, 237453, 228779, 262345, 280467, 305356, 358313, 405935, 437492, 482656, 516622, 468071, 363407, 342565, 471348, 635514, 680864, 582607, 430031, 313298, 267919, 275686, 288188, 284694, 303133, 367638, 416369, 380093, 304658, 296196, 361308, 412226, 424829, 468267, 560151, 613903, 571471, 485883, 423944, 376376, 318665, 285153, 318418, 391027, 431947, 410977, 368313, 368670, 426424, 470417, 417485, 303698, 278571, 407133, 544138, 504491, 314521, 178130, 214202, 347687, 460287, 528115, 582668, 633437, 666209, 652745, 550196, 357551, 171787, 111662, 183794, 295075, 384357, 454453, 487695, 442047, 349016, 315348, 391896, 512284]
37642E12284P2916J371l6766k6533J5809L2932k3491r4484o5745M2716P2079l0024
37630D73064j14603p1628m27j5038m0934L1826J30718J20397L4178J050K6569
37619E75172K6233J391K147j4503j02136j61488n9688J23834J72486M4541p9756
37608E28233p2384m26L4436L7917N1637O2698M1202r180o5819r7722p2261j0054
37596D28277L427o6881j28512q3515L1119J17813J60184J77852J22678l1549j61621
37585E69272j26738J1211O9499J8455p838L5501L9046m0183q2313o186Q5227O1685
37573F26638l8906p6421q367O8305N4943l3680j01962r3621m8719k3475P312R2604
37561D24651J69811J13287n2926j34869l6348R4159Q9639j126m1062l4006n5970
$$ y = [512284, 585200, 586571, 549805, 523272, 539081, 572013, 548522, 454038, 388293, 431009, 503088, 473064, 358461, 286833, 286406, 271368, 230434, 262260, 392978, 513375, 547553, 548603, 575172, 601405, 602796, 604943, 590440, 488304, 326816, 267128, 390962, 563448, 607989, 528233, 455849, 455423, 489859, 527776, 579413, 642111, 683313, 674133, 608314, 510592, 438331, 428277, 431704, 364823, 236311, 152796, 183915, 301728, 461912, 639764, 762442, 730893, 569272, 442534, 453745, 523244, 541699, 533861, 569362, 608408, 568225, 485912, 479726, 564953, 626638, 587732, 511311, 502944, 571249, 626192, 592512, 490550, 396929, 348210, 324735, 332047, 424651, 594462, 707749, 654823, 519954, 483606, 577765, 667404, 666278, 625216, 591210, 535240]
37550E35240o7240J1823J12147R9099m813o2981m5899l1268l0145J768K2912l1177
37538E09466q2930j2360J12828J20257J8979k5455J4027L303p4794q2834p190
37527D93297n268j02518j10019M5228J64153R7744q502K4942J08588N8112p9010
37516F86747j06130k476N7339j4021j00041o8939M9971J20876O7790m4373q3515
37505E63228p243P7504N8539j6788j9656M5464M7467m3517r9731n2201L835l737
37493E53164M133Q7789J40579N3397q7530j21242m7052J2636K0515L8144O7274
37482G21807L5350n5670j00170m0016N3374Q3409M1285j9422o1166p3167m2860
37471E42754L1191J01315R0672j6606j24829j19093j6421M0296k3466r8011m3191
$$ y = [535240, 468000, 479823, 591970, 691069, 686256, 623275, 577376, 546108, 515963, 517731, 540643, 509466, 426536, 414176, 527004, 647261, 666240, 640785, 654812, 658115, 583321, 500487, 493297, 488029, 385511, 275492, 320720, 484873, 582617, 574115, 599057, 707645, 765757, 686747, 580617, 578141, 635480, 621459, 521418, 452479, 502450, 623326, 691116, 646743, 563228, 555985, 633489, 692028, 675240, 655584, 701048, 748515, 704998, 605267, 553066, 556901, 553164, 557297, 645086, 785665, 839062, 751532, 630290, 583238, 595874, 616389, 654533, 721807, 757157, 701487, 601317, 561301, 614675, 698084, 739369, 719947, 658781, 585614, 542754, 573945, 675260, 765932, 749326, 624497, 505404, 488983, 529279, 505813, 407802, 364611]
37460C64611J00528J60428O4077q5010j57673j22725j9497R0488J32238P1724
37450E99189k3343n7866m0619m8847p7555m7717L3013N8980O754j4015N3636J09198
37438E50808N8125k9129k3219O9249J16557L9310r3606j44687n8468O6085P4337
37427F25362m9156j39857p0770O2001Q4117O798j5615M4384N4910k6546p4002
37416E01626j9991K6420k0498p0642k0468O6494O8330l922m4124j2977L8428N8893
37404E67569L7047p113k5271J4209O1844L7282m3922q4250n5511k6635k5214P60
37392D50795N3864N7426q4k6948J2160L3824r111m7672l5506k8512n6979n9160
37380C44097j5486l332l8733j8135Q7631J40135N0516n9814m8661L0770M6039
$$ y = [364611, 465139, 625567, 689644, 604634, 446961, 324236, 304739, 395227, 527465, 599189, 575846, 517980, 477361, 428514, 350959, 303242, 336255, 395235, 401989, 387974, 441610, 550808, 608933, 579804, 556585, 625834, 742391, 781701, 688095, 543408, 484940, 551025, 625362, 576206, 436349, 365579, 427580, 511697, 518495, 502880, 547264, 602174, 575628, 501626, 481635, 508055, 487557, 416915, 396447, 462941, 531271, 527349, 483225, 470248, 508676, 567569, 604616, 597503, 572232, 586441, 648285, 685567, 641645, 557395, 501884, 475249, 450035, 450795, 504659, 562085, 562001, 535053, 547213, 581037, 571926, 524254, 488748, 460236, 403257, 344097, 328611, 325279, 286546, 268411, 356042, 496177, 546693, 486879, 438218, 468988, 515027]
37369E15027J391j0527J9900L6372L2735L3732K6389M349N356L1377K6827l798
37357G19130J5815O7166K4486j06992j37080Q4R3895j1792j44007q4279N7769
37346D94195L2632j22093j51660j1246Q6650M3005J127O2011J22437P8072q849
37335F26281l5565p808J3857Q026k1051o3532q0045l4312M0038P4704N6854J5705
37323E93152m3381j07326j08381j3274Q7148Q9571L3555K6345O1536M9074j1627
37312F56392l6090j4269j9732n9740n3412K4008R2731Q6903K8417l0726o0224
37301F14258m3681Q432M1596J3210m8587q7188q1812l0905O1582J34029R0713
37290F71647n3873j51408j17996m5687k8544j2286O2437J09369M7905k3056J5710
$$ y = [515027, 516418, 505891, 525791, 562163, 594898, 628630, 655019, 659368, 664724, 696101, 722928, 719130, 734945, 802111, 826597, 719605, 582525, 582609, 676504, 664712, 520705, 436426, 494195, 526827, 404734, 253074, 241828, 328478, 371483, 372610, 434621, 557058, 635130, 626281, 590716, 582908, 596765, 604791, 583740, 520208, 440163, 405851, 445889, 520593, 577447, 593152, 549771, 442445, 334064, 320790, 407938, 497509, 531064, 557409, 618945, 668019, 656392, 620302, 606033, 586301, 526561, 473149, 497157, 589888, 676791, 705208, 674482, 614258, 570577, 579009, 620605, 633815, 585228, 498040, 416228, 385323, 446905, 580934, 671647, 617774, 466366, 348370, 302683, 274139, 261853, 324290, 433659, 481564, 458508, 474218]
37279D74218Q3030L4472p6276q7470o311K5536r386k632N4453N8310p278n5282
37267D85384o4126p8091o6574K6215J21790R7616P572M538P2028N7235m6911r1554
37255E25122m4371k8833p1897n6375L6566P6275K6866J0827O5964O8768k1681
37244E87231o8576k374N1912M225l9966K4670J17305J12752L1667k9781m4722
37233G44343l2619K441L4367J9186j2598J6052P5385M6839o7554j17106l9901
37222F68835L9385K0950k5902j5545J3763Q586P038L8350M2543j7121p6559q4790
37210F19533q1443r2854p0833k52N3152O0669P0862Q3035K3237r6169j42846o0042
37198C66049M5843P8100O6277N0859P637m6910l4759L1024L7706j8811l000J05723
$$ y = [474218, 557248, 591720, 515444, 427974, 421663, 447199, 437813, 435181, 489634, 547944, 540666, 485384, 421258, 343167, 276593, 302808, 424598, 522214, 529786, 534324, 606352, 663587, 616676, 525122, 480751, 451918, 380021, 323646, 360212, 436487, 463353, 474180, 540144, 608912, 587231, 518655, 516281, 568193, 572418, 532452, 557122, 674427, 787179, 818846, 789065, 744343, 711724, 714165, 748532, 767718, 755120, 771172, 846557, 893396, 825842, 708736, 668835, 708220, 729170, 703268, 687723, 701486, 710072, 717110, 755460, 798003, 780882, 704323, 619533, 538090, 445236, 374403, 374151, 427303, 487972, 558834, 641869, 665106, 568937, 426091, 366049, 411892, 489992, 556269, 607128, 614765, 567855, 533096, 564120, 601826, 583015, 580015, 685738]
37186F85738J34281L143j12534n2981P8513R7977J0813o3090r1946r9061n5899
37175E34954L7241Q1958L3387l948L5253M0248o8358j47622m0697J48597J93994
37164H45007O7245p3126j32659j29577o3471O7569J62910J16931m171m3368J6212
37153H29502N2426R581m7647p1195q0120p7060l6523K0708M1145K2867M405j1871
37141F56218m6028p3231m6508K9069R9865J18041O2832m1264j04426m7503P4014
37130F81079J17255N1460q818l835j0746o5040p0396J5386P2611K1564l0525J1478
37118G81473M5577l8575j32399p6552N5372O3046n9747j26429m9020O4282R7033
37107F24061N0431k1204p3720p2687k3559J7055K5810M9633R6355Q7810N499l8842
$$ y = [685738, 820019, 823162, 710628, 657647, 736160, 834137, 844950, 781860, 689914, 590853, 534954, 572195, 654153, 687540, 683592, 718845, 759093, 690735, 543113, 502416, 651013, 845007, 912252, 839126, 706467, 576890, 513419, 580988, 743898, 860829, 856658, 813290, 829502, 881928, 891509, 843862, 772667, 692547, 615487, 578964, 599672, 640817, 663684, 668089, 656218, 610190, 536959, 490451, 519520, 619385, 737426, 800258, 758994, 654568, 607065, 681079, 798334, 849794, 840976, 837141, 826395, 761355, 690959, 706345, 778956, 800520, 769995, 781473, 827050, 788475, 656076, 579524, 634896, 697942, 638195, 511766, 462746, 527028, 624061, 674492, 653288, 579568, 506881, 483322, 500377, 526187, 575820, 672175, 759985, 765484, 726642]
37095G26642J3006M5820k9781r8924l2551P5447N8707m3416p0342j4337R434m077
37083F35628K8363P6564M3662k3163L672Q2965N2916p6567j17660j4763O8938
37072G60555K7819l4197n340O1525O8824K1674l0699q1849j18892q6926K2655
37061F05149J20202J12273L752j16522j51755o7659O2476J08241L1838n7767o0638
37050E89590k0755j6072n199Q1338J70375J30228j3328j07218r8006p1926p5503
37039E63524n3357J9163Q1120R1778P7024M8812j7895j05952j42623q8316K0322
37028D93600J15308J39864P5592k3652o7584m0695j2715o838L2619R2317N9985
37017H57801o8691j21322j6099P6198N589r5984l9901R0179Q7760k1511m9665
$$ y = [726642, 739648, 785468, 755687, 656763, 624212, 699659, 758366, 714950, 644608, 630271, 639705, 635628, 663991, 740555, 784217, 761054, 764726, 847691, 900607, 824040, 706380, 691617, 760555, 788374, 754177, 748837, 810362, 879186, 900860, 870161, 788312, 669420, 582494, 605149, 725351, 837624, 841376, 724854, 573099, 505440, 567916, 676157, 707995, 650228, 589590, 568835, 552763, 547564, 628902, 799277, 929505, 916177, 808959, 710953, 639027, 563524, 510167, 529330, 610450, 702228, 779252, 828064, 810169, 704217, 561594, 473278, 493600, 608908, 748772, 824364, 800712, 733128, 692433, 679718, 672880, 705499, 797816, 857801, 789110, 667788, 651689, 727887, 733476, 637492, 597591, 687770, 775530, 754019, 704354]
37006G04354J5752K5753l4136m2211j616k7335q9230m2271Q7277J17098K3304
36995G36739k8171J2285J2971n5733m8425P0485J28140K9954q3067p2016M477
36984G07639L7886L6175M2842M1383K2050J1276j1997q8994j50426q1195O5008
36973F31647J02704m644r4182o8041p113K1614O3271J21840J09118J4257n8349
36962H32122p1346q8060r1436J3368J70810J87370M2774n1304Q535O4730o65o0420
36950I56478J0052J01022O4119l8903o2636j1635J6546N741l286j2166k6528j4251
36938I84553J4959k568n4901m5289L0634N2477j8415o9636m3239k4579m3307J1299
36926G91988J60710K20825O5874j52845k05739p5517Q1071J43192Q5627n1715
$$ y = [704354, 720106, 745859, 711723, 669512, 667896, 640561, 551331, 509060, 596337, 713435, 736739, 708568, 720853, 733824, 678091, 629666, 700151, 828291, 858245, 775178, 703162, 707639, 745525, 781700, 824542, 865925, 887975, 899251, 887254, 798260, 647834, 566639, 631647, 734351, 729707, 635525, 567484, 560371, 581985, 645256, 767096, 876214, 890471, 832122, 760776, 672716, 581280, 594648, 765458, 952828, 995602, 944298, 952833, 1017563, 1016898, 956478, 966530, 1067552, 1131671, 1092768, 1030132, 1018497, 1035043, 1040784, 1037498, 1025332, 998804, 984553, 999512, 996944, 942043, 896754, 927388, 979865, 961450, 891814, 848575, 823996, 780689, 791988, 952698, 1173523, 1239397, 1086552, 880813, 805296, 886367, 1029559, 1115186, 1063471]
36916A063471j53537j06983K9195O3634n4392j57458j23360l4567J0869N2915
36906E89787J23426J36696N4518j3828k278m928p7397j04959j0814Q3162N9432
36895H32817J699K7462P8884M6448l6040p7957q8683j06975r6959l8535Q095L0599
36883E80855R9920J81772J13503j03951k12596o6204J22085J03416l6729o6163
36873G15908J1252K2410n1122p6829k2690K3912L5825N2532N7715J5079k8375
36862G55617j4790J5340N335j2949l933q420l5661r043P3197Q0537k5420q3549
36850G36261J0161J21834J10751M9121L8239Q240r4953j23420L3736K00155J53782
36839A243907k9056j19795r0805p1534p7478l9173J900l0346o7274j4552N2461
$$ y = [1063471, 909934, 802951, 832146, 895780, 841388, 683930, 560570, 526003, 536872, 589787, 713213, 849909, 904427, 890599, 888321, 883393, 805996, 701037, 690223, 773385, 832817, 834516, 861978, 940862, 987310, 951270, 873313, 784630, 677655, 580696, 542161, 550256, 580855, 680775, 862547, 976050, 872099, 659503, 593299, 715384, 818800, 782071, 715908, 727160, 749570, 698448, 621619, 598929, 622841, 658666, 711198, 768913, 783992, 755617, 740827, 756167, 761502, 748553, 744620, 736200, 700539, 691496, 764693, 845230, 819810, 736261, 746422, 868256, 979007, 1028128, 1066367, 1074607, 979654, 856234, 889970, 1090125, 1243907, 1214851, 1095056, 1004251, 932717, 855239, 816066, 817966, 787620, 720346, 705794, 758255]
36828G58255K5998k0497K4649Q4689M2543j9194K6823R0650J9752j07667j12599
36817H13402k2433K0989L9265J19375J59011K0423j59662j34891M8283J27517
36807A031279M3430l0087k2828k2752l1045L0507R4300K4127j10718j25963m5858
36796H34392l8128p5761P302J54289J32864m7348j15537J7310J28086O2466o0458
36785I99477j04969r9705p9319k967R0191Q0451j2235l1151M9416Q7926M1142
36774A018257K4276O5850M9677m4053p7890m18O8271N1466J1952q746m6079p6172
36762A036391k3547P2402R2589M3078K6892L1555l3842j15901p6334M3157O8243
36751A164683r433l8342N506O359l2463K213P7791N3515m4716p9484r4237k23193
$$ y = [758255, 784253, 763756, 788405, 873094, 915637, 896443, 923266, 1013916, 1033668, 926001, 813402, 790969, 811958, 851223, 970598, 1129609, 1150032, 990370, 855479, 903762, 1031279, 1074709, 1044622, 1021794, 999042, 967997, 998504, 1092804, 1116931, 1006213, 880250, 834392, 796264, 720503, 727805, 882094, 1014958, 967610, 852073, 869383, 997469, 1059935, 999477, 894508, 794803, 715484, 712517, 802708, 883159, 870924, 839773, 889189, 977115, 1018257, 1042533, 1108383, 1158060, 1114007, 1036117, 1035699, 1103970, 1155436, 1167388, 1158642, 1112563, 1036391, 1012844, 1085246, 1177835, 1220913, 1247805, 1279360, 1245518, 1129617, 1053283, 1096440, 1164683, 1155250, 1116908, 1122414, 1128773, 1096310, 1098523, 1176314, 1229829, 1185113, 1105629, 1011392, 788199]
36739G88199l48786k25196O5819J85781Q4374M5245J39386J01530j29281k21348
36729D85723m139K21041J73379J3896m71N3981j2952j30621j16504Q24O9505O4298
36717H17960M1902J820m4078k5572L5841J6131p3623o3670O5261J12683J1007
36706H95662m2081N5777J21071K6866o4557j1595N3097j368n0511K6281R1692
36695A100334N691j01584o5560K0557J04o1515l2326L1006J9859j0475J8342L0637
36683I55070l0175m4139N8641J19970K5418o0892K0478J20734L8707j15523j14249
36672I74040o208j422q3463n4725R9016J80833R6951l8435j03732r1631m5424
36661I25800j0271j5905k1817M1746J21304P2800q4675j40692j9086Q5293K5508
$$ y = [788199, 439413, 214217, 280036, 465817, 550191, 595436, 734822, 836352, 707071, 485723, 481584, 702625, 876004, 889900, 889429, 943410, 930458, 799837, 683333, 684157, 753662, 817960, 859862, 861682, 817604, 792032, 827873, 844004, 770381, 706711, 771972, 884655, 895662, 853581, 909358, 1030429, 1057295, 992738, 981143, 1034240, 1032872, 982361, 1008642, 1100334, 1106025, 1004441, 938881, 959438, 959542, 898027, 865701, 896707, 916566, 906091, 924433, 955070, 924895, 880756, 939397, 1059367, 1084785, 1023893, 1044371, 1165105, 1203812, 1088289, 974040, 967832, 966410, 882947, 828222, 927238, 1108071, 1205022, 1166587, 1062855, 971224, 925800, 915529, 899624, 877807, 919553, 1040857, 1113657, 1028982, 888290, 869204, 954497, 980005]
36650I80005p1877n8994j0075k6766k8615N6753J12916N6179J9727R7500J31790
36639A258543j940j27333n4703P9925N8154l5256J2163J42720J33132k3122j44621
36628A297662j74039j79590j43810k4910O4394M624r2233m4233R3949J34114O9173
36617A005101L6295N6085N3174N1841J14066J63061R1740l4801q7815q4602r6254
36606A267891p4133K6519R0454K4356n3990k4169J0359o2877j16318j5547R3098
36595A165643K8874p6175q095J23253P3399q4669q5339N4806Q1063m0393r1695
36584A140672p035N3820L2255L5444O9454K3979o5812m1056Q3188J21621L1039
36573A477569m3913l9040l0797l5135M660M2556j2907q9157m3995O2728N0110
$$ y = [980005, 908128, 849134, 839059, 812293, 783678, 840431, 953347, 1009526, 1029253, 1126753, 1258543, 1256603, 1129270, 1074567, 1154492, 1212646, 1177390, 1189553, 1332273, 1465405, 1442283, 1297662, 1123623, 944033, 800223, 775313, 839707, 844331, 752098, 707865, 801814, 935928, 1005101, 1041396, 1097481, 1150655, 1202496, 1316562, 1479623, 1571363, 1536562, 1448747, 1364145, 1267891, 1193758, 1220277, 1310731, 1335087, 1281097, 1256928, 1267287, 1204410, 1088092, 1072545, 1165643, 1194517, 1118342, 1110247, 1233500, 1306899, 1222230, 1136891, 1191697, 1272760, 1232367, 1140672, 1133637, 1187457, 1219712, 1255156, 1324610, 1348589, 1282777, 1241721, 1324909, 1446530, 1477569, 1433656, 1394616, 1363819, 1328684, 1333344, 1375900, 1362993, 1273836, 1229841, 1292569, 1342679]
36562A342679o1247p8914K1771O1222k7540j00913n7961K7771O5025N2835J3447
36551A258175l4287m3671l384J8043m262J3412R3789J16109L5430p137M8570L6613
36539A527400j14512j80517j6346J40620N2221j03559n5581P5619K1975j28706
36529A218614j12957J4755K2728k9259O9489K14467J44070n2498p3880M5456K3708
36518A484693j14029q5820R2205J20273l1085q7696M343J6211q6656q9729K4044
36507A246754M3576l4585n800R9907N4139q7667m1855J53753J67606k1308q6233
36496A488287L6152N6650p4566o6185J13902J20572j30332k72574j23448L8294
36486A186752K6237L8598J75703J93205j2078j63246r9859l9724j07964q9187
$$ y = [1342679, 1281432, 1202518, 1224289, 1285511, 1257971, 1157058, 1099097, 1126868, 1191893, 1244728, 1258175, 1223888, 1180217, 1176833, 1194876, 1190614, 1204026, 1297815, 1413924, 1449354, 1442217, 1490787, 1527400, 1412888, 1232371, 1216025, 1356645, 1408866, 1305307, 1249726, 1325345, 1347320, 1218614, 1105657, 1120412, 1143140, 1113881, 1183370, 1397837, 1541907, 1489409, 1415529, 1460985, 1484693, 1370664, 1284844, 1377049, 1497322, 1466237, 1378541, 1382884, 1399095, 1312439, 1222710, 1246754, 1290330, 1255745, 1249945, 1349852, 1403991, 1316324, 1274469, 1428222, 1595828, 1574520, 1488287, 1524439, 1581089, 1506523, 1440338, 1554240, 1674812, 1544480, 1271906, 1148458, 1186752, 1212989, 1251587, 1427290, 1620495, 1608417, 1445171, 1345312, 1305588, 1197624, 1108437]
36476A108437R9748J77494J3389r9279K8144J43242M4167n2729M0340J12840k0812
36465A594981j43312l8059J09221O6120m1405k0298K7981l4789q4596n570N2439
36454A482713k3963o9530K6010P5704m2076j25501k7805O3924O520j7420J11505
36443A460081J66868K485j26693j3438J13978J9186j00694L835J61704J05271
36433A792583m7239n0694J2029n2662j39321n6848Q4448Q2393J4856M4990Q7082
36422A771617J3312m6872M1409J13780o69j31963o5171O5341L4007o7233l9428
36411A688130L7478r464r2372m4175N3231M8472J4396N7481O9357l3447q2243
36400A706844L0072R3691m3981j56139l0246J32947Q4086k8260K6212J06581q176
$$ y = [1108437, 1208185, 1385679, 1399068, 1299789, 1327933, 1471175, 1515342, 1462613, 1502953, 1615793, 1594981, 1451669, 1413610, 1522831, 1588951, 1547546, 1527248, 1555229, 1520440, 1435844, 1430274, 1482713, 1458750, 1389220, 1415230, 1490934, 1448858, 1323357, 1295552, 1359476, 1365996, 1348576, 1460081, 1626949, 1629434, 1502741, 1489303, 1603281, 1622467, 1521773, 1525608, 1687312, 1792583, 1745344, 1694650, 1706679, 1654017, 1514696, 1457848, 1542296, 1624689, 1639545, 1684535, 1771617, 1784929, 1738057, 1779466, 1893246, 1892577, 1760614, 1695443, 1760784, 1794791, 1727558, 1688130, 1725608, 1716144, 1623772, 1579597, 1632828, 1681300, 1695696, 1753177, 1822534, 1789087, 1706844, 1736916, 1830607, 1786626, 1630487, 1600241, 1733188, 1817274, 1789014, 1815226, 1921807, 1913631]
36389A913631j60895r2403P8569Q7275n340L404M3472l5810j01108J4748J42591
36378A888134P8349n982J08247K18267L8355k45972k60995n9730M2439L3678J02216
36367A937006J67850L8095j35960p2971J17820J25926P51K1871J47329J03329
36357B451046q1639j30552k5314N207o9913q4467l7812n0871o4276L1593J03059
36346B046061j360j02581K2648J96320J18867r2614j05923N8376J23777O0270
36336B323841L4378K1325q4162j43610l557J44879P2298n4799L85O3339r9751
36325B274566k45791m8256K50423K06752n0655p6120Q6169M9210j41834j09691
36315B194773J00204R3758j12085j16940J06814J75624J0271o9182K5466N1261
$$ y = [1913631, 1752736, 1660333, 1738902, 1826177, 1820837, 1824241, 1867713, 1831903, 1730795, 1745543, 1888134, 1966483, 1960501, 2068748, 2287015, 2325370, 2079398, 1818403, 1758673, 1801112, 1834790, 1937006, 2104856, 2142951, 2006991, 1934020, 2051840, 2177766, 2178517, 2200388, 2347717, 2451046, 2369407, 2238855, 2213541, 2218748, 2148835, 2064368, 2026556, 1975685, 1911409, 1943002, 2046061, 2044701, 1942120, 1964768, 2161088, 2279955, 2187341, 2081418, 2139794, 2263571, 2323841, 2358219, 2379544, 2295382, 2151772, 2148215, 2293094, 2365392, 2310593, 2310978, 2374317, 2274566, 2028775, 1980519, 2230942, 2437694, 2387039, 2310919, 2397088, 2446298, 2304464, 2194773, 2294977, 2388735, 2276650, 2159710, 2266524, 2442148, 2452419, 2383237, 2408703, 2459964]
36305B459964k6023N425J05768L3925j28805q4019J03939J15381j5414QR8624
36294B668773l59j69296o3530J67241Q5924k01473j90816J00093J60122p4667
36284B482012j32133R6794J87777O556q9211J3973J9699r2441Q614K68190K21086
36273B990916j41844k71081l894J72817J3481j13921Q697P6904o5306j06160Q6934
36262B647543J80409J9313q9026M890L0902j01285q8170J42773K37502P5646j3479
36251C047018R2216R0938r3921j22746Q2386J47058m4655j29803K2498P3412q8073
36240C076328j16969Q3472J43029m5722r6836J17923K07116N767j32926m0644
36230C200538n629j08477l6622K06095J87298j14743j71898J36066K67494Q242
$$ y = [2459964, 2433941, 2439366, 2545134, 2579059, 2450254, 2366235, 2470174, 2585555, 2570141, 2570149, 2668773, 2668414, 2499118, 2435588, 2602829, 2688753, 2487280, 2296464, 2396557, 2556679, 2482012, 2349879, 2446673, 2634450, 2641006, 2551795, 2565768, 2585467, 2493026, 2501640, 2769830, 2990916, 2849072, 2577991, 2574097, 2746914, 2760395, 2646474, 2655171, 2732075, 2666769, 2560609, 2647543, 2827952, 2847265, 2758239, 2763129, 2794031, 2692746, 2604576, 2747349, 2984851, 3060497, 3047018, 3139234, 3230172, 3136251, 3013505, 3095891, 3242949, 3198294, 3068491, 3090989, 3164401, 3076328, 2959359, 3042831, 3185860, 3140138, 3043302, 3161225, 3368341, 3374108, 3241182, 3200538, 3194909, 3086432, 3049810, 3255905, 3443203, 3328460, 3156562, 3292628, 3560122, 3568364]
36220C568364j52026M3452J80158K8922k7808J91698K81085M8836j35831j41125
36210C885725l21969o39646n11709P3267L23421k4585k12827J76197M74748J81934
36200C404556j38135M2292K53930k935k89762r5937J98790R7472q7314O6897K36496
36189C686350L4759j87381l9116J34861l3565j80331N1342K59007N6655j47043
36179C635538N8074K69595O2310j68284J9446K50176Q1666j33098K3886J98891
36169D298200P730j53909R7725L11811N0306k32145n0367J76230l0172k49959
36159D225450j2022K39008J4387k19800N3943L47663R0791k33507J56L43110J40172
36148D989351j98347r616L19257J17287k45188p5350L01563K01320r8807K4332
$$ y = [3568364, 3416338, 3459790, 3639948, 3668870, 3641062, 3832760, 4113845, 4162681, 4026850, 3885725, 3563756, 2924110, 2412401, 2485668, 2809089, 2784504, 2571677, 2747874, 3222622, 3404556, 3266421, 3308713, 3562643, 3559708, 3269946, 3174009, 3372799, 3470271, 3382957, 3449854, 3686350, 3721109, 3533728, 3494612, 3629473, 3595908, 3415577, 3466919, 3725926, 3782581, 3635538, 3693612, 3963207, 4025517, 3857233, 3876679, 4126855, 4208521, 4075423, 4099309, 4298200, 4305930, 4152021, 4249746, 4561557, 4611863, 4379718, 4329351, 4505581, 4475409, 4225450, 4213428, 4452436, 4466823, 4247023, 4300966, 4648629, 4739420, 4505913, 4506069, 4849179, 4989351, 4791004, 4781388, 5100645, 5217932, 4972744, 4897394, 5198957, 5400277, 5301470, 5325802]
36138E325802K76033P5325k23800k9538K55969Q358l21203k9504M24174K24146
36128E985762k68743k17639J30573M0348k22617J5687L99678K05391j92995k9979
36118E845466L28286J09831k87917m9750M04328J81807l21998j44962L88503K97642
36108F751236j69973q0197L35742J95317k25555m5081M10049K14589k85162j17030
36098F983935L73723J89305k99115l7170N82336L96916k65511j88588L94121L07150
36088H437102k27094o9856M95889K91250l51661j57655N51085M03520l43670k76653
36078H752257M18152L52181k73518n8017P37704N95094k62107k23806N82513N60061
36068A1180514j77086m5081P62114N50339m57426l84501O56952P03667k55204
$$ y = [5325802, 5601835, 5677160, 5453360, 5423822, 5679791, 5688149, 5366946, 5337442, 5761616, 5985762, 5717019, 5499380, 5629953, 5670301, 5447684, 5463371, 5863049, 6068440, 5875445, 5845466, 6173752, 6283583, 5995666, 5945916, 6350244, 6532051, 6210053, 6065091, 6453594, 6751236, 6581263, 6501066, 6836808, 7032125, 6806570, 6761489, 7171538, 7386127, 7100965, 6983935, 7357658, 7546963, 7247848, 7210678, 7793014, 8189930, 7924419, 7735831, 8129952, 8437102, 8210008, 8140152, 8636041, 8927291, 8575630, 8417975, 8969060, 9372580, 9028910, 8752257, 9170409, 9522590, 9249072, 9191055, 9928759, 10523853, 10261746, 10037940, 10620453, 11180514, 11003428, 10958347, 11720461, 12270800, 11813374, 11428873, 12085825, 12789492, 12534288]
36059A2534288k59021P42767P72355k26535k27163Q24528Q29707k50807j97369
36050A4542750J038765J076692k11261l15307R97307J146372j50955k24482J226847
36041A9126728J391884n5821j21811J563274J770815L2944j73722J770850K162126
36032B7467267K12144j59584J995869K560986N31354L74592L131085L679447O07329
36023D0400489l18728L035864M725035K287760K006149O309080P785899L561962
36015F9793510K461416Q069097R791256L920045N760446K0269869J8160638k7324219
36007A10902058q8325528j03797926n6942879K425410K3735235J2567350M182937
36000i5253343Q836034J0996866N288038K705726O654890P937020L571010J199506
$$ y = [12534288, 12275267, 13018034, 13790389, 13563854, 13336691, 14161219, 14990926, 14740119, 14542750, 15581515, 16658207, 16446946, 16131639, 17128946, 18275318, 18124363, 17899881, 19126728, 20518612, 20462791, 20340980, 21904254, 23675069, 23708013, 23534291, 25305141, 27467267, 27679411, 27519827, 29515696, 32076682, 32608036, 32982628, 36113713, 39793160, 40400489, 40081761, 43117625, 47842660, 50130420, 52136569, 58445649, 66231548, 69793510, 72254926, 80324023, 90115279, 94035324, 99795770, 120065639, 138226277, 110902058, 22576530, -81221396, -138164275, -135738865, -112003630, -99436280, -95253343, -86417309, -75420443, -70132405, -67426679, -60771789, -52834769, -49263759, -48064253]
35992d8064253L469446M026374Q50613k10990K640011L809346J226366j37571
35984c2390658J871999K908874Q94068l18331J246799K152239N68074l85160R79486
35975b2472610J777249M37444l45123Q93942J585251L10421m86723N95189J260686
35966a6444274J51319n50630M92964J211104K70353l95702N00230J122164K19963
35957a3422509m47045L54474R45279J08682n43594K16873Q86798K64800k54129
35948a1890371M33906R23062J17243n55347J05391P84018K41146l64125J41414
35939a0063663O74981J25715m49060M9129O06160J28612m24027L4435O06529K16510
35929h494679l17274L9596N35379J99882k54655O3891M34502K0550m04839J6522
$$ y = [-48064253, -44594807, -40568433, -39717820, -39928810, -37288799, -33479453, -32253087, -32390658, -30518659, -27609785, -26715717, -27034048, -25787249, -23635010, -23066936, -23452096, -22472610, -20695361, -20257917, -20603040, -19709098, -18123847, -17813426, -18300149, -17704960, -16444274, -16292955, -16843585, -16350621, -15139517, -14869164, -15264866, -14764636, -13642472, -13422509, -13869554, -13515080, -12569801, -12461119, -13004713, -12787840, -11901042, -11636242, -11890371, -11456465, -10533403, -10416160, -10971507, -10866116, -10082098, -9840952, -10205077, -10063663, -9388682, -9262967, -9712027, -9662898, -9056738, -8928126, -9352153, -9317718, -8711189, -8494679, -8811953, -8772357, -8236978, -8037096, -8291751, -8227860, -7793358, -7772808, -8177647, -8161125]
35919h161125N02766J54494k93189N0802M75591J06505l33849N8692N69163K30677
35909f639473l14809p8774L89137J36715l32770r1551L99872K36468j77725m987
35899f477897L49268R1636l32049r7631L64041J99770k13762l4725L99567K63015
35889e488767j47200l8386L09885J30808k96564j91605K20156J89242j06805J149
35879e418087L06955J72651j58721l9281K77032J27819k28503r5107K95038K06586
35869d553618k02098k01339J46310J96478k7313j483J86188N7725k18290j30629
35859d748069J37061N6761j83457m7721K59985J65097j53203r9760J91973J46010
35849d275323j23982n8959K40972K30791j3578M117J83165N2193k30269j41011
$$ y = [-8161125, -7658359, -7503865, -7797054, -7746252, -7270661, -7164156, -7498005, -7439313, -6870150, -6639473, -6954282, -7033056, -6643919, -6507204, -6839974, -6931525, -6531653, -6295185, -6472910, -6477897, -6128629, -6036993, -6369042, -6466673, -6102632, -5902862, -6116624, -6151349, -5751782, -5488767, -5635967, -5674353, -5364468, -5233660, -5530224, -5721829, -5501673, -5312431, -5419236, -5418087, -5111132, -4938481, -5097202, -5136483, -4859451, -4731632, -4960135, -5055242, -4760204, -4553618, -4755716, -4957055, -4810745, -4614267, -4641580, -4643063, -4456875, -4399150, -4617440, -4748069, -4611008, -4554247, -4737704, -4785425, -4525440, -4360343, -4513546, -4613306, -4421333, -4275323, -4399305, -4458264, -4217292, -3986501, -4000079, -3995962, -3812797, -3760604, -3990873, -4131884]
35839d131884J71618J46770j16754p5668J86511J41622j22344o6651K28615J96456
35829c441709j33434j96158M9164J03644q9721r5377J24889J69250M691k3852
35819c528613P5013Q474j11143M4571K83971J69532j32522j14502J33696J11874
35809c059649j31254j12426J56020K31267R6369P7932O9059k59333o28620m78627
35799d039262L219J36433q1518m8067K81151L33056K1741j06198R8799J83164
35789c217482J0555m0810R2649L7030j99457j69164J33438K03720l6323r9827
35779c285671J31669K02923k5439j32372L2597R5849o7113j01467Q5949J31242
35769b931833m6925p4951J21175J50743o3917j10792J10571J79179l7625j29571
$$ y = [-4131884, -3960266, -3813496, -3930250, -4005918, -3819407, -3677785, -3800129, -3866780, -3638165, -3441709, -3575143, -3771301, -3722137, -3618493, -3708214, -3803591, -3678702, -3509452, -3504761, -3528613, -3453600, -3445126, -3556269, -3511698, -3227727, -3058195, -3190717, -3305219, -3171523, -3059649, -3190903, -3303329, -3147309, -2916042, -2819673, -2741741, -2672682, -2932015, -3560635, -4039262, -4036043, -3899610, -3981128, -4029195, -3748044, -3414988, -3393247, -3499445, -3400646, -3217482, -3206927, -3247737, -3155088, -3118058, -3317515, -3486679, -3353241, -3149521, -3185844, -3285671, -3154002, -2951079, -2976518, -3108890, -3076293, -2980444, -3047557, -3149024, -3063075, -2931833, -2978758, -3053709, -2932534, -2781791, -2845708, -2956500, -2845929, -2666750, -2704375, -2833946]
35759b833946N9966J39511n9744j57547L4031J50212k8192j80486o9734O1954
35749b883975K5476J6069J27532J16081p9255j47068J4736R2344l5613o1987J36435
35738b679225K31678M8121j23729p1966J1940j3501R566J18434Q9901q1156r8398
35727b558335O4602P1484j28627j60190P6800J84784j7546j73580m4323J07826
35717b577105O8122K9397J20206J25283m1937j17961p51M3409q0129r4071Q1442
35706b444095J29368n3937j33821K5335R9083n1316r2131J19982K14276p492j70496
35695b365244L747K05294J15836o0845n2686Q006m1581m2816Q6076R3161j01136
35684b152188j46987J16346L02706J26610j10867q8496M192o6356r6648R7776
$$ y = [-2833946, -2773980, -2634469, -2694213, -2851760, -2817729, -2667517, -2695709, -2876195, -2945929, -2883975, -2858499, -2842430, -2714898, -2598817, -2678072, -2825140, -2810404, -2718060, -2753673, -2815660, -2679225, -2447547, -2399426, -2523155, -2595121, -2583181, -2596682, -2587116, -2468682, -2378781, -2459937, -2558335, -2493733, -2422249, -2550876, -2711066, -2634266, -2449482, -2467028, -2640608, -2684931, -2577105, -2508983, -2479586, -2359380, -2234097, -2276034, -2393995, -2394746, -2351337, -2431466, -2525537, -2444095, -2314727, -2368664, -2502485, -2477150, -2378067, -2429383, -2521514, -2401532, -2187256, -2194748, -2365244, -2361497, -2156203, -2040367, -2101212, -2153898, -2145892, -2187473, -2230289, -2144213, -2051052, -2152188, -2299175, -2182829, -1880123, -1753513, -1864380, -1952876, -1948684, -2015040, -2111688, -2013912]
35674b013912K29360L5910k06730j58097R540j2657j08522l5432P7708J0205r7272
35663b269899k1502J12279R3394K3064O6438J11432L1082l0171L7454N7688o7318
35652a856059j19213N892N2333r1551j13780J40221L04326J17731r0612K13J25795
35641a524704l1391k20063r9743J00054O234j99414j28990R7710J08072l9098
35631a931333k8912R5298P4395k5914L1105J56029J05851m1566o5011l4686j08500
35620a773244j45116R338J24185l2667k04165o1546J79960J27422q4474n7904
35610a918211J39293J38329l1136m1922P7989K1767j71869j76565J1223R1032
35600a860070K4608L6498J13565M3958j00010m9534J35361J45697j2650m5441
$$ y = [-2013912, -1784552, -1748642, -1955372, -2113469, -2103929, -2116586, -2225108, -2260540, -2182832, -2172627, -2269899, -2291401, -2179122, -2085728, -2062664, -1996226, -1884794, -1853712, -1883883, -1846429, -1788741, -1856059, -1975272, -1969380, -1917047, -2008598, -2122378, -1982157, -1677831, -1560100, -1650712, -1650499, -1524704, -1556095, -1776158, -1875901, -1775847, -1769613, -1969027, -2098017, -2000307, -1892235, -1931333, -1960245, -1864947, -1790552, -1816466, -1785361, -1629332, -1523481, -1565047, -1630058, -1664744, -1773244, -1918360, -1909022, -1784837, -1817504, -2021669, -2083215, -1903255, -1775833, -1860307, -1918211, -1778918, -1640589, -1671725, -1713647, -1635658, -1613891, -1785760, -1962325, -1951102, -1860070, -1835462, -1798964, -1685399, -1641441, -1741451, -1790985, -1655624, -1509927, -1522577, -1568018]
35590a568018P4021Q2315n7649j08881k6774p773p2231m1747P0020O4598n4506
35579a646625r5925m4258l0998j6549J09730K13410J07459n7513k2676R8077K8709
35568a357159j26713o6515J12623N9969j73823k01234K1081J48151P7143N5423
35558a451054J36935R1869q5343j18528K2741N2436r2569j41899r451O4817j2564
35547a542610m5143K6886J6817r3897q2915P2262J23263J3654k8998M8663K9554
35536a462464j14352j29155L5173J04271j8213p8027M4687J18342P490p8791J3870
35525a557169J13854N4372n4365o6220k1295J3213N1359N0579n1996j28109l371
35514a599148J78901J13702j37378k00106l786J18956K1261n1181L8347Q8957
$$ y = [-1568018, -1493997, -1411682, -1469331, -1578212, -1604986, -1612759, -1684990, -1726737, -1656717, -1592119, -1646625, -1742550, -1786808, -1817806, -1834355, -1724625, -1511215, -1403756, -1461269, -1483945, -1385868, -1357159, -1483872, -1550387, -1437764, -1377795, -1551618, -1752852, -1731771, -1583620, -1506477, -1451054, -1314119, -1222250, -1307593, -1426121, -1403380, -1350944, -1443513, -1585412, -1594863, -1530046, -1542610, -1587753, -1560867, -1544050, -1637947, -1720862, -1648600, -1525337, -1511683, -1540681, -1492018, -1462464, -1576816, -1705971, -1670798, -1566527, -1584740, -1662767, -1618080, -1499738, -1492248, -1571039, -1557169, -1443315, -1388943, -1443308, -1509528, -1530823, -1517610, -1466251, -1415672, -1467668, -1595777, -1599148, -1420247, -1306545, -1443923, -1644029, -1647815, -1528859, -1507598, -1558779, -1520432, -1431475]
35504a431475l893m2499O2825J09575J3590j8201Q9509J09055m2995j13247J9715
35493a248041J05767j2905j11029j0768R0644j95j30482j16107n8133p2284l3353
35482a596886J33898K25555J01030m0745q47Q7452L4590p0314o8393j9911k7984
35471a242555j6794P3331J10502J9172m0939L5402Q2837l5366j63305j20547K220
35460a296042M0972K5133L6243K5905k8886j8920O9569O8075o3791j16709Q94
35449a257557P3878l6973j32589l0934J14541J06919L4757M7046O7760k5m2869
35438a056046K6535N4288p0937j70687p7746O6194P8784M6309R1067R4759m6725
35427i64205j48464l8409J01634L2215j20506q5973Q7628J41444L6708m9519m5206
$$ y = [-1431475, -1435368, -1477867, -1415042, -1305467, -1291877, -1310078, -1220569, -1111514, -1154509, -1267756, -1248041, -1142274, -1155179, -1266208, -1276976, -1186332, -1186527, -1317009, -1433116, -1491249, -1563533, -1596886, -1462988, -1237433, -1136403, -1177148, -1177995, -1090543, -1055953, -1126267, -1194660, -1214571, -1242555, -1259349, -1186018, -1075516, -1056344, -1097283, -1061881, -979044, -1014410, -1177715, -1298262, -1296042, -1255070, -1229937, -1193694, -1167789, -1196675, -1215595, -1146026, -1077951, -1141742, -1258451, -1257557, -1183679, -1220652, -1353241, -1384175, -1269634, -1162715, -1127958, -1080912, -1013152, -1013177, -1056046, -1029511, -975223, -1046160, -1216847, -1294593, -1228399, -1149615, -1103306, -1012239, -917480, -964205, -1112669, -1151078, -1049444, -1017229, -1137735, -1223708, -1136080, -994636, -957928, -1007447, -1052653]
35416a052653q971N3067J33008J06237p9736k32119j67548mN6124J3916P498K1513
35404a149668k1868n5849M727O9081K7910m0795l0180j577k3330p068Q8836J12645
35392a027136n92m5865J01693K10755O2959j50559j34443L1198P0199k1772n0326
35381i53889k913j848j5231M8267R0651m031r4033n610J17157L6682j48719j67818
35369a101335m3660j6570r7631q5442L1502O0847l2564q5621l8141J8149N5267
35358a335199J04142R8634j2024q6776J404J02535K5080j04006m7219J08381R5608
35347a049440n7211q7954K8411O6858k0255m7517L2126O0107p419l9944o534p059
35335a135831l3447Q791O4453Q818p6787j8376J09281Q3158o6054r5459K8850
$$ y = [-1052653, -1061624, -1008557, -875549, -769312, -849048, -1081167, -1248715, -1248719, -1192595, -1178679, -1171181, -1149668, -1171536, -1227385, -1222658, -1153577, -1125667, -1166462, -1196642, -1198219, -1221549, -1228617, -1139781, -1027136, -1027728, -1073593, -971900, -761145, -698186, -848745, -983188, -951990, -881791, -903563, -953889, -956802, -958650, -973881, -925614, -834963, -838994, -933027, -938637, -821480, -784798, -933517, -1101335, -1144995, -1161565, -1259196, -1344638, -1313136, -1252289, -1284853, -1370474, -1408615, -1390466, -1335199, -1231057, -1132423, -1144447, -1231223, -1229819, -1127284, -1102204, -1206210, -1253429, -1145048, -1049440, -1106651, -1194605, -1166194, -1099336, -1119591, -1167108, -1134982, -1074875, -1082294, -1122238, -1128772, -1135831, -1169278, -1160487, -1096034, -1087216, -1164003, -1182379, -1073098, -989940, -1055994, -1151453, -1122603]
35324a122603R5579K6419m1250m5081n1408l4859P5179J58889N0272j23536j00491
35313a112890O4086Q5821m7491q1019J5024O654j21446j05212R7000J90209N1153
35302i58111p1363r475O6704P609o6286m1802o438j2089L4205J12468N4137j10535
35290a000976j19056P4655J84160P6675p679Q6570J41777j9410j93329j53161
35280i29774l2870n2015j30196q5898J1667o88o1209j8309O9756M9071m0253m3498
35268a264216M0159R3579R6335J03023R0690J1305p3471o8298L859M8043L3094
35257h85898r141m6826m8053m284J7178m0991q7885M187J53999J50138r204j01599
35245i08379m4695r97m7084l3563J03784J79754O6499r0389j27310r4923p4593
$$ y = [-1122603, -1027024, -1000605, -1041855, -1086936, -1138344, -1173203, -1098024, -939135, -888863, -1012399, -1112890, -1048804, -962983, -1010474, -1091493, -1076469, -1069815, -1191261, -1296473, -1199473, -1009264, -958111, -1029474, -1038949, -972245, -964636, -1030922, -1072724, -1079162, -1091251, -1057046, -944578, -890441, -1000976, -1120032, -1045377, -861217, -784542, -792221, -705651, -563874, -583284, -776613, -929774, -962644, -1014659, -1144855, -1230753, -1219086, -1219774, -1280983, -1299292, -1229536, -1180465, -1220718, -1264216, -1224057, -1130478, -1034143, -931120, -840430, -829125, -902596, -970894, -967035, -918992, -885898, -895039, -941865, -989918, -994202, -977024, -1018015, -1105900, -1101713, -947714, -797576, -806780, -908379, -953074, -954071, -1001155, -1034718, -930934, -751180, -684681, -775070, -902380, -997303, -1071896]
35234a071896q859J07628J11138n7482j85863j02850N0504O9512K691L783N6549
35223a025145P0528Q1216J35363J35149J1644r6863n1215M8118L4527n0591o5440
35212g72709j8501n918j7902k173l894n9430p3668J7815R5296M4390l8976k0866
35200h56536L6280J2731l5134K671O0402J5002p4937p2482q566l921l1440K1196
35188i34734J20845J35744N9893n201m1164r9349j47016j06240o633N7190P3105
35177h93560P8133M8698l1224p2661o683P0988L6179n9733p9337j8531K1889J6464
35165h89378J3514J4105o131j4025J8074L5632k385l9234l2594l6273o6002k8590
35153a033287R0396J33186J8198q8639l2905O7335L0731p4630o5857L7932Q0623
$$ y = [-1071896, -1080755, -973127, -861989, -919471, -1105334, -1208184, -1157680, -1088168, -1085477, -1081694, -1025145, -954617, -873401, -738038, -602889, -591245, -688108, -739323, -691205, -656678, -707269, -772709, -791210, -797128, -815030, -817203, -821097, -880527, -954195, -936380, -841084, -796694, -835670, -856536, -820256, -807525, -842659, -839988, -779586, -764584, -839521, -912003, -920569, -924490, -955930, -934734, -813889, -678145, -618252, -623453, -664617, -763966, -910982, -1017222, -1023855, -966665, -893560, -815427, -766729, -797953, -870614, -877297, -806309, -770130, -829863, -909200, -927731, -905842, -889378, -875864, -861759, -867890, -881915, -863841, -828209, -830594, -869828, -902422, -938695, -1004697, -1033287, -942891, -809705, -791507, -880146, -913051, -845716, -814985, -889615, -955472, -917540, -836917]
35142h36917M6512L1743K9273k4574p3798l7157J1314k4476n7661J8043Q4047
35131h33651j1097j33034m9088J52519J74582l54q9560J5143J06086M8433k6397
35120f46418j4663k0294j07338j41544l7792N9091J1001p7414l4413J01636J50837
35109g57311N6192o2741q0972M917J00395J08990K1024p6953j01153n9793q741
35098h56146L3263O3614M9958j0521m4185n185L7497J5491j3473K9181R4264R3594
35086e12648N4660M1342P774j00368j80802j03724N4324J04515K9223k7907j7337
35075f50948j9743m7394k2138M5610N4989L315q548L1668L2569j3895j3332M5892
35063e61955O5599J8046j5400o842j9434o2032o6098k8553k4613o0680o2278j9760
$$ y = [-836917, -790405, -758662, -729389, -753963, -827761, -864918, -853604, -878080, -935741, -917698, -833651, -844748, -977782, -1026870, -874351, -699769, -700123, -789683, -774540, -668454, -620021, -646418, -661081, -681375, -788713, -930257, -968049, -908958, -897957, -975371, -1009784, -908148, -757311, -701119, -763860, -844832, -839915, -739520, -630530, -609506, -686459, -787612, -847405, -856146, -822883, -759269, -709311, -719832, -764017, -769202, -731705, -716214, -729687, -700506, -606242, -512648, -457988, -416646, -408872, -509240, -690042, -793766, -739442, -634927, -605704, -633611, -650948, -670691, -718085, -740223, -694613, -639624, -636309, -644857, -613189, -580620, -594515, -607847, -561955, -496356, -478310, -493710, -500552, -519986, -582018, -648116, -676669, -701282, -761962, -824240, -844000]
35051h44000m40j1423L704L4589J8952k1186q201M3182N8671N3549Q4241R5884
35039d92478Q465q9079m6385P8981R2472j6435p2069k6676j1935n8211l9022N5970
35027f16402P0260k1481l8565P9193J36149Q683j34404j02707K9281P6597J6050
35016d97346n7878j07409j33268j03217k6263J2409p905J0515J05101J57127P8140
35005e69994m0473p4522m2120k2976j5753J4035L8690K0107j8452l9833l4941
34994g86232J6472J22029J92327J16702m7594j17511n2629o277n6683q5036j0631
34983g15063N0178j0635r7049o7173M2662R5484N7398M60k0872k401L1742K8133
34971f07136l7201q0065q284R4883N7176r2833j30733J4288J40652R5373j4285
$$ y = [-844000, -844440, -855863, -852159, -817570, -798618, -819804, -828005, -784823, -726152, -672603, -588362, -492478, -484013, -573092, -619477, -540496, -448024, -464459, -536528, -563204, -575139, -633350, -672372, -616402, -546142, -567623, -606188, -526995, -390846, -382163, -516567, -619274, -589993, -513396, -497346, -555224, -662633, -795901, -899118, -925381, -912972, -920877, -910362, -805261, -648134, -569994, -610467, -684989, -727109, -750085, -765838, -751803, -713113, -693006, -711458, -751291, -786232, -769760, -647731, -455404, -338702, -386296, -503807, -556436, -562713, -619396, -704432, -715063, -664885, -675520, -772569, -839742, -797080, -701596, -644198, -643738, -664610, -667011, -635269, -607136, -644337, -724402, -732686, -637803, -580627, -673460, -804193, -789905, -649253, -553880, -568165]
34960e68165m9870n5760r3784q1193K6620Q7439K155q3511j3806J04138Q5886
34949f39851j4968j8330O6136Q1966J2078j6952K2472L0268k1038m5324j071O0947
34937d83667R8078R7732L2277q3228j34405m0740R8897J23515K7154o7432r8282
34926d30101r2477n6370J7888P1423M0805k5995l7054m206l364k9251j7939K0384
34914e46257J9683j6141k4898o77J0619J203j1988m6227r6277p9198M1475J37898
34902f10785P0710q4429j22374m00J15252R7992M783n1843m0330J7238R2198J27086
34890c84902O5943m9289r6291k7723O4381P9769L6057J1870J9503M041m9744p9817
34878d06202m0540J3208p224q5858j07763l0079L8324k973q6004q0716K438N0336
$$ y = [-568165, -618035, -673795, -767579, -848772, -822152, -734713, -732558, -816069, -829875, -725737, -639851, -654819, -673149, -607013, -525047, -512969, -529921, -507449, -477181, -498219, -543543, -544614, -483667, -385589, -287857, -255580, -338808, -473213, -513953, -415056, -291541, -264387, -331819, -430101, -522578, -578948, -561060, -489637, -448832, -474827, -511881, -516087, -519451, -548702, -566641, -546257, -526574, -542715, -567613, -568290, -557671, -556468, -568456, -614683, -710960, -790158, -748683, -610785, -540075, -624504, -746878, -747278, -632026, -534034, -529251, -581094, -621424, -604186, -511988, -384902, -318959, -368248, -464539, -492262, -427881, -348112, -312055, -300185, -280682, -276641, -326385, -406202, -446742, -433534, -440758, -526616, -634379, -664458, -626134, -629107, -715111, -795827, -793389, -743053]
34866g43053M3885O0870J01778Q1623Q08m5171m2637p1924j21427q1312L8395
34855g78165Q7835L4146K3300J03451J13255l2865j64180j10565M6839J35880
34845e41069J30429P8537k5305j36600j14645M5485J21794l771j20217j8004J49444
34834d33922J08738q7269j62998o4671J1424j9147l9107P740L2511j282k1636
34823f69619p722j1990j8926L6933J17116J15761L6323l0009o9627j22410j39401
34812g63571n1050O3724P0100K137n95N8467N6741p207j8030K7442J8851m0913
34800e83904k9775N7188Q0193o199q3706p2398k0833K8655Q6220J10094L7887
34789c96578o1904n2590M3572O9451m111m2228L632K2456l0626m4080L9665J09136
$$ y = [-743053, -699168, -638298, -536520, -454897, -454089, -499260, -541897, -613821, -735248, -816560, -778165, -690330, -656184, -632884, -529433, -416178, -449043, -613223, -723788, -676949, -541069, -410640, -332103, -357408, -494008, -608653, -563168, -441374, -445145, -565362, -583366, -433922, -325184, -412453, -575451, -640122, -628698, -647845, -686952, -679212, -646701, -647983, -669619, -677341, -689331, -708257, -671324, -554208, -438447, -402124, -432133, -501760, -624170, -763571, -814621, -750897, -680797, -678660, -679255, -620788, -564047, -571254, -589284, -561842, -542991, -583904, -613679, -556491, -476298, -482497, -566203, -638601, -659434, -630779, -544559, -434465, -396578, -458482, -511072, -467500, -398049, -402160, -444388, -440756, -418300, -448926, -493006, -453341, -344205]
34777c44205O7026k5397o8907o1328m4874l1995l2575n4484n5674L736O8671O2269
34765e17737K2406L0259M7593j0826r0979p8014j6985l7698r5229l3040J09999
34754f70251J28250K486n7635K7168Q8334K8731k3804R854Q863q5366j15625J2198
34742f46797J27530O1893p9119j04280k8634J7098K5118O3040R9596O2777p203
34731d08981j9694J6207K9037P426j7219l8361m0647J4725R4378Q3851m4106j55200
34719d78584j30183j6922O6887P9046L5262m0031q0583j6555R1788Q9043m3941
34708d44773j37352q2377J9357M0942Q421o528k1315n6577n1473K1759Q0504O9588
34696e59824N3715Q1917R2501M3390k491j1641m9641j23873j20726p411P1463
$$ y = [-344205, -277179, -302576, -371483, -432811, -477685, -509680, -542255, -596739, -652413, -648677, -580006, -517737, -495331, -465072, -417479, -428305, -519284, -597298, -614283, -651981, -747210, -780250, -670251, -542001, -539515, -597150, -569982, -481648, -452917, -476721, -466867, -458004, -543370, -658995, -646797, -519267, -457374, -536493, -640773, -669407, -652309, -627191, -564151, -464555, -401778, -408981, -428675, -412468, -383431, -376005, -393224, -431585, -472232, -457507, -363129, -279278, -323384, -478584, -608767, -625689, -558802, -479756, -444494, -484525, -565108, -581663, -489875, -400832, -444773, -582125, -664502, -645145, -604203, -595782, -602310, -623625, -680202, -731675, -709916, -629412, -559824, -506109, -424192, -331691, -288301, -290792, -302433, -352074, -475947, -596673, -604084, -532621]
34685e32621J9625n5700m2734p218l1093m0754L7580J06703N8291l2746m4444
34674e65111r155j3352k4584J7365O3144O4221Q2849J36739R6299q4358k08094
34663d44037j18212K8628J4016q0850m5382O7887M1443j02573j29366N135R6866
34652f66445N3093J1876N5570P6231L046o7061n1432k322K7324O6359J12700J01967
34640b79094M3072K6213M8357k634j33867j88752q2244O0045R1844M1348J4540
34629c61172J8152o783n4147o5267k9240J2656L4262L5318J1864l0657n2286j4945
34617e02245N4400P1071j3673j31842j47189j5845J31883J32778k433j08132q7961
34606f19188j3774J9351J5006K871l2893p6959m5669Q3202J96485J87559Q7008
$$ y = [-532621, -512996, -568696, -611430, -618648, -649741, -690495, -652915, -546212, -487921, -520667, -565111, -574266, -587618, -612202, -594837, -531693, -467472, -384623, -247884, -151585, -235943, -444037, -562249, -533621, -519605, -600455, -645837, -577950, -536507, -639080, -768446, -763311, -666445, -613352, -601476, -545906, -469675, -466629, -533690, -585122, -587444, -560120, -493761, -381061, -279094, -236022, -209809, -161452, -164086, -297953, -486705, -568949, -508904, -417060, -375712, -361172, -343020, -349803, -403950, -469217, -498457, -485801, -451539, -416221, -404357, -435014, -487300, -502245, -447845, -376774, -390447, -522289, -669478, -685323, -553440, -420662, -423095, -531227, -619188, -632962, -613611, -598605, -595734, -628627, -705586, -751255, -668053, -471568, -284009, -197001]
34595a97001j8744r6770j24374o0518M8950O7609k5866o6969L8209J36566O5113
34584b33795p7372q6915K9135R5365M5961m0421j17532j85572j79588m1278J26176
34573f65836J55959N3109k5116N60O7211J02169P9592j3060j31474j55465m6744
34562e79095N3033K4725l1883K2929J10035P0117l8987l7442N0722L8710q4408
34551d01544j30438l7226M3631K3450K694N9891J20277J04212M0975j7712o0544
34540b52334p3337n8871q0481j51924j45781J6846J68475J09190n8169p1482O8428
34529e29440J20993K8238j6962M9895N7096n4830j03146k96P7043j11j00175q3906
34517e55601k6020k5700k1822L9424O0056k1646q6358l3928M7802O0482O3288
$$ y = [-197001, -215745, -312515, -436889, -497407, -448457, -380848, -406714, -473683, -435474, -298908, -233795, -311167, -398082, -368947, -273582, -227621, -268042, -385574, -571146, -750734, -792012, -665836, -509877, -456768, -481884, -481324, -414113, -311944, -232352, -245412, -376886, -532351, -579095, -526062, -501337, -533220, -510291, -400256, -330139, -369126, -406568, -355846, -317136, -401544, -531982, -569208, -525577, -502127, -499433, -439542, -319265, -215053, -174078, -191790, -252334, -325671, -384542, -465023, -616947, -762728, -745882, -577407, -468217, -526386, -597868, -529440, -408447, -380209, -397171, -347276, -290180, -345010, -448156, -448452, -371409, -371520, -471695, -555601, -581621, -607321, -629143, -589719, -529663, -551309, -637667, -671595, -623793, -563311, -500023]
34506e00023J15749J30277L9500n2069l9353J1567P444j0472Q991K72p0916r0565
34494d49598J3268J11493O8407m2459p6262l6643k0M4862J17427J33033L6747
34483g9745o8632q5427q5729j50886j83913p3489P4710Q1276k0026m8057L2344
34472f07574Q3855L3519m2023o1568l0044J1266K4692j2061o2718n2054J5661
34461f99049M4571R358O238O9838R1439K1652j3419O5408J22427L1514r2021q2737
34449d24781m874j8812q8269o2212L9022O6574J5178J1297O2054M9583l3577o3821
34437d52638j0670J9889j2555k0504M0499R7218Q7405L2559l3927r4219j05170
34426d52113m6158Q447j8871p5465o1377k873k135n5196p3116m7436l3261m062
$$ y = [-500023, -384274, -253997, -214497, -266566, -305919, -294352, -286908, -297380, -288389, -288117, -359033, -449598, -436330, -324837, -256430, -298889, -375151, -411794, -411814, -366952, -249525, -116492, -79745, -148377, -233804, -319533, -470419, -654332, -727821, -653111, -571835, -591861, -639918, -607574, -523719, -490200, -532223, -593791, -623835, -612569, -587877, -599938, -662656, -714710, -699049, -654478, -645120, -638882, -569044, -477605, -455953, -469372, -403964, -281537, -250023, -342044, -424781, -429655, -448467, -536736, -598948, -559926, -493352, -478174, -466877, -404823, -355240, -388817, -452638, -463308, -443419, -455974, -476478, -435979, -338761, -251356, -218797, -252724, -346943, -452113, -498271, -489824, -508695, -584160, -645537, -648410, -650545, -705741, -778857, -826293, -859554, -863616]
34414h63616R9259K00547J61002J4578o0533j3870K6890k408j3428L2763L4019
34403c84797n8615j28500p9632O201R196m3975m6699J8177P7748Q5121N5697K2653
34391d67425J1706L2305O2433O9498N3019K9260j2586p8921j15304o3734L1824
34380d47925O8560L4865J9486N7917P4223J3456o1240o1832p35L6810P661n1289
34368c10043q1966o6361l0297l967O696J959l2733q7817r2661M545J24652J30241
34356d37752L0008j4941O1955J21681M6719o1409m6990N2096Q3251K4723j7251
34345a57910o596q299m5931p3979p7154p2422l6837M6616J05177O3338k1005l4001
34333c19003J7009L3167p534m5417o4382q5317p4685q17O1794L1634k4973L706
$$ y = [-863616, -764357, -563810, -402808, -388230, -448763, -462633, -435743, -438151, -451579, -418816, -384797, -443412, -571912, -651544, -645343, -636147, -680122, -726821, -708644, -630896, -545775, -490078, -467425, -455719, -423414, -360981, -291483, -238464, -209204, -221790, -300711, -416015, -479749, -447925, -379365, -344500, -325014, -267097, -192874, -179418, -240658, -302490, -303225, -266415, -258754, -310043, -392009, -458370, -488667, -492634, -485938, -483979, -516712, -604529, -697190, -692645, -567993, -437752, -407744, -422685, -360730, -239049, -192330, -253739, -300729, -248633, -165382, -140659, -157910, -164506, -172805, -218736, -292715, -369869, -442291, -479128, -432512, -327335, -263997, -285002, -319003, -301994, -268827, -276361, -321778, -386160, -471477, -546162, -546979, -485185, -453551, -478524, -474818]
34321d74818P1951N5391j8194k0286L1848M233r0017r4095O080M1549m1063p8196
34309f05617K4798J25138Q0358k9219n2497K128K6800L60j1317K3456P1895Q5286
34297b58431L3945n7971j07573p2621l1575o1800q1567L1900J97305K02251L3429
34286a72708q0404j1156R0254N0160p7726j35576q7595n559N6992P5769L6023
34275b61526k3188l2865l733p858l3176M267Q3527Q3685Q78k7543L0718L6657
34263a50157o0849j12991l0679N0810Q412n8104j5634O9912O7584Q406J840L8947
34251a82503M1011N427l5607r4780j44658q5208P1584J36802J9706r4410k7581
34240c90217R3477N2896q4213q8679L9631Q4362j8967j05136p6935k7188k7128
$$ y = [-474818, -402867, -347476, -365670, -385956, -354108, -349875, -439892, -533987, -527907, -486358, -527421, -605617, -580819, -455681, -375323, -404542, -457039, -454911, -428111, -427751, -439068, -415612, -343717, -258431, -224486, -282457, -390030, -462651, -494226, -556026, -637593, -605693, -408388, -206137, -172708, -253112, -264268, -174014, -123854, -201580, -337156, -424751, -430310, -373318, -297549, -261526, -284714, -317579, -321312, -329170, -362346, -358079, -274552, -190867, -189989, -217532, -186814, -150157, -211006, -323997, -354676, -303866, -295454, -353558, -369192, -299280, -231696, -223290, -221450, -182503, -141492, -136065, -171672, -266452, -411110, -496318, -424734, -287932, -268226, -362636, -390217, -296740, -243844, -328057, -416736, -377105, -292743, -311710, -416846, -493781, -520969, -548097]
34229e48097k0131J7561J1188m9515n7591K7460R7098O9607J0216k772o096n4904
34217e05976r9028n5943N3852J29851J18390N7320J2415P443J1311j7149o8955
34206c56469q7790m8878J062J6305K1418N8600J07487J17663Q5511L7572k5219
34195g2738j00536j39893j05142l9378r231p462J1955L5173J2947l6241l9543
34184d90089J3471M7576R559o0870q4918l2437N3540J01986Q7615N9387O7918
34173b27262P7394J5944q7046j11422k3942N9657M6252l747N843N1727M8002j3319
34161a61919p0283q3511m7177L0311R2967O1264m6608j07557p2239l7825o3070
34150e05647m9265P3843J79383J19550l7358j15332q5972m3218q218N2124Q1431
$$ y = [-548097, -568228, -550667, -539479, -588994, -646585, -619125, -522027, -452420, -442204, -444976, -451072, -505976, -605004, -660947, -607095, -477244, -358854, -301534, -289119, -281676, -270365, -287514, -356469, -444259, -493137, -492075, -475770, -454352, -395752, -288265, -170602, -85091, -47519, -72738, -173274, -313167, -418309, -457687, -466918, -474380, -462425, -427252, -414305, -450546, -490089, -476618, -429042, -419483, -480353, -565271, -597708, -544168, -442182, -354567, -295180, -227262, -149868, -133924, -220970, -332392, -356334, -296677, -250425, -254172, -248329, -196602, -148600, -161919, -232202, -315713, -362890, -332579, -239612, -178348, -224956, -332513, -404752, -442577, -505647, -554912, -481069, -301686, -182136, -219494, -334826, -420798, -464016, -472234, -420110, -338679]
34139c38679R211p7769m0229P1529Q3000j9270p7230l2032P525j4140j8393K6660
34127d19817L9453m864j7735K6489K9618m1647o9576K1570J28379J22709K9251
34116a56170m2236m7663j3833K4866L2236j3050o4881n2672N13R38n6625p3258
34104d61835j8984J3601k1629m0618J3688O3080L5376l639L2328R5846Q4917Q724
34092a99145l7596k2014j653k0839n7973o5908k2338M6472P6733L5301k1817j6359
34080c07136K8834J7279o0374r6797l4593M3102M6623Q800O658L4532L7609J2100
34068b63363p671j8611l5660m3631k1639J1715K2391L133l6434q1653r1505k2071
34056e84999R3489J45814P5746m6423j08461p8145k702O1339P4241J7805p4061
$$ y = [-338679, -329468, -407237, -447466, -375937, -292937, -312207, -389437, -421469, -413944, -428084, -446477, -419817, -380364, -385228, -402963, -376474, -346856, -388503, -458079, -436509, -308130, -185421, -156170, -198406, -246069, -259902, -235036, -202800, -215850, -280731, -333403, -332890, -331952, -388577, -461835, -480819, -467218, -488847, -529465, -515777, -452697, -417321, -420960, -388632, -292786, -207869, -199145, -236741, -258755, -260408, -281247, -339220, -405128, -427466, -380994, -304261, -268960, -290777, -307136, -278302, -261023, -321397, -418194, -452787, -409685, -363062, -354262, -347604, -313072, -275463, -263363, -271034, -289645, -325305, -368936, -390575, -378860, -356469, -353336, -389770, -471423, -562928, -584999, -491510, -345696, -269950, -316373, -424834, -502979, -505681, -444342, -370101, -352296, -426357]
34045d26357j22332q3811M8O4022R4235J10100J06425N7148l4174j14964j18006
34034d67666k1945J08812J64901J04389L873l9191k3299j0933k0298k5613l4338
34023b61308p0467r5752m7309M5924Q1442K7722l9186n3623k7999N553L4067L7635
34011c63301R471l87M7022Q1757P429j28233j75827r9951j2229K1777N1664Q9071
33999d71737N6471m8009r6091k4432O0230O1064L5816N9837Q1000L3219k2716
33988b75348l471M6467L6965j5378l8737l6870n0009n2121m400M8333M7206K8208
33976b69155N0589P3103K0048p3277r9232l4886M2470P3485O0712K1091k2063
33965a57115k6389J7192N0953K9078j8367n5320r8439j35299q0452P9517J88433
$$ y = [-426357, -548689, -632500, -632452, -568430, -474195, -364095, -257670, -200522, -234696, -349660, -467666, -489611, -380799, -215898, -111509, -107636, -146827, -170126, -181059, -201357, -226970, -261308, -331775, -427527, -474836, -428912, -347470, -319748, -358934, -412557, -440556, -435003, -400936, -363301, -353830, -354217, -307195, -225438, -218009, -346242, -522069, -622020, -634249, -612472, -560808, -471737, -415266, -463275, -559366, -583798, -523568, -462504, -426688, -366851, -285851, -252632, -275348, -278819, -232352, -195387, -210765, -249502, -286372, -336381, -388502, -392902, -344569, -297363, -269155, -218566, -145463, -125415, -198692, -297924, -332810, -290340, -216855, -156143, -135052, -157115, -183504, -166312, -115359, -86281, -104648, -159968, -258407, -393706, -474158, -394641, -206208]
33954b06208J08057o2913j12100j4701N2591j1002j03329r9095j6887M8753N9540
33943c57294L7754N490k9394o0733p9692o5175L485R1629J08500K1255p2255o3779
33931d60209R669K7892k0299k5857N1224J02104L1709q5582r0399N4308K04240
33920b01200J90808J0454j66179j82013o5064K8019K0268j3308N530L8114J9516
33909c15055j5555P857O9073P3499o869r3350r7638p724J09750J56438Q2219m7164
33897h4519j06608o8647l7048p7859j07585l5385O6630N7043n8262j31033p9274
33886f62547K2438O8389M4600Q194J0271N4271R1781O7020m909l7776R867O7446
33874b60955N2205j7294o7824p4734n0696P776Q2949J03076L4913m1801l8505
$$ y = [-206208, -98151, -161064, -273164, -287865, -235274, -246276, -349605, -448700, -465587, -416834, -357294, -319540, -314050, -343444, -404177, -483869, -549044, -545559, -453930, -345430, -324175, -396430, -460209, -450540, -422648, -442947, -468804, -417580, -315476, -283767, -369349, -459748, -405440, -201200, -10392, 62, -166117, -348130, -413194, -385175, -364907, -378215, -372685, -334571, -315055, -330610, -322753, -253680, -180181, -187050, -280400, -378038, -385762, -276012, -119574, -37355, -84519, -191127, -259774, -296822, -374681, -482266, -517651, -451021, -393978, -452240, -583273, -662547, -640109, -571720, -527120, -518926, -508655, -454384, -362603, -295583, -300492, -338268, -328401, -260955, -208750, -226044, -293868, -368602, -419298, -411522, -328573, -225497, -190584, -232385, -270890]
33863b70890J6025M0404L1350L3039L6546J5995P169L9285M8674j9734q8177n7940
33851a68254J6249J6066l1774j1463N5867L8351o0074q2842J6796Q8150K2320
33840a00608q8522j13832o5816k5543k382L5419P0170O0917J0806m5373p7458
33829c42222n8705J6321R6925J17664P9260K9509j7801o5985o9491M172O9298
33818a41055J2440j16031j45082l2596P5754O8655L052l1014l5894l3920k581
33807c78272M6344M3022j4968l0624K8921N8910j1424r4508q8198l2363j3932
33796d87092j5843J9341N8095L7084l196K6400J07515J27906L8698r1737j70151
33785c52980j52562m6750Q5120J41697P3858l9778o7259K2497J23667J16523m914
$$ y = [-270890, -254865, -214461, -183111, -150072, -113526, -97531, -90362, -51077, -2403, -22137, -110314, -168254, -152005, -135939, -167713, -179176, -123309, -84958, -145032, -227874, -211078, -122928, -100608, -189130, -302962, -368778, -394321, -396703, -361284, -291114, -230197, -219391, -264764, -342222, -400927, -384606, -287681, -170017, -90757, -61248, -79049, -145034, -214525, -210353, -141055, -128615, -244646, -389728, -422324, -346570, -277915, -274863, -305877, -341771, -375691, -378272, -331928, -288906, -303874, -334498, -305577, -246667, -258091, -352599, -440797, -473160, -487092, -502935, -483594, -425499, -388415, -391611, -365211, -257696, -129790, -91092, -182829, -352980, -505542, -552292, -467172, -325475, -251617, -291395, -358654, -336157, -212490, -95967, -100881]
33774a00881j34454j65874r5225o510M0183O8167J05796J05282J6153r4759j01020
33763c63142L739Q4491M6773m8942q8172m1021L7187Q1066N8666j0090o0196m9851
33751c49492j6714j4889k4613r81K5422K400k3500K7538J04762Q2930k0718n6536
33739b64391J0665M7082j1399n3566l876M0957o986o8611m2031L1209O5448P1950
33727a83549Q0835M2932o4065j42149j11924m1720j9605r957L5516M7414k8945
33716c95217q6479j5533Q7669O1014n1419o9905K4901P4960J4690m1066p134M5601
33704c57918K9916k1615k4263L8712J10782J26445O3247l4103r1071r2715r5464
33693c48047j19328j03119k0131N3703O4622P4208J29180J44838M6712p0064p4645
$$ y = [-100881, -235335, -401209, -496434, -502944, -462761, -394594, -288798, -183516, -167363, -262122, -363142, -359403, -274912, -228139, -277081, -365253, -406274, -369087, -288021, -229355, -239445, -299641, -349492, -366206, -381095, -405708, -406689, -381267, -378867, -402367, -374829, -270067, -187137, -207855, -264391, -253726, -206644, -218043, -271609, -275485, -234528, -241514, -310125, -352156, -320947, -255499, -183549, -102714, -59782, -123847, -265996, -377920, -419640, -439245, -449202, -413686, -366272, -395217, -481696, -497229, -409560, -348546, -399965, -469870, -444969, -370009, -355319, -396385, -403519, -357918, -328002, -349617, -373880, -335168, -224386, -97941, -34694, -68797, -159868, -252583, -348047, -467375, -570494, -590625, -536922, -472300, -398092, -268912, -124074, -77362, -147426, -222071]
33682b22071j0216n384m8655l2841K9941L0954k8657m7120k1944m5659j02011
33671e03663o5211P3232J65351J33096N9803J6251k8348p1425l3481P5040J08210
33660g1145j226j22227j12913m601Q8248J23866J10491L9713o2995j15152q8393
33649b16334n4237n1207j3927Q5819J44873Q1302k2626m9118k5409m3297p5101
33638b39262k4888P6120Q4976l5600j51667j44922n6534Q166L4326Q0689J48438
33627b20158J51545L8879j06158j45250n9422K1840k53n2311n415J13794J48504
33616a14405M8715m7135j8113O3678M9924o9480j70456j71243j05452l2508L1253
33605e35222P5829O8357N303m6790j5537P6363J18768M6600o5921r1476j9817
$$ y = [-222071, -232287, -237671, -286326, -319167, -289226, -258272, -286929, -334049, -355993, -401652, -503663, -568874, -495642, -330291, -197195, -137392, -121141, -149489, -220914, -254395, -179355, -71145, -72371, -194598, -307511, -312112, -223864, -99998, 10493, 50206, -12789, -127941, -216334, -270571, -321778, -335705, -249886, -105013, -23711, -46337, -95455, -120864, -164161, -239262, -264150, -188030, -103054, -138654, -290321, -435243, -491777, -483611, -449285, -368596, -220158, -68613, -29734, -135892, -281142, -340564, -318724, -318977, -371288, -376703, -262909, -114405, -65690, -112825, -130938, -67260, -17336, -86816, -257272, -428515, -533967, -566475, -535222, -459393, -391036, -385733, -432523, -448060, -371697, -252929, -206329, -272250, -363726, -383543]
33594c83543K7916k2572q4796l9841Q4167J54747J23244O4600L4620l103p8058
33583a22619j31359q9396K8956J24094J16521K1960o0009m4594L1206L9867n9067
33572a44440j36735p0912N9403P9461j8687p0689K482R0275Q3801K1756k0108
33561a24393n1036r1300r0925k0749M6398M3148J8668M6560R2775P7596J1576
33550d1682l4492n0323p2397q3000l1601N3466P4950J19r1591j10499n1022K5929
33538d12143N9517L0845k5554m8433j3959L3620L9707J1710J066K4508M0011N452
33526b53653o1094r1236l9101N6479J03502O8490K4008M2370P9909M3521n1058
33515g7863r0802m0311Q440o173k3493J3248M9380K5737k234L5101P4414O560
$$ y = [-383543, -355627, -378199, -462995, -502836, -418669, -263922, -140678, -76078, -41458, -44561, -122619, -253978, -343374, -314418, -190324, -73803, -51843, -111852, -156446, -125240, -85373, -144440, -281175, -352087, -292684, -213223, -231910, -302599, -300117, -209842, -126041, -104285, -124393, -175429, -266729, -357654, -378403, -332005, -288857, -270189, -223629, -130854, -53258, -41682, -76174, -126497, -198894, -281894, -313495, -260029, -185079, -184960, -276551, -387050, -438072, -412143, -352626, -321781, -347335, -395768, -409727, -376107, -336400, -324690, -323624, -299116, -259105, -253653, -314747, -405983, -445084, -388605, -285103, -216613, -192605, -150235, -70326, -26805, -77863, -168665, -208976, -200536, -206709, -230202, -216954, -167574, -141837, -144071, -108970, -34556, -27996]
33503b7996j24693j52070k3329J12373J01914j8483r2195n0062K5384L3419j3469
33492b29207k7492J7383M8952J2295m1434l6154P517J3301j7699j5233K8546M9108
33480a90117L9110N9895R3669L0429j28245k01413q1100P5163N6410r1560j44193
33469d81952l2369Q9206R9661N4645L4441J1620n2355r8319n2575N0239J09008
33458b68750Q3933K5495O36K8273P0986P3626K8538l911K3151N7934J2219r5615
33446C6515j44785q0348J0007L1368J1245K5330O1250M7308k0227p4079q8475
33435a84891j01576j16243p2351M0900J23287Q2744l0548q5273m2955P362q442
33424c87986m8986l2274M4898J10460J10826N8169j491l2868l0141j4043p036
$$ y = [-27996, -152689, -304759, -328088, -215715, -113801, -132284, -224479, -274541, -249157, -215738, -229207, -256699, -239316, -190364, -178069, -219503, -255657, -248140, -234839, -252538, -267771, -239225, -190117, -151007, -91112, 2557, 32986, -95259, -296672, -377772, -302609, -246199, -337759, -481952, -514321, -425115, -325454, -270809, -236368, -224748, -277103, -375422, -427997, -377758, -268750, -184817, -159322, -158686, -130413, -59427, 14199, 42737, 38826, 61977, 119911, 132130, 36515, -108270, -188618, -178611, -147243, -135998, -110668, -49418, -2110, -22337, -96416, -184891, -286467, -402710, -475061, -434161, -310874, -228130, -258678, -343951, -386906, -379544, -387986, -436972, -469246, -424348, -313888, -203062, -144893, -146384, -179252, -209393, -223436, -230472]
33413b30472n824N700K0025J9098K2874O6801J17755Q8010k7989j10149o9695
33402a03866K3538N1414J5847n007r355n4274j17689j10987k5904N0438O9774
33391b16071O0417L3851k4858p0642l3001M9516O3820R427K977O3626N9936o1946
33379f2948j60515j11618J570L2893p366r203M7000Q7285P4584L3244j2391m0503
33367a27968k5560K730l4035j29977j59656n8347O2053P7816L2508L0811N2025
33356b77600J8189k8285J6453J20021J39044L6479o8272p8458l1283r476l2039
33345a95227n4989k5927O0655J29688Q7871m2227j20700p7230r389j9404n9445
33334c26324m4676j1227k4652k8753N3686J48181J29593L5198j126K1969l275
$$ y = [-230472, -236296, -230596, -210571, -191473, -168599, -101798, 15957, 103967, 75978, -34171, -103866, -80328, -28914, -13067, -18074, -27429, -81703, -199392, -310379, -336283, -285845, -216071, -155654, -121803, -146661, -217303, -250304, -200788, -136968, -127541, -124564, -60938, -1002, -62948, -223463, -335081, -333511, -300618, -307984, -317187, -270187, -182902, -108318, -75074, -87465, -127968, -153528, -150798, -184833, -314810, -474466, -532813, -470760, -392944, -360436, -329625, -277600, -259411, -287696, -271243, -151222, -12178, 24301, -43971, -122429, -153712, -163188, -195227, -250216, -276143, -215488, -85800, 2071, -40156, -160856, -238086, -247475, -266879, -326324, -371000, -382227, -406879, -435632, -381946, -233765, -104172, -68974, -70100, -48131, -51406]
33323e1406p7098r4234m6443k8054m1202Q199J06800J23044L2059l7140k2673
33312a28148j3930n8917o8246J0752Q5341P1067J8107J552O360m675j9040l1015
33300a30792o1688p9016j9255P3945P1576l3355r2507l5255K6435M528j9437L8938
33288b55883J07385Q9510K6575k43j0269l7083j7911Q6977J64596R3106o0551
33277A86209j35855j07236o8159m2261K5470J11496J09967O545p3470l1774P8194
33266E9126J33532Q6482r938q1424j00719q3674m2854K4668R4452J07539N2132
33255B39322M166J7329L0928j1904k4996Q7880K22009K04015R9577J13685J63850
33244A145861r8702o92358j073473p88483j12614L00785K45050O7860M9435Q4904
$$ y = [-51406, -128504, -222738, -269181, -297235, -338437, -330238, -223438, -100394, -68335, -105475, -128148, -142078, -200995, -269241, -258489, -173148, -102081, -83974, -82422, -76062, -80737, -99777, -130792, -192480, -271496, -290751, -216806, -145230, -178585, -271092, -306347, -279912, -275384, -294821, -255883, -148498, -58988, -32413, -32656, -42925, -80008, -97919, -10942, 153654, 246760, 186209, 50354, -56882, -125041, -167302, -141832, -30336, 79631, 86176, 12706, -19068, 59126, 192658, 279140, 269202, 187778, 87059, 3385, -39469, -14801, 79651, 187190, 239322, 243488, 260817, 291745, 279841, 254845, 342725, 564734, 768749, 868326, 982011, 1145861, 1047159, 354801, -718672, -1507155, -1619769, -1318984, -1073934, -1006074, -956639, -871735]
33234h71735K5054m0663O778Q7327P4392J039l1376j4681J7590P9410J54085J42426
33222c70354J4123q6415k0672J28509J62557M7397n5560l7018J8499j3141j04363
33211c16438j28646n6861L181k2847n7804O011J24383J45063K9621q0397n9195
33200d13929M0650R0114O4297K9453J1701j6191n2060o8974q0168j04250q8345
33189e87702K5481J63923J72435K7590j07934r2972J6122O3595O422n3868l1026
33178c97934L2475L9620j6216l7907L2387J11702P8601m9244j28343q7820j4053
33167d36732K550o69M2219Q7993N6061k3284n0550j1913K0298J8321J8172K1084
33155b56450j1069n9331n4028Q347N1207L8401J8131K6321L3453J3676j2960l3595
$$ y = [-871735, -846681, -887344, -880566, -793239, -718847, -717808, -749184, -763865, -746275, -666865, -512780, -370354, -356231, -442646, -463318, -334809, -172252, -124855, -180415, -217433, -198934, -212075, -316438, -445084, -501945, -498764, -521611, -579415, -573404, -449021, -303958, -274337, -354734, -413929, -373279, -283165, -218868, -189415, -177714, -193905, -245965, -314939, -395107, -499357, -587702, -562221, -398298, -225863, -198273, -306207, -399179, -383057, -319462, -313040, -366908, -397934, -365459, -325839, -342055, -379962, -347575, -235873, -157272, -206516, -334859, -422679, -436732, -434182, -434851, -392632, -304639, -248578, -271862, -322412, -334325, -314027, -295706, -277534, -256450, -267519, -326850, -380878, -372531, -321324, -282923, -264792, -238471, -205018, -191342, -204302, -237897]
33143b37897o2577q3887n1378K3186N9614K6279m648L2160R2869R2775L0918j8768
33131a01354j9161j3005n0057j10180j21290m8835M9873Q1286K4776m5397n8645
33120d11989k7406j597R816K6094M2481M4212M1371L7569Q14p3030j08407m2588
33108d62660N8002O6649k5572r2407m5473N6500J00227N9210N438Q608N0880M8335
33096a72263l1525r5111l2687R7425J09224l7123j38561l7049J26898J20086k3690
33085a14376p2953J6012L8311r9790k06988j04915R4150J59000N8097m8068n0629
33074c32149J6153Q2814J17690J02937L2369n8925j15197j08651m4677N0771J22280
33063a34585J05952p4j13800j48104q8729J6659J07910J38399R6885K2688l3518
$$ y = [-237897, -300474, -384361, -435739, -412553, -352939, -326660, -331308, -299148, -206279, -113504, -82586, -101354, -120515, -133520, -183577, -293757, -415047, -463882, -414009, -332723, -307947, -353344, -411989, -439395, -440992, -431176, -405082, -362601, -318389, -277018, -239449, -238635, -311665, -420072, -462660, -404658, -338009, -363581, -455988, -501461, -444961, -344734, -285524, -280086, -271478, -220598, -172263, -203788, -298899, -331586, -234161, -124937, -162060, -300621, -337670, -210772, -90686, -114376, -187329, -171317, -133006, -232796, -439784, -544699, -450549, -291549, -233452, -281520, -332149, -315996, -233182, -115492, -12555, 19814, -39111, -154308, -262959, -307636, -256865, -134585, -28633, -28707, -142507, -290611, -379340, -362681, -254771, -116372, -19487, 3201, -30317]
33052c0317o5151q7205p7251p360P4591Q0866J0024m6360l7683r393l668M019
33040a94888L3083M6036J6359j6130k344M9330Q9783P5106l973r3285j01101j7889
33028a19913L5470k5610r7094m4490M8417m006j48770j30152Q9817K26752J09934
33017e9645m8610j2470R4697K5168j55245j77746k2056O2868k6077j08167m3925
33006d71208O0112O4567O761j7214j7538l6622l5285K3988P0786K2980p0106q9563
32994d88342j7876M8061M1294k106k1920j6382j4607r407L3664J03504J24273
32983b19844M2129q6399j37267n7839P2126J30752P4750l9082j17329j02801j9294
32972d60098M5778L5596m371M260M9610N4884J8847K2264P4712P7773o766p2709
$$ y = [-30317, -95468, -182673, -259924, -267284, -192693, -111827, -101803, -148163, -185846, -195239, -198907, -194888, -161805, -115769, -99410, -115540, -117884, -68554, 21229, 96335, 92362, -923, -102024, -119913, -84443, -110053, -207147, -251637, -203220, -207226, -355996, -486148, -396331, -169579, -59645, -108255, -120725, -26028, -860, -156105, -333851, -355907, -293039, -319116, -427283, -471208, -411096, -346529, -339768, -356982, -374520, -411142, -446427, -422439, -351653, -328673, -398779, -488342, -506218, -458157, -416863, -418969, -440889, -457271, -471878, -481285, -447621, -344117, -219844, -177715, -264114, -401381, -459220, -387094, -256342, -181592, -220674, -338003, -440804, -460098, -414320, -378724, -383095, -378835, -329225, -274341, -255494, -233230, -158518, -80745, -87511, -160220]
32960a60220l1936M8034O2966K8216R260j0736o9854j13142p5094j4146k4659
32949c51311o5811k7377O9870R7702L2257j3285K2361P1494P3176N3897L9604
32938B577P332l7352m2916q897J059k4845k3707J3439O639o3993q9885K024J13216
32925a45309J05576L947m6341N957N7567J4975p2629r0560j6751N6409M6591k6458
32913a07026q9599j07942q5820j9434P6978J21489M2515q6553j04501J1179R6346
32902b52368L9964n8816p0953m3734q1841j29268n5032J00732J59644P2976j8786
$$ y = [-160220, -192156, -144122, -81156, -52940, -43680, -54416, -124270, -237412, -312506, -326652, -351311, -417122, -444499, -374629, -276927, -244670, -257955, -235594, -164100, -90924, -37027, 2577, 9909, -27443, -70359, -79256, -78197, -103042, -126749, -113310, -106671, -170664, -260549, -258525, -145309, -39733, -35786, -82127, -76170, -18603, -3628, -76257, -166817, -183568, -127159, -80568, -107026, -196625, -304567, -390387, -409821, -332843, -211354, -168839, -255392, -359893, -348714, -252368, -212404, -271220, -342173, -385907, -467748, -597016, -652048, -551316, -391672, -318696, -337482]
$$ [...]
##END NTUPLES=NMR SPECTRUM
##END=
