##TITLE=31Pdec_BAU-j-24.12
 DMSO-d6, 24 sc
 24.12.2019
##JCAMPDX= 6.0         $$ Bruker NMR JCAMP-DX V2.0
##DATA TYPE= NMR SPECTRUM
##DATA CLASS= NTUPLES
##ORIGIN= UXNMR, Bruker Analytische Messtechnik GmbH
##OWNER= root
$$ XWIN-NMR		Version 3.5
$$ Tue Dec 24 16:03:40 2019 Russian Standard Time (UT+4h)  she@DPX200
##.OBSERVE FREQUENCY= 81.013821
##.OBSERVE NUCLEUS= ^31P
##.ACQUISITION MODE= SIMULTANEOUS
##.ACQUISITION SCHEME= undefined
##.AVERAGES= 24
##.DIGITISER RES= 17
##SPECTROMETER/DATA SYSTEM= spect
##.PULSE SEQUENCE= zgpg30
##.SOLVENT NAME= CDCl3
##.SHIFT REFERENCE= (INTERNAL, CDCl3, 0, 182.463)
##AUDIT TRAIL= $$ (NUMBER, WHEN, WHO, WHERE, WHAT)
$$ ##TITLE= Audit trail, XWIN-NMR		Version 3.5
$$ ##JCAMPDX= 5.01
$$ ##ORIGIN= Bruker BioSpin GmbH
$$ ##OWNER= she
$$ F:/spectra/data/she/nmr/P31/1/pdata/1/auditp.txt
$$ ##AUDIT TRAIL=  $$ (NUMBER, WHEN, WHO, WHERE, WHAT)
(   1,<2019-12-24 16:02:19.03 +0400>,<she>,<DPX200>,
      <created by zg, POWCHK disabled, PULCHK disabled
       configuration hash MD5:
       00 E9 B6 7A A2 85 ED C7 34 08 36 98 17 FE 4E 26
       data hash MD5: 32K
       F4 32 2A 7D 18 57 A6 BA 01 3B 5D B8 F8 8A 31 A8>)
(   2,<2019-12-24 16:02:47.40 +0400>,<she>,<DPX200>,
      <Start of raw data processing
       efp BC_mod = 2 LB = 1 FT_mod = 6 PKNL = 1 PHC0 = -1715.8 PHC1 = 147.6012 SI = 64K 
       data hash MD5: 64K
       53 25 40 C4 E8 5F 29 34 BB FE 59 04 E6 F8 38 0B>)
(   3,<2019-12-24 16:03:04.03 +0400>,<she>,<DPX200>,
      <pk PHC0 = -3.790778 PHC1 = 8.400001 
       data hash MD5: 64K
       15 B9 84 14 54 E7 C1 2E 88 6A 61 8F B7 EB 60 9B>)
$$ ##END=
$$ 
$$ hash MD5
$$ A7 96 0D 7F 09 AD 7D C2 02 F4 B9 92 ED 49 47 B0
##$RELAX= 
##$RELAX= 
##$RELAX= 
##$RELAX= 
##$RELAX= 
##$RELAX= 
##$RELAX= 
##$RELAX= 
$$ Bruker specific parameters
$$ --------------------------
##$DU= <F:/spectra>
##$EXPNO= 1
##$NAME= <P31>
##$PROCNO= 1
##$TYPE= <nmr>
##$USER= <she>
##$AMP= (0..31)
100 100 100 100 100 100 100 100 100 100 100 100 100 100 100 100 100 100 
100 100 100 100 100 100 100 100 100 100 100 100 100 100 
##$AQSEQ= 0
##$AQ_mod= 1
##$AUNM= <au_zg>
##$AUTOPOS= <>
##$BF1= 81.014009
##$BF2= 200.13
##$BF3= 200.13
##$BF4= 200.13
##$BF5= 200.13
##$BF6= 200.13
##$BF7= 200.13
##$BF8= 200.13
##$BYTORDA= 1
##$CFDGTYP= 0
##$CFRGTYP= 5
##$CHEMSTR= <none>
##$CNST= (0..31)
1 1 145 1 1 1 1 1 1 1 1 1 1 1 1 1 1 1 1 1 1 1 1 1 1 1 1 1 1 1 1 1 
##$CPDPRG= <waltz16>
##$CPDPRG1= <>
##$CPDPRG2= <waltz16>
##$CPDPRG3= <>
##$CPDPRG4= <mlev>
##$CPDPRG5= <mlev>
##$CPDPRG6= <mlev>
##$CPDPRG7= <mlev>
##$CPDPRG8= <mlev>
##$CPDPRGB= <>
##$CPDPRGT= <>
##$D= (0..31)
0 1 0 0 0 0 0 0 0 0 0 0.03 2e-05 3e-06 0 0 0 0 0 0 0 0 0 0 0 0 0 0 0 0 
0 0 
##$DATE= 1577188938
##$DBL= (0..7)
120 120 120 11 120 120 24 19 
##$DBP= (0..7)
150 150 150 150 150 150 150 150 
##$DBP07= 0
##$DBPNAM0= <>
##$DBPNAM1= <>
##$DBPNAM2= <>
##$DBPNAM3= <>
##$DBPNAM4= <>
##$DBPNAM5= <>
##$DBPNAM6= <>
##$DBPNAM7= <>
##$DBPOAL= (0..7)
0.5 0.5 0.5 0.5 0.5 0.5 0.5 0.5 
##$DBPOFFS= (0..7)
$$ [...]
##$SUBNAM2= <"">
##$SUBNAM3= <"">
##$SUBNAM4= <"">
##$SUBNAM5= <"">
##$SUBNAM6= <"">
##$SUBNAM7= <"">
##$SUBNAM8= <"">
##$SUBNAM9= <"">
##$SW= 369.568048894756
##$SWIBOX= (0..15)
0 1 3 0 0 0 0 0 0 0 0 0 0 0 0 0 
##$SW_h= 29940.119760479
##$TD= 32768
##$TD0= 1
##$TE= 0
##$TE2= 300
##$TE3= 300
##$TEG= 300
##$TL= (0..7)
0 120 53 12 22 120 120 120 
##$TP= (0..7)
150 150 150 150 150 150 150 150 
##$TP07= 0
##$TPNAME0= <>
##$TPNAME1= <>
##$TPNAME2= <>
##$TPNAME3= <>
##$TPNAME4= <>
##$TPNAME5= <>
##$TPNAME6= <>
##$TPNAME7= <>
##$TPOAL= (0..7)
0.5 0.5 0.5 0.5 0.5 0.5 0.5 0.5 
##$TPOFFS= (0..7)
0 0 0 0 0 0 0 0 
##$TUNHIN= 0
##$TUNHOUT= 0
##$TUNXOUT= 0
##$USERA1= <user>
##$USERA2= <user>
##$USERA3= <user>
##$USERA4= <user>
##$USERA5= <user>
##$V9= 5
##$VALIST= <valist>
##$VCLIST= <CCCCCCCCCCCCCCC>
##$VD= 0
##$VDLIST= <DDDDDDDDDDDDDDD>
##$VPLIST= <PPPPPPPPPPPPPPP>
##$VTLIST= <TTTTTTTTTTTTTTT>
##$WBST= 1024
##$WBSW= 4
##$XGAIN= (0..3)
0 0 0 0 
##$XL= 0
##$YL= 0
##$YMAX_a= 38939
##$YMIN_a= -42149
##$ZGOPTNS= <>
##$ZL1= 120
##$ZL2= 120
##$ZL3= 120
##$ZL4= 120
##$ABSF1= 0
##$ABSF2= 0
##$ABSG= 0
##$ABSL= 0
##$ALPHA= 0
##$AQORDER= 0
##$ASSFAC= 0
##$ASSFACI= 0
##$ASSFACX= 0
##$ASSWID= 0
##$AUNMP= <proc_1d>
##$AZFE= 0.1
##$AZFW= 0.5
##$BCFW= 0
##$BC_mod= 2
##$BYTORDP= 0
##$COROFFS= 0
##$CY= -3
##$DATMOD= 1
##$DC= 0
##$DFILT= <>
##$DTYPP= 0
##$F1P= 0
##$F2P= 0
##$FCOR= 1
##$FTSIZE= 65536
##$FT_mod= 6
##$GAMMA= 0
##$GB= 0
##$INTBC= 1
##$INTSCL= 5.30512e-09
##$ISEN= 30
##$LB= 1
##$LEV0= 0
##$LPBIN= 0
##$MAXI= 10000
##$MC2= 0
##$MEAN= 0
##$ME_mod= 0
##$MI= 50
##$NCOEF= 0
##$NC_proc= -4
##$NLEV= 6
##$NOISF1= 182.463
##$NOISF2= 159.3651
##$NSP= 0
##$NTH_PI= 0
##$NZP= 0
##$OFFSET= 182.463
##$PC= 4
##$PHC0= -1719.591
##$PHC1= 156.0012
##$PH_mod= 1
##$PKNL= yes
##$PPARMOD= 0
##$PSCAL= 0
##$PSIGN= 0
##$REVERSE= no
##$SF= 81.0140089999434
##$SI= 65536
##$SIGF1= 159.3651
##$SIGF2= -187.1042
##$SINO= 113.3802
##$SIOLD= 16384
##$SREGLST= <1H.CDCl3>
##$SSB= 0
##$STSI= 65536
##$STSR= 0
##$SW_p= 29940.119760479
##$SYMM= 0
##$S_DEV= 0
##$TDeff= 32768
##$TDoff= 0
##$TI= <>
##$TILT= no
##$TM1= 0
##$TM2= 0
##$TOPLEV= 0
##$USERP1= <user>
##$USERP2= <user>
##$USERP3= <user>
##$USERP4= <user>
##$USERP5= <user>
##$WDW= 1
##$XDIM= 65536
##$YMAX_p= 489044559
##$YMIN_p= -4221399
$$ End of Bruker specific parameters
$$ ---------------------------------
##NTUPLES= NMR SPECTRUM
##VAR_NAME=  FREQUENCY,     SPECTRUM/REAL,   SPECTRUM/IMAG
##SYMBOL=    X,             R,               I
##VAR_TYPE=  INDEPENDENT,   DEPENDENT,       DEPENDENT
##VAR_FORM=  AFFN,          ASDF,            ASDF
##VAR_DIM=   65536,         65536,           65536
##UNITS=     HZ,            ARBITRARY UNITS, ARBITRARY UNITS
##FACTOR=    0.456856943014862, 1,           1
##FIRST=     14782.0589164792, 0,            0
##LAST=      -15158.0608439998, 0,           0
##MIN=       -15158.0608439998, -4221399,    0
##MAX=       14782.0589164792, 489044559,    0
$$ Real data points
##PAGE= N=1
##DATA TABLE= (X++(R..R)), XYDATA
$$ [...]
41493 54152 -34677 -426138 -591391 -441748 -359885 -492469 -469317 8432 634956 848133
41483 848133 563032 246023 250813 369724 203303 -225563 -496407 -372538 -66822 135301
41473 135301 233369 313631 239380 -153147 -663813 -871932 -676239 -389689 -238868 -70349
41463 -70349 310900 780798 1073738 1115231 965228 617013 111652 -291154 -360415 -244688
41453 -244688 -282056 -498276 -608814 -518342 -454337 -514325 -458757 -162301 65615 -75525
41443 -75525 -361567 -353051 -82170 -16574 -343673 -674553 -569329 -72476 409854 556700
41433 556700 341004 -24569 -236905 -146986 64120 104315 2084 91776 484485 827305
41423 827305 773737 457441 252470 238853 182109 -61530 -383862 -617473 -677445 -567192
41413 -567192 -429509 -499663 -792709 -937145 -582027 91119 534083 478310 150178 -135179
41403 -135179 -304775 -427302 -550641 -698588 -827368 -780664 -490946 -170709 -48037 -4194
41393 -4194 184051 347953 156284 -183921 -59604 570377 955804 628072 110219 94042
41383 94042 402238 357195 -158467 -637665 -746612 -591118 -302788 63696 259275 7997
41373 7997 -524071 -879634 -924304 -870529 -757556 -461295 -216295 -481994 -1141382 -1459887
41363 -1459887 -1103031 -609067 -498544 -479180 -43975 580427 710952 219602 -323165 -470033
41353 -470033 -368330 -359942 -504916 -638361 -663450 -656600 -759611 -982226 -1100149 -887794
41343 -887794 -513355 -459932 -875160 -1255146 -1069338 -506297 -243268 -582358 -1170997 -1522765
41333 -1522765 -1458057 -1039400 -440030 44887 165090 8954 -94442 -31712 -22866 -212608
41323 -212608 -413644 -406922 -288972 -334976 -627369 -965943 -1097418 -961590 -743847 -680706
41313 -680706 -759737 -693426 -320088 88499 158337 -34897 -75539 137373 234699 -10212
41303 -10212 -298280 -265853 -12716 134338 154729 291553 611218 931952 1123304 1177821
41293 1177821 1021136 560149 -36577 -377448 -284693 -23603 15203 -238962 -488291 -400597
41283 -400597 50039 535066 664857 379201 18133 -54279 160769 373765 399030 314365
41273 314365 251171 203915 106008 -33788 -157740 -251369 -330478 -366917 -297924 -131585 -11483
41262 -11483 -109367 -406506 -642794 -597264 -386334 -309590 -386852 -288396 159062 643295 763772
41251 763772 562368 371893 277735 82209 -244968 -459237 -445929 -400647 -484149 -576418
41241 -576418 -520524 -371795 -251690 -175881 -189560 -447740 -948396 -1367970 -1397820 -1117715
41231 -1117715 -822255 -604394 -354275 -79846 40793 -80225 -334910 -575218 -711379
41222 -711379 -684140 -515668 -364074 -345649 -322555 -65641 367931 626844 479913 60512
41212 60512 -349823 -603919 -689119 -624914 -478099 -360435 -305239 -235110 -128378 -108921 -271465
41201 -271465 -515794 -678969 -763538 -889216 -1037311 -998455 -643275 -156388 105153 -19990
41191 -19990 -357637 -651652 -850150 -1031699 -1136221 -988996 -626054 -366938 -426528 -637083
41181 -637083 -739419 -790431 -1033083 -1454658 -1742866 -1658544 -1229415 -621609 -72159 106993
41171 106993 -206137 -652273 -716246 -423589 -339017 -717902 -1062069 -816938 -180463 181786
41161 181786 23142 -310347 -496058 -583557 -684252 -695953 -500971 -196521 42416 186445
41151 186445 305387 402943 420621 348848 226013 39641 -275257 -682682 -939221 -773694
41141 -773694 -245816 198063 198691 -61920 -108516 170424 426065 433922 377854 387969 216466
41130 216466 -289363 -726243 -595482 -34527 354762 298534 53539 -92255 -79661 115610
41120 115610 469968 678934 392782 -228366 -609100 -502288 -231004 -100867 -39188 14325
41110 14325 -154296 -618654 -1043524 -1150751 -1105332 -1122812 -1051141 -728004 -435930 -539951
41100 -539951 -877738 -961859 -657792 -243120 101372 428313 690192 681679 368736 -21449
41090 -21449 -265691 -269951 4282 445624 680885 393848 -238031 -725948 -883914 -942402
41080 -942402 -1041301 -979639 -588856 -55398 289725 306358 69954 -248668 -442162 -381112
41070 -381112 -151863 44775 136749 173993 138935 -500 -94557 34791 247345 219040
41060 219040 -41945 -170640 -26331 80532 -82947 -264903 -94090 415642 956542 1275690
41050 1275690 1216607 699561 -41184 -447349 -229968 178893 129595 -386900 -758299 -608098
41040 -608098 -259032 -238963 -609089 -957257 -910328 -497477 -55279 116259 -26488 -347657
41030 -347657 -718117 -1030147 -1120584 -901292 -570613 -440248 -486183 -358505 36865 303839
41020 303839 147951 -119715 -33015 326125 515990 457103 460196 595191 582642 395564
41010 395564 429305 836450 1148154 908172 361610 113027 283833 409864 129189 -367730
41000 -367730 -624887 -425224 62522 490452 623618 518174 441838 565087 757095 769185
40990 769185 580636 428037 471801 563144 430967 36786 -367228 -547797 -562762 -635622
40980 -635622 -803322 -848394 -649167 -432723 -480854 -667713 -576428 -130011 196357 3768
40970 3768 -418760 -442814 34233 462276 431905 188539 120378 94790 -251922 -749312 -791184
40959 -791184 -269495 151281 -20416 -373499 -284383 42738 -100599 -715600 -985062 -510998
40949 -510998 64392 40458 -347653 -443216 -212878 -125253 -253773 -199324 151861 435908
40939 435908 456943 472996 677911 866512 827398 689443 649316 649008 529777 280585 1134
40928 1134 -160765 9663 558582 1061132 969025 384197 26620 235978 524805 446483
40918 446483 347874 714787 1216433 1116380 410040 -182914 -307843 -339092 -556944 -646209
40908 -646209 -306494 169553 309323 94878 -178429 -411942 -698409 -960663 -952538 -601029
40898 -601029 -103338 327162 641722 867862 975143 898455 673875 504896 605746 920568
40888 920568 1106441 937531 623522 508661 538260 339899 -161749 -578228 -624841 -506178
40878 -506178 -528470 -645625 -684765 -760305 -1074620 -1439767 -1404373 -862881 -205991 194074
40868 194074 364386 498894 594143 495156 181460 -152482 -284335 -169483 25666 90474
40858 90474 -1000 -60646 61870 262569 318867 182644 647 -121384 -216173 -322467
40848 -322467 -416894 -495765 -569166 -549353 -316055 52360 280909 216224 1057 -148351
40838 -148351 -187413 -172224 -111720 -29221 -23307 -106648 -118596 25975 142228 45775 -128398
40827 -128398 -171196 -250681 -717791 -1442606 -1773037 -1330312 -496256 122509 398361 551958
40817 551958 614614 459493 225385 236452 482543 584562 365171 103232 92883 261092
40807 261092 379697 374729 245706 -53459 -433317 -607636 -464675 -299178 -409086 -645696
40797 -645696 -665511 -470527 -346000 -358068 -297964 -116121 -38317 -180444 -368318 -441985
40787 -441985 -461674 -500165 -483443 -361272 -214599 -84443 84225 227839 144970 -171362
40777 -171362 -425622 -397257 -185484 69425 403109 740134 732259 260371 -160585 48068
40767 48068 680770 963666 602032 122346 80468 393756 654724 700418 587572 326563
40757 326563 -13481 -148908 110598 509788 620558 389845 103272 -138911 -528895 -1067748
40747 -1067748 -1350503 -1064170 -460125 -50823 40547 136433 429543 641862 391442 -270345
40737 -270345 -867689 -998990 -689006 -252860 49454 155439 98565 -89496 -346995 -552062
40727 -552062 -618473 -600800 -618383 -667274 -607633 -392099 -205356 -257760 -495362 -657368 -600739
40716 -600739 -411505 -200753 4934 124104 17730 -235361 -294371 -1095 343566 428983
40706 428983 455635 794581 1237249 1119691 299386 -495111 -565018 -107067 166985 -13636
40696 -13636 -307811 -376988 -249599 -101136 -14876 -2452 -21409 52561 285466 536258 623115
40685 623115 574716 513218 385524 95010 -164478 -67214 309594 468294 152459 -280033
40675 -280033 -366202 -190719 -235290 -652774 -975569 -655383 228398 966419 986383 505461
40665 505461 226063 422479 652142 492350 179370 185350 476120 664237 691994 800645
40655 800645 922013 730895 327409 210649 437170 478866 160356 31503 405403 714599
40645 714599 409764 -89553 -64918 331248 387974 21948 -202907 -95298 -15302 -52426
40635 -52426 114294 422467 336467 -197660 -496124 -205334 90316 -198076 -747694 -901109
40625 -901109 -647864 -418789 -303617 -121965 9769 -161230 -457022 -465026 -205455 -49428
40615 -49428 -54490 53107 277037 318424 165015 120667 165533 -94703 -653862 -891144 -448842
40604 -448842 208586 498950 507761 606775 713890 521512 184047 134265 326619 289263
40594 289263 -54509 -214339 75455 423339 391622 115616 6211 156872 368928 520349
40584 520349 576959 419028 4989 -385363 -389832 -21623 356661 478385 362502 121124
40574 121124 -137964 -222762 27442 452153 626031 309501 -314030 -886407 -1160696 -1010307
40564 -1010307 -436409 277789 643252 414870 -137208 -545711 -613528 -432598 -103242 333518
40554 333518 742307 886325 620453 26763 -607674 -910935 -651792 26690 668494 902148
40544 902148 725993 375081 65640 -57888 54513 223569 131519 -249537 -521231 -388714
40534 -388714 -102142 -46408 -108699 95099 486055 553877 167327 -165256 -27046 341832
40524 341832 444493 143750 -367856 -900324 -1287570 -1336238 -1056087 -759407 -669681 -606175
40514 -606175 -309863 103041 305109 227674 62138 -100156 -316291 -536980 -602145 -486298
40504 -486298 -309849 -129290 53429 115066 -81802 -394696 -476077 -203097 172115 349781
40494 349781 273603 60820 -160174 -283941 -277100 -255959 -360591 -515013 -495447 -287562
40484 -287562 -156429 -238878 -268304 84473 693767 1021999 697418 -91028 -820098 -1155610
40474 -1155610 -1173795 -1113444 -1040706 -840973 -475095 -96999 115471 134164 38217 -89068
40464 -89068 -158872 -91776 83882 261200 447010 756706 1111343 1158552 706383 57606
40454 57606 -346510 -464122 -530405 -531514 -206866 421228 909601 893396 436752 -184863
40444 -184863 -745631 -1024722 -850601 -387809 -109519 -269637 -612164 -783662 -793150 -836022
40434 -836022 -896391 -829985 -690183 -648190 -661660 -531476 -273284 -134327 -185556 -169721 98837
40423 98837 377182 255992 -272703 -723886 -685935 -340364 -220603 -473817 -628737 -253009
40413 -253009 389132 637739 279076 -275013 -633270 -848502 -1091031 -1293007 -1345391 -1337968
40403 -1337968 -1335237 -1172348 -770767 -431863 -469368 -710116 -741068 -572662 -649785 -1149310
40393 -1149310 -1614542 -1468971 -724883 -22889 7851 -610289 -1205388 -1142567 -491331 121318
40383 121318 288419 170121 7042 -293996 -798167 -1132099 -898233 -306994 64237 24632
40373 24632 -163074 -352155 -627378 -882003 -833164 -540071 -395708 -485043 -458930 -197373
40363 -197373 -56662 -218150 -329771 -124322 119433 140888 223550 629996 947406 659680
40353 659680 84775 10931 516519 885590 729043 472402 532987 658841 443228 12889
40343 12889 -219352 -178552 -113403 -159904 -258418 -368576 -476443 -489096 -368472 -279739 -388844
40332 -388844 -605883 -734743 -767235 -799817 -769397 -556731 -301075 -306622 -603659 -868871
40322 -868871 -855168 -672952 -550324 -517951 -459339 -320602 -141305 17510 84261 23215
40312 23215 -61176 -2843 166174 207369 47776 -38290 169797 419870 269014 -266003
40302 -266003 -645528 -444729 190051 794411 1061915 953790 560845 67881 -254733 -233903
40292 -233903 26481 245344 229038 -8974 -322800 -553243 -625153 -588367 -522116 -394825
40282 -394825 -132336 156195 212435 6650 -98329 233424 824049 1130027 852312 226582
40272 226582 -283753 -435995 -358855 -386089 -729803 -1216812 -1401576 -1065725 -531835 -311985
40262 -311985 -502483 -721639 -605369 -139917 481382 1063453 1401551 1312766 833413 266841
40252 266841 -71229 -88925 111785 374581 574365 688969 797580 894158 764101 254235
40242 254235 -377315 -660439 -482910 -171683 27012 188145 323291 182521 -287785 -652694
40232 -652694 -534382 -195775 -165151 -457165 -625104 -508524 -443246 -664356 -929808 -905724
40222 -905724 -598134 -200242 229908 697447 1045671 1063048 771860 421542 187081 3571
40212 3571 -266433 -588887 -753973 -610662 -249225 98512 304648 394660 364099 116661
40202 116661 -320191 -668313 -659280 -351035 -35843 95025 31553 -220376 -635146 -997924
40192 -997924 -1003736 -641900 -301063 -337676 -632645 -718796 -326083 300707 650431 470746
40182 470746 11325 -265522 -172005 84440 237092 245206 173957 -11767 -331764 -586553
40172 -586553 -525681 -208194 27077 -21372 -223574 -373559 -431436 -427862 -320416 -95512
40162 -95512 100164 87973 -113342 -291635 -274059 -99843 41638 20750 -91049 -104134
40152 -104134 54909 230450 196401 -102574 -494246 -716637 -603582 -233586 66792 1495
40142 1495 -330755 -494394 -254510 102647 148797 -147367 -473072 -613114 -568754 -352630
40132 -352630 8476 308112 326582 178176 190673 414260 562187 484372 356530 291208
40122 291208 113092 -271612 -567922 -429116 53690 435439 419031 116193 -142433 -159256
40112 -159256 -61376 -144716 -461063 -647134 -344236 299797 811957 1006213 1064684 1035462
40102 1035462 706358 101467 -331808 -256687 174664 669574 1148117 1517701 1502769 1044506
40092 1044506 548282 380177 399119 322370 232062 307074 351676 88100 -284707 -326815
40082 -326815 -20967 266216 366850 385029 302833 35422 -166252 97053 739210 1216509
40072 1216509 1242847 1028900 772301 413879 13829 -136464 9226 88415 -124722 -377267
40062 -377267 -374208 -219661 -160999 -164570 -7249 388688 881299 1196842 1024630 298935
40052 298935 -528293 -832817 -579694 -397833 -722907 -1236380 -1393801 -1136048 -748975 -341263
40042 -341263 130760 523190 590382 325382 -69674 -450311 -734496 -797157 -625226 -446347
40032 -446347 -458771 -571122 -628417 -694573 -835054 -833544 -475487 48300 382512 502249
40022 502249 576590 486724 -30308 -796264 -1256451 -1199780 -957213 -781430 -513126 -72624
40012 -72624 187927 -10137 -344143 -295756 90020 273244 3269 -350831 -340252 -13400
40002 -13400 222372 148702 -60456 -144447 -76303 3615 57018 180346 358340 358432 -951
39991 -951 -568342 -996471 -1120680 -1048212 -894161 -627939 -249552 56889 100606 -55447
39981 -55447 -156287 -70998 70179 87585 -2144 -47223 -20760 -81928 -330967 -616609 -690415
39970 -690415 -481377 -107389 301856 627678 683707 368435 -88248 -299813 -229915 -258083
39960 -258083 -595720 -908620 -760461 -221713 249889 392555 305222 130899 -90940 -264122
39950 -264122 -234840 -23801 150256 131709 -50296 -321215 -628131 -854532 -867725 -691445
39940 -691445 -470879 -264376 -54432 48964 -130760 -510920 -724023 -542411 -156928 85506
39930 85506 82768 7306 51103 241593 428690 392200 51494 -382024 -554383 -320209 122075
39919 122075 446856 460126 165754 -280023 -657433 -842907 -892801 -887913 -772318 -503636
39909 -503636 -263709 -260831 -362041 -229008 143635 337579 68494 -428887 -700553 -534160
39899 -534160 -24739 560946 860468 630602 66217 -324769 -323434 -222055 -277454 -269896
39889 -269896 91114 588333 714281 336934 -197764 -544138 -625002 -501077 -302053 -260367
39879 -260367 -501927 -788194 -737980 -330983 51555 107576 -95829 -326672 -442956 -410465
39869 -410465 -295763 -288670 -518726 -803948 -794454 -415358 45601 333413 458828 461144 232106
39858 232106 -232128 -634427 -694766 -545985 -558571 -812033 -974528 -748828 -265749 55912
39848 55912 -44622 -441328 -794945 -878331 -719866 -484681 -289848 -162005 -122085 -226269
39838 -226269 -483086 -750026 -769795 -385307 247286 732839 818175 650108 530568 478440
39828 478440 256206 -166601 -473424 -452248 -306804 -300624 -343288 -230012 -84781 -177860
39818 -177860 -415328 -437176 -209181 -82969 -191846 -218619 53902 346952 309287 31462
39808 31462 -176755 -280867 -422956 -479957 -148547 510431 983444 904201 493227 225394
39798 225394 237536 284334 193688 105158 195718 378691 447741 407460 436196 544447 529602
39787 529602 343521 234562 344959 416856 185048 -126874 -79814 294276 490058 235049
39777 235049 -201835 -495062 -646880 -713579 -550073 -120208 252557 283518 137682 100860
39767 100860 71033 -195497 -489970 -327204 265940 643481 399988 -78150 -206017 -30854
39757 -30854 -79583 -515270 -867768 -686640 -153487 161230 -2731 -364834 -526207 -397171
39747 -397171 -151250 42014 91354 -67339 -399234 -715198 -875038 -988447 -1206474 -1381248
39737 -1381248 -1229631 -837108 -645055 -824323 -1007882 -840660 -461489 -163254 101638
39728 101638 473481 685395 334372 -401170 -828977 -635002 -280044 -312742 -636750 -735483
39718 -735483 -394000 109738 437143 539690 561313 582085 554937 434765 278956 178026
39708 178026 126864 66520 62523 276855 662588 875030 703135 442485 529264 867040
39698 867040 890104 353554 -313574 -614793 -613508 -682322 -880315 -945737 -802825 -701311
39688 -701311 -808150 -962452 -969602 -922202 -1030474 -1238829 -1232818 -853470 -335141 -24246
39678 -24246 35773 83614 243327 348153 225320 -22373 -157920 -105897 51539 265089
39668 265089 507402 643300 538663 295192 178964 296051 498087 599452 519558 246418
39658 246418 -124945 -341238 -230475 5897 19683 -147308 -89457 316818 668249 627194
39648 627194 411662 410245 584998 600143 370960 150273 161730 418138 811924 1138156
39638 1138156 1135842 769219 371387 249808 265760 100754 -185129 -243308 -35999 73722
39628 73722 -105599 -306530 -214724 140115 531903 785031 738192 271467 -415913 -805187
39618 -805187 -590146 -54652 282958 246571 30478 -164476 -253955 -148313 187856 562176
39608 562176 681517 482562 164107 -103880 -313128 -451630 -421350 -201789 64962 242326
39598 242326 328636 352757 293622 211744 300504 615340 849495 622317 -7242 -546951
39588 -546951 -662751 -550489 -581524 -773870 -844680 -670105 -411618 -207132 -24714 119299
39578 119299 85309 -92536 -75987 376207 1015672 1338793 1131315 591638 19305 -377695
39568 -377695 -438930 -122454 324941 513328 338383 108624 154864 442152 653953 556414
39558 556414 200757 -160014 -299165 -215555 -122256 -182878 -297528 -257924 -67501 60632
39548 60632 15925 -88684 -136200 -147720 -133135 10273 322270 629346 695197 454782 39351
39537 39351 -338567 -482624 -329358 -56606 25114 -218778 -600176 -803546 -660435 -238585
39527 -238585 225321 482324 490399 469987 609895 780917 742646 546762 423106 315449
39517 315449 -48962 -577109 -780021 -501890 -191582 -165544 -104667 279570 542943 90706
39507 90706 -830167 -1399143 -1351556 -1168109 -1155724 -1026100 -537586 47244 399328 543318
39497 543318 588123 464177 203374 96588 263890 382268 140738 -306646 -619615 -727787
39487 -727787 -717619 -544636 -206984 28612 -38301 -147375 88685 559995 757203 453314
39477 453314 -67761 -462203 -672879 -780667 -800774 -720874 -553918 -310688 -63658 11474
39467 11474 -139066 -250345 -40180 329169 413089 130256 -107279 -15109 168018 116999
39457 116999 -51355 -1307 247892 316340 2919 -449800 -685185 -631728 -482447 -393676
39447 -393676 -315726 -114235 190531 356482 155793 -312917 -648352 -573246 -281924 -236253
39437 -236253 -604671 -1026699 -1022586 -573513 -161079 -201598 -570887 -811019 -717724 -506011
39427 -506011 -385410 -255639 -4887 129877 -161057 -708523 -968376 -741410 -438418 -452447
39417 -452447 -578416 -357208 202548 620940 624000 471707 520401 733865 800196 563748
39407 563748 156365 -208992 -403661 -382822 -177957 96572 338124 567331 848842 1102942
39397 1102942 1129456 864575 485885 187657 -13856 -137757 -63038 272288 581211 443404
39387 443404 -140568 -689145 -845374 -772247 -766686 -755435 -478455 7336 365441 445946
39377 445946 375542 216867 -108188 -534426 -845476 -1012256 -1190080 -1306051 -1065073 -529445
39367 -529445 -243246 -482893 -791597 -651066 -245943 -57470 -9315 327253 825889 848210
39357 848210 282043 -159891 49138 519187 588398 216530 -197661 -487904 -693516 -650300
39347 -650300 -188622 381063 526442 225624 -40193 -43739 -62962 -275221 -412615 -273083
39337 -273083 -150121 -399200 -867815 -1131500 -1100915 -1011725 -929192 -670092 -223092 119452
39327 119452 156222 31593 -31531 -29052 -51096 -46784 77809 219179 139698 -226144 -658291
39316 -658291 -853106 -654221 -112037 554035 1030809 1084218 756207 336782 61455 -128969
39306 -128969 -446457 -897326 -1185501 -1038707 -565797 -189601 -216720 -546822 -840974 -910339
39296 -910339 -858035 -864785 -953878 -1024170 -1021072 -956557 -801075 -511850 -198301 -95575 -267317
39285 -267317 -467624 -449530 -294859 -227352 -191014 74054 521556 728108 499543 226787
39275 226787 356404 749351 915036 718164 458305 338640 293650 337919 605886 924323
39265 924323 811349 147645 -534382 -725171 -568590 -486823 -489528 -287304 115238 404334
39255 404334 442208 353101 188815 -84471 -304441 -239333 -6516 44059 -106026 -114761 135639
39244 135639 378066 479371 622655 787782 573815 -130649 -751407 -724886 -249121 95243
39234 95243 180498 303812 536469 624540 460520 196976 -76662 -365161 -511510 -321649
39224 -321649 51334 235618 171790 142871 260793 329587 282000 336326 583545 782936
39214 782936 724376 476118 142708 -283506 -675251 -729342 -390054 -11472 120762 143035
39204 143035 265527 364552 201933 -177924 -536208 -734232 -728530 -507327 -259449 -342611
39194 -342611 -811427 -1233103 -1260242 -1105774 -1112663 -1162884 -961415 -642836 -554638 -604523 -402367
39183 -402367 22134 230445 104803 -18356 -8994 -139654 -471197 -634779 -473287 -340900
39173 -340900 -431618 -333388 304473 1082917 1344135 1061599 741410 651421 656158 689177 877342
39162 877342 1193038 1392141 1336253 1073774 631977 51169 -412301 -477325 -249658 -111291
39152 -111291 -174481 -179804 17980 213097 205163 89330 64452 199780 476580 799365 904659
39141 904659 581890 87360 -25343 338454 602224 316793 -196772 -365860 -216291 -228125
39131 -228125 -516237 -671113 -407240 84880 513137 817330 989746 901351 523096 103521
39121 103521 -79613 -21369 90990 140899 146490 164503 232994 330824 334403 119048 -234559
39110 -234559 -444527 -311413 79688 464796 602902 378624 -117698 -565997 -653394 -406328
39100 -406328 -124998 39096 194703 338216 207356 -286367 -780708 -909025 -778097 -677043
39090 -677043 -557557 -234498 79418 -20212 -420529 -543230 -207979 84905 -51258 -309151
39080 -309151 -245244 -7489 -44351 -343540 -470830 -289602 -163389 -356039 -600026 -462194
39070 -462194 55985 491974 463847 105873 -116470 -7642 95679 -183620 -646453 -734137
39060 -734137 -374392 -182352 -610620 -1295365 -1596213 -1461210 -1304988 -1267210 -1133676 -886973
39050 -886973 -763281 -736134 -492549 -42902 169966 -19308 -169608 76475 397403 296688
39040 296688 -100327 -221549 110025 435160 276622 -293140 -766782 -732417 -265442 147888
39030 147888 126332 -162732 -231589 54006 316672 278800 169217 274259 425087 305196
39020 305196 11625 -133747 -171638 -426566 -896783 -1189185 -1095363 -810926 -511996 -132097
39010 -132097 295956 464960 203807 -199103 -326220 -129573 80945 37181 -224051 -421148
39000 -421148 -312494 -8905 61559 -313158 -732446 -639936 -125275 160440 -52942 -289616
38990 -289616 -110189 227167 248349 9401 -98043 -8947 48634 77679 277673 539197
38980 539197 488417 106730 -148142 489 244146 167561 -144138 -249018 32449 384001
38970 384001 383314 -2530 -374011 -356211 -40500 163505 113111 105316 324036 445900 151591
38959 151591 -234530 -142349 318535 444481 4731 -422339 -402671 -284609 -455734 -546666
38949 -546666 -33844 732578 865337 189705 -555253 -790479 -690175 -555772 -282050 199359
38939 199359 507065 336954 23560 53171 281380 200125 -159959 -211132 265367 753816
38929 753816 773020 528162 468974 571049 490641 227465 159832 434847 725164 694128
38919 694128 401566 104051 -106791 -278721 -388740 -390738 -397538 -587320 -904239 -1027062
38909 -1027062 -732279 -209490 88258 -82466 -488638 -677352 -490327 -243086 -333410 -747643
38899 -747643 -1087478 -1060449 -771392 -490203 -319616 -209068 -136680 -100390 -24691 141754
38889 141754 288359 261494 67222 -198883 -538664 -957033 -1256654 -1214657 -965762 -900515
38879 -900515 -1112122 -1260790 -1123609 -947893 -1010998 -1114636 -873013 -343573 5073 -92843
38869 -92843 -445405 -751677 -894208 -859806 -677015 -509442 -537979 -662224 -590567 -328079
38859 -328079 -263517 -589312 -942157 -900401 -587748 -429427 -493373 -507927 -459947 -670759
38849 -670759 -1158081 -1386140 -954687 -226612 108729 -66795 -240659 -75099 143622 14276
38839 14276 -339594 -431088 -80822 366056 503171 302850 -3908 -296187 -612844 -899236
38829 -899236 -933169 -598229 -108845 169070 90066 -173812 -376621 -416857 -312562 -117852
38819 -117852 50998 40053 -145511 -257799 -106579 102262 -26429 -484105 -738404 -381607
38809 -381607 305548 692924 574926 296596 153536 40186 -187024 -333557 -130002 298866
38799 298866 513692 274823 -215838 -561694 -509757 -96194 368621 488641 139733 -347523
38789 -347523 -503343 -210448 248849 577267 688617 580644 255050 -157819 -417185 -422407
38779 -422407 -281998 -85733 166912 348473 217417 -183061 -439572 -331634 -202824 -440395
38769 -440395 -834078 -892348 -637466 -558722 -792190 -904713 -638114 -349866 -428783 -696931
38759 -696931 -761895 -633563 -560253 -487433 -174519 238997 277388 -198881 -762254 -980236
38749 -980236 -883118 -726022 -579650 -371635 -137075 -6557 -37622 -193908 -397380 -512413
38739 -512413 -414276 -176110 -41669 -104322 -181450 -132478 -93299 -206213 -333858 -305873 -248074
38728 -248074 -317187 -275993 197778 824239 884279 207962 -498027 -572945 -212271 2070
38718 2070 -12110 79240 309374 360249 177430 100189 300665 541766 617273 627590 652283
38707 652283 533130 224353 41410 270206 745868 1085139 1159981 1089941 924324 603214
38697 603214 148414 -316427 -660353 -731225 -422092 77745 323090 155757 -12995 219124
38687 219124 594111 536834 19738 -390221 -330623 -17169 249993 492903 796755 1029940
38677 1029940 1049083 906031 677833 368031 133575 285011 826230 1280866 1253157 926457
38667 926457 720297 674326 519284 219687 68423 236342 505980 522181 173079 -294231
38657 -294231 -484209 -254350 58969 -16009 -453909 -692247 -367715 186070 409960 227584
38647 227584 -18613 -116496 -115836 -68990 2200 -11089 -138085 -180202 -49843 -59470 -458941
38636 -458941 -884593 -805733 -395542 -332236 -748022 -1060827 -975913 -942269 -1299637 -1606844
38626 -1606844 -1285650 -474879 226022 512284 447883 128384 -275934 -437103 -291318 -275113
38616 -275113 -676976 -1047135 -805853 -176379 153770 129910 309359 741704 716887 -89208
38606 -89208 -951835 -1053592 -566355 -236610 -277525 -283716 -57504 97429 -53065 -288771
38596 -288771 -287265 -63338 116559 94063 -36003 -61059 122455 367045 385801 96687
38586 96687 -202891 -158118 181617 419964 349246 204640 281461 506970 592976 486026
38576 486026 404593 440804 397577 147393 -53688 150406 674241 976386 671621 10022
38566 10022 -378140 -145891 473319 989075 1137612 1004968 775144 487601 88274 -351016
38556 -351016 -599243 -524335 -303377 -239302 -378148 -456431 -270343 55733 267798 311569
38546 311569 304147 265927 88873 -222152 -462088 -455060 -253710 -35793 100813 153090 110953
38535 110953 -20801 -116398 1928 309506 493799 266070 -254397 -619319 -573775 -357067
38525 -357067 -353258 -557013 -595981 -260304 209637 423799 265476 -55779 -235064 -96024
38515 -96024 272743 539088 421763 12136 -349341 -523555 -651087 -742725 -558767 -85008
38505 -85008 248668 157090 -16903 155958 430835 229879 -388868 -739718 -527157 -222689
38495 -222689 -232103 -291047 -54130 219642 83989 -309509 -400792 -67116 240146 222342
38485 222342 148516 393103 868009 1128746 912133 408534 25606 -49528 -29114 -231312
38475 -231312 -625541 -815538 -556835 -126930 4448 -224494 -414562 -227829 234383 598187
38465 598187 608793 322827 22878 -39309 102638 149111 -107538 -507777 -742553 -774524
38455 -774524 -832771 -1001955 -1068856 -865815 -551931 -396516 -423264 -432799 -283770 8550
38445 8550 374205 695902 746687 349981 -322002 -792436 -765717 -462609 -323065 -463450
38435 -463450 -626726 -629512 -587376 -606892 -517205 -140678 321143 457392 172970 -207764
38425 -207764 -375078 -325357 -169527 76848 359284 460252 236603 -130440 -333576 -332421
38415 -332421 -353481 -507097 -591475 -357728 117829 416197 157491 -594411 -1341885 -1625496
38405 -1625496 -1459832 -1212994 -1103311 -996032 -711415 -307930 46042 286999 405000
38396 405000 358039 200827 127414 197736 193427 -31618 -237106 -127121 149712 190869 -47675
38385 -47675 -230733 -225420 -253950 -368348 -252065 191097 468608 133814 -481593 -652152
38375 -652152 -263971 53441 -169018 -667601 -940198 -905670 -778243 -596947 -291467 -70883
38365 -70883 -294224 -910188 -1403355 -1433241 -1213576 -1076592 -967104 -658737 -242281 -30470
38355 -30470 -86877 -208790 -320499 -509200 -684401 -620600 -409624 -434143 -726140 -786492
38345 -786492 -313728 286463 482756 360997 327768 343848 25748 -587341 -958014 -824951
38335 -824951 -556276 -556642 -732084 -778600 -678661 -629363 -683982 -730338 -709504 -641413 -502551
38324 -502551 -252421 45930 249648 271209 137307 -52024 -190208 -232826 -220198 -207337
38314 -207337 -205002 -234296 -356712 -553768 -677384 -667074 -710939 -981224 -1287622 -1255448 -836413
38303 -836413 -383457 -188659 -186548 -161841 -21311 207044 443118 561216 498293 369624
38293 369624 292594 137315 -281988 -798841 -1021244 -900942 -810447 -966289 -1154934 -1163192
38283 -1163192 -1080293 -980273 -721268 -340607 -248490 -646016 -1075536 -993930 -560355 -381794
38273 -381794 -612575 -786897 -530098 -19255 330658 330152 89733 -149317 -207759 -124761
38263 -124761 -89471 -124772 -7990 322435 523944 319821 -1518 36427 365134 484615
38253 484615 251214 35552 39587 -10319 -282005 -418261 -44745 604755 939602 746190
38243 746190 373869 253499 457495 720041 740714 464516 128607 8911 116238 223062
38233 223062 167122 -20123 -269438 -539134 -690830 -559483 -258599 -161051 -401161 -632405
38223 -632405 -516360 -242006 -241393 -526764 -695908 -580709 -488681 -676895 -942483 -976393
38213 -976393 -850323 -823820 -840295 -615758 -192859 23554 -96817 -136074 248305 743237
38203 743237 790798 379784 12714 -23763 78953 122251 198207 404289 624595 737012
38193 737012 732968 540830 93356 -321792 -221721 360388 780681 670904 426894 442167
38183 442167 397081 -107266 -664244 -573804 21758 333423 168282 140114 551322 879016
38173 879016 661535 213166 54712 153200 157902 12640 -76318 -21202 133203 372935
38163 372935 637739 769640 723008 621512 488574 200664 -172280 -324352 -178899 -40639
38153 -40639 -93911 -130706 -2343 74253 -46083 -114125 35130 92640 -183189 -403613 -78489
38142 -78489 550960 796636 497059 125684 -23017 -177903 -535244 -850034 -780325 -330220
38132 -330220 211967 579732 686412 626532 553807 483435 311435 110851 164517 499769
38122 499769 684874 421453 57527 72403 304192 246154 -65993 -130276 99626 98659 -284383
38111 -284383 -483450 -139606 257569 120685 -322595 -417342 -71643 208500 126648 -92358
38101 -92358 -185883 -189020 -189600 -104796 128702 369076 442222 362999 243181 84596 -169243
38090 -169243 -419902 -456622 -287300 -245427 -570018 -985210 -993641 -599940 -390420 -736009
38080 -736009 -1262450 -1402953 -1173067 -982913 -902825 -642430 -187721 96264 74967 49609
38070 49609 190158 226260 -51495 -380275 -424586 -290169 -321363 -588510 -850827 -879533
38060 -879533 -615278 -169797 162164 98697 -247176 -413787 -212615 -41161 -326188 -911985
38050 -911985 -1309503 -1332340 -1137318 -811193 -314539 234261 575840 611290 442034 171320
38040 171320 -92460 -144159 103463 383643 357156 77596 -114377 -82776 52111 273627
38030 273627 653840 962101 747557 -25035 -786588 -1012468 -773430 -454096 -215613 1378
38020 1378 159765 129848 -54823 -184437 -135373 -30442 -120986 -523128 -1031146 -1238808
38010 -1238808 -967516 -518036 -312735 -357139 -336205 -194458 -199994 -344223 -165295 538490
38000 538490 1227099 1264882 759364 301730 95842 -125258 -434637 -556797 -428416 -365116
37990 -365116 -504695 -568250 -402955 -306115 -488782 -615873 -294111 276133 586956 551659
37980 551659 473810 431915 224815 -95165 -182650 -1800 37704 -246008 -459017 -253992
37970 -253992 106629 197788 108612 192890 366510 215631 -234750 -408661 24530 661894
37960 661894 885638 580922 145045 2655 264325 661857 701584 117618 -692114 -949145
37950 -949145 -400075 332411 543660 312203 236310 546357 924214 1088983 1077159 924515
37940 924515 541864 50625 -159113 66723 375095 364469 76365 -183854 -277344 -224169
37930 -224169 21588 458319 809742 745050 316975 -79465 -182275 -60871 145112 404584
37920 404584 649964 709112 516255 230032 39070 -17110 26706 142184 223390 98576
37910 98576 -244727 -586441 -742940 -764506 -750568 -654584 -443238 -254826 -153232 106701
37900 106701 736512 1422762 1560795 1022232 348791 73753 155528 240149 198046 154169
37890 154169 168419 139558 -53493 -476715 -1094004 -1640906 -1702639 -1156366 -447596 -173620
37880 -173620 -404809 -631366 -399483 180343 600340 502729 26292 -319359 -142533 399082
37870 399082 717102 433026 -186540 -554186 -417009 -23417 270329 346964 315404 344458
37860 344458 505090 643552 472730 -57868 -583893 -719305 -523124 -333956 -258237 -142863
37850 -142863 21564 52735 -65346 -151944 -192706 -345393 -520012 -385126 60148 345269
37840 345269 179774 -136956 -208830 -81972 -4426 1032 -13358 -177325 -526975 -745053
37830 -745053 -581262 -296586 -267789 -369820 -226266 97431 182454 -32213 -151463 45370
37820 45370 352206 568506 733597 847071 798160 703091 887128 1344121 1594907 1308551
37810 1308551 739004 313095 92536 -80024 -167805 -18598 276486 415703 260796 -14660
37800 -14660 -136678 26712 387144 702168 767157 606505 423534 345483 311671 213472
37790 213472 12310 -278755 -566404 -637932 -364942 37884 207792 130886 151547 397273
37780 397273 548174 390659 254192 531340 984688 977285 353373 -316695 -459334 -137658
37770 -137658 205504 389319 586572 858907 943266 658757 297040 296805 592353 669159
37760 669159 369591 213068 596185 1059287 885709 205862 -165335 32046 146814 -309608
37750 -309608 -913933 -1028481 -681744 -291530 8198 229341 135473 -374648 -769200 -451139
37740 -451139 308445 655069 317609 -142995 -260500 -184554 -156349 -101551 4664 -81201
37730 -81201 -401404 -565802 -341105 -79340 -176697 -436779 -397960 -51619 210394 221648
37720 221648 182294 217842 184572 -26742 -270254 -317865 -106773 201850 312102 16119
37710 16119 -530339 -853504 -663246 -211639 56236 96116 223068 538420 758744 697042
37700 697042 592149 759425 1108707 1225465 855771 165725 -437898 -655981 -518766 -333681
37690 -333681 -373200 -582320 -657140 -421662 -24243 252962 242037 -77903 -602088 -1059163
37680 -1059163 -1146844 -873552 -608534 -614960 -701722 -569980 -327564 -313663 -509795 -543695
37670 -543695 -298787 -83667 -69656 1804 307061 538952 372163 2980 -200543 -320335
37660 -320335 -646615 -991082 -854339 -282714 51786 -204471 -590824 -535274 -98284 295923
37650 295923 466600 440312 150964 -374981 -758066 -641092 -200564 105719 179532 276530
37640 276530 477911 614396 663068 751554 755792 380123 -264443 -635849 -492134 -209444
37630 -209444 -137682 -68757 316062 837128 1091009 1089683 1155344 1304574 1217838 822869 460803
37619 460803 353242 273461 -53389 -495709 -703477 -584167 -346692 -146119 85688 433566
37609 433566 786639 912062 682480 185216 -368230 -815503 -1131249 -1348797 -1418819 -1215561
37599 -1215561 -733961 -224569 -19623 -198671 -505958 -636901 -529044 -321969 -140456
37590 -140456 -41040 -88537 -292145 -475749 -426558 -231260 -242602 -576518 -850703 -650514
37580 -650514 -116681 211059 90262 -166269 -155996 157470 549001 854824 1023906 1009100
37570 1009100 808591 558568 427320 418705 371698 159603 -147484 -304062 -83846 464916
37560 464916 948231 928220 358924 -362780 -818365 -925676 -838613 -677925 -513209 -462775
37550 -462775 -572314 -632955 -358898 194749 574719 406533 -169585 -649475 -700556 -447710
37540 -447710 -244582 -266501 -382982 -383161 -236810 -84385 -4059 118490 421844 800740
37530 800740 911746 524444 -167565 -691691 -783944 -632534 -559297 -575590 -438902 -103358
37520 -103358 141188 53989 -261587 -572364 -787467 -825299 -476334 250062 813964 638027
37510 638027 -95963 -594385 -491109 -292372 -573510 -1155269 -1437791 -1249233 -926287 -712247
37500 -712247 -522632 -285922 -117125 -66851 3240 176633 326916 314946 181355 49120
37490 49120 -46369 -158587 -349053 -641711 -983771 -1252031 -1370031 -1374386 -1277688 -977121
37480 -977121 -477867 -100110 -188925 -641385 -1004682 -1055437 -974667 -910307 -750649 -492130
37470 -492130 -444132 -766101 -1097083 -1011015 -630825 -400944 -413225 -409307 -367748 -564452 -976207
37459 -976207 -1138863 -833684 -493035 -588791 -929045 -959527 -577209 -227271 -240842 -441831
37449 -441831 -457358 -153855 283225 500867 212587 -485660 -1031665 -902865 -266194 143163
37439 143163 -113010 -697634 -1019243 -949334 -784427 -710898 -623179 -400644 -95354 163917
37429 163917 278447 200109 -9281 -163403 -129451 11068 93452 89705 53562 -65106 -342990
37418 -342990 -655803 -748618 -560773 -301952 -165420 -118866 -25876 155028 344851 429369
37408 429369 345454 144883 -44673 -172319 -299727 -417164 -376876 -155520 1369 -63179
37398 -63179 -96906 176922 483773 266479 -459687 -994450 -833753 -244834 232928 458896
37388 458896 579925 590615 376269 9032 -310045 -484416 -484731 -258455 94861 259210
37378 259210 84368 -144027 -99539 90319 58101 -242361 -536880 -693168 -818108 -931921
37368 -931921 -896825 -693022 -471963 -305749 -134176 33612 105376 79175 -2413 -207630
37358 -207630 -543282 -720229 -477337 -99284 -139793 -566520 -709574 -276493 108881 -209123
37348 -209123 -898450 -1050079 -404900 399832 780861 849527 951315 1050841 919247 647049
37338 647049 561551 715193 814466 697414 580668 703452 960854 1077700 974871 738700
37328 738700 357089 -221329 -797062 -996174 -715035 -255371 63843 202590 226924 110178
37318 110178 -131557 -342173 -459069 -635934 -929442 -1085466 -898895 -592819 -530774 -693003
37308 -693003 -765023 -647559 -533201 -513761 -446453 -238323 7912 166624 196439 88138
37298 88138 -87295 -131414 49493 239505 205442 101534 248807 568057 618235 224163
37288 224163 -297318 -596907 -639742 -523957 -288499 -10206 185292 291708 366572 327462
37278 327462 115846 7737 325037 830173 915238 487864 126891 171815 222604 -140132
37268 -140132 -655731 -829332 -677202 -576741 -661427 -772625 -782585 -626629 -253920 167624
37258 167624 301440 180879 302300 824173 1142922 773883 191170 116400 352090 151488
37248 151488 -466344 -694188 -237820 255017 255751 30346 -56566 -165741 -469638 -649539
37238 -649539 -448350 -234903 -432321 -755636 -641500 -189023 -14544 -258150 -382269 -40147
37228 -40147 434056 625442 650531 820950 1028373 905935 469344 160712 214000 344016
37218 344016 217599 -64363 -196534 -161708 -180737 -289823 -316545 -251282 -283516 -416692
37208 -416692 -407063 -203251 -82105 -160128 -141218 166199 425819 250072 -168710 -345254
37198 -345254 -230644 -176279 -277316 -261317 -32030 165790 214361 314576 562415 725779
37188 725779 644820 532247 642640 873871 905135 568733 -47747 -685205 -983785 -690037
37178 -690037 31120 641170 734202 395262 -12916 -250708 -297376 -235188 -187244 -250393
37168 -250393 -372044 -390667 -273436 -193452 -291176 -473267 -530827 -373535 -96561 110365
37158 110365 107161 -66322 -225318 -272847 -296306 -320857 -155241 274813 623800 518140
37148 518140 136863 -14414 155168 277974 210420 206207 310518 176073 -271582 -549571
37138 -549571 -365778 -156075 -410922 -870997 -939724 -625896 -499846 -823088 -1235986 -1311640
37128 -1311640 -1023549 -641949 -469754 -672113 -1103025 -1330600 -1068956 -531753 -153764
37119 -153764 -72284 -105437 -91144 25754 293904 638414 784268 617492 469529 669968
37109 669968 962238 815198 239265 -200058 -194413 -25715 3332 -10754 83261 136576 -40619
37098 -40619 -341350 -514668 -449873 -148828 354781 878398 1111820 944365 608148 359575
37088 359575 202608 57495 -14160 61810 193482 263093 308218 388259 392399 158121 -290590
37077 -290590 -741843 -956255 -777288 -245946 302448 453813 182279 -67918 68866 424741
37067 424741 586683 458249 268921 154084 40291 -91136 -133504 -83940 -80403 -139824
37057 -139824 -95786 98510 223305 110870 -49343 70509 479970 821445 779896 396251
37047 396251 -54347 -363843 -494734 -479598 -352329 -190381 -129610 -259526 -502786 -637996
37037 -637996 -481784 -75924 312840 429641 303030 236007 462569 848252 1030510 851332
37027 851332 530544 375366 444880 583345 672470 719783 754172 765141 737995 663571 531009
37016 531009 377665 299541 328541 357022 294784 246287 382911 653703 781677 584551
37006 584551 177104 -186019 -356768 -332976 -166507 64137 235383 232348 50319 -183164
36996 -183164 -315283 -314021 -296537 -381380 -531298 -605995 -551336 -426450 -244168 49872 378425
36985 378425 497012 291599 -31714 -196728 -153315 25693 355225 812929 1170749 1249883
36975 1249883 1225211 1349240 1481202 1297536 920363 836299 1098174 1128335 573381 -99616
36965 -99616 -238637 108613 391142 389197 342778 361530 256526 28426 26649 399178 755462
36954 755462 674480 294561 67282 88246 51679 -170499 -312607 -201857 -100946 -288612
36944 -288612 -544174 -423366 54769 395383 311650 19952 -236835 -519608 -829032 -864253
36934 -864253 -535660 -339025 -691192 -1167823 -1045693 -464346 -302931 -841583 -1319075 -1099858
36924 -1099858 -560691 -342901 -332965 -38912 431597 514475 143384 -131557 19862 338115
36914 338115 504619 512719 388438 37163 -428971 -637123 -480507 -347647 -554557 -862516
36904 -862516 -876826 -651491 -506779 -436984 -170104 224294 285684 -122737 -470548 -250547
36894 -250547 259639 337096 -190026 -725675 -741758 -406787 -177912 -146997 -139855 -175409 -361628
36883 -361628 -495431 -290696 39051 -5164 -342610 -292249 339049 791240 443647 -171233
36873 -171233 -109236 583736 982383 673119 256071 350539 785087 1055054 1059373 1029885
36863 1029885 1086532 1196819 1339321 1446457 1381699 1173213 1065628 1166305 1267536 1196885
36853 1196885 1088144 1083862 1027630 742031 408072 340134 509484 608922 518231 403736
36843 403736 383082 378436 337645 368245 574554 899736 1171261 1216876 960130 506851 102890
36832 102890 -93245 -140889 -133932 -9953 291282 582255 566446 201224 -260990 -573967
36822 -573967 -673689 -600346 -453996 -414890 -584314 -771560 -646667 -178902 238591 187234
36812 187234 -344770 -947237 -1113598 -628254 211424 789658 763938 423189 261545 295038
36802 295038 137967 -274358 -494963 -240039 178220 358836 374897 478512 565677 380891
36792 380891 39786 -132521 -154880 -283115 -420668 -200773 278219 377672 -186976 -863953
36782 -863953 -1003209 -676626 -371261 -194691 121408 597068 896692 852401 676835 567352
36772 567352 434330 161110 -122348 -201917 -73055 66062 43184 -137922 -316877 -316230
36762 -316230 -115715 122659 262732 367332 556703 766474 809432 641803 398143 183597
36752 183597 5059 -115343 -155179 -207386 -362216 -470881 -278489 161552 469434 430867
36742 430867 260323 253377 422765 633994 851312 1028203 966127 559921 56165 -199887
36732 -199887 -196390 -186877 -252295 -205158 47410 285047 224618 -131041 -480901 -526968 -269884
36721 -269884 -12924 -33107 -251111 -331715 -127355 140929 205054 52864 -201697 -515728
36711 -515728 -782416 -726448 -246647 265870 287845 -199224 -728807 -966006 -972424 -848494
36701 -848494 -499489 81096 598068 774938 733619 827216 1147573 1372790 1131114 442882
36691 442882 -239293 -446394 -141505 304221 571748 671643 704985 600193 323745 157929
36681 157929 418129 964319 1343696 1399174 1365414 1333144 1050706 434663 -96077 -82077
36671 -82077 407832 920388 1154872 1129286 969245 779164 638144 524318 303157 -70258
36661 -70258 -434371 -640535 -759783 -899405 -940028 -682910 -202582 173372 257891 219094
36651 219094 360515 780683 1281740 1578671 1606918 1623417 1930448 2484344 2891071 2841011
36641 2841011 2433515 2007428 1774315 1702790 1641131 1442754 1060723 616633 310916 219094
36631 219094 271611 436954 733943 1013097 982910 622113 357945 606131 1253987 1800909
36621 1800909 1919412 1702803 1453512 1409894 1620483 1939529 2198644 2464887 3002834 3883812
36611 3883812 4803391 5414474 5647363 5557805 5121076 4418866 3775796 3380246 2966556 2239450
36601 2239450 1450138 1127452 1322843 1557347 1499901 1276289 1084331 934218 860698 987318
36591 987318 1229161 1272683 1004834 660757 421018 197186 -23196 17790 431563 853288
36581 853288 838443 420727 12320 -123558 -63402 21212 80623 174518 354028 542071
36571 542071 549509 339786 220987 502726 956406 984184 444959 -78785 -64410 277166
36561 277166 432871 354076 365325 543790 669256 685914 759833 894929 891279 712382 550861
36550 550861 493601 426933 301133 199186 129768 47991 85498 431257 953859 1284828
36540 1284828 1330186 1338380 1382399 1184283 628634 63887 -163238 -162225 -225474 -382145 -504794
36529 -504794 -603805 -709762 -686530 -479327 -340212 -459994 -565180 -275986 272349 589188
36519 589188 528672 393688 368281 306526 143790 71320 164515 233454 216365 360961 812457
36508 812457 1347261 1723243 1965467 2071235 1795980 1079848 383445 171828 265161 146465
36498 146465 -217993 -349423 -28892 371666 436937 205956 -31738 -129927 -93019 72311
36488 72311 310064 465021 452769 409062 563644 992566 1501581 1707360 1325519 527414
36478 527414 -90103 -119426 156461 165963 -130796 -239255 33221 246955 52758 -213736
36468 -213736 -31150 536703 985752 1077097 975436 811341 541294 233251 110449 238477
36458 238477 443619 598666 755045 950553 1115091 1220157 1308583 1313728 1059451 547171
36448 547171 87088 19253 371821 856103 1148971 1164429 1094416 1163968 1315782 1240685
36438 1240685 816181 372222 321798 615709 804926 618052 237226 -11978 -8927 174028
36428 174028 411440 562272 542580 456394 515356 744732 894623 731351 326270 -12169
36418 -12169 -27848 285285 692583 910255 865316 762143 823443 1019090 1156487 1157684 1080621
36407 1080621 929946 657024 331379 109308 29796 20690 74323 201186 253802 82511
36397 82511 -125775 18118 552810 1041634 1111818 845315 521195 277179 200448 441431
36387 441431 964649 1411505 1494021 1356527 1280929 1213448 923190 517874 397883 657958
36377 657958 895768 776223 515524 557189 921095 1187141 1135895 1083081 1364096 1712436
36367 1712436 1540919 823560 261160 386698 895381 1174845 1147327 1135675 1179452 1085439
36357 1085439 1025308 1409255 2127352 2582603 2635398 2855547 3555318 4201376 4194509 3691458
36347 3691458 3188962 2789400 2418484 2320057 2671519 3006987 2711351 1938217 1414509 1436923
36337 1436923 1666153 1842828 2059313 2274218 2172512 1680666 1146486 846731 717210
36328 717210 685564 854900 1204415 1481880 1559268 1581365 1636720 1592851 1373888 1105295
36318 1105295 891577 743278 768364 1085361 1495527 1642329 1577711 1724038 2144069 2346045
36308 2346045 2048401 1648640 1592793 1712264 1605183 1321655 1194454 1239681 1216863 1136551
36298 1136551 1235066 1501133 1653242 1599391 1559364 1680542 1825159 1802274 1584297 1253899
36288 1253899 938364 825061 1046363 1495552 1894829 2065219 2007186 1741485 1260144 690946
36278 690946 360562 562517 1254289 2020207 2390194 2264973 2010327 2047854 2397752 2771773
36268 2771773 3045795 3352455 3679789 3741716 3425424 3046574 2909077 2899517 2820048 2832956
36258 2832956 3158188 3546032 3557412 3283802 3271382 3712402 4224395 4539895 4899655 5525912
36248 5525912 6173905 6575529 6981150 7813630 8974126 9928559 10400356 10556412 10503386
36239 10503386 10042035 9107424 8126117 7626608 7616437 7619362 7321034 6939277 6859171 7076018
36229 7076018 7194224 6936995 6456441 6074117 5888112 5789140 5743141 5827196 6006457 6114854
36219 6114854 6111172 6127919 6171953 6030354 5660338 5427305 5652012 6093709 6268614 6196484
36209 6196484 6365760 6912780 7357381 7391040 7442926 8038020 8945158 9498518 9572893 9668692
36199 9668692 10087430 10604860 11029313 11511620 12104850 12539965 12745931 13158299 14141092
36190 14141092 15441323 16602955 17649192 18957642 20663718 22568492 24495258 26433887
36182 26433887 28509745 31082862 34622489 39167841 44221942 49553349 55720432 63300154
36174 63300154 72037812 81518243 92395468 106089696 123404692 144380930 169542045
36167 169542045 200389320 238580828 285300241 340604325 400788373 455271190 488569759
36160 488569759 489044559 457240796 405306603 348248502 295847476 251264821 214212823
36153 214212823 183716506 158851138 138711093 122430742 109129795 97872025 87853736
36146 87853736 78614143 70042153 62281789 55565466 49916607 45027487 40594430 36641350
36138 36641350 33263631 30252905 27378953 24892055 23224065 22207881 21116910 19556495
36130 19556495 17840461 16390133 15246391 14317203 13613349 13017211 12256104 11343749 10637235
36121 10637235 10217645 9658660 8726078 7873691 7619749 7768870 7723659 7325703 6892913
36112 6892913 6570224 6165828 5642428 5310060 5370908 5564358 5456671 4954623 4392991 4136862
36102 4136862 4163015 4090019 3664745 3135503 2975171 3267172 3608875 3665644 3547295 3515217
36092 3515217 3575546 3537785 3264415 2701789 1900293 1200021 1140028 1886973 2902635 3442019
36082 3442019 3273629 2711349 2121748 1682838 1487923 1557273 1769916 2006544 2301531 2671203
36072 2671203 2935421 2969438 3000338 3331759 3846581 4120873 4022835 3875178 3971878 4203479
36062 4203479 4236752 3869185 3173186 2463768 2100976 2118784 2095786 1648983 1017395 840103
36052 840103 1330629 1999693 2283287 2130368 1829357 1550516 1281188 1017670 802695 672887
36042 672887 695479 938670 1311105 1576299 1622316 1565704 1509549 1399858 1242861 1243003 1526151
36031 1526151 1885237 2002143 1798536 1393159 872337 338462 50763 210748 628964
36022 628964 871263 767089 560942 534311 692403 881466 1004717 1006989 807097 400382
36012 400382 -42095 -296548 -286170 -96135 171579 486166 834414 1132979 1243464 1110897
36002 1110897 871013 737766 756714 774383 712008 720391 920451 1143684 1172894 1131636 1300606
35991 1300606 1569821 1481625 938448 455484 446816 624070 494716 182397 245224 795525
35981 795525 1342426 1555755 1680694 2022665 2459615 2728864 2847933 2939990 2912964 2653682
35971 2653682 2350609 2274007 2343572 2233261 1841570 1371513 997692 741734 647968 779473
35961 779473 1002693 1039457 813872 560267 528427 726785 971129 1046333 845934 511855
35951 511855 379523 588214 821460 683066 252160 -56627 -136901 -288122 -617892 -781785
35941 -781785 -506601 -14097 309092 365567 237273 -80659 -533959 -822028 -683739 -247936
35931 -247936 156364 419963 658517 929847 1175668 1336499 1337144 1099289 741851 565636
35921 565636 624523 558990 147197 -238125 -120413 335749 536412 292100 -56977 -284073
35911 -284073 -487873 -616338 -366966 222901 596216 414817 94785 241460 825789 1280683
35901 1280683 1215025 688822 -54798 -749194 -1064640 -795416 -172029 261467 189742 -188269
35891 -188269 -458645 -437280 -255159 -124196 -134976 -255841 -422745 -565600 -591817 -464113
35881 -464113 -329211 -427487 -761215 -999049 -908085 -740673 -876191 -1155042 -1012727 -367638
35871 -367638 106015 -118061 -650085 -764558 -467982 -421126 -876742 -1292262 -1152203 -682294
35861 -682294 -440342 -529846 -588599 -389521 -90317 96058 198002 381063 705259 1050677
35851 1050677 1209503 1047314 646905 274823 125438 126338 81347 -50501 -155322 -207790
35841 -207790 -330106 -571509 -796815 -875717 -848986 -814040 -764633 -652575 -510633 -403354
35831 -403354 -336175 -301507 -305497 -252286 41656 557567 960767 1002917 891423 964542 1117041
35820 1117041 932283 355474 -194822 -456421 -622717 -853049 -939516 -752759 -614286 -818727
35810 -818727 -1084967 -939605 -447328 -93041 -66541 -138842 -172913 -250100 -281276 -17651
35800 -17651 429408 567862 235506 -97648 -10730 264264 273154 77155 126716 538425
35790 538425 923125 947983 737249 622553 731195 954232 1179580 1395863 1576750 1573750
35780 1573750 1221686 575023 -40120 -306989 -221762 -19650 153372 334206 518574 552115
35770 552115 332372 -25832 -313137 -398501 -232573 152709 551046 660871 419882 147637
35760 147637 183829 457064 592434 424917 221460 321479 667392 823915 490559 -88932
35750 -88932 -346006 -30377 498230 707237 488737 167804 29445 64522 138296 160987
35740 160987 74793 -97728 -158506 81566 475057 642645 488260 353061 517685 787779
35730 787779 772897 412744 18167 -128594 -56327 -22578 -221441 -536701 -616609 -314369
35720 -314369 29237 -8244 -295368 -281651 182826 585607 493200 150042 41181 194564
35710 194564 290704 229905 203338 340679 619578 1000526 1346726 1352737 891903 330871
35700 330871 158499 367617 518953 353426 24386 -224564 -289788 -146095 131465 294860
35690 294860 161643 -88513 -129268 46297 175012 177432 204058 262453 216302 193924 539746
35679 539746 1193720 1529739 1083358 157219 -561234 -763395 -643701 -452695 -242689 -8534
35669 -8534 184610 285325 350840 495494 762514 1058505 1229550 1206964 1027444 708626
35659 708626 246084 -196165 -291838 61723 520788 687218 581652 472609 413075 312076
35649 312076 325627 691148 1180381 1228713 731419 238458 155324 192596 -95016 -594265
35639 -594265 -830605 -639830 -285360 -46098 14606 -35263 -71432 19549 182412 224038
35629 224038 143026 233347 654116 1091631 1117789 742088 328510 77515 -103519 -274329
35619 -274329 -332157 -250242 -187202 -264104 -395935 -420309 -283931 -60343 122417 143297 -36991
35608 -36991 -319856 -518558 -478441 -169325 267206 549909 457672 81364 -205432 -117329
35598 -117329 249778 549346 539537 259576 -64742 -227878 -219296 -227129 -401784 -628015 -659817
35587 -659817 -475977 -316078 -319051 -327000 -146137 169515 407167 430491 247881 -1472
35577 -1472 -72028 182257 556311 677367 526458 494759 774336 1010799 811496 318040
35567 318040 -43559 -154821 -187195 -169753 10834 246041 243823 -31722 -275650 -256062
35557 -256062 -61020 110407 169918 105478 -59278 -207241 -203662 -82555 -8682 -15537 76605
35546 76605 425232 936028 1303571 1260858 846967 456745 489230 864236 1058835 753365
35536 753365 239406 -7986 51432 110904 41499 -21608 -19874 -35858 -39213 104990 365042
35525 365042 565742 678524 802954 869591 676337 254337 -98739 -208923 -196010 -217374
35515 -217374 -283220 -343271 -328957 -144310 134379 157892 -239662 -597546 -330316 362926
35505 362926 674627 354185 50366 252481 553050 404861 38417 17810 281843 312482
35495 312482 53126 -22504 268941 536051 448295 164580 -34057 -150312 -317538 -530556
35485 -530556 -714951 -856889 -914860 -776223 -437838 -94631 66498 54251 -29123 -160017
35475 -160017 -351267 -511265 -474653 -200135 111890 160717 -146164 -545379 -663933 -423284
35465 -423284 -96265 51868 28276 -35196 -110308 -222592 -316294 -314611 -212591 -16601 254896
35454 254896 420960 231233 -217458 -431912 -162022 177041 91834 -216804 -155455 327348
35444 327348 675791 593503 392748 354885 308980 88989 -105706 -137263 -259920 -623751
35434 -623751 -849328 -575668 -112557 -9118 -200452 -164927 200539 482027 511318 594873
35424 594873 854043 935891 650750 394695 576571 1004046 1217537 1133774 970813 787942
35414 787942 529191 350095 447577 634056 503512 22017 -423141 -587479 -613916 -645198
35404 -645198 -553876 -210909 255756 632565 839406 861944 684511 409151 228830 167501
35394 167501 61007 -105882 -106824 147077 426183 567623 733614 1026700 1164678 915560
35384 915560 603347 706263 1086590 1141764 725004 393742 583493 983759 1028740 707934
35374 707934 534007 815635 1264866 1365003 960262 393216 103157 182287 404542 625382
35364 625382 926887 1290782 1412280 1104280 688858 637333 926868 1125089 1051338 935655
35354 935655 917098 847749 706435 749258 1028845 1158797 838487 295781 -82361 -280415
35344 -280415 -502280 -720271 -709847 -393243 112950 646801 985032 895222 468418 179325
35334 179325 313613 557211 498874 300586 407916 753892 795769 342809 -163077 -302476
35324 -302476 -187654 -162280 -339341 -595514 -733952 -524195 123039 878830 1192432 948751
35314 948751 671242 878790 1482699 2030814 2314918 2470123 2639917 2831309 3033394 3250732
35304 3250732 3452307 3647124 3940631 4346628 4613165 4434359 3826462 3137521 2683255
35295 2683255 2499413 2440375 2375949 2255380 2084963 1903409 1738882 1565987 1331431 1032036
35285 1032036 754142 627071 707349 871771 868480 570900 171847 8242 175092 439034
35275 439034 565958 578413 608937 662518 677665 714049 895701 1200858 1459358 1554495 1505230
35264 1505230 1344692 1036423 565246 65724 -184503 51393 706927 1331218 1419123 924100
35254 924100 333720 118550 219852 238552 9499 -256147 -350740 -306985 -202316 14452
35244 14452 369702 729222 968771 1148637 1384969 1665934 1921790 2154035 2358504 2452143
35234 2452143 2437563 2498465 2723019 2873690 2718390 2496536 2696014 3362784 4018821 4375381
35224 4375381 4745233 5522638 6586947 7551023 8376213 9371483 10693142 12183801 13644930
35215 13644930 14941164 15854375 16160367 15900367 15325761 14560005 13577315 12508026 11621225
35206 11621225 10919466 10084741 8989310 7988315 7527393 7686222 8263120 9054622 9842728
35197 9842728 10332399 10353738 9986156 9307976 8224178 6761093 5320539 4339241 3807951
35188 3807951 3384194 2870039 2322553 1805800 1331266 998668 933858 1099064 1349644 1605008
35178 1605008 1782694 1714295 1392805 1159280 1311437 1632172 1677313 1453262 1372478 1539831
35168 1539831 1573265 1267727 979944 1091738 1433115 1545307 1294228 938267 733040 716908
35158 716908 796641 843223 756488 571998 443941 434181 421929 319667 255551 399077 675678
35147 675678 793763 562783 133241 -93304 163718 731701 1097102 942516 472297 77633
35137 77633 -150620 -324093 -343859 -390 534262 751779 451247 -32761 -360596 -558956
35127 -558956 -699058 -617225 -241236 130881 202445 100859 151432 437909 833284 1231111
35117 1231111 1480248 1343771 847145 450339 522279 815715 810806 422118 6902 -177432
35107 -177432 -131088 142304 596037 888138 627615 -58778 -579435 -578807 -260919 43104
35097 43104 265619 430110 433531 235764 53715 136213 441751 690945 682561 472740 286242
35086 286242 285793 396938 390154 180182 -53925 -136007 -129507 -142923 -69110 219618 545279
35075 545279 619853 505696 527976 724344 744768 382228 -122194 -430693 -487755 -408203
35065 -408203 -232930 36601 333528 585566 750959 752347 558669 356114 390812 586832
35055 586832 599853 342482 146268 242772 394304 284119 17782 -62615 106970 287848
35045 287848 332967 321637 326546 285571 138907 -58003 -194200 -208681 -152910 -177203 -378293
35034 -378293 -633201 -707191 -562657 -393558 -297465 -137216 151025 361703 342814 296075
35024 296075 469831 706731 633717 246592 -32582 70876 331394 356358 84416 -175561
35014 -175561 -108081 290685 715483 846700 662017 412980 269086 119946 -155158 -380337
35004 -380337 -279756 95167 402547 471171 461866 526913 583971 543802 510890 580881 646830
34993 646830 620023 658706 896662 1072994 794631 171562 -183317 63987 497452 504182
34983 504182 62621 -341391 -434778 -392961 -362068 -164129 351599 975466 1384428 1501251
34973 1501251 1398486 1087873 690492 587908 992840 1471303 1341539 577202 -109552
34964 -109552 -192854 71705 177302 97917 142805 342833 410563 243626 94012 179471
34954 179471 403135 575266 719747 985628 1317390 1390243 977143 334528 57060 431065
34944 431065 1033990 1167149 657837 24374 -163132 146815 598718 840317 696878 196698
34934 196698 -371503 -614781 -458967 -266232 -342714 -503486 -366805 64943 400696 367224
34924 367224 72641 -188556 -181403 145599 552277 598542 107438 -511953 -677615 -336994
34914 -336994 36751 127188 95167 158203 238531 227551 279222 541529 786333 624845 38250
34903 38250 -547885 -709261 -369306 260659 876732 1200357 1121303 843032 747730 969620
34893 969620 1182655 977984 417532 6203 63341 342125 431448 340452 401472 682866
34883 682866 847563 647620 240561 -118378 -411835 -693295 -832831 -690220 -390879 -198282
34873 -198282 -223565 -430367 -752616 -1007223 -907686 -447433 -77569 -174792 -504319 -582971
34863 -582971 -407457 -356631 -471850 -381441 29477 416845 569086 682068 851581 811350
34853 811350 480637 300764 608660 1029465 953626 385220 -127963 -250938 -124097 31217
34843 31217 161660 254975 293874 329291 343681 122768 -435120 -974146 -1021096 -648005 -404081
34832 -404081 -549072 -758937 -710625 -555510 -580385 -729676 -776996 -749523 -837942 -990698
34822 -990698 -931369 -587401 -233545 -134583 -237222 -315007 -276339 -191497 -80257 169987
34812 169987 626025 1139890 1464064 1531946 1517658 1560197 1531250 1214375 669992 237046
34802 237046 124567 170156 110778 -59191 -181236 -281532 -563750 -1020152 -1298125 -1109789
34792 -1109789 -618892 -228179 -75016 35884 219326 283467 13692 -501988 -968395 -1179710
34782 -1179710 -1094358 -749002 -287767 1210 -97670 -453572 -687109 -564128 -171201 283897
34772 283897 676529 946714 1054004 1032265 970115 872546 648012 283108 -80126 -290846
34762 -290846 -309874 -157076 127604 430972 621017 704152 776348 788014 581875 250488
34752 250488 177627 510749 818856 571746 -166469 -819450 -999678 -820202 -529155 -179246
34742 -179246 218309 469779 341056 -144262 -652463 -767388 -297115 531964 1191495 1299436
34732 1299436 976282 642478 487357 328587 13205 -297857 -393961 -373025 -509899 -830381
34722 -830381 -1018976 -782989 -193502 379086 616005 514831 331700 279834 315703 269544
34712 269544 152662 204034 572562 1063968 1322075 1215183 932218 718534 632433 574880
34702 574880 450797 250623 44695 -56824 -7305 63571 -67964 -424590 -698761 -588426
34692 -588426 -234303 -104195 -386636 -739217 -788212 -630611 -560672 -499534 -130949 436740
34682 436740 648286 309186 -24302 231628 911482 1411615 1504408 1403906 1218603 869570
34672 869570 504213 446602 639269 625954 268910 24195 235109 568609 527820 200057
34662 200057 48299 168915 243313 146477 113149 235704 226522 -134320 -613199 -800364
34652 -800364 -597265 -255020 -50018 -59708 -170963 -201680 -67295 134260 279055 431701
34642 431701 725602 1027987 1000131 614913 333246 515689 871278 828302 347297 -13872
34632 -13872 128871 502061 601794 336244 36186 -23237 85587 79140 -212983 -620443
34622 -620443 -722755 -301850 290689 450114 80333 -248770 -93107 224729 110810 -396666
34612 -396666 -700519 -556972 -391001 -572834 -846794 -769185 -390733 -145985 -223046 -366286
34602 -366286 -255102 167630 731809 1209997 1433709 1374283 1146997 903446 747538 741331
34592 741331 862713 935825 784424 515843 437025 587546 616662 302603 -80811 -182369
34582 -182369 -97281 -108468 -114110 212065 762901 1005853 727466 328135 213505 270064
34572 270064 165362 -139105 -435775 -610107 -670558 -583291 -314040 37773 316565 468016
34562 468016 519097 495562 449912 452220 453920 292336 -49794 -314899 -243533 107223 440457
34551 440457 550498 485876 440612 541075 685279 609162 240747 -60679 125389 644592
34541 644592 828782 345686 -322531 -496307 -135616 250686 340452 279900 308174 441773
34531 441773 557545 554984 414066 242997 212346 288748 164181 -319081 -807369 -815328 -398168
34520 -398168 -95401 -197468 -415951 -359604 -19592 349082 557521 531836 252660 -164157
34510 -164157 -456628 -437597 -163728 164413 372468 386425 301328 376004 748563 1141917
34500 1141917 1114225 663761 288343 313038 462356 314676 -85322 -351026 -302526 -97793
34490 -97793 59137 67451 -109171 -357627 -378869 -21578 410602 482536 213138 7038
34480 7038 12585 -54394 -340258 -511817 -246632 230400 434371 270398 54544 -20871 -74427
34469 -74427 -171356 -137729 104865 302939 220291 56168 222881 749485 1187642 1173874
34459 1173874 854440 620794 603209 616054 494263 257901 -29222 -335278 -545532 -477755
34449 -477755 -130847 230273 380212 413041 556325 793942 890014 782353 721611 913751
34439 913751 1189141 1195386 849683 431054 221354 205587 192774 115851 77889 126792 123552
34428 123552 -91720 -462983 -734899 -707691 -419341 -65718 198895 340454 373881 299994
34418 299994 132768 -75539 -288792 -524417 -759646 -824525 -520417 87843 607047 679625
34408 679625 379476 121190 197422 543893 937036 1213889 1248185 953779 476047 190195
34398 190195 292482 527433 552931 450345 571564 944569 1189113 1071574 804077 663517
34388 663517 615542 503071 347433 226666 57432 -243172 -523584 -576736 -436794 -254763
34378 -254763 -3905 394705 736955 674527 207845 -274318 -511688 -632230 -795021 -881769
34368 -881769 -747360 -543112 -526238 -668876 -703136 -505149 -219686 -8348 134273 268908
34358 268908 369775 386070 358459 365653 373576 247959 -18873 -169705 77283 617936 951117
34347 951117 705223 66344 -467591 -642943 -552698 -309921 38301 287722 176976 -158731
34337 -158731 -221534 132349 378349 64038 -461826 -522427 -92023 248664 246626 259366
34327 259366 526245 762229 736751 731987 1024055 1306015 1114552 577912 222323 162108
34317 162108 17826 -348324 -544662 -285870 99894 107259 -247796 -486917 -324850 15532
34307 15532 148338 -25389 -286163 -393645 -314727 -183082 -122106 -166364 -320671 -576599
34297 -576599 -814495 -809710 -483150 -87492 38887 -87599 -87362 274479 729337 794436 350267
34286 350267 -204137 -376335 -84842 290712 344097 86209 -106582 16091 278164 368408
34276 368408 277458 219101 209416 47626 -251775 -351898 -78824 275196 363554 263650 265525
34265 265525 375456 370567 234550 163949 162711 12599 -280034 -373138 -99773 208150 157904
34254 157904 -140812 -228612 84605 513844 692377 547521 250277 -21572 -174832 -167318
34244 -167318 -3534 237489 416130 402941 180464 -88945 -147360 111515 480062 625122
34234 625122 482924 370831 608388 1077108 1284708 892322 90496 -584759 -737879 -391640
34224 -391640 102716 336574 113798 -404764 -837326 -953840 -872517 -792851 -649494 -260849
34214 -260849 226174 364229 -6530 -467434 -513668 -146189 233409 353956 265787 130225
34204 130225 77704 196360 407961 416026 44093 -417167 -499332 -194849 16787 -148939
34194 -148939 -403140 -347969 -29857 216852 279175 331550 479956 608460 591157 454035
34184 454035 267203 16957 -323163 -658566 -802656 -649429 -270657 180612 608041 940844
34174 940844 1023323 721107 197403 -110611 41554 384080 454358 142977 -258156 -443098
34164 -443098 -319281 35246 385752 414648 79601 -184374 49865 597178 931557 978947
34154 978947 1117320 1369367 1230990 533679 -125146 -213541 -37211 -193799 -637193 -836034
34144 -836034 -617956 -307617 -158526 -146763 -250186 -465272 -574505 -320011 178951 521746
34134 521746 511071 238299 -199379 -683640 -895025 -621972 -210881 -217513 -596226 -748630
34124 -748630 -451133 -183436 -341730 -648724 -663768 -452981 -353150 -362105 -193366 192440
34114 192440 483557 446084 210372 70598 117880 151397 -16643 -206200 -6516 621784
34104 621784 1137904 1101438 821993 880605 1173406 1044982 381791 -106532 78373 512682
34094 512682 532292 142666 -158407 -92463 253423 669933 854668 516140 -183876 -597021
34084 -597021 -364734 79895 150443 -113907 -340052 -499113 -726914 -793522 -422002 59382
34074 59382 67381 -333335 -539768 -359900 -161130 -79630 159632 506930 443326 -128623
34064 -128623 -532666 -269741 247006 377667 199929 235208 586202 916950 1078101 1186627
34054 1186627 1154771 669876 -251443 -1057606 -1186916 -630199 125422 607345 746260 802702
34044 802702 967052 1120518 1069215 894155 839366 899110 815984 519259 235438 74523
34034 74523 -130020 -401965 -424733 -42880 362528 347815 18304 -178299 -62967 222897
34024 222897 573085 912766 993093 654608 236090 252108 637633 764991 316856 -276174
34014 -276174 -452822 -223611 -12128 -48369 -186925 -193778 3646 293914 479858 449846
34004 449846 306867 240230 249445 144313 -132168 -351068 -263145 110539 531094 762805
33994 762805 689863 374351 83696 100603 392875 607230 494404 193014 -26496 -131788
33984 -131788 -261218 -409712 -402475 -158750 176965 377294 333921 156045 102408 305163
33974 305163 520096 347887 -184934 -524320 -308644 58114 -61158 -590540 -831923 -503073
33964 -503073 -129153 -198002 -443789 -367735 -84145 -112630 -511900 -779350 -612493 -266627
33954 -266627 -42026 127003 348032 424476 167151 -200515 -309296 -179831 -148759 -324638
33944 -324638 -458135 -373525 -210631 -128172 -22131 285790 734689 1076501 1169183 1079512
33934 1079512 927650 747120 519349 289094 196148 347318 637178 773305 581531 244071
33924 244071 100526 226039 368058 324827 195332 148682 108684 -143844 -603172 -946269
33914 -946269 -866926 -438757 -78327 -114458 -412919 -517498 -205301 226804 350970 139271
33904 139271 -114580 -280006 -459667 -612822 -525217 -248612 -147473 -313850 -358194 -77718
33894 -77718 84962 -318206 -985180 -1274750 -1121588 -946691 -823786 -427173 196117 515371
33884 515371 338904 105038 116104 106744 -100091 -130186 281947 718905 737288 628880
33874 628880 855589 1114586 777359 36934 -285262 -62011 -55153 -576147 -868147 -312649
33864 -312649 512237 673257 241099 8861 177355 206256 -73194 -84816 480905 993136
33854 993136 712509 -136497 -660843 -454027 44050 277920 199937 70326 7042 -50327
33844 -50327 -133507 -211530 -268170 -265392 -104375 243097 614190 783770 684051 414422 100446
33833 100446 -143859 -189715 -4530 225759 257785 96460 -15496 59891 194395 226222
33823 226222 168848 91456 -28621 -191218 -266021 -176418 -72374 -130449 -272890 -285180 -141948
33812 -141948 -1056 79326 180086 277349 196605 -126618 -517588 -753916 -754949 -574360
33802 -574360 -360006 -300060 -402869 -351277 149669 859937 1178185 935763 648996 761248
33792 761248 999251 847004 379495 140177 297721 426589 188304 -197488 -332975 -174947
33782 -174947 24236 92629 44338 -57988 -162757 -219985 -237551 -293583 -412143 -492849 -435309
33771 -435309 -273300 -131800 -107195 -215630 -385914 -488030 -452283 -356173 -289009 -165449
33761 -165449 152935 560753 760523 658312 469178 349727 204991 11658 23717 369248
33751 369248 678840 494379 -54959 -356592 -87075 438285 711747 533230 22833 -558812
33741 -558812 -895560 -794180 -436957 -258025 -428345 -641911 -543593 -182845 119531 197906
33731 197906 157441 175247 336125 569765 643436 355426 -153389 -472578 -467610 -522615 -979532
33720 -979532 -1552474 -1679651 -1332321 -1018874 -987990 -924433 -592699 -303112 -393093 -589659
33710 -589659 -348396 318755 804731 704002 272150 4455 78049 361302 694752 924260
33700 924260 845656 414135 -46702 -114258 223844 547929 553981 402985 388730 458980 319812
33689 319812 -63147 -355768 -307919 -85257 -10340 -124637 -178466 14835 364021 609186
33679 609186 538585 139447 -358149 -630194 -560460 -342069 -166047 89553 647243 1354708
33669 1354708 1702524 1397279 694426 50309 -348230 -553563 -556889 -273738 225276 674413
33659 674413 828281 634749 236796 -120625 -266103 -277145 -382403 -596491 -619126 -282718
33649 -282718 68694 -46097 -554360 -855123 -593775 -107062 41270 -270721 -688932 -836410
33639 -836410 -617198 -193657 158607 240226 105454 -7760 -5455 -72383 -355386 -657813
33629 -657813 -665012 -404380 -237894 -372075 -582751 -520585 -159562 165161 108610 -359981
33619 -359981 -935945 -1225030 -1049163 -578509 -173255 -63336 -163581 -208433 -68079 113723
33609 113723 160411 204145 605139 1415195 2099730 2073128 1462984 1005242 1099268 1319503
33599 1319503 1085037 492235 105183 110167 144750 -43252 -228748 -167477 -59779 -264621
33589 -264621 -735311 -1041528 -929273 -635797 -572016 -795785 -911414 -529395 226830 796823
33579 796823 807751 472737 241120 222084 203645 123711 158990 327062 376443 214819 119608
33568 119608 305590 549998 511157 220879 -16030 -65806 -37960 -30978 -78822 -259336 -575003
33557 -575003 -787531 -656389 -312672 -121851 -200199 -357568 -497704 -718908 -961557 -940565
33547 -940565 -599735 -295024 -279965 -296238 2473 428568 454794 -37365 -580731 -740916
33537 -740916 -588847 -433410 -359665 -248585 -80640 45937 152168 385015 728607 900211
33527 900211 669963 187200 -155707 -154471 32869 132497 50609 -101895 -164478 -49706
33517 -49706 202756 434366 491150 373928 199102 15611 -201423 -360210 -273475 16749
33507 16749 159068 -58253 -365988 -387197 -194884 -151909 -280848 -213952 178153 523031
33497 523031 489956 253762 163712 216055 163468 -19353 -105342 9708 183161 280613 322773
33486 322773 335468 247202 30927 -167113 -147038 121366 454386 643129 656866 621442
33476 621442 616143 597800 563034 615453 722696 593470 88141 -373777 -225351 435093
33466 435093 905507 858767 749621 994201 1273900 1117682 751729 743107 1026178 961413
33456 961413 338618 -301884 -462054 -272436 -107635 -66725 -69735 -115637 -196563 -207166 -123058
33445 -123058 -47970 24128 215453 428425 345559 -60833 -360250 -237096 80159 221165
33435 221165 195764 197033 159302 -100540 -479862 -706382 -742887 -737245 -677118 -445902 -151443
33424 -151443 -46790 -145249 -228890 -219137 -226400 -246232 -143177 26949 3679 -281640 -562569
33413 -562569 -572617 -293692 164478 655929 912593 684066 103708 -351994 -423280 -339757
33403 -339757 -377050 -414817 -182523 260338 576475 577806 358999 82141 -146589 -234485
33393 -234485 -151287 -17348 19102 -12728 47563 267155 567017 851000 1044764 1041808 780596
33382 780596 392236 133894 137400 307751 466430 499850 383601 182050 32252 16572
33372 16572 38641 -69415 -310485 -509145 -545508 -469739 -354333 -188300 -3653 31520
33362 31520 -209298 -600672 -856435 -808718 -513067 -124453 217127 403650 401955 316664
33352 316664 307596 394061 425879 308435 170155 200471 361783 389705 112669 -311495 -532399
33341 -532399 -343158 152272 663549 953715 974217 820073 587660 297392 -29891 -263841
33331 -263841 -234353 43233 296848 256046 -37722 -272942 -228245 -6602 120455 29148
33321 29148 -154152 -227517 -123415 61425 198953 248620 241399 202308 162593 231585 528087
33310 528087 967255 1228687 1083877 706652 493133 576147 695798 600303 393159 354021
33300 354021 533918 686433 566394 190137 -176673 -220728 169200 755870 1105014 996137
33290 996137 661986 523132 714907 993258 1093664 1043086 1074898 1339142 1759555 2121147
33280 2121147 2254422 2162726 1987079 1843936 1753629 1776100 2105280 2855420 3791119 4490876
33270 4490876 4834526 5122310 5596793 6039655 6029194 5465391 4626206 3790464 3045904 2437757
33260 2437757 2039938 1817790 1635026 1473822 1444169 1488692 1327979 884529 536641 665657
33250 665657 1089882 1287735 1132472 1011903 1130848 1099838 511467 -327269 -634083 -93314
33240 -93314 762570 1199037 1078539 867514 983155 1333733 1532942 1434021 1298312 1398878
33230 1398878 1601489 1530893 1125423 771642 780548 971097 988933 844450 826963 990204
33220 990204 1079518 969366 824920 762166 687124 595312 686555 975701 1104305 826480
33210 826480 432446 359302 575128 719562 715907 811180 1034372 1061397 735854 358653
33200 358653 264784 375125 378896 173093 -91628 -285070 -423180 -566107 -724174 -853754
33190 -853754 -894883 -850992 -831264 -917458 -992069 -844791 -474383 -120060 50020 96271 93977
33179 93977 -8795 -185597 -207120 56691 351652 292521 -160258 -664386 -889029 -786839
33169 -786839 -525882 -303368 -192427 -67212 242316 627007 691390 251688 -323240 -534836
33159 -534836 -398763 -341801 -517441 -613125 -405136 -134751 -144742 -407347 -627898 -634846 -465937
33148 -465937 -205735 62051 220994 210530 114289 56739 56087 46904 -11668 -90334 -77560
33137 -77560 170213 607104 841666 472569 -328986 -862262 -708632 -237276 -56289 -215625
33127 -215625 -298673 -112227 145691 335465 543723 741845 677368 266842 -197825 -405451
33117 -405451 -360016 -214658 -1140 283939 489853 414358 36762 -449391 -766561 -703334
33107 -703334 -300400 75557 52589 -276948 -425528 -133233 329220 582545 554627 311239
33097 311239 -156318 -671922 -755425 -210545 402560 378586 -190429 -593784 -522416 -326952
33087 -326952 -263992 -149705 60756 3293 -427304 -697345 -409112 -25316 -248618 -962927
33077 -962927 -1398215 -1204494 -761341 -448293 -201647 91326 286182 298383 323889 483697
33067 483697 555018 317878 -67571 -283622 -275164 -216070 -201384 -191286 -153861 -79440 45760
33056 45760 127849 -30136 -418539 -652979 -365094 302726 824494 883987 636167 401136
33046 401136 312893 290299 173058 -144606 -570935 -811985 -674437 -359330 -251427 -408553
33036 -408553 -503859 -340703 -157848 -257813 -550050 -698851 -592896 -410758 -271981 -86288
33026 -86288 197648 397387 278107 -151218 -610166 -790218 -603868 -239516 7807 -623
33016 -623 -140466 -207075 -167752 -136731 -113065 87878 532483 922489 852462 318016 -211871
33005 -211871 -306371 -14571 316969 526512 722025 939258 1000472 825026 657087 770391
32995 770391 1056239 1130539 819456 331380 -59907 -288919 -395089 -359560 -195512 -62327
32985 -62327 -101878 -204459 -97631 308744 758910 869908 497657 -96415 -437249 -261121
32975 -261121 212919 506350 413777 204793 216077 380147 339715 -36050 -468159 -626339
32965 -626339 -482583 -227877 7610 214121 361020 350153 143646 -126037 -228745 -50957
32955 -50957 252970 372687 167263 -152085 -250021 -57767 178491 242530 190785 185091 233868
32944 233868 245422 249879 380976 634414 810188 764728 604005 521979 516107 399101 98385
32933 98385 -189064 -226061 -40023 125252 134671 84279 61127 -46860 -362343 -757092 -971329
32922 -971329 -946517 -837046 -703652 -440806 -79117 96264 -85737 -375040 -394870 -138382
32912 -138382 75931 90876 72487 150557 177208 -4469 -247696 -263723 -2012 322587
32902 322587 544307 708135 906110 1115991 1267338 1346707 1347259 1199517 865686 469243
32892 469243 223997 227462 399020 618597 828376 969894 932592 665145 295086 40486
32882 40486 -6569 40112 -1788 -189349 -375735 -314466 88897 588008 754720 420799
32872 420799 -123048 -481760 -597638 -653963 -653829 -419502 -35114 69002 -332873 -881562
32862 -881562 -1044725 -739487 -315810 -75925 -73433 -266021 -558971 -743341 -683119 -550705
32852 -550705 -597617 -712109 -543493 -107270 117594 -145353 -557231 -664472 -516519 -461819
32842 -461819 -552639 -546683 -390734 -286064 -265381 -106121 220079 372624 133061 -214778
32832 -214778 -286414 -172281 -241114 -453968 -313284 387106 1148451 1383827 1177061 1040035
32822 1040035 1064973 822218 167727 -368148 -313519 9621 -52874 -505268 -722843 -423507
32812 -423507 -61830 -90443 -316194 -307828 -81359 28328 -32801 4051 233790 412147
32802 412147 328822 75238 -119996 -132621 3289 117953 2936 -328000 -518756 -254853
32792 -254853 249034 436373 129012 -248245 -275757 -56244 76330 69187 57993 -31181
32782 -31181 -381224 -824873 -880012 -364497 302119 585862 446570 272819 319811 413933
32772 413933 209156 -403200 -1165562 -1648172 -1565298 -998701 -359514 -67443 -197533 -447178
32762 -447178 -474409 -242335 5296 74644 43630 120801 343940 508797 422698 169657
32752 169657 47757 232626 563536 709976 511727 88822 -349893 -683841 -841595 -742333
32742 -742333 -420578 -126851 -107022 -263274 -215888 207597 688134 767280 408731 33800
32732 33800 -11998 140907 124774 -133429 -310546 -152640 145025 203326 10363 -64401
32722 -64401 153515 359342 255116 46800 114326 357550 319720 -56782 -278846 -39373
32712 -39373 341501 459910 414292 490850 578813 353534 -121219 -423158 -357139 -131417
32702 -131417 34650 127566 158048 100055 51298 154254 321179 325179 181167 118972 154500
32691 154500 53031 -206146 -318604 -153642 10726 -47485 -143339 -41567 155298 244571
32681 244571 241886 157997 -226572 -961673 -1556293 -1491164 -968243 -656351 -739203 -733477 -328139
32670 -328139 102773 67215 -336329 -590005 -425880 -44094 217899 196323 -51233 -301863
32660 -301863 -291108 48932 455718 557280 249958 -226317 -589820 -783942 -902749 -973381
32650 -973381 -949715 -880825 -907140 -1024596 -1006603 -695554 -256093 38558 172408 295766
32640 295766 338734 66441 -419057 -613405 -260353 246691 406537 291699 312316 486951
32630 486951 422953 6663 -347611 -275274 64872 290063 307090 306105 409852 540873 555918
32619 555918 365783 -7012 -374056 -464961 -198166 170019 279593 48698 -244159 -259998
32609 -259998 54525 425960 557654 460859 409538 527478 560732 238234 -230847 -311060
32599 -311060 147877 643221 661204 365017 324065 640592 737373 156583 -742317 -1195759
32589 -1195759 -1004354 -700188 -709695 -768222 -439305 104054 279147 -29229 -288965 -97055
32579 -97055 320749 580795 689254 804538 800463 484466 42102 -155730 -75070 21872
32569 21872 32114 45643 14544 -193701 -443418 -445919 -233490 -110356 -114555 23866 318631
32558 318631 401492 128287 -135932 -76716 109649 80643 -165810 -439903 -675920 -808636
32548 -808636 -639138 -160275 236228 223541 -540 -51998 59820 77154 33090 179913
32538 179913 434355 358543 -205344 -821790 -942045 -507817 36223 223103 1899 -245638
32528 -245638 -136059 250083 449783 217762 -152125 -251300 -101898 -51719 -264747 -557341
32518 -557341 -662492 -468064 -78897 212216 154703 -119611 -194698 23939 97283 -275022
32508 -275022 -690527 -579484 -72002 169588 -139238 -659751 -1029156 -1207695 -1236678 -1132791
32498 -1132791 -1058209 -1154930 -1195628 -852994 -305826 -55972 -137885 -123093 22350 -189298
32488 -189298 -808449 -1117274 -686391 -92106 -27467 -281465 -257540 -10574 7955 -113800
32478 -113800 75667 440981 349485 -263033 -709156 -577906 -223779 -5023 262895 724552
32468 724552 977109 665829 151951 28650 247503 274137 -49323 -349511 -403043 -449604
32458 -449604 -692045 -898646 -747258 -313180 39234 120745 51140 -8063 -37087 -42049 64748
32447 64748 337602 627072 701674 568030 518583 745731 1024874 986461 678170 600032
32437 600032 1062661 1716152 1936759 1586236 1141020 1056288 1228456 1206281 799003 307700
32427 307700 155203 391555 635458 507961 70420 -251417 -186713 64119 128199 -46324
32417 -46324 -183142 -102191 88910 238846 324456 298071 42976 -349741 -521904 -313020
32407 -313020 -63648 -157243 -461023 -596162 -590170 -761681 -1011421 -811526 -38340 722542
32397 722542 959317 850587 784921 725303 485979 250645 273410 329961 44131 -404149
32387 -404149 -496726 -232523 -151984 -470052 -788123 -818909 -833518 -1122240 -1472614 -1506660
32377 -1506660 -1205565 -817250 -518546 -399776 -501339 -641824 -498822 -85744 157318
32368 157318 -11817 -261819 -237572 -134080 -314485 -642138 -681714 -403746 -201041 -258274
32358 -258274 -340809 -220684 48307 297541 378628 146293 -384201 -874658 -963278 -714698
32348 -714698 -479027 -355806 -162175 83834 79868 -259957 -600039 -632148 -418400 -150649
32338 -150649 118455 343419 390587 275509 235021 366564 446782 308760 131055 103283
32328 103283 66126 -195460 -505582 -515044 -251503 -82448 -171647 -327963 -407687 -511768
32318 -511768 -685923 -743900 -573248 -390718 -480707 -813597 -1113422 -1210791 -1140608 -944669
32308 -944669 -585414 -93627 352162 582231 598835 514226 376831 138172 -218245 -590319
32298 -590319 -839389 -933094 -962829 -1010246 -1035680 -946949 -765326 -637229 -631754 -615262 -453997
32287 -453997 -295546 -450078 -933353 -1333646 -1301361 -1020487 -952192 -1181292 -1303102 -994825
32277 -994825 -427327 17733 221799 333586 443204 474839 378485 259304 265741 406020
32267 406020 506179 369739 10162 -316804 -386706 -252121 -97530 58415 303592 543728
32257 543728 572412 435143 388491 433800 265433 -182246 -536600 -553388 -480751 -562596 -581331
32246 -581331 -290763 61365 124215 51419 188025 423563 459870 484614 854836 1248457
32236 1248457 972064 160701 -210691 230106 638186 228770 -567810 -844593 -535663
32227 -535663 -260055 -216120 -23511 439635 758430 644531 348058 225680 263305 227180
32217 227180 66276 -16074 184881 622122 978404 947892 582300 259579 238116 367166
32207 367166 335505 77980 -173013 -128307 332424 1020945 1470981 1322058 767566 399693
32197 399693 509439 785932 810442 550838 228629 25075 90510 476711 841642 636673
32187 636673 -110061 -626569 -397133 107563 183389 -64905 -74711 138417 83569 -241363
32177 -241363 -321365 -77481 -62996 -545687 -1080923 -1230918 -1108923 -954701 -733383 -459176
32167 -459176 -404487 -634940 -767851 -544061 -256280 -262277 -438760 -496645 -506063 -678900 -879257
32156 -879257 -799881 -491129 -318654 -455891 -730192 -921237 -945608 -786486 -475539 -142901
32146 -142901 59349 57000 -177403 -612207 -1020837 -1050370 -593442 40955 461419 568072
32136 568072 505293 429952 439615 535743 543678 269785 -174165 -446601 -443823 -371515 -276310
32125 -276310 40380 454468 406564 -259028 -838368 -679758 -147031 -47967 -419245 -611340
32115 -611340 -407058 -256279 -384951 -452951 -285734 -248100 -573672 -895827 -825298 -541126
32105 -541126 -412155 -398715 -246959 -10164 35698 -155640 -360814 -384965 -158741 299640
32095 299640 767011 836266 357283 -255759 -444088 -156692 166350 176011 -85575 -397311
32085 -397311 -581721 -529274 -271462 -53301 -95990 -266471 -230778 26514 126459 -133971
32075 -133971 -417433 -302129 82253 208094 -87630 -332940 -60640 525789 794594 502806
32065 502806 69497 -19685 205000 398092 460455 588763 841982 1001571 927181 752985
32055 752985 585502 265500 -339375 -980238 -1239739 -1037425 -691507 -498058 -453933 -399378
32045 -399378 -240483 5884 230082 267354 76824 -99605 44777 443346 648120 381313
32035 381313 -102883 -376343 -364204 -270212 -139888 140761 446273 421615 23563 -302912
32025 -302912 -227243 -19321 -111170 -407494 -468534 -271572 -274212 -635183 -866304 -523862
32015 -523862 129056 494438 404797 139566 -127128 -459119 -811849 -982763 -942176 -851552
32005 -851552 -707113 -341452 129586 275378 -23948 -290198 -91379 318396 373997 15068
31995 15068 -282601 -198021 119710 419967 640379 752894 687830 567916 698678 1101855
31985 1101855 1316854 947037 225030 -271816 -355634 -339576 -452761 -531725 -419117 -330248
31975 -330248 -545277 -915321 -980124 -541745 122424 627470 839280 816750 620894 325112
31965 325112 75137 -28392 -50724 -103165 -152038 -72468 131424 283203 227254 -13743
31955 -13743 -283538 -435208 -431860 -356560 -318599 -327293 -303011 -236851 -237581 -339199 -381021 -237672
31943 -237672 -88049 -240924 -689244 -1041304 -964129 -546936 -146441 14758 17391 92643
31933 92643 360447 680252 771146 547838 278083 263887 419206 382205 56921 -204969
31923 -204969 -54623 427291 860498 937091 571001 -97429 -691515 -806881 -443368 -80540
31913 -80540 -129221 -453994 -639633 -566771 -459276 -471845 -520294 -489324 -366254 -179042 4798
31902 4798 54722 -62183 -158299 -53920 160282 301466 406530 579828 655189 393168
31892 393168 -32669 -172052 43313 206236 95591 -15329 103370 234577 150545 84731
31882 84731 381251 914334 1238201 1161572 834586 400131 -84853 -450742 -480955 -193473
31872 -193473 176805 458009 609180 588325 393924 182588 108290 93500 -17301 -158225
31862 -158225 -155925 -61590 -69377 -161061 -155337 -65609 -42332 17582 361711 819397 834531 259882
31850 259882 -329641 -412785 -212931 -233080 -444128 -439832 -204101 -160038 -451230 -679571
31840 -679571 -513494 -175983 -101885 -362993 -668917 -788567 -755866 -727699 -807363 -981451
31830 -981451 -1106581 -976603 -521039 44803 361280 270003 -29537 -223656 -244843 -292697
31820 -292697 -496406 -707459 -736941 -669493 -735640 -930701 -1024314 -972403 -1014229 -1224371 -1272725
31809 -1272725 -891476 -342754 -73845 -58784 104208 481077 640370 312759 -195883 -471949
31799 -471949 -533163 -589081 -530985 -93273 559546 852740 524472 2997 -139914 110297
31789 110297 307360 207715 23449 -8438 -4217 -188119 -451945 -441932 -71126 306423
31779 306423 326383 43400 -193473 -165781 52116 261196 319613 212170 69565 74833
31769 74833 241638 355346 258500 98649 113538 253274 254409 64544 -70202 8724 137952
31758 137952 88478 -121526 -272596 -169584 230859 753172 1012338 700401 -23616 -609081
31748 -609081 -702196 -500501 -412068 -551390 -728220 -763791 -630161 -401315 -231653 -259968
31738 -259968 -385747 -294068 123660 539989 587464 314340 4230 -272288 -593603 -809695
31728 -809695 -644182 -175145 169480 180811 111315 240912 494196 632513 577593 387684
31718 387684 124410 -97785 -115625 71046 251705 306077 370590 542514 618625 377142
31708 377142 -10893 -147105 33715 134306 -192443 -782810 -1141538 -1002143 -589852 -322249
31698 -322249 -331818 -368987 -183124 111582 170552 -120730 -480591 -571037 -373050 -136253
31688 -136253 -48848 -74582 -90419 -82903 -159677 -379965 -621085 -682334 -531597 -351614 -288298
31677 -288298 -273975 -198051 -101123 -23669 183796 622501 1010612 930188 416096 -33849
31667 -33849 -89429 98033 274250 388841 380681 74747 -426750 -603678 -139107 557749
31657 557749 823584 570031 283823 325031 583047 764670 699359 384063 -14184 -238900
31647 -238900 -231130 -224621 -351988 -369679 -79053 226935 177281 -16178 142791 583682 736827
31636 736827 463243 263645 421970 595588 525830 528353 867599 1178857 1017041 567546
31626 567546 281829 142160 -143109 -464280 -440313 -101991 132771 135102 189799 426579
31616 426579 621548 634493 595315 565163 432731 246913 231604 343561 244550 -114526
31606 -114526 -317047 -129322 94099 -17588 -240898 -133214 243555 424809 226814 -94309
31596 -94309 -303475 -420511 -498287 -504979 -461933 -433087 -376560 -261971 -286227 -635949 -1038766
31585 -1038766 -948165 -279667 409199 635657 528865 433427 351128 132805 -59933 65639
31575 65639 429412 684634 759595 857362 929534 648467 46108 -284345 80035 785868
31565 785868 1154981 1000364 650063 354236 84447 -142311 -160661 34602 183228 91073
31555 91073 -133241 -257753 -167628 121371 486348 674042 479777 51920 -195854 -99420
31545 -99420 42856 -76366 -331524 -394837 -220830 -29038 72668 156442 228601 202877
31535 202877 110513 74842 64266 -74154 -306014 -401331 -299520 -209223 -231243 -159102 150397
31524 150397 436181 323546 -164951 -626379 -743606 -545347 -263012 -116748 -200304 -395424
31514 -395424 -422668 -138231 251136 433369 408496 458576 706284 918939 805280 341329
31504 341329 -239278 -624345 -582833 -153690 273224 279543 -94541 -394132 -365063 -264012
31494 -264012 -392459 -594558 -496692 -57447 438289 818912 1134541 1384156 1460526 1368479
31484 1368479 1205325 925544 446397 11369 62026 602026 1038613 889272 370834 28823
31474 28823 24458 106820 120240 165544 285070 305309 68476 -356931 -737169 -837357 -559141
31463 -559141 -39526 430605 689939 821154 886480 737139 296726 -145187 -223744 32480
31453 32480 333529 594634 866451 904060 364494 -479760 -798951 -256002 468313 557186
31443 557186 76769 -298491 -243078 39583 360908 695906 859248 592128 45913 -288180
31433 -288180 -250478 -193458 -348580 -449978 -246766 -6288 -121397 -441383 -408642 187452
31423 187452 921667 1237126 1021999 634756 496199 691706 903168 758001 300366 4831
31413 4831 188722 538820 466611 -106487 -607033 -527133 -22257 379529 464629 472936 636149
31402 636149 867026 969908 935439 881430 841750 789034 786483 907304 1002399 767907 145907
31391 145907 -506512 -793968 -709369 -519202 -339696 -81695 213693 298976 106935 -33336
31381 -33336 209022 681930 885373 555678 -55956 -470170 -402718 69186 601562 831926
31371 831926 660461 299441 -32790 -387500 -891208 -1357692 -1373745 -817285 -39357 553749
31361 553749 853756 886038 603606 85610 -303364 -271970 15105 202331 253099 353745
31351 353745 419984 138031 -470985 -944880 -965372 -700460 -429006 -186087 23968 23404
31341 23404 -243329 -500103 -531048 -518853 -659486 -709624 -350977 193360 412672 289372
31331 289372 296914 601393 801323 606600 289511 212712 304531 301729 208087 196825 277771
31320 277771 352187 423695 491403 395566 36640 -379845 -561689 -475305 -258008 46936
31310 46936 390132 504210 146359 -495336 -958704 -1058953 -992944 -919135 -779696 -588062
31300 -588062 -532948 -639829 -623454 -292238 115249 234027 69142 -57169 15048 101164
31290 101164 -7751 -240506 -365026 -307438 -224274 -266512 -377323 -381094 -208896 57971
31280 57971 337450 609081 808086 804215 565659 222829 -121038 -506604 -917358 -1112463
31270 -1112463 -880072 -387909 -48616 -34239 -121292 -37837 223257 486284 623951 632479
31260 632479 587990 584230 635059 632022 497278 357429 410895 608248 643103 342609 -69783
31249 -69783 -210782 40160 444651 682892 644935 455707 281850 178321 137346 188726
31239 188726 314213 318293 23826 -367344 -410946 -64234 144659 -121617 -414479 -136816
31229 -136816 450126 476029 -292580 -1081036 -1158446 -714197 -390474 -401786 -514464 -567458
31219 -567458 -567942 -451007 -158617 106062 37901 -352212 -706039 -707141 -354456 110510 423494
31208 423494 500160 512125 681475 950727 1010923 729207 354094 189422 267202 460698
31198 460698 693315 890748 961377 975237 1102240 1225010 959750 292426 -201268 -127333
31188 -127333 112437 -49511 -425732 -378272 149949 559125 504421 257278 98136 -52759
31178 -52759 -240767 -252386 -21217 176137 155685 64372 -21932 -309793 -814873 -1081275
31168 -1081275 -755618 -152004 151834 87195 83276 401324 829950 1006449 770139 218831
31158 218831 -367402 -681801 -651947 -521196 -538409 -644942 -620230 -433180 -238664 -83339
31148 -83339 152200 499174 781005 818731 641787 431652 322322 303188 283156 207939
31138 207939 102914 18411 -10914 74452 347055 739218 989379 909364 654012 521562
31128 521562 516428 371137 31102 -185622 -42248 271486 433413 401829 320186 213209
31118 213209 43438 -75675 -18213 72421 -76797 -454722 -740958 -723919 -529255 -381603
31108 -381603 -337397 -344179 -398857 -505371 -560050 -426717 -131125 113794 120336 -79508 -293819
31097 -293819 -378440 -295648 -1175 533151 1093104 1231599 750027 54266 -276813 -248619
31087 -248619 -426195 -1073746 -1682528 -1598113 -880142 -241564 -216314 -618857 -829339 -485679
31077 -485679 126573 363318 -53387 -666251 -801369 -381021 66797 182600 150183 192391
31067 192391 156555 -105582 -331453 -218013 76890 218786 261758 475326 759702 733164
31057 733164 368967 72156 65421 120036 18092 -87489 27389 252636 260345 -68702
31047 -68702 -462584 -498053 -51925 455772 412722 -272843 -990711 -1141654 -813608 -483997
31037 -483997 -300881 -74501 184779 224129 14663 -207156 -383576 -669781 -982262 -984691
31027 -984691 -630966 -277024 -124487 594 168937 139486 -129886 -230237 109175 561924
31017 561924 683796 522254 392835 355111 309868 362467 638487 878652 653782 -33378
31007 -33378 -688272 -884428 -665978 -406013 -425386 -713423 -924562 -738741 -272803 45367
30997 45367 53647 24659 167501 318947 307232 234939 152910 -126724 -557110 -641992 -158226
30986 -158226 315934 171568 -273607 -261555 219228 502888 376143 302201 467196 444065
30976 444065 47725 -226827 8248 426206 568915 495519 416381 188034 -301816 -652574
30966 -652574 -445546 29159 97988 -392556 -992274 -1339143 -1427623 -1255189 -746421 -118446
30956 -118446 135051 -184220 -719451 -1021286 -1031809 -981138 -1019130 -1099175 -1086993 -877473
30946 -877473 -510489 -219918 -234255 -485115 -659108 -579522 -367396 -169363 62033 380933
30936 380933 630366 628098 471750 429870 550308 592904 394404 111422 1298 99416
30926 99416 233145 247940 81367 -291175 -788941 -1137711 -1070383 -664781 -294235 -170878
30916 -170878 -128655 39463 252233 344803 416040 686038 1085051 1272010 1070138 647071
30906 647071 238452 -83712 -322288 -448511 -468260 -443157 -392407 -300132 -210979 -146188 39196
30895 39196 462060 874952 844379 356470 -74326 -65737 154626 147015 -126067 -353399 -346597
30884 -346597 -170116 70536 299654 412624 376265 317879 330293 300215 129566 -9649
30874 -9649 110431 414391 639432 717731 773204 826316 809362 820875 1027231 1300735 1281388
30863 1281388 864629 350245 37005 -73114 -103825 -110940 -156635 -319460 -506006 -479296
30853 -479296 -201361 64146 114706 55420 40958 262 -178595 -370087 -352240 -121806
30843 -121806 131505 284436 332177 255645 33123 -239711 -412310 -475351 -572766 -801587
30833 -801587 -1087997 -1277784 -1293122 -1192591 -1101867 -1070427 -992382 -718970 -260556 190382
30823 190382 459084 542035 542573 537751 546309 554668 528227 438838 298369 140363 8265 7032
30811 7032 262545 704528 998102 887232 528974 262891 136382 -41549 -241272 -208920
30801 -208920 45147 191933 147493 243321 613871 868793 713409 477711 573814 761541
30791 761541 500810 -166149 -648196 -632162 -345712 -31897 296321 534688 463970 202656
$$ [...]
##END NTUPLES=NMR SPECTRUM
##END=
