##TITLE=31Pdec_BAU-j-24.07
 CDcl3, 124 sc
 24.7.2019
##JCAMPDX= 6.0         $$ Bruker NMR JCAMP-DX V2.0
##DATA TYPE= NMR SPECTRUM
##DATA CLASS= NTUPLES
##ORIGIN= UXNMR, Bruker Analytische Messtechnik GmbH
##OWNER= root
$$ XWIN-NMR		Version 3.5
$$ Wed Jul 24 15:59:05 2019 Russian Standard Time (UT+4h)  she@DPX200
##.OBSERVE FREQUENCY= 81.013821
##.OBSERVE NUCLEUS= ^31P
##.ACQUISITION MODE= SIMULTANEOUS
##.ACQUISITION SCHEME= undefined
##.AVERAGES= 124
##.DIGITISER RES= 17
##SPECTROMETER/DATA SYSTEM= spect
##.PULSE SEQUENCE= zgpg30
##.SOLVENT NAME= CDCl3
##.SHIFT REFERENCE= (INTERNAL, CDCl3, 0, 182.463)
##AUDIT TRAIL= $$ (NUMBER, WHEN, WHO, WHERE, WHAT)
$$ ##TITLE= Audit trail, XWIN-NMR		Version 3.5
$$ ##JCAMPDX= 5.01
$$ ##ORIGIN= Bruker BioSpin GmbH
$$ ##OWNER= she
$$ F:/spectra/data/she/nmr/P31/1/pdata/1/auditp.txt
$$ ##AUDIT TRAIL=  $$ (NUMBER, WHEN, WHO, WHERE, WHAT)
(   1,<2019-07-24 15:57:24.48 +0400>,<she>,<DPX200>,
      <continue with go, POWCHK disabled, PULCHK disabled
       configuration hash MD5:
       00 E9 B6 7A A2 85 ED C7 34 08 36 98 17 FE 4E 26
       data hash MD5: 32K
       7F 0A 11 73 64 51 52 2B 8C 11 1D 2E 4D 6B 3D 18>)
(   2,<2019-07-24 15:57:27.50 +0400>,<she>,<DPX200>,
      <Start of raw data processing
       efp BC_mod = 2 LB = 1 FT_mod = 6 PKNL = 1 PHC0 = -539.3307 PHC1 = 405.2 SI = 64K 
       data hash MD5: 64K
       4E D8 C9 3C 00 38 58 33 D7 6E 58 A1 54 97 C7 B6>)
(   3,<2019-07-24 15:57:46.96 +0400>,<she>,<DPX200>,
      <pk PHC0 = -33.35381 PHC1 = 89.59999 
       data hash MD5: 64K
       60 FD 76 7A 19 BE 06 4C 12 53 0F 94 97 7C 63 76>)
(   4,<2019-07-24 15:57:50.21 +0400>,<she>,<DPX200>,
      <abs ABSG = 5 
       data hash MD5: 64K
       AE 9A 81 65 0F C0 CE 5A A5 78 65 65 2D D9 1E 2A>)
$$ ##END=
$$ 
$$ hash MD5
$$ 6E 16 35 22 96 29 49 0B 7F 0D 79 F0 EC 6E 89 1A
##$RELAX= 
##$RELAX= 
##$RELAX= 
##$RELAX= 
##$RELAX= 
##$RELAX= 
##$RELAX= 
##$RELAX= 
$$ Bruker specific parameters
$$ --------------------------
##$DU= <F:/spectra>
##$EXPNO= 1
##$NAME= <P31>
##$PROCNO= 1
##$TYPE= <nmr>
##$USER= <she>
##$AMP= (0..31)
100 100 100 100 100 100 100 100 100 100 100 100 100 100 100 100 100 100 
100 100 100 100 100 100 100 100 100 100 100 100 100 100 
##$AQSEQ= 0
##$AQ_mod= 1
##$AUNM= <au_zg>
##$AUTOPOS= <>
##$BF1= 81.014009
##$BF2= 200.13
##$BF3= 200.13
##$BF4= 200.13
##$BF5= 200.13
##$BF6= 200.13
##$BF7= 200.13
##$BF8= 200.13
##$BYTORDA= 1
##$CFDGTYP= 0
##$CFRGTYP= 5
##$CHEMSTR= <none>
##$CNST= (0..31)
1 1 145 1 1 1 1 1 1 1 1 1 1 1 1 1 1 1 1 1 1 1 1 1 1 1 1 1 1 1 1 1 
##$CPDPRG= <waltz16>
##$CPDPRG1= <>
##$CPDPRG2= <waltz16>
##$CPDPRG3= <>
##$CPDPRG4= <mlev>
##$CPDPRG5= <mlev>
##$CPDPRG6= <mlev>
##$CPDPRG7= <mlev>
##$CPDPRG8= <mlev>
##$CPDPRGB= <>
##$CPDPRGT= <>
##$D= (0..31)
0 1 0 0 0 0 0 0 0 0 0 0.03 2e-05 3e-06 0 0 0 0 0 0 0 0 0 0 0 0 0 0 0 0 
0 0 
##$DATE= 1563969240
##$DBL= (0..7)
120 120 120 11 120 120 24 19 
##$DBP= (0..7)
150 150 150 150 150 150 150 150 
##$DBP07= 0
##$DBPNAM0= <>
##$DBPNAM1= <>
$$ [...]
##$SUBNAM3= <"">
##$SUBNAM4= <"">
##$SUBNAM5= <"">
##$SUBNAM6= <"">
##$SUBNAM7= <"">
##$SUBNAM8= <"">
##$SUBNAM9= <"">
##$SW= 369.568048894756
##$SWIBOX= (0..15)
0 1 3 0 0 0 0 0 0 0 0 0 0 0 0 0 
##$SW_h= 29940.119760479
##$TD= 32768
##$TD0= 1
##$TE= 0
##$TE2= 300
##$TE3= 300
##$TEG= 300
##$TL= (0..7)
0 120 53 12 22 120 120 120 
##$TP= (0..7)
150 150 150 150 150 150 150 150 
##$TP07= 0
##$TPNAME0= <>
##$TPNAME1= <>
##$TPNAME2= <>
##$TPNAME3= <>
##$TPNAME4= <>
##$TPNAME5= <>
##$TPNAME6= <>
##$TPNAME7= <>
##$TPOAL= (0..7)
0.5 0.5 0.5 0.5 0.5 0.5 0.5 0.5 
##$TPOFFS= (0..7)
0 0 0 0 0 0 0 0 
##$TUNHIN= 0
##$TUNHOUT= 0
##$TUNXOUT= 0
##$USERA1= <user>
##$USERA2= <user>
##$USERA3= <user>
##$USERA4= <user>
##$USERA5= <user>
##$V9= 5
##$VALIST= <valist>
##$VCLIST= <CCCCCCCCCCCCCCC>
##$VD= 0
##$VDLIST= <DDDDDDDDDDDDDDD>
##$VPLIST= <PPPPPPPPPPPPPPP>
##$VTLIST= <TTTTTTTTTTTTTTT>
##$WBST= 1024
##$WBSW= 4
##$XGAIN= (0..3)
0 0 0 0 
##$XL= 0
##$YL= 0
##$YMAX_a= 63981
##$YMIN_a= -87488
##$ZGOPTNS= <>
##$ZL1= 120
##$ZL2= 120
##$ZL3= 120
##$ZL4= 120
##$ABSF1= 182.463
##$ABSF2= -187.1042
##$ABSG= 5
##$ABSL= 3
##$ALPHA= 0
##$AQORDER= 0
##$ASSFAC= 0
##$ASSFACI= 0
##$ASSFACX= 0
##$ASSWID= 0
##$AUNMP= <proc_1d>
##$AZFE= 0.1
##$AZFW= 0.5
##$BCFW= 0
##$BC_mod= 2
##$BYTORDP= 0
##$COROFFS= 0
##$CY= -3
##$DATMOD= 1
##$DC= 0
##$DFILT= <>
##$DTYPP= 0
##$F1P= 0
##$F2P= 0
##$FCOR= 1
##$FTSIZE= 65536
##$FT_mod= 6
##$GAMMA= 0
##$GB= 0
##$INTBC= 1
##$INTSCL= 5.30512e-09
##$ISEN= 30
##$LB= 1
##$LEV0= 0
##$LPBIN= 0
##$MAXI= 10000
##$MC2= 0
##$MEAN= 0
##$ME_mod= 0
##$MI= 50
##$NCOEF= 0
##$NC_proc= -6
##$NLEV= 6
##$NOISF1= 182.463
##$NOISF2= 159.3651
##$NSP= 0
##$NTH_PI= 0
##$NZP= 0
##$OFFSET= 182.463
##$PC= 4
##$PHC0= -572.6845
##$PHC1= 494.8
##$PH_mod= 1
##$PKNL= yes
##$PPARMOD= 0
##$PSCAL= 0
##$PSIGN= 0
##$REVERSE= no
##$SF= 81.0140089999434
##$SI= 65536
##$SIGF1= 159.3651
##$SIGF2= -187.1042
##$SINO= 113.3802
##$SIOLD= 16384
##$SREGLST= <1H.CDCl3>
##$SSB= 0
##$STSI= 65536
##$STSR= 0
##$SW_p= 29940.119760479
##$SYMM= 0
##$S_DEV= 0
##$TDeff= 32768
##$TDoff= 0
##$TI= <>
##$TILT= no
##$TM1= 0
##$TM2= 0
##$TOPLEV= 0
##$USERP1= <user>
##$USERP2= <user>
##$USERP3= <user>
##$USERP4= <user>
##$USERP5= <user>
##$WDW= 1
##$XDIM= 65536
##$YMAX_p= 321190457
##$YMIN_p= -47420953
$$ End of Bruker specific parameters
$$ ---------------------------------
##NTUPLES= NMR SPECTRUM
##VAR_NAME=  FREQUENCY,     SPECTRUM/REAL,   SPECTRUM/IMAG
##SYMBOL=    X,             R,               I
##VAR_TYPE=  INDEPENDENT,   DEPENDENT,       DEPENDENT
##VAR_FORM=  AFFN,          ASDF,            ASDF
##VAR_DIM=   65536,         65536,           65536
##UNITS=     HZ,            ARBITRARY UNITS, ARBITRARY UNITS
##FACTOR=    0.456856943014862, 1,           1
##FIRST=     14782.0589164792, 0,            0
##LAST=      -15158.0608439998, 0,           0
##MIN=       -15158.0608439998, -47420953,   0
##MAX=       14782.0589164792, 321190457,    0
$$ Real data points
##PAGE= N=1
##DATA TABLE= (X++(R..R)), XYDATA
$$ [...]
40171 -8585679 -8255572 -8225135 -6752245 -3824034 -1041869 497387 1156350 1563341 1615010
40162 1615010 1172527 667728 189951 -904010 -2254800 -1688905 1780144 5120475 4352408
40153 4352408 280107 -2120232 -664454 1202801 93590 -2323650 -2709049 -1500124
40145 -1500124 -1436740 -2647387 -3101566 -2826989 -3626852 -4821270 -3256874 1602177 5915653
40136 5915653 6292065 3963659 2464390 2767258 2541154 -269381 -4427269 -6399840 -4295027
40127 -4295027 -308785 1635087 395652 -1907337 -3807675 -5947507 -7648893 -5839236
40119 -5839236 -249136 3747999 1781007 -2523312 -2332713 2131320 4035422 519109
40111 519109 -3262674 -2153597 2369472 6043859 7769831 8668964 8724068 7515332 5773553
40102 5773553 3643928 -171109 -5224690 -7910826 -5976543 -2333344 -1684080 -5022617
40094 -5022617 -9721189 -13205080 -14203706 -12220444 -8368997 -5409316 -4826769 -5263564 -5436621
40085 -5436621 -6276723 -7956683 -7578026 -3243056 1720293 2673503 532722 389355 3551195
40076 3551195 5256037 1341771 -6096023 -11262127 -10799420 -6156871 -1382744 304506
40068 304506 -1406736 -4400788 -6551633 -7224693 -6405223 -3930321 -583568 1685612 2173514
40059 2173514 2522064 3653693 3354865 -630501 -6482767 -10084648 -10009230 -8014307 -5511248
40050 -5511248 -2727796 -872970 -1589074 -3848891 -4513830 -2804215 -1622673 -3522465
40042 -3522465 -7533462 -10802359 -11468302 -9278786 -5255343 -1522134 -6053 -826744
40034 -826744 -3015473 -6291924 -10339063 -13080794 -12345713 -9050018 -6016497 -3781837
40026 -3781837 -650389 3073928 4603860 3202812 1506572 992506 -152037 -2744854
40018 -2744854 -4001575 -2091842 6444 -1107675 -3526134 -2979943 -90699 44859
40010 44859 -4255362 -8017393 -6054684 57381 3794463 1346539 -4638029 -9016234
40002 -9016234 -10102427 -10268454 -11306968 -11697539 -9798657 -7475790 -7472460 -8283011 -5686954
39993 -5686954 296506 4301657 3086725 -22254 -830109 -464645 -1900804 -3587422
39985 -3587422 -1914362 1659664 1901529 -1684061 -3415386 -210833 3347995 1965633
39977 1965633 -2250326 -2997511 946958 4378457 3552316 1245858 2200494 6280861 8884454
39968 8884454 7055205 2353937 -2551585 -7313938 -12193762 -15098942 -13510525 -8878191
39960 -8878191 -5782626 -5992858 -6454097 -4723445 -3298699 -5639474 -10031683 -11144682
39952 -11144682 -7148038 -2070154 -861498 -4481683 -9869523 -12468757 -8943080 -180306
39944 -180306 7904617 9170886 3873053 -1410412 -1090271 4114453 9488953 11381400
39936 11381400 9019690 3927156 -729802 -2091174 -549818 677264 -60396 -920974
39928 -920974 -293930 134849 -1674846 -4240768 -4439750 -1813552 1754615 5300130 8582590
39919 8582590 9706388 6689623 1355443 -1905334 -1801628 -1279020 -2196879 -2382641 293006
39910 293006 4012846 5628506 4901619 3623736 2412130 1149316 1098971 3402417 6209339
39901 6209339 6503502 4694390 4288994 6517928 8334457 7035537 4282987 3578460 5458064
39892 5458064 7249431 6639136 3740312 273565 -1815153 -1477960 348014 1347620 774874
39883 774874 927953 3969123 8083865 9216088 6500933 3265914 1941280 782938
39875 782938 -2514168 -6234405 -6606007 -3462563 -889756 -1785880 -4237940 -4475958 -1599993
39866 -1599993 2218759 4888910 5605636 3511991 -2113848 -9366517 -13589839 -11898729
39858 -11898729 -6987559 -4302066 -5606851 -7466102 -6261500 -2260670 2129742 5393674
39850 5393674 6307054 3067872 -3610691 -8277211 -5894202 1025616 4652943 1903863
39842 1903863 -1896069 -939441 3647860 6989151 7336507 6102182 3978724 1515505
39834 1515505 1663480 6739379 13350412 15051138 10517606 5019313 3099858 3805279
39826 3805279 4272715 3952040 3231539 1372613 -1590983 -3475802 -2865737 -1262989 -348423
39817 -348423 489926 1768463 1785769 -296996 -1789600 -304738 1879849 1254535 -717872
39808 -717872 589389 5469548 8846173 7384680 3616094 1747743 2755270 5024504
39800 5024504 6810856 6472448 3028124 -1686296 -3735939 -1741655 1201031 1780644
39792 1780644 417466 -755606 -1442242 -2402978 -3208173 -3433805 -4453634 -7194508 -9340353
39783 -9340353 -7744632 -2924586 1580811 3754710 4356786 4313033 3895279 4196630 6157354
39774 6157354 7947426 6635069 3020344 1353004 3157556 4916636 3694771 1450481
39766 1450481 909025 407845 -2957962 -6966579 -5944099 1117404 8333437 10112143
39758 10112143 7393355 4922771 4720978 4657823 2382303 -1591740 -4766007 -5317779 -3584173
39749 -3584173 -1437124 -302608 284158 1851977 4635828 6669150 5792651 2329856
39741 2329856 -832669 -1086282 1127159 2764819 1714288 -504774 -479593 2682668 6115467
39732 6115467 7077364 6470848 6816499 7930929 7120352 3483056 -509085 -2308837 -1987253
39723 -1987253 -695346 1528134 4920477 8423858 10579861 11180249 10849147 9845126
39715 9845126 8364860 7103711 6358130 5422761 3919401 2706161 2378775 2132904 1457306
39706 1457306 1458323 2610746 2657777 -649820 -5605689 -8146648 -6979695 -4304309 -1765073
39697 -1765073 943367 3153160 2728348 -37605 -1463880 307989 1992773 -185764
39689 -185764 -4810957 -7428353 -6743971 -5208248 -4394815 -3526074 -2497574 -2619986 -3455033
39680 -3455033 -2267956 1646163 4789479 3908168 701987 -557388 945062 1779980
39672 1779980 -450712 -3637779 -4065708 -1130915 2300745 3440675 2099312 10683
39664 10683 -959546 225057 3269646 6312873 7187731 5828842 4593953 5075690 5501408
39655 5501408 3139208 -1122273 -3021368 -365459 4016614 6042837 5148776 3554163
39647 3554163 2519642 1748549 1401022 1960582 2510756 1868848 1426109 3946695 8863495
39638 8863495 11623547 9182675 3840926 -154033 -1817922 -3117387 -5119743 -7142994
39630 -7142994 -8936618 -10932508 -12236811 -10812487 -6484791 -2075337 -477810 -1468337
39622 -1468337 -2142775 -31463 4516776 8607996 9500082 7584543 6299789 8103555
39614 8103555 11009545 10772921 6534318 2254874 1668750 3683072 4461615 2809229 1267723
39605 1267723 2119592 4453500 5906518 5817173 5431994 5624453 5632255 4257444 1678310
39596 1678310 -439122 -673907 585488 1684318 1822901 2021654 3428324 5159438 4942439
39587 4942439 2116476 -1048287 -1784668 37789 2106173 2591985 1730690 482182 -962419
39578 -962419 -2511830 -3112122 -1885337 -89985 -287935 -2912037 -4947656 -3314520 1011252
39569 1011252 3716089 2139658 -1710491 -3777804 -2604222 -214413 1200741 1916258
39561 1916258 3312951 4984836 4747945 1702419 -1967085 -3166990 -1289261 1531515
39553 1531515 3139688 3041346 1482583 -1290700 -3964116 -4079843 -893065 2635594 2840015
39544 2840015 -28527 -2434304 -2728612 -2849560 -4032161 -3996473 -776561 3058130 3391874
39535 3391874 645902 -693530 1472434 4350764 4958263 4068868 3836472 4152991 3603962
39526 3603962 2206888 917694 -293740 -1715927 -2296772 -934784 1421931 3006382
39518 3006382 3728623 4281648 3783572 1232256 -1199986 165083 5003789 8515425 7775437
39509 7775437 5517666 5635572 7622878 8200829 6578024 4967670 4683669 4608203 3566596
39500 3566596 2003470 958328 886205 1633886 2480041 2523582 2177348 3487546 7244794
39491 7244794 10492755 9268677 3847083 -1002422 -1468030 1512698 4410062 5074147
39483 5074147 3709857 1708631 774832 1989679 4552422 6185245 5536694 3557586
39475 3557586 2239349 2889202 5623387 9184296 11240808 10635159 9478260 10860967
39467 10860967 14151106 15286438 12656934 9547289 8879801 8715247 5945351 1836567
39459 1836567 101329 1104932 2002013 1723677 1757095 2280993 1650880 19873 -583599
39450 -583599 -504138 -2558536 -6445303 -7361656 -2806687 2932423 4519730 2896959 2816691
39441 2816691 5035513 5744908 3485450 1930242 4144063 7451480 6824565 1926258
39433 1926258 -2107252 -1261167 2161764 2750461 -494532 -2743440 -605531 2140370
39425 2140370 -442008 -7310385 -11286188 -9464719 -7315621 -9677691 -12599183 -9060200
39417 -9060200 200949 7322893 7819653 5134646 4419920 6512998 9363675 11506064
39409 11506064 12171202 10717774 7807172 5377764 4409233 4300842 4699117 5749091 6363906
39400 6363906 4902820 2000647 21680 -588229 -1271043 -1466432 1152324 5540144 6991933
39391 6991933 4100924 1404525 2079708 2662574 -626605 -4495901 -3303988 1635371
39383 1635371 3967723 2302669 1705118 4848639 7883548 6960958 3806534 2183533
39375 2183533 2571369 3060339 2840984 2428967 2303795 2889474 4062343 3792161 -227120
39366 -227120 -6427010 -9564502 -6763886 -1053129 2728979 3231491 2140758 943550
39358 943550 368808 1061673 2549369 3074221 2264473 2172862 3867913 5177206 4085246
39349 4085246 2169987 1892063 2487584 1808061 560437 980313 2392907 2176789 829464
39340 829464 1905446 6279407 10216097 10430853 7965944 5558742 3938345 2591989
39332 2591989 1933175 2480154 3216008 2690279 1056662 -242645 -173192 1278136 3221522
39323 3221522 3884827 1749217 -2310771 -5095836 -4478754 -2032513 -1305299 -4067857 -8940016
39314 -8940016 -12881930 -13283881 -9611331 -4148136 -449084 8504 -920660 -992010 -775045
39305 -775045 -2355479 -5428380 -6822427 -4503642 -439082 1730027 989878 -460792
39297 -460792 -662512 -341785 -1180410 -2829099 -3229903 -1751261 -348328 -910673 -2706749
39288 -2706749 -3535541 -2527393 -588504 1220507 2306317 2010602 120128 -2071623
39280 -2071623 -2720592 -1740046 -930329 -1544251 -2819196 -3063541 -1070442 3464387 9325840
39271 9325840 13337851 12408402 6977319 1129691 -1590917 -1374762 -584612 -576390 -1205353
39262 -1205353 -2102115 -2801525 -2271830 224628 3960172 7301209 9199962 9596024 8832188
39253 8832188 7223558 4794234 1255310 -3047124 -6264094 -6570062 -4893325 -4422659
39245 -4422659 -6614365 -9392148 -10344255 -9895197 -9875966 -10721052 -11897590 -13452716 -14895068
39236 -14895068 -13943598 -9079957 -2583221 1575746 2400296 1973236 1498011 284725 -1265971
39227 -1265971 -1013180 1390770 2990589 1350893 -1826605 -2700124 -24753 3432196
39219 3432196 3813760 -83945 -5435422 -7489053 -3846214 3048863 8246812 8943011
39211 8943011 6136248 2541262 476643 1134219 3606842 4668710 1908971 -2661802
39203 -2661802 -4622155 -3139624 -2014710 -3750761 -5821720 -4847625 -1642854 569131
39195 569131 730321 -233943 -2320006 -5713424 -8251966 -7290147 -3942320 -2153915 -3234593
39186 -3234593 -4409267 -3512592 -2069302 -2213721 -3065370 -2340829 -122078 1181174 244532
39177 244532 -1377404 -1099147 1688294 4614730 4475375 861610 -2605155 -1705833 3611835
39168 3611835 8955238 10108873 6732580 1356839 -3418485 -5698084 -4078871 1117421
39160 1117421 6763381 8992444 6943280 3581307 2439295 4131749 6327185 6588122
39152 6588122 4757430 2720645 2313053 3792732 6168185 8227136 8727409 6405907
39144 6405907 1238317 -4308470 -6819944 -5455888 -2873261 -1969007 -2901589 -4255841
39136 -4255841 -5631660 -7193912 -7672783 -5453469 -1805140 -491505 -3054671 -6386397
39128 -6386397 -6475974 -3172573 417934 2110961 2187759 1465224 237268 -667206 13727
39119 13727 1987477 3282813 3103290 3112658 4502709 5430726 3514841 -153800 -2116974
39110 -2116974 -1499119 -1103892 -2810391 -4465236 -3165639 176636 1973205 947190
39102 947190 -352536 850823 4348468 7830581 9393510 8400805 5263448 1588276
39094 1588276 -388414 25628 732454 -832227 -4140055 -5793661 -3824990 -406367
39086 -406367 903384 -284409 -1060875 481864 2619622 2422781 -511007 -3911313 -5563689
39077 -5563689 -4916539 -2603372 80926 1384970 350103 -1840105 -2955908 -2337847
39069 -2337847 -1121409 238759 2793540 6660682 9622892 9692573 7847817 6635715
39061 6635715 6978158 7916735 8658824 9103625 8941565 8068214 7497044 8023451 8334587
39052 8334587 6525349 3400275 1980436 3344166 5161462 5100107 3661074 2660269
39044 2660269 2745539 3551939 4636051 5047164 3590797 843443 -690911 45204 656448
39035 656448 -1556152 -5716491 -8506098 -8078245 -5047428 -898547 2306278 1836185 -3091062
39026 -3091062 -8873116 -10534026 -7454338 -3736272 -2703321 -3648415 -4576759 -5370469 -6777868
39017 -6777868 -8299452 -8724781 -7605295 -5210438 -2201292 55315 377113 -378274 -28273
39008 -28273 1684663 2469307 946770 -1417957 -2987694 -4219971 -5635529 -5810358 -3542611
38999 -3542611 -172434 2367602 3985224 4855734 3773151 891056 -264054 2731293
38991 2731293 6551669 6283494 2899754 1594384 3247772 3298044 -41754 -2318517 -129465
38982 -129465 3085666 2158831 -2480614 -6295463 -6775652 -4568273 -728643 3529533 5871710
38973 5871710 4930408 2301748 -61848 -2799477 -6726699 -9481637 -8228462 -4371382
38965 -4371382 -1754607 -988180 584162 3667796 5686656 4943186 2715360 781369
38957 781369 -231132 56479 1371762 1695480 -146492 -1234042 1979320 7036439 7404128
38948 7404128 2139359 -1809026 374739 4005274 1644041 -6414579 -13135033 -14109061
38940 -14109061 -11325207 -8434471 -6419302 -4443091 -2214922 -592909 -839456 -3095754
38932 -3095754 -5154097 -4115256 -113364 3389320 4074844 3385743 3443989 4057174 4590214
38923 4590214 5820103 7459772 6920844 3670394 1733116 3982417 6888789 5674183
38915 5674183 2089962 1340454 3057339 1967738 -2791964 -5819180 -3995911 -688755
38907 -688755 499725 428004 304064 -1699970 -6179803 -9278700 -7727376 -3876616 -2120913
38898 -2120913 -3089539 -4679803 -6089172 -7266556 -6694294 -3380845 554338 2375721
38890 2375721 2325802 2269504 2759322 3833993 6040652 7758148 4769398 -3375767 -9579838
38881 -9579838 -7070002 974367 5475531 3922286 2320523 4693290 7707799 7937790
38873 7937790 8034596 11391136 15119202 13546369 6690516 596801 -433307 1654727
38865 1654727 2592816 1642923 1844879 5144503 8953006 8767727 3832070 -1822247 -4858023
38856 -4858023 -6815851 -10582217 -14851670 -15802576 -13216903 -10671395 -9731328 -8426529
38848 -8426529 -6180316 -5477575 -6823210 -6621654 -2915575 718196 404616 -2342313 -3991096
38839 -3991096 -4859791 -6874414 -7863213 -3831132 3605557 7512194 4403365 -1465230
38831 -1465230 -3992787 -2101136 780220 1314495 -1282227 -5260463 -7360997 -5436372
38823 -5436372 -1104193 1645551 1062597 -844500 -1788324 -1956516 -2419081 -3101411 -3765621
38814 -3765621 -5040474 -6820544 -7284208 -5279415 -2364971 -686971 100803 1959512
38806 1959512 5242541 8086099 8667264 6779099 3605782 1057597 740609 2412529
38798 2412529 3944294 3718133 2317381 1052899 134488 -482155 -105609 903327 62976
38789 62976 -3675370 -6578582 -4051106 2345065 5843152 3296786 -954423 -1896484 -622159
38780 -622159 -1099407 -3299881 -4082989 -3483753 -5097991 -9578869 -12068537 -8379774 -1133223
38771 -1133223 2839668 62550 -6609171 -11867413 -12891712 -10487273 -7099836 -4705469
38763 -4705469 -3993878 -4455699 -4804359 -3812892 -1530899 307061 -131504 -2592655 -5034841
38754 -5034841 -6329111 -7244791 -8051586 -7089656 -3573780 -179852 -100044 -2440341 -3648051
38745 -3648051 -3028727 -3124909 -4348736 -3620535 -62090 2192409 -22287 -3495148 -3139873
38736 -3139873 496972 2571102 1326465 -331034 -55761 1469774 3284491 5188174
38728 5188174 5617810 2622601 -2175613 -4620026 -4090373 -4251949 -6222481 -5904415 -1087614
38719 -1087614 3443855 2337649 -2288853 -4355596 -2962867 -2463489 -4666248 -6821017
38711 -6821017 -7471204 -8589128 -10402881 -9230997 -3287024 3118231 4493709 1048558
38703 1048558 -2166495 -1458929 2527918 6790339 8699030 7494388 4795751 3151804
38695 3151804 3054899 2310491 -672466 -4235187 -5401825 -3402725 -35014 2547537 3374148
38686 3374148 3033344 3363526 5495667 7599589 6575220 2895690 1017640 3119343
38678 3119343 5426511 3774658 128546 -526607 2121618 3960173 3512863 3526949 5139718
38669 5139718 5557636 3055468 -104593 -1676079 -2450313 -3256702 -2863200 -1377424 -1894626
38660 -1894626 -5537972 -8282174 -6461865 -2493747 -920655 -1244225 464265 4317612
38652 4317612 6039608 3384887 -1221769 -4681057 -6171508 -5953541 -4665858 -3977038
38644 -3977038 -4785209 -4970014 -2268483 1163434 1126664 -1978675 -3547867 -2041559 -734106
38635 -734106 -1256166 -907687 1558222 2833880 678657 -2242472 -3561274 -5547618 -10114327
38626 -10114327 -13812387 -12782481 -9252953 -7867290 -8340373 -7171194 -4321162 -2468417
38618 -2468417 -1358111 1125764 3297119 1217265 -4219451 -7554923 -6543742 -4248304
38610 -4248304 -2837516 -921286 1717262 2254588 -235352 -2685541 -3022645 -3013305 -4156638
38601 -4156638 -5006526 -4754677 -5231915 -6847235 -6636101 -3188449 282231 794070 -53243
38592 -53243 281925 755980 -611140 -2488910 -2218178 268990 3475135 6758179 9003936
38583 9003936 7947785 3957520 1324013 2377498 3736661 2271584 918807 3422038
38575 3422038 6783561 5424980 725637 -548340 3271036 6465535 4733270 524107
38567 524107 -1684456 -785541 1476371 2665617 836476 -2890623 -3421245 2316929 9257323
38558 9257323 9525644 3588132 -284990 1690576 4174938 2525323 72313 1481259
38550 1481259 4837178 5567291 3879980 2947449 2848813 1530317 -349745 -343094 1334185
38541 1334185 2312817 2027353 1761449 1795366 1633426 2087064 4262991 7352902 9833538
38532 9833538 11701719 13270451 13288893 10803758 7471954 5489071 4541041 3115182 1239251
38523 1239251 -455206 -2529469 -4916902 -5219059 -1894889 2376983 3473820 625235
38515 625235 -3918566 -7847047 -8827074 -4685502 2627677 6358051 3096242 -1191290
38507 -1191290 890771 6649480 7011659 599720 -4207234 -2181485 2078961 3141844
38499 3141844 2623062 3470778 2962297 -2295613 -8671815 -9455843 -4457465 63189 170709
38490 170709 -1969671 -2986330 -2652755 -2395107 -2453887 -1977169 -668807 506441 204006
38481 204006 -1385444 -1878671 537367 3987240 5097017 4385900 5869171 10217591 12598222
38472 12598222 9868932 5790248 5268946 6922398 6118605 2743518 471444 -118520
38464 -118520 -1875673 -4938190 -6006006 -4392254 -3402284 -4240866 -3663743 -65256 2649958
38455 2649958 577793 -4178166 -6493911 -4845259 -1724656 621987 1628959 1005337
38447 1005337 -779507 -1251606 1813437 6890211 9806280 8502477 4928961 2333077
38439 2333077 2419757 5003152 8442177 10076457 7939012 2782199 -2395750 -4908973
38431 -4908973 -3796953 453346 5752400 8309626 5155999 -2305914 -8903324 -10783751
38423 -10783751 -8663291 -5450903 -2502119 400735 2964060 4404772 4927452 5272758
38415 5272758 4955605 2656574 -1417566 -4928642 -5598108 -3246706 290177 2425805
38407 2425805 1414757 -1887375 -3960650 -1925371 2895220 6287802 6203082 4624786
38399 4624786 4060023 4582381 5389872 6651376 7853426 6732984 2616890 -1052855 -780286
38390 -780286 1773871 2307816 642794 593010 3138047 4655180 3283824 2165337 3587940
38381 3587940 4205866 194295 -5780958 -7378615 -2874419 3563489 7870888 9093094
38373 9093094 6977989 1469759 -4404221 -5522866 -827290 4479719 5217178 2537676
38365 2537676 1647337 4722846 8374423 7623380 1067745 -7345993 -11075429 -6824885
38357 -6824885 1415541 5627316 2257795 -3975040 -6038026 -2586761 1892594 3306144
38349 3306144 1615948 -873845 -1951542 -197605 4031891 7666271 7220030 2985049
38341 2985049 -858806 -1200998 671850 1709651 1236559 898931 1852936 3787535 5915720
38332 5915720 7319196 6972725 4995177 3284059 3306591 3868471 2885094 750902 -349855
38323 -349855 -167112 -612337 -1972315 -2064612 -325283 554238 -754450 -1107040 2211201
38314 2211201 5904584 4523083 -1063582 -3906740 -260422 5747151 8185341 6190359
38306 6190359 2647668 -556098 -3109582 -4650969 -5526259 -7290060 -9836977 -10112785
38298 -10112785 -6650186 -3182151 -3843631 -6437962 -5229159 135533 3710273 2137505
38290 2137505 -552677 634633 4511772 6286547 4524893 1936937 688602 297026
38282 297026 -220336 -840454 -1468481 -2570919 -4417801 -6543689 -7997074 -7855733 -6218764
38273 -6218764 -4933956 -5893734 -7920117 -7243701 -2517917 2542412 3667538 1564155
38265 1564155 193218 707236 632530 -1006925 -1592868 658024 3309196 3132381 831100
38256 831100 -489258 -467446 -1902884 -5694116 -8215278 -5547042 1102425 6274678 6313409
38247 6313409 2889878 324140 991947 4042220 7076698 7726220 4800209 -114901
38239 -114901 -2717366 140129 6424237 10688362 10259115 7710416 6602449 7075430 7066962
38230 7066962 5829351 4111964 2155592 -216112 -2094352 -2118546 -561618 681568
38222 681568 209726 -1675935 -3485386 -3485038 -908647 2856005 5250921 5684315 6379790
38213 6379790 8886697 11456736 11748513 10390417 9331051 8161298 5181107 1085392
38205 1085392 -1814181 -3376544 -4981181 -5519953 -2340436 3365084 6594514 5309748
38197 5309748 2928756 2219750 1187412 -1975309 -4029842 -1195062 4257023 6686490
38189 6686490 4926197 2920832 3171401 3911086 3083550 1234305 -544841 -2371871 -3958357
38180 -3958357 -3744337 -1145226 2027743 3548283 2897813 771008 -2021322 -4347897
38172 -4347897 -4822561 -3046635 39155 3477440 6928642 9658580 10277695 8315747
38164 8315747 5075237 2138798 -185960 -2254050 -3699321 -3563494 -1526659 1581105
38156 1581105 4415656 6054682 6463302 6131085 5255360 3647995 1655114 445491 638962
38147 638962 1198812 647580 -971756 -2335068 -2748739 -2749573 -2888657 -2903013 -2173140 -347547
38137 -347547 2386280 5187377 7103638 8052857 8408016 7322468 3238622 -2816920 -6544692
38128 -6544692 -5134811 -1036018 1527662 2022704 2324462 1746221 -1945939 -7053135 -8718534
38119 -8718534 -6071913 -3610096 -3821138 -3541576 -359313 2397444 1206523 -1274801
38111 -1274801 -531326 2032547 1296414 -3152006 -6411831 -5690889 -3155564 -1078527 917349
38102 917349 2658145 1920104 -1939794 -6188946 -8347471 -8890247 -8977403 -8376793 -7212284
38093 -7212284 -6977604 -7960841 -8167081 -6665553 -5474366 -5928622 -5640574 -1909592 3599691
38084 3599691 6543009 5207274 1559141 -2021410 -4344531 -4457307 -2101499 684827
38076 684827 945161 -1594425 -4213361 -5063766 -5561562 -7918798 -11477985 -12734793 -8965117
38067 -8965117 -1489147 4907543 6374303 3894763 1719130 1650182 947621 -2641493 -6160159
38058 -6160159 -4995019 27087 3144210 1618734 -748799 373798 3837918 5618419
38050 5618419 4711984 3049428 1207061 -1874453 -5175325 -5446192 -2006788 1115630
38042 1115630 -152960 -4655660 -7347303 -5352342 -1118578 555290 -2313778 -7023420
38034 -7023420 -9129346 -6956389 -2945114 -498045 -255224 -344159 404757 1316459 2077286
38025 2077286 3891644 7064588 9047051 7030490 1938214 -2190119 -2862655 -1442277
38017 -1442277 -428895 -129394 948317 3435920 6072908 7159025 6407794 5295642
38009 5295642 5520112 6841523 6872699 3912621 -266728 -1825263 709050 4753784 6871478
38000 6871478 6193056 3921302 1124673 -1478109 -2824174 -2525660 -1927674 -2304536 -2456679
37991 -2456679 -185499 3820335 5835580 3762466 239933 -382203 2630120 5548842
37983 5548842 4690222 763389 -1910348 -290988 4090386 7347739 8006154 7871508 8115746
37974 8115746 7082419 3732250 1044442 2771786 7659921 10437442 8811404 5972125
37966 5972125 5015503 4407931 1433777 -2645744 -4382637 -3714832 -3982885 -6242370 -6918876
37957 -6918876 -2709236 4235917 8203339 6512322 2422953 839013 2227052 2327597
37949 2327597 -2005021 -8450008 -12112773 -11525889 -9465035 -8249769 -7179014 -5322121
37941 -5322121 -3834326 -3601588 -2946707 -181272 3198500 4558815 4243113 4783429 6583143
37932 6583143 7316492 5684605 3059761 911394 -958619 -2818075 -3790556 -3297530 -2066281
37923 -2066281 -803729 630299 1984797 2216750 1256104 511758 498583 -332003 -2879536
37914 -2879536 -5123993 -4671767 -2505745 -1715518 -2794756 -2831196 -62247 3066732 3008361
37905 3008361 -169794 -3191547 -4018998 -3531859 -2529302 204922 4934050 8104243
37897 8104243 5802471 -246080 -3748571 -2059275 81389 -2505610 -7647421 -8903098
37889 -8903098 -4947428 -1179017 -1586556 -3452954 -2164357 2093302 5354791 5546062
37881 5546062 4089133 2770564 1815238 1061910 799340 848842 304621 -1109635 -2316979
37872 -2316979 -2124911 -697816 672705 1039694 631025 135338 -433112 -1491973 -2497585
37863 -2497585 -1920896 549233 2806150 2769787 1277579 688813 1187782 948322 -125068
37854 -125068 41274 1472422 812092 -3569175 -7835936 -7177313 -2361400 1546331 2109727
37845 2109727 1636712 2429198 3519955 3287544 2410389 2325839 2672904 2295484 1597514
37836 1597514 1860367 2748410 2457256 521922 -1157097 -845465 604110 1023061 54591
37827 54591 -467193 528744 1514447 526267 -1886950 -3376896 -2865331 -1187407 998174
37818 998174 3799882 6372069 7007430 5957007 5931450 8203202 10132825 8625694 4559859
37809 4559859 1456261 820404 1338542 2099163 3840351 6647271 8597647 7581196 3479701
37800 3479701 -1543277 -4124400 -1886174 3865158 8317010 7943262 4568510 2606862
37792 2606862 3046482 3020174 980414 -1231810 -2069499 -2433841 -2728663 -1267255 1992564
37783 1992564 3142446 -931445 -7416417 -10703492 -9600532 -7854514 -7757605 -7018192 -3185514
37774 -3185514 1779603 3582047 861445 -3575313 -6248963 -6089345 -4037704 -1174362
37766 -1174362 1711121 3371945 2484948 -558002 -3165836 -3007760 -641555 1417456
37758 1417456 1954703 1858369 1646184 275246 -2523353 -4521627 -3469342 -344234 1803195
37749 1803195 1891570 1845375 3462655 5926030 7122353 6298509 4466088 2655738 673415
37740 673415 -2129131 -5152951 -6329549 -4345945 -895720 519606 -1426789 -4163234
37732 -4163234 -4245518 -1035639 3589900 7797869 10320806 9681662 5683158 1539802 1557989
37723 1557989 5674055 8709271 6574365 1262728 -2096508 -1376204 1626565 4914815
37715 4914815 7829249 9241026 7513824 3253386 -352862 -1264901 -785366 -825326 -1081847
37706 -1081847 -796877 -1336050 -4134473 -7083952 -6278401 -1582386 2525729 2686086 751714
37697 751714 671673 3307863 6229040 7186758 5715269 2232914 -2208953 -5537207 -6034436
37688 -6034436 -4430512 -3217775 -3573792 -4111095 -2995739 -308957 2136244 2685003 1225884
37679 1225884 -933539 -2469786 -3474390 -5164515 -7926826 -10293716 -10409307 -7928024
37671 -7928024 -4015439 -352767 1337895 151599 -2522677 -3752014 -2682488 -1905908
37663 -1905908 -3381772 -4769774 -2717340 1435821 2930659 389466 -2451604 -2548563
37655 -2548563 -1473199 -1941601 -3488165 -3821661 -2399410 -559589 467076 108646 -1612604
37646 -1612604 -3457919 -3701243 -2333220 -750176 1264391 5352298 10117010 10444976
37638 10444976 4112017 -3891837 -7263693 -6364111 -6155040 -7801431 -7341136 -2708812
37630 -2708812 2775419 5463731 6158222 7559814 9502775 9262571 5415594 -494474
37622 -494474 -5519889 -7294908 -5076427 -55213 5339756 9022078 10318738 9711336
37614 9711336 8031141 5969289 3971005 2416327 1751746 2010414 2307284 1694309 595667
37605 595667 206157 300057 -636547 -2472313 -2712318 -47618 3309927 4575808 3916162
37596 3916162 3106127 2496777 1668173 1406793 2289753 2709245 1179156 -746561 -930984
37587 -930984 -521207 -1699850 -3037425 -1659325 857801 189385 -3010944 -3097876 1273731
37578 1273731 3916925 450751 -4516254 -4374010 -711763 -616926 -5671242 -9670854 -7684426
37569 -7684426 -2512482 -310093 -2892121 -6590998 -7247589 -4425114 -942884 532651
37561 532651 -187602 -1625088 -2709837 -3148134 -2505072 -606306 1346576 1961370 2036405
37552 2036405 3627863 6416213 7453464 5317045 2000168 -403858 -2143063 -3353464
37544 -3353464 -2150727 2145509 6088169 5536585 891772 -3655507 -5110613 -3597250
37536 -3597250 -464513 2816914 4487648 3846096 2719529 3621560 6541888 9116830
37528 9116830 9602949 8259851 6415057 5577812 6658433 8584083 8614221 5495553 1205520
37519 1205520 -1802639 -3425914 -4238659 -3149713 524199 4366933 5413538 4156817
37511 4156817 2919652 1658858 -925361 -3336312 -2806862 -492321 -478237 -3214009 -4567547
37502 -4567547 -2498643 -148745 -455146 -1817988 -1576809 -320582 -229 -506194 -674696
37493 -674696 -299474 1053861 4578348 9179602 10740385 7396968 2981513 1879860
37485 1879860 2880313 2090350 -50618 488618 4336720 7356571 6789868 4564669 3410912
37476 3410912 3353875 3438553 3572812 2998257 191554 -3496016 -3175612 3457620 11487625
37467 11487625 13821575 9751762 5014536 3871503 4899279 5099064 4363754 3969695
37459 3969695 3498717 1876103 -202094 -1309957 -1542599 -1421214 156224 3901983 6889656
37450 6889656 5033364 -780740 -4708128 -3431901 -174819 904874 905602 3218422 6792481
37441 6792481 6999751 2725374 -1682566 -2290547 42111 2359661 3706427 4799061
37433 4799061 5885856 6917724 8372259 10145143 10705244 8944860 6088057 4351314
37425 4351314 4266251 4540305 4115664 3185131 2310328 1521161 586978 -144103 460984 3100775
37415 3100775 6291143 6888777 3773771 332754 1142945 6108173 10181605 9586334 5983317
37406 5983317 3192230 2082171 928093 -721710 -1292841 35142 2117749 3796346
37398 3796346 5403973 7637909 9929156 10719343 9172072 6306924 4275395 4272788 5298043
37389 5298043 5497530 4567377 3957608 4741853 6381495 7680897 7710275 5708478 1763027
37380 1763027 -1988708 -2758478 -564183 1593236 1954763 2067051 3036621 2415027 -2168703
37371 -2168703 -8053871 -9931789 -6674756 -2334649 -236908 477849 1563697 2214385
37363 2214385 827208 -1977745 -4152034 -4681414 -3645692 -1169833 1872478 3192701
37355 3192701 1263535 -2182573 -3679211 -2027579 800208 2695201 3485878 3591306
37347 3591306 2681127 993905 329550 1685896 2827208 665192 -3998330 -6696592
37339 -6696592 -5083817 -2031097 -1271103 -2109638 -1113755 2205469 4541168 3497164 291726
37330 291726 -2723997 -4695178 -5574056 -5170609 -4139966 -3971133 -4712843 -4514839 -2761167
37321 -2761167 -1782669 -3717541 -7236884 -9291282 -8856190 -7063798 -4804477 -2338604
37313 -2338604 -495270 -70735 -292523 403551 2301239 4443626 6176613 7267249 7240898
37304 7240898 6220253 5726078 6894200 8474134 8344866 6438069 4362606 2790483
37296 2790483 1263940 43260 -165661 -110784 -1319105 -3476395 -4637318 -4182113 -3465624
37287 -3465624 -3303993 -2869395 -1451345 462694 2021671 2272999 28988 -4227059 -6790309
37278 -6790309 -4226789 1443260 4528282 3340703 2243983 4435187 6745450 4723458
37270 4723458 -323364 -3451524 -3361993 -3190729 -4553493 -5008259 -2380159 1583292 3576177
37261 3576177 2846342 1301308 585697 608692 735386 1196397 2677004 4833444 6089953
37252 6089953 5463592 3938983 2932841 1867359 -930345 -4752283 -6145460 -3211218
37244 -3211218 1499747 4015612 3568313 2480951 2503595 3156089 3073044 1276711 -2326146
37235 -2326146 -6112489 -7163450 -4421886 -795010 -12187 -1959938 -3528080 -3504584 -3449956
37226 -3449956 -3656091 -2073474 1451257 3682618 3184175 3523672 7652217 11844389 10154039
37217 10154039 3626070 -488135 857752 2465749 -557993 -5291290 -5963519 -2744866
37209 -2744866 -646321 -1717828 -3520599 -4643187 -6567088 -9454218 -10734068 -9337119
37201 -9337119 -7360728 -5811154 -2538494 3328199 8585619 10619793 11661799 14702798
37193 14702798 17691852 16168493 10450920 6021581 6847824 11466077 15612710 16145497
37185 16145497 12730131 8099269 6106912 7337703 7858024 4813305 1231944 1494261
37177 1494261 3970717 3335242 -754606 -3280367 -2451081 -2287520 -4865007 -6248313 -3500680
37168 -3500680 -300953 -1047970 -3532452 -2636678 1385997 3545459 1754102 -768092
37160 -768092 -532555 2298411 5277078 6559617 6250687 6139157 7541654 8831352 6961999
37151 6961999 2388791 -191039 2305550 7538561 11742190 14218991 15181865 12891269
37143 12891269 7076080 2160467 2223800 4919012 5329847 3862120 4613922 7182516 6554310
37134 6554310 1493482 -2974331 -2862134 123629 2908213 5290483 7689113 8762776
37126 8762776 7792368 6295548 5300089 4034063 2911750 4258408 7896753 9533382
37118 9533382 6468393 2122729 1740060 5638700 9729157 11112075 10175074 8169423
37110 8169423 5579994 2757052 174100 -2031750 -3692142 -4054559 -2379672 1140589
37102 1140589 5166978 7431779 5985136 1829924 -578470 1906153 6371996 7211597
37094 7211597 4128587 2547326 5156453 7860728 6550746 3435865 3024068 5325391
37086 5325391 7191321 7734933 8079924 7707704 5474761 2919989 2284748 2276040 142381
37077 142381 -2789308 -2384412 1473700 4124657 3147733 1664309 2872575 5223328 5525162
37068 5525162 3772473 2068946 990365 -106470 -718998 -58001 578967 -876206 -3664960
37059 -3664960 -4481458 -1980108 1073525 1352949 -838943 -2571596 -2553854 -2232885 -2634119
37050 -2634119 -2591113 -1382265 -873029 -2555093 -4002825 -1770359 2572816 3370158 -1069398
37041 -1069398 -5232720 -3548155 2449804 7138948 8305059 7822089 6717333 4056402
37033 4056402 392375 -1763390 -1565999 -864320 -1106155 -2042784 -3834854 -7175607 -10343453
37024 -10343453 -9450053 -3686169 2015693 1947867 -3887391 -10065826 -11808814 -9353001
37016 -9353001 -6553355 -6061641 -6194203 -3027549 4129015 10820832 12671832 11075206
37008 11075206 10749278 12498950 12492880 9198818 6472569 7566483 10037582 9978433 8272844
36999 8272844 8469437 10279393 9788115 5795547 1774760 810450 1992232 3030058 3579827
36990 3579827 4271487 4632456 4096182 3879400 5850760 9816527 13301319 14109712 12402486
36981 12402486 10283353 9786560 11154339 12777977 12922099 11545315 10102533 9585953
36973 9585953 9400526 8433972 6623959 4970672 4368762 4876908 5845438 6333520 5693261
36964 5693261 4271088 3352152 3854692 5188916 6024972 6097486 6318814 6828382 6106242
36955 6106242 3165132 -20437 70519 4291200 9271077 10857506 8350052 4560634
36947 4560634 2378853 2329625 3198939 3881296 4234346 4651139 5172545 5134259 4002715
36938 4002715 2574999 2584896 4648495 7357481 9067761 9699792 9774860 8678983 5585615
36929 5585615 1617024 -857443 -1129720 -513218 395157 2604593 5983292 7826830 6055651
36920 6055651 2477688 718647 1559703 2506957 1906570 1216244 2382349 4845211 6747380
36911 6747380 8036982 10328528 13715416 15719842 14412582 11177740 8843469 7934027
36903 7934027 6770757 5046864 4829146 7111151 9544016 9319080 6866560 4864649
36895 4864649 4711238 5881286 7664649 9231633 8888711 6059002 3529636 4575140
36887 4575140 7773749 8145525 4220883 336050 265416 2231230 2989551 3601465 7056971
36878 7056971 12075668 13948739 11374661 8288531 7970211 8799558 7576173 4461803
36870 4461803 2381438 2925162 4929519 6603611 7458378 8109292 9148451 10421474 11114011
36861 11114011 10669360 9671693 9251517 9358986 8455188 5711046 2868343 2533173 4514509
36852 4514509 5431418 3128984 384322 2107231 8800187 15107056 15984385 12221520
36844 12221520 7949061 4782372 1740901 -244455 1661532 6829784 10039111 8055373
36836 8055373 4166825 3341783 5401181 6287362 4319530 1647686 444678 972123 2913699
36827 2913699 5499948 6556593 4472029 1194155 546475 3523816 7847111 11854696
36819 11854696 15613506 18179370 17522806 14094965 11040523 9672241 8023819 5164655
36811 5164655 3277078 3478716 3291527 1123421 -23426 3070214 8225297 10481141
36803 10481141 8589773 5154697 1858444 -1214061 -2434214 420648 5616367 8052299
36795 8052299 5696525 2139560 1356471 2882825 3880671 3439623 2709976 2460636 2513376
36786 2513376 2719597 3173683 4100448 6042357 8991223 11038881 9773437 5881594 3426005
36777 3426005 5170949 9228937 11792941 11684607 10554625 9980187 10352217 11672228 13409873
36768 13409873 14129884 13144030 12128110 13184888 15405017 15270831 10972147 5001359
36760 5001359 1856701 3815104 9094369 13558762 14227390 11594575 8469652 6653228
36752 6653228 5763134 5465126 6822749 9948957 12096105 10533129 6517955 4067830
36744 4067830 5227485 8680742 12374074 14927633 14970876 12230544 9358713 9429704 11246161
36735 11246161 10739764 7844109 7646577 12514726 17287194 15997794 10271085 6620383
36727 6620383 7382802 9067366 8825156 7720556 7114717 6014182 3421361 259033 -2412332
36718 -2412332 -4651284 -5984690 -4804180 -654731 4740424 9674981 13814400 16646889
36710 16646889 16882380 14672518 12440082 12027855 12581795 12470352 11671929 11019492 10731744
36701 10731744 11057495 12811122 15817122 18197717 18523611 17348235 15618718 13387614
36693 13387614 11280933 10966589 12347408 12507622 9691067 6226806 4984807 5148360
36685 5148360 4637618 4508405 6778968 9402814 8330329 4240583 2248744 4374082
36677 4374082 7224484 8392373 9937651 12978669 13835369 9784899 4988548 5533813
36669 5533813 10536621 13394928 11324056 8594799 9438086 12168760 12598525 10234604
36661 10234604 8200950 8421504 9555219 9639933 8908008 9183025 11146134 13064968 12644285
36652 12644285 9848010 7004381 5847780 5613821 4976347 4610790 6001747 8400443
36644 8400443 9324074 8177464 6957346 6684839 5711498 3092185 1204340 2479473 5258262
36635 5258262 6064241 5067857 5609303 8230690 9249779 6735053 4082320 4874737 7291771
36626 7291771 7423316 5951050 6850374 10354398 12398612 11662778 11947604 15365861 17837806
36617 17837806 14970427 8976408 5482440 5748846 6535389 6248597 6454576 7637016 8057339
36608 8057339 7411964 7577016 8807497 9019352 8051649 8774627 12098722 14474010 12822432
36599 12822432 8933112 6301091 5353435 4773330 5052521 7252878 10075626 11635041
36591 11635041 12615789 14158600 14239991 10513083 5801238 5679828 10179667 12949624 10359751
36582 10359751 6807413 8043585 12913400 15601771 13820882 10663314 9238588 9324809
36574 9324809 9579581 9817831 9953416 8964288 6405574 3643213 2308757 2391397 3010493
36565 3010493 4403197 7667734 12408645 15906096 15564263 11832866 7862047 6214396
36557 6214396 6667029 7496165 7932873 8347240 8585300 7696323 5725592 4492538 5452139
36548 5452139 7267733 6755861 2610515 -2539554 -4542220 -2170222 1440799 2148553
36540 2148553 -862606 -4737627 -6507721 -5721848 -3379460 55717 4237705 7579661
36532 7579661 8169068 6005036 3006405 813618 -221359 -60019 1361973 3238473
36524 3238473 4295283 4700366 6015657 8324307 8942218 5569901 -107105 -3630010
36516 -3630010 -2488095 1487856 4401363 4006294 1091631 -1943802 -3357922 -3070176
36508 -3070176 -1800775 173538 2820348 5308335 6346390 5795613 4884002 4478894 4252256
36499 4252256 3887726 3663728 3252352 1742029 -59089 583139 4322812 7454266 6361848
36490 6361848 2749246 987959 1210652 -525054 -4814925 -6582257 -2490323 3526733
36482 3526733 5874961 5409594 7230462 11913392 14230648 11136285 6370647 5096248
36474 5096248 7358258 9499410 9672432 8886000 7835202 5858467 3125660 1439219
36466 1439219 2102506 4470946 7236927 9864359 11860207 11589757 7266405 -576064
36458 -576064 -8320832 -11810077 -10037328 -6051578 -3696519 -3649653 -3526989 -1816914 -94599
36449 -94599 -324872 -1462390 -871737 1376190 2203701 227919 -1578052 234856 4465486
36440 4465486 6390973 3772040 -430160 -1850881 512977 4246524 6725535 6957033
36432 6957033 5264476 2992828 2174647 3586299 5011520 3431665 -462079 -2164969
36424 -2164969 805029 5099556 5951449 3696561 2549286 3754053 4221885 2585535
36416 2585535 2087853 5162950 9058932 10226383 9767421 10166129 9296090 3484649 -4470688
36407 -4470688 -6799231 -1368568 4968722 5849654 2974636 1172718 997406 715352 1457018
36398 1457018 4690409 7295447 5276331 935630 151371 3022276 3726585 367841
36390 367841 -1763716 965553 4708976 4862164 3168370 3244542 3495714 599844 -2813663
36381 -2813663 -801828 6354912 11652690 11098191 8315365 7892251 9324869 10160474 10652035
36372 10652035 11675123 11387347 8168641 4803081 5376425 8850108 9859830 6174712
36364 6174712 1769933 1351540 4621068 7604164 7708561 5592910 3093284 1107117
36356 1107117 -570771 -2392456 -4282971 -5472202 -5191261 -3530688 -1310069 715129
36348 715129 2019001 2108385 1161670 604015 1708469 3570303 3960435 2532569 1575566
36339 1575566 2875042 5399951 7084103 7343980 6547645 4557351 1591659 -693992
36331 -693992 -1007300 -363230 -166220 613424 3640888 7203046 7333159 3424293 -431822
36322 -431822 -895369 688288 1521615 1901378 3999074 7807306 11045028 12348289 12251113
36313 12251113 11432908 10078424 8839138 8637095 9452830 10590758 11803246 12771005 12111195
36304 12111195 8889309 4893420 3184194 4043229 4507647 2751753 917022 2079235
36296 2079235 5761845 8329328 7417421 4346136 1899442 992102 483516 -190396 380907
36287 380907 3415867 7090866 7642241 3893749 -825096 -2472850 -768507 1728787
36279 1728787 3851862 6625639 10008341 11570591 9516726 5185953 1301964 -908837
36271 -908837 -1650406 -906124 1450326 4381975 6020589 5472298 3662691 2450537 3170845
36262 3170845 5482840 7172786 5878733 1906394 -1290694 -588290 3212414 6544669
36254 6544669 7589256 7783442 8273843 7100720 2257457 -3417633 -3725956 3308056 11835005
36245 11835005 14472178 10689132 6127044 4484734 3846077 1695073 -372537 493215
36237 493215 3462830 5233990 5006140 5260623 7848856 11588798 13698651 12077879 6873122
36228 6873122 1487299 836270 6107783 12125348 12735427 8163411 3898888 2881368
36220 2881368 2838152 1751065 1464639 3903799 7361292 9199520 9549784 9679184 9010489
36211 9010489 6745859 4774194 5806849 9353789 12176141 12351484 10727642 8759228
36203 8759228 7094597 6224999 6413191 6486405 4366732 -197861 -4229710 -3982784 838556
36194 838556 5844499 6038794 1544445 -2025012 -39492 5742254 10148309 11345891
36186 11345891 11353361 10789178 7647622 2104762 -1764859 -1060220 2483044 5927527 8662006
36177 8662006 10503811 9991280 7418316 6264648 8363600 10569800 9582262 7194138
36169 7194138 7029982 8787039 9812164 9913659 10173761 9257297 5801981 2634609 3371897
36160 3371897 6162900 6224258 3652953 2994050 5380541 7014677 5908980 4425514 4140987
36151 4140987 3671331 2945334 4258762 7230993 7825788 4701340 1931437 2990224 6246831
36142 6246831 8711052 10024121 10421549 9126396 7345943 8358808 11667187 11722240 6128706
36133 6128706 624878 1438583 6561675 9529045 8593903 6868234 5959453 5122242 5142012
36124 5142012 7518351 10395061 10168465 6893956 3827887 2023287 -214852 -2641622
36116 -2641622 -2465188 811011 3939199 4541929 4003233 4631292 6659446 9108583 11243233
36107 11243233 12163124 10971849 8333896 6428725 6798395 9208358 12263364 13806987
36099 13806987 11639121 6041486 1077173 1006983 5481705 10206826 11947941 10843605
36091 10843605 8466877 6206216 5364328 6379309 7839475 8131750 7601497 7222910 6334574
36082 6334574 4312358 3154854 4952990 7746877 7884771 6008479 6253425 9333797
36074 9333797 11137737 9226549 6202702 4973913 4890533 4622067 4855580 5658350 4836330
36065 4836330 1705784 -802859 -670848 -186423 -1643045 -2823960 -645674 3272303
36057 3272303 4925865 3975157 3242709 3577207 3652835 4104770 7241512 12387672 15627352
36048 15627352 15048630 12853458 11393848 10344413 8956717 8075954 8275334 8438953 7965998
36039 7965998 8388006 10900546 13734688 13901786 10864163 7088231 5335453 6204128 7883512
36030 7883512 7854550 5382671 2476958 1586814 2498412 2882692 1907111 1407663 2923224
36021 2923224 5521380 7598989 9067441 10498298 11798864 13192625 15774459 19257426
36013 19257426 20889433 19013662 16276350 16354915 18439724 18374867 15011100 11643823 10497369
36004 10497369 9704715 7546171 6056004 7446500 9651219 9117123 6521022 5862560
35996 5862560 8284577 10441247 9565448 7060033 5813543 6297404 6948871 6975056 7170164
35987 7170164 8447087 10532674 12137157 12357753 11972636 12625085 14246113 14614348 12683903
35978 12683903 10736640 11170308 12741147 12900145 12464384 14051707 16573209 16023780 12210149
35969 12210149 9702229 10519721 10805202 7442441 3486973 3423913 6667125 9602549 10936031
35960 10936031 11037460 9006747 4976450 2893207 6076606 11655616 14113183 12910837
35952 12910837 11878305 12460050 12760707 12374927 12780846 13331974 12160900 10803583 12356726
35943 12356726 15076017 13943404 9286038 7355078 10645989 14041483 13182246 10601024
35935 10601024 10166719 11059555 11288838 12096652 14290518 14710803 11414309 8566440 10695884
35926 10695884 14982930 14941183 10013073 6192937 7869391 13349750 17917296 17958759 13120981
35917 13120981 7430939 6680090 11618311 15890431 14134131 9335962 7701760 9098459
35909 9098459 8523388 5267875 3848876 6008142 8311943 8640882 9055076 10577373 10772992
35900 10772992 8935009 8601967 11711632 14364852 12106780 6633409 3777874 6491903
35892 6491903 12423070 17130080 17786244 15019802 12565756 13760058 17449102 19197080
35884 19197080 17375277 15603336 17686574 22454068 25532301 24455425 20213479 15272970
35876 15272970 11795605 10616943 10600385 10008289 9157719 10041652 12720095 14454104 13578558
35867 13578558 11761565 10912037 10450202 9600380 9691773 11552326 13087700 12694654 12974402
35858 12974402 17061138 22529502 23484885 18802048 14035051 13976454 16933386 18283955
35850 18283955 16780996 14743041 13894838 13923238 14455391 15746909 17016186 16206594 12641371
35841 12641371 8873353 8514149 12325259 17423675 20538766 21200623 21203901 21737146 22205492
35832 22205492 21786148 20906915 20489584 20329288 19116748 16248704 13189759 12476080 15035563
35823 15035563 18798154 20650774 19698552 17645931 15953518 14278991 12528715 12526716 15710457
35814 15710457 20435215 23854077 25608775 27094320 27756754 25496972 21116188 18860917
35806 18860917 20949167 24230217 24258163 20715122 16896616 15488624 16720900 19175018
35798 19175018 20473694 18563710 14402083 12150272 14500423 18930677 21075343 20812346
35790 20812346 21844111 25374140 27663820 25143040 19341450 14832043 13884999 15131311
35782 15131311 16614094 18098632 20269603 23106147 25695599 27172501 27607411 28163968
35774 28163968 30114491 33227126 35542013 35617141 34599088 34566458 34823408 32148207 25961924
35765 25961924 20781135 20692973 23062573 21795322 16528147 13831292 17947049 25033718
35757 25033718 29379548 31012077 33021268 34912070 33992758 31226553 30026320 30246726
35749 30246726 28897452 26306565 25865780 27640989 28195442 27300521 28480904 31720055
35741 31720055 32546051 30593967 31673441 37535748 40933970 36398710 29385348 27869064
35733 27869064 30447354 30774501 29234378 30841341 34248714 32954652 27122957 24600100
35725 24600100 28734587 33833007 35200168 35753070 39151774 43387648 45492863 46658160
35717 46658160 48034113 46683040 40887155 35269385 35162350 38863053 40580402 38730418
35709 38730418 36417697 35535276 35257127 35305488 36266021 37220913 36872488 36410033 37732766
35700 37732766 39681195 39869395 39519667 42043014 46703509 48264827 44253500 38762033
35692 38762033 37134031 39829117 43545968 45927246 46837777 46723209 46090618 45819065 46180675
35683 46180675 46013709 44181510 41423492 39669814 39888047 41509571 43591361 45631370
35675 45631370 47482551 49322838 51669518 54741325 57752185 59384407 59121055 57728580
35667 57728580 56245757 54899663 53509124 52768740 54196155 58180679 62774254 65573186
35659 65573186 66508365 67300124 68191274 67435088 65035598 64569417 68744334 74578607 76298126
35650 76298126 72868183 69327563 69847426 72706953 73967485 73218816 72702030 72628719 71072123
35641 71072123 68086290 66448427 67648116 69938122 71394460 72491173 74361508 76723896
35633 76723896 79110339 82116542 85582788 87523031 87192234 87361356 90527225 94273263
35625 94273263 94095390 90245982 87706511 89060337 91612818 92819908 94299876 97972744
35617 97972744 101867500 103134632 102558776 102525420 102664104 101427248 100416059 102748544 107620380
35608 107620380 110625274 109698586 107115639 105294058 104293666 104110930 105651915 108131640
35600 108131640 108989441 108046154 108574068 112450307 117410598 121171181 124896044 129737923
35592 129737923 133233816 133093746 132088644 134426818 138599519 139010212 134820642 132108555
35584 132108555 135657262 142841062 148091417 149959783 150595631 150878050 150073965 149171418
35576 149171418 150489078 153708540 155723685 155436495 155741573 159116127 163750715 166301202
35568 166301202 166551623 166668929 167264580 167424474 167932583 170709623 174608119 175489559 172058978
35559 172058978 168552164 169571619 174790108 180868288 185944129 189481871 190222173 187983617
35551 187983617 185920841 187221044 190561834 192486127 193251603 196058320 200874546 203710460
35543 203710460 202675400 200436572 199529779 199338268 199282303 201035650 205375403 210121078
35535 210121078 213365894 215772787 217719029 217444686 214440287 211542297 210933989 210961825
35527 210961825 209824914 209526935 212663327 217623704 220701644 221238025 221097815 220508489
35519 220508489 218087529 214133694 210614948 208461114 207483618 207950004 209558946 210080031
35511 210080031 207930257 205019285 204194684 205036878 205048573 203639484 201853930 199670845
35503 199670845 197020097 195946459 197888877 200155129 199258608 196516956 195794996 196811481
35495 196811481 195866840 192626848 190564954 190512791 189433522 186257561 183251482 180691475
35487 180691475 176322477 171579825 171521057 175776195 176535304 169968371 163238882 164173859
35479 164173859 169185326 168724336 161359382 154658448 153416660 154463369 153655111 151523216
35471 151523216 150010721 148495135 145694740 142532465 140933735 141441334 143027084 143852977
35463 143852977 142107521 137860197 133908786 132720650 132823239 130661048 125916102 122246058
35455 122246058 122283196 124324805 124650516 121198303 114753618 108708562 107724838 113765457
35447 113765457 122558462 126626730 123154009 116656805 112644338 111125156 108344622 102794376
35439 102794376 96763395 92912739 91761279 92214529 92572722 91152937 87730939 84494630
35431 84494630 84011248 85993658 87463663 86434897 84015823 82263107 81363774 80096187
35423 80096187 78076593 75997331 74007014 71542669 69140475 68895402 71942213 76184513
35415 76184513 77838137 75279312 70480495 66491473 64394200 63303488 62662268 63253331
35407 63253331 65485474 67644384 67280469 64443211 61966652 61603085 61499773 59435724
35399 59435724 57066283 57647986 60089788 59697075 55943921 54679489 59598406 65891334
35391 65891334 66914847 63567376 61194531 59925312 55551794 49116151 47150688 50736542
35383 50736542 52474100 48021954 43316453 44987988 49886068 50977074 48867267 49384920
35375 49384920 52409751 51736719 45917260 41446155 43376191 48816174 52089214 51558389
35367 51558389 48892574 45522127 42479646 40922376 40612154 39967427 38861820 38975068
35359 38975068 40408423 40788013 39002524 37040404 36719408 37405516 38507235 41151919
35351 41151919 45108196 46745476 43002370 35804302 29998171 28035909 28814986 30625434
35343 30625434 32954376 35835192 39075831 41872933 42436698 39075698 32629742 26572437
35335 26572437 23560694 23055854 23255566 23671908 24397542 24532729 23318009 21787938 21583758
35326 21583758 22941630 25159525 27910847 30671480 32086242 31521384 30166354 29146738
35318 29146738 27872312 25825280 24350680 24580475 25086904 24019859 22202240 21361064
35310 21361064 20622111 18231808 15987786 17768570 23076298 26034875 22703086 16498202
35302 16498202 14055438 17569369 23432141 27198952 27642632 26230137 24491308 22665323
35294 22665323 20500677 18758947 19084482 21844242 24987344 26284328 26000316 25792832
35286 25792832 25777506 24953704 23927192 24083260 23920397 19945527 12548317 7261918 7737614
35277 7737614 10793559 11742767 11620695 14535568 19767676 22106618 20019830 18057037
35269 18057037 19674054 22466438 23014408 22297277 22835211 23671148 22338424 19755787 18815659
35260 18815659 19163115 17702318 14025629 11016178 9533179 6877753 2190817 -598886
35252 -598886 2025135 7923256 12313143 13823339 14238272 13970521 11880910 9175154 9319314
35243 9319314 13025475 16608640 17019070 15872428 16224282 17317392 15588183 10429488
35235 10429488 6062228 6704080 11639258 16432246 18040091 17157327 15837855 14709382
35227 14709382 13432481 12531023 13036100 14653752 15939362 16478126 17384076 19194637 20801257
35218 20801257 21239572 21048210 20767709 19539824 16706829 13657201 12344742 12723613 13269543
35209 13269543 13304917 13054769 12040835 9407090 5648745 2400052 829247 1616969 5452994
35200 5452994 11332166 15356630 14339873 10448704 9079672 11780244 14547274 13970653
35192 13970653 11632242 10772723 11735158 13067453 14663688 17060299 19199967 19481067
35184 19481067 18152780 16699124 15595767 14171521 11843491 8413580 4382303 1814800
35176 1814800 2914675 6460738 8019559 5564292 2427282 2263666 3640280 2898527
35168 2898527 227919 -1085163 -24574 1755711 3943663 7376799 10120943 8790783
35160 8790783 4693474 3743488 8198973 12832519 12326572 8963686 9165140 14576856 20533417
35151 20533417 22497322 20531108 17288616 14353336 11446297 7813235 3779423 1354364
35143 1354364 2663750 6848968 9598005 7640255 3247844 2102174 6462030 12560410
35135 12560410 15560633 14979295 13531092 12380079 10444784 8056572 7959489 11209945
35127 11209945 14672625 15078245 13769963 14174404 15653075 14199772 9707944 7733110
35119 7733110 11499138 16227040 15445732 10149561 6862756 8114698 10077035 9455930
35111 9455930 7391328 5376420 2394379 -1366866 -2209503 2071823 7741684 9471989
35103 9471989 7397682 6192231 8093538 10465460 10283275 7866730 5357817 3870029
35095 3870029 3351642 3786063 5291813 7590382 9989696 11606130 11569272 9603280 6589781
35086 6589781 4170134 3637152 5176144 7717938 9296413 8306171 5168012 2308389
35078 2308389 1699799 2697302 3017891 1534561 -783048 -2530412 -3383567 -3645488 -3196879
35069 -3196879 -1693082 537959 2616307 4173629 5518555 6490374 6234808 5080225
35061 5080225 5496390 9120367 13257073 13200894 8777510 5488267 7235238 10872299 11069506
35052 11069506 8071586 6329311 6947694 6724302 4708033 4263000 6945372 9179616
35044 9179616 7890776 5602264 6409300 9573343 10747627 7941413 3128429 -884449
35036 -884449 -2466631 -1134059 1865842 3652734 2536131 39998 -1464999 -1797888
35028 -1797888 -1840282 -1079816 1339306 4480151 6898072 8720585 10085073 9125363 4446196
35019 4446196 -1641691 -5362070 -5938369 -5066679 -3465514 -1412335 -1251495 -4985225 -9905846
35010 -9905846 -11087506 -8313003 -6154579 -6763796 -7197005 -5025875 -1997745 -82444
35002 -82444 2048160 5871692 9416257 9542092 5814290 413874 -3581895 -2847081 3817535
34993 3817535 11936758 13906154 7892981 999573 492339 5043651 8330740 8200475
34985 8200475 7404066 7307533 6440927 4890746 5023954 7163282 8758028 8774991 9093551
34976 9093551 10397428 10391630 7812889 4938048 4004927 3954044 3115061 2673072 4575644
34967 4575644 7717528 9285366 8910778 8431860 7963109 5469838 860645 -2403919 -1351914
34958 -1351914 2765219 6407178 7940391 8142893 7818941 7260740 7467893 9185373 10453534
34949 10453534 7883437 1591557 -3590102 -3809115 -1145878 -375854 -2344440 -3847114
34941 -3847114 -3418734 -3337293 -5020169 -5942036 -3239166 1925294 5874941 6847091 5880247
34932 5880247 4408619 3021376 1979588 1111799 -591228 -3893912 -7976793 -11069297
34924 -11069297 -11911277 -9862870 -4743846 1953853 6637696 6419339 2316987 -1768537
34916 -1768537 -3213894 -2623473 -1934550 -2108537 -2898594 -3671701 -3945873 -3609906 -2742131
34907 -2742131 -1194514 911294 2059324 235192 -3982663 -6863436 -5905105 -3346658
34899 -3346658 -2797978 -3493510 -1320584 4518044 9651792 10555143 8979270 8165169 7553462
34890 7553462 4641648 462945 -805857 2076271 5104165 4199048 362553 -2220222
34882 -2220222 -1737762 -199535 94343 -743997 -1388207 -1280907 -395225 1577192 4424120
34873 4424120 6714979 7349617 7108547 7095499 6335511 3084623 -1614574 -4170184 -2915568
34864 -2915568 -192454 1003261 450885 -359239 -642716 -87431 1936959 5041146 7158520
34855 7158520 6989357 5630808 4187536 1865482 -1333123 -2466699 376713 3824415
34847 3824415 3060070 -1116958 -3439529 -1896408 400176 1217134 1883155 2713331 1042459
34838 1042459 -3490635 -6257234 -3826468 719454 2516668 2005313 3006359 5925143
34830 5925143 7507504 6251689 3721337 1011743 -1953528 -3769509 -2424502 590789
34822 590789 1005256 -2173942 -4796852 -3361079 415899 2713301 2496942 967970 -1430065
34813 -1430065 -4496623 -6363292 -5298116 -2830742 -2218352 -3892959 -5120750 -4489176
34805 -4489176 -3943618 -5184986 -6452829 -4936058 -953672 2450595 3356141 2300580
34797 2300580 166164 -2832646 -5605568 -5973287 -3388854 -365508 303963 -1231354
34789 -1231354 -2682365 -2584932 -1072090 1228401 3322628 3742094 2251061 1008829 1988320
34780 1988320 3861039 3765430 1564424 -517829 -2148561 -5160801 -9024420 -9933960 -6141812
34771 -6141812 -840216 2451587 4238220 6136822 6689363 3786737 -743100 -2893165
34763 -2893165 -1816016 -10680 921014 1302767 902371 -945922 -2911663 -2795282 -1202501
34754 -1202501 -899334 -2368688 -3245253 -2429323 -1458168 -1387925 -1672845 -2524177 -4632798
34745 -4632798 -6005098 -3527572 1048384 1719662 -2608357 -4658252 1317314 10407508
34737 10407508 13351944 9245681 5772503 7801948 11973888 13349126 11898460 10182981
34729 10182981 8738226 6635091 4079415 1893392 -73340 -2134485 -3493988 -3140744
34721 -3140744 -1124736 1780419 4572935 5880371 5022025 3634515 4113690 5716888
34713 5716888 4777123 190116 -4060525 -4222559 -2228348 -2582255 -5441789 -6805112 -5194094
34704 -5194094 -3857694 -5127965 -6334080 -3972379 367686 1427392 -3002044 -9369180
34696 -9369180 -12600934 -11159535 -7324765 -4048584 -2763385 -3521964 -5678074 -7837512
34688 -7837512 -7986224 -4915736 106148 3849483 4127054 2125148 1115536 2948581
34680 2948581 6365506 8523600 7448410 3319064 -1532432 -4044308 -3297154 -2115935
34672 -2115935 -4115942 -8679721 -10947938 -8022780 -3049879 -976880 -1920161 -1668933
34664 -1668933 1996591 6678470 9115244 8457224 5118655 -454875 -6189741 -8256277
34656 -8256277 -5120098 -204026 1984597 1482415 2195328 5973902 9864629 9917772 6010606
34647 6010606 1784535 520038 1974145 3240593 2182658 -481680 -2495334 -2556593
34639 -2556593 -743975 2476551 5857210 6660560 3149434 -1804242 -2627992 2050230
34631 2050230 7216683 8078770 5960639 4887943 5119920 4046912 1682926 687517 1562690
34622 1562690 2270952 2662935 4883283 8687504 10654466 9449540 7983358 8605387 9812287
34613 9812287 9801223 9767776 11095477 12390614 12115541 11279890 10517921 7494696 1046801
34604 1046801 -4641811 -4632291 -488732 1829994 526480 -711616 -109711 -984888 -5465215
34595 -5465215 -9687407 -8784848 -3819339 -95963 -159395 -1924913 -3003590 -3305941 -2860884
34586 -2860884 -308507 4464552 8158803 7242203 2945968 558441 2911922 6665905
34578 6665905 6844950 3586752 1702388 3882770 7328036 8003780 5618146 2686855
34570 2686855 758731 -196979 -120273 882596 1357741 37666 -1677721 -1065128 1967124
34561 1967124 4433611 4333234 3215649 3620880 5344742 5729929 3314640 -10904 -1078792
34552 -1078792 558966 1608502 -1048821 -5866756 -7820016 -4540388 657032 3140860
34544 3140860 2580020 2212067 3761089 5580253 5609334 4069784 2849740 3356624 4959370
34535 4959370 4942183 905753 -5873342 -10894632 -11594482 -10222949 -9583954 -8225355 -3353838
34526 -3353838 3072348 5726301 3306363 209085 64781 1679198 2769620 3763375
34518 3763375 5530315 6477672 4730315 1240908 -1550069 -2500150 -1410268 2119459
34510 2119459 7281369 11183967 11749822 10329011 9344776 8508429 5680699 755709 -3661595
34501 -3661595 -5440636 -5058037 -4326445 -4134478 -3795631 -2304968 -179011 493581 -1166351
34492 -1166351 -2633801 -662833 3848311 6367903 4925827 2942278 4188301 7551827
34484 7551827 9272346 8376332 6973543 6252470 5080116 2519656 -296866 -1139556 1237579
34475 1237579 5532891 8121320 6309805 2000183 84743 2117153 4023901 1880178
34467 1880178 -2580382 -4769819 -3388821 -760803 1294696 2658553 3034612 1985727
34459 1985727 296971 -1103504 -2592106 -3936049 -2709205 2169655 6908639 6759245
34451 6759245 2528629 -737918 -777832 428287 1571788 3411193 4986962 3609434
34443 3609434 -89679 -1850960 -258105 1074644 -70715 -603594 2255421 5758826
34435 5758826 6166908 5197251 7269414 12330412 15948692 15492271 12223229 8054329 4215080
34426 4215080 2774275 5288485 9263188 9635636 5125902 169090 -970559 709517
34418 709517 1774800 1938763 3844433 8190745 12059099 12503966 9625407 5270515 615499
34409 615499 -3476472 -5164643 -3016371 1522147 5075292 6142452 6302955 7246644 8503803
34400 8503803 8921666 8420216 7074638 4476602 1650480 1514066 5136228 9324994 10549933
34391 10549933 9517677 8749541 7477582 3300920 -2036068 -3708379 -1245784 77665
34383 77665 -2951165 -6710440 -6384844 -2750640 -198153 -661203 -2658048 -4392966 -4803956
34374 -4803956 -2974779 671912 3499097 3303466 1178544 15457 1051650 3403355
34366 3403355 5849615 7506431 7877246 7660861 8256533 9289541 8429547 5138143 2426305
34357 2426305 2786966 4463302 4374705 2918252 2691549 3616714 2747824 -1264750 -6346948
34348 -6346948 -9763091 -10450165 -8547608 -4721842 -330306 3223197 5514547 6636951
34340 6636951 6280655 4371149 1908620 13969 -1147513 -1692760 -1572453 -1680257 -3520604
34331 -3520604 -6445343 -7474665 -5747927 -4650870 -6867346 -9762689 -9228514 -6250435
34323 -6250435 -5494184 -8247424 -10875094 -10192458 -6734497 -2473215 1458552 4340889
34315 4340889 5842730 6616131 6756357 4459353 -935609 -5604420 -4774584 675612 5030360
34306 5030360 5198557 3401401 2142685 898252 -987100 -2140882 -1678890 -617846
34298 -617846 757487 3767379 8030542 10447049 9316951 6708011 5022833 3894383
34290 3894383 2164289 298772 -911246 -1675310 -1861639 -959327 -531752 -3356810 -8346781
34281 -8346781 -9894815 -4913811 2561523 6669209 6700949 5535720 3902004 528539
34273 528539 -3405860 -4409356 -1547663 1906593 2487576 501476 -545690 2159252
34265 2159252 7320231 10256515 8315521 4994666 5926133 10846471 13610547 11265068
34257 11265068 8137469 7957869 6918296 -152801 -9995503 -13679230 -8261043 -23160
34249 -23160 4232058 4169680 3095967 2477857 1522177 -387422 -2891997 -5059129 -5627600
34240 -5627600 -3960646 -1262910 129483 -1053096 -4074216 -7040958 -8137950 -6985942
34232 -6985942 -5520962 -6198506 -8536194 -9363267 -7555402 -5822967 -5908096 -5164332 -1102364
34223 -1102364 3441635 3876446 762938 -1251630 -203230 1921439 3787121 5776322
34215 5776322 6668676 4181489 -474800 -2983944 -1895634 -257089 -288382 -464998 647958
34206 647958 1469960 287053 -1960036 -3559804 -4210655 -4075142 -3153489 -2428939 -2874105
34197 -2874105 -2819548 231402 4457747 4522685 -947412 -6783731 -8243924 -6555400 -4993519
34188 -4993519 -3524270 -856829 1515997 1330599 -614644 -2092906 -2950607 -3934906 -4240175
34179 -4240175 -3463580 -3829929 -6984879 -10508267 -11083823 -9159255 -6900497 -3902139 637810
34170 637810 3694007 1883431 -2057297 -2216533 1326980 2525467 -688325 -3023886
34162 -3023886 -681731 2684559 2657689 1220995 2010484 2666811 -1473711 -8165557 -9716802
34153 -9716802 -3876008 2974909 5255443 5337793 8002170 12026285 12017459 6589053 56804
34144 56804 -3548248 -4034227 -2335992 1488414 5750246 6221110 956796 -5894000 -8388707
34135 -8388707 -6019421 -3548728 -3944852 -4809193 -2693413 1830473 5152215 5035152 2452669
34126 2452669 2091 -293712 1631685 3701873 3463004 663366 -2589199 -4523515
34118 -4523515 -5363229 -5770038 -5200257 -3098272 -598292 568025 390048 419196 1402585
34109 1402585 2179305 1139011 -1795058 -4794718 -5628538 -3746170 -912300 565688
34101 565688 122210 -1028976 -1727733 -1752835 -1157013 -43536 919162 980937 383008 -188943
34091 -188943 -962261 -2383770 -3484460 -3043209 -2168875 -3062096 -4972485 -4497297 -829096
34082 -829096 2592822 3382143 3926504 7176312 11333625 12038156 8360177 3593378 943683
34073 943683 918455 2216108 2982406 1894624 -139180 -290762 2558298 5923888 7209838
34064 7209838 7115698 7185710 6179024 2265653 -2831804 -5798467 -6834669 -8735978 -11361786
34055 -11361786 -11406592 -8132713 -5130632 -5000699 -5738694 -4210499 -606723 2396323 3133079
34046 3133079 2190940 1394748 2305965 4706497 6593643 6856877 7025328 8279560 8090383
34037 8090383 3367301 -3628622 -6795355 -4115545 184667 2471785 4098222 6784651
34029 6784651 8163344 5680214 1687549 301789 1099711 277097 -2761809 -4217274
34021 -4217274 -1770710 1773391 2159776 -1077967 -4608820 -5561363 -4435414 -3745802 -4541069
34012 -4541069 -5087175 -3364274 -140972 1622966 373966 -2205599 -3197057 -1375118
34004 -1375118 1936578 4079462 3249754 326894 -1926001 -2376055 -3096605 -5829626 -8365548
33995 -8365548 -7201792 -2833869 939423 2539484 3741261 5283731 5458884 3879053
33987 3879053 2663123 2648222 2241098 1274681 1844666 3782322 3933130 2081269 2509790
33978 2509790 6539677 8809139 5461928 1140086 2040815 5998386 6281261 2559806
33970 2559806 665216 2586475 4227146 3579675 4149571 8353227 13201919 14966810
33962 14966810 13714799 11159779 8062266 5691505 5859554 7281416 5689612 176779
33954 176779 -3980518 -1892504 4173230 7730679 5953089 1702454 -1040720 -1001868 673458
33945 673458 2322203 3041465 2930350 2239552 677073 -1490954 -2290287 -22630 3666753
33936 3666753 5060137 3098109 474216 -544034 -774892 -1605190 -2428559 -2192217 -1460953
33927 -1460953 -1319844 -1751569 -2271573 -2607022 -1913854 710217 3987964 4961391 2998309
33918 2998309 1173045 2288699 5612117 8871666 11076658 11623330 9129176 3679889
33910 3679889 -1484591 -2970793 -853731 2338101 4744252 5657232 4752185 2883634
33902 2883634 2057765 2669756 2464379 206242 -1624423 -257968 3083136 5090835 5020128
33893 5020128 4581387 4541570 4403772 4374229 4663360 3721241 97970 -4665685 -7677037
33884 -7677037 -8246865 -7165504 -4024429 1168289 5047561 3956464 -474231 -3131415
33876 -3131415 -2678149 -2401580 -3500503 -2789067 1133315 4261276 2772134 -1253248 -2919081
33867 -2919081 -935994 1908409 2933442 1755378 -405970 -1735622 -1253437 -317001
33859 -317001 -1130694 -3151034 -3455580 -1545146 -522382 -1856226 -2582448 -361375 2131033
33850 2131033 1412581 -1171897 -2233464 -2282427 -3874838 -5439069 -2840439 2791193 4640801
33841 4640801 -442350 -6856085 -7448817 -2459390 2147583 3230513 3673977 7263344
33833 7263344 13178668 16801057 15083008 10032177 6435621 6522985 8075824 8191500 7097655
33824 7097655 6590334 6358784 4689793 2064701 825565 1233900 1163578 260550 884189
33815 884189 3655014 5710021 5546041 6034688 9278434 11400001 6995455 -2611622 -10264074
33806 -10264074 -11962369 -10414357 -8813263 -5863370 190831 6181502 7013908 2875702
33798 2875702 -596560 191859 2494009 2045124 -385531 -215809 3990310 8033146 7636780
33789 7636780 4115803 2333624 4316040 7556642 9354041 9837968 9759215 8073890 3983590
33780 3983590 -276155 -1354833 945624 3480137 3761447 2267077 659308 -379975
33772 -379975 -886642 -657796 470559 2046833 3244140 3375244 2322139 1055487 1262772
33763 1262772 3417099 5668013 6007230 5121221 5361247 7128276 8436238 8225141 7645713
33754 7645713 7325523 6007734 3464511 2338645 4657021 8076446 8278532 4428845
33746 4428845 -57062 -1799741 -395798 2607027 5358376 6078768 3911546 261299
33738 261299 -2055172 -1672724 249575 2072133 3604361 5509557 7784558 9480624
33730 9480624 9507654 7606681 4990952 3730814 4736448 6762000 8335623 9890136
33722 9890136 12331164 14129169 12318006 6742753 970013 -1936562 -2472862 -2438073 -1857164
33713 -1857164 -82933 1643794 1084632 -2161364 -6469228 -10204466 -12281124 -11539641
33705 -11539641 -7805488 -3394766 -1341665 -1736202 -1752029 82661 1635974 517701
33697 517701 -1819774 -1355396 3283315 8462812 9152298 4408824 -1372415 -2871526 722805
33688 722805 5169017 6190880 4238059 3242597 5000706 6476429 3593675 -3414882
33680 -3414882 -9990369 -12322432 -10806123 -7948619 -4594017 -144764 4126253 4755295
33672 4755295 477824 -4824670 -5875420 -2206734 1621537 2115846 807072 1264521
33664 1264521 4457879 8830342 13154685 16847942 18433584 16471377 12051434 7988341
33656 7988341 5141882 1775887 -2697173 -5677975 -4745737 -1498708 -2961 -1953921
33648 -1953921 -5007691 -5837859 -3631946 -376543 1542912 1639365 1250464 1236145 531694
33639 531694 -1843860 -3974684 -2705790 1303331 3091895 31755 -3556379 -1695761
33631 -1695761 4898325 9736838 9315562 6586041 5053480 4019283 1869006 44615
33623 44615 346008 1231654 658625 393539 3138564 6763948 6346946 1912637 -732736
33614 -732736 1845877 5904660 5891493 1277872 -4274609 -7782400 -8424535 -6384144 -2926303
33605 -2926303 -227616 1017796 2437838 4684479 5322658 2423040 -1624389 -2855677
33597 -2855677 -986566 1032603 1647467 1890306 2850489 4964224 8799105 13122707 13273167
33588 13273167 5911332 -4711750 -10026615 -7628537 -3885846 -4496420 -7241150 -7030734
33580 -7030734 -3844139 -1370243 -623128 294720 1336154 -23814 -4270257 -8285753
33572 -8285753 -9129709 -7021218 -3861907 -717643 2289878 4776959 5784984 4587933
33564 4587933 1667336 -1385460 -3570536 -5734568 -8723292 -10530249 -7778901 -901464
33556 -901464 4759453 4821338 785935 -2819609 -4112469 -4149371 -3376103 -1065532 2301618
33547 2301618 4948394 6120629 6448584 6147192 4659900 1982558 -1009751 -3240766
33539 -3240766 -3679725 -2111686 -518217 -1671246 -4932626 -5990330 -2912055 429630
33531 429630 25258 -2198583 -2207227 -1124587 -3194819 -7933781 -10319352 -8665276 -6502416
33522 -6502416 -6017379 -5309045 -3433513 -2546270 -2939302 -1195854 3989867 8854028 10416048
33513 10416048 10849053 12509617 12686536 7647430 -853337 -7238988 -8532235 -5977825
33505 -5977825 -2114625 904658 1836120 1631704 2384479 3361937 1148771 -4174034 -6997984
33496 -6997984 -3688330 1827591 4263771 4928086 7922427 11528231 10287106 4427516
33488 4427516 258234 748052 1947077 227657 -2374318 -2375302 -152288 1604892 1865659
33479 1865659 1494986 1481569 2303422 3517898 3591343 1897329 512701 1564173 3428462
33470 3428462 2862413 460422 -78172 1732546 2239348 212613 -455512 2892302 6718318
33461 6718318 6136643 1886091 -1168352 -797864 756361 1046169 594931 1373135 3687376
33452 3687376 5402083 4340823 1386199 36576 1783933 3577776 2300288 87708
33444 87708 1280117 5034764 6148071 3631375 2658252 5951354 9029970 7664123 4840934
33435 4840934 5239339 6891622 4554056 -1084942 -4151461 -2759162 -1166847 -2229739
33427 -2229739 -3492043 -2631820 -1825243 -3650820 -6133697 -5408947 -1523056 1569891 1192617
33418 1192617 -1285428 -2896125 -2503640 -1220857 -484441 -706064 -1709448 -3519783 -5887722
33409 -5887722 -7466841 -6798302 -4401306 -2647550 -2961924 -4251005 -4724265 -4034155 -2808091
33400 -2808091 -1349470 176303 1396464 2443702 3735781 4373127 2688853 -521626
33392 -521626 -1749418 362049 2388005 1062915 -1489727 -1160092 1212555 924855 -2901934
33383 -2901934 -5481566 -3336667 953228 2948969 2042147 457292 -988683 -3136362
33375 -3136362 -5642887 -6678685 -5556880 -3890950 -3665063 -5084169 -6782144 -7682906
33367 -7682906 -8004075 -8169218 -7406539 -4705176 -1131427 726169 451224 707350 2711115
33358 2711115 3250942 -642409 -5952996 -6976418 -3695840 -1868867 -3992482 -5435843
33350 -5435843 -2143361 2493208 2758227 -510459 -1388757 1948004 4772181 3301555
33342 3301555 139305 -130898 2291926 3303577 1144196 -1647392 -2777654 -3636010
33334 -3636010 -6348261 -9333742 -8702782 -3858682 1058132 2180907 42217 -2632466
33326 -2632466 -4821960 -6536977 -6250580 -2471364 2732101 5181765 3876159 1966270
33318 1966270 2001851 3058025 3387341 3081288 2803861 2443923 2563732 4759834 8646691
33309 8646691 10573036 7658833 1729851 -2867445 -4277312 -4026281 -3904217 -4072539 -3957703
33300 -3957703 -3398450 -2837913 -3003590 -3852134 -3605484 -349265 4651827 7095827 4554708
33291 4554708 -303093 -2979666 -2167881 161679 2049611 2671047 1418466 -1504755
33283 -1504755 -3982567 -3716805 -1090387 1173149 911788 -2026064 -6243506 -9170132
33275 -9170132 -8135431 -3164642 1980843 3514466 1809871 214694 719085 2869081
33267 2869081 5836705 8855413 10239280 8823079 6214675 5012491 4966771 3637643
33259 3637643 828452 -571363 1362139 5238756 8494648 9562940 7850998 4292466
33251 4292466 2095774 3845353 7321687 7430118 3113213 -1028764 -1155837 1320341
33243 1320341 3228596 3871107 3491212 1245364 -2114087 -2787330 950959 4693938 3250127
33234 3250127 -1723436 -3947367 -1333120 2127316 3108670 2874248 3528996 4502517 4472425
33225 4472425 3569825 1965334 -807630 -3232721 -1466521 5544436 12592238 13115463
33217 13115463 6921434 294360 -1476092 772963 2788726 2400203 852920 -91625
33209 -91625 -538708 -1724457 -3896541 -5644717 -5314121 -2791540 240698 1770449 1131578
33200 1131578 -702049 -2357871 -3431521 -4435013 -5496291 -5738483 -4464390 -2510452
33192 -2510452 -1547468 -2125689 -3307424 -4232885 -4940815 -5380044 -4866265 -3228457 -1478701
33183 -1478701 -518185 -31536 524178 703399 -223384 -2085659 -4172226 -5982535 -6874263
33174 -6874263 -6063888 -3976145 -2397957 -2130458 -1899732 -1045827 -1470341 -4513604 -7412152
33165 -7412152 -6116631 -1124505 2674593 2019913 -1677659 -5198387 -6262914 -3434764
33157 -3434764 2901079 8694295 9298596 5746872 3967481 6003917 6699919 2236152
33149 2236152 -2822500 -2028948 3013185 5462298 3977085 3779012 7159542 9745944
33141 9745944 7949693 4313392 2643995 2524467 1903077 1195168 1104032 -528871 -5621977
33132 -5621977 -11559975 -13730653 -11139661 -6528960 -2392811 64181 -333341 -3306511
33124 -3306511 -5521047 -4284471 -2145483 -3685294 -8042086 -9354500 -5406817 -1001888
33116 -1001888 -701736 -2589878 -2426327 -512136 -299843 -2194453 -3051344 -1399674 413226
33107 413226 -237590 -3039343 -5583049 -5727556 -3028578 632611 1984401 -420137 -4063818
33098 -4063818 -5208481 -3522982 -1998292 -2340457 -2819667 -1273509 1976824 5261014
33090 5261014 7736929 9138708 8877082 6875292 4294941 2209375 467782 -1129117
33082 -1129117 -1788283 -1283023 -1376860 -3748805 -7074991 -8168464 -5977883 -2698759 -751417
33073 -751417 -366497 -652895 -1417432 -2848521 -4354127 -4797063 -3584338 -1084923 1532053
33064 1532053 2619373 1092600 -2206984 -4882356 -5434749 -4803067 -4808488 -5759743 -6541209
33055 -6541209 -6499153 -6020463 -5494299 -4989687 -4960908 -5892505 -6903698 -6089524 -3023294
33046 -3023294 212935 1491007 1216384 1288674 2248461 2934872 2640211 2003367 1563049
33037 1563049 794290 -876674 -3018915 -4596642 -4764449 -3218194 -676297 1041227
33029 1041227 739768 -189077 859802 3951811 6187280 5958618 5353897 6402808 7024830
33020 7024830 3825203 -2037931 -5330711 -3510855 23169 633640 -2064960 -5075759
33012 -5075759 -6460574 -6694572 -6467579 -5390398 -3277718 -1357084 -1168857 -2324378 -2186157
33003 -2186157 1170956 5688523 6673036 2478300 -2907496 -4981165 -4696904 -5986966
32995 -5986966 -8430732 -7214482 -1183557 4100807 3967040 960274 -230925 -502202
32987 -502202 -3762460 -8741350 -9399439 -3749188 2839692 4549533 1425381 -2749371
32979 -2749371 -5389248 -5904954 -4416056 -2091370 -1056429 -2081563 -3635074 -4347200
32971 -4347200 -4648649 -4808981 -3587634 -728420 1156747 -369276 -3878309 -5855541
32963 -5855541 -5440513 -5029805 -6332738 -7956535 -7367126 -3923857 462936 3052503 2738208
32954 2738208 1279692 1559026 4106616 6359426 6236252 5119247 5648251 7575634 8032173
32945 8032173 5675424 2385659 433374 -185360 -787717 -1830027 -2799207 -3441923 -4005774
32936 -4005774 -4481021 -4369938 -3376625 -2042078 -1398645 -1773175 -2089381 -940809 1499160
32927 1499160 3321494 2993684 979882 -1083839 -1964903 -1110273 1478019 4611281 6074108
32918 6074108 4663365 1567670 -1121474 -2428939 -2228251 -487311 1595486 1235591
32910 1235591 -2654502 -6731071 -6613630 -2701727 308388 -295764 -2711200 -4916173
32902 -4916173 -7753211 -11789081 -14286367 -12359958 -7411409 -3526557 -2361254 -2096306
32894 -2096306 -939575 613102 1049405 -128766 -1632460 -1016820 2837815 7012373
32886 7012373 6311639 -252807 -6683884 -6693682 -1729330 1424890 206084 -1271965 162370
32877 162370 1861646 696820 -1099924 326494 3485393 3137232 -1871009 -6744823
32869 -6744823 -7245628 -4459804 -1870985 -679740 26443 504256 97357 -997229 -1474970
32860 -1474970 -378267 2090945 5004098 7356086 8580068 8813568 8316743 6635911
32852 6635911 3319072 -244931 -1076942 2193198 7205750 10108999 9384249 6438163
32844 6438163 3114366 146816 -2081270 -2820211 -1586294 1172647 4208609 5795354
32836 5795354 4419121 370965 -3517213 -4258521 -2186057 -630007 -1577221 -3224877
32828 -3224877 -2958567 -1242949 -560204 -1214616 -727134 2002547 4196080 2753068 -816048
32819 -816048 -1573044 2306250 6525301 6025709 1879481 29307 3278766 7670739 8181291
32810 8181291 5216589 2865866 2716552 2927409 2600311 3129597 4712471 5168941 3648896
32801 3648896 2404478 3019106 3682815 2513720 984777 1115474 1434070 -649303 -3817002
32792 -3817002 -4191419 -1346809 940729 403254 -958532 -992230 -844067 -2257642 -4090789
32783 -4090789 -4085049 -2445992 -1164696 -757607 -46786 1211065 1638444 379773 -1736524
32774 -1736524 -3644862 -5331231 -6895484 -7224449 -4821703 -95112 3993375 4320807
32766 4320807 677846 -3968561 -6292315 -5248820 -2150866 768565 1612746 9277
32758 9277 -2123574 -2187347 -211441 833731 -782420 -2835803 -2538186 -801949 -276290
32749 -276290 -602426 661106 3050739 3353884 1071114 -522854 123455 448715 -1330795
32740 -1330795 -3012216 -2645866 -2245018 -4015528 -6106280 -5859282 -4591270 -4984662 -5909012
32731 -5909012 -4470901 -1757677 -1539309 -3723042 -4128375 -1371889 671070 -1178175
32723 -1178175 -4771870 -5953832 -3694454 -54189 2738303 3533090 2507279 1633049
32715 1633049 3234240 6866612 9279897 8577229 6655132 6239438 7187044 7314523 5646764
32706 5646764 3196651 1179653 -221691 -1514480 -3014219 -4257694 -4409849 -3678042
32698 -3678042 -3641836 -5047496 -5995148 -3952274 989870 6581117 11177226 13735009 12374246
32689 12374246 6678181 947158 622036 4725467 6414083 2520269 -2206589 -2722232
32681 -2722232 -607497 295997 606749 2698688 4714736 3198328 -315091 -1425776
32673 -1425776 -671194 -2969536 -8880169 -12415158 -9390473 -3066143 868821 911324 -1081155
32664 -1081155 -3645815 -5636479 -5195580 -2007961 1145621 1672759 506036 -70151 -213431
32655 -213431 -1468010 -3133008 -2605972 874338 5079903 7439297 7202282 5066595 2102513
32646 2102513 -907891 -3946299 -7186635 -9343831 -7967377 -2977283 1362429 497099
32638 497099 -4725474 -8882120 -8687200 -6390088 -5656453 -6541115 -6477543 -4710849 -3255191
32629 -3255191 -3589040 -4415408 -3457908 -397198 2841674 4296095 3810888 2846119 2976062
32620 2976062 4613276 6804990 8099800 7844153 6754676 5959303 5407343 3838728 878696
32611 878696 -1445415 -540712 3240044 6223279 5456346 2320207 905729 3084514 6471980
32602 6471980 7488747 5268112 1862162 -514639 -1317497 -1063188 -158164 1150011 2343606
32593 2343606 2906965 2915518 2827606 2626072 1594647 -773023 -3799452 -5848190 -5695628
32584 -5695628 -3800390 -2255019 -3240598 -7066376 -11500920 -13326501 -11098181 -6633993
32576 -6633993 -3523837 -3711340 -5526392 -5630848 -3134030 -927052 -1954329 -4816591
32568 -4816591 -4930701 -360503 5532993 8425408 8056189 6855944 5233751 1585581
32560 1585581 -3288489 -5506813 -3261050 124725 339094 -2529942 -4757776 -3808594
32552 -3808594 -491666 2698931 3642259 1841931 -781102 -1230559 907269 2256929
32544 2256929 -134148 -4612316 -7152347 -6624668 -5047383 -3309808 -73716 4575318
32536 4575318 7487310 6040311 1720091 -1060583 1066687 7595852 14007654 14962114
32528 14962114 9624903 3483457 2620601 6634997 10009983 9874873 8345865 6898167
32520 6898167 3532602 -2176072 -5846822 -3918550 730468 2855145 2056159 1630652
32512 1630652 2202788 1448151 -630661 -1137958 663291 2194587 2387897 3498580 6490125
32503 6490125 8375467 6503481 2517889 -550030 -2645329 -5139494 -6811773 -5042992
32495 -5042992 -559015 2391403 1299569 -1657034 -3027171 -2426997 -1794945 -1634437 -302135
32486 -302135 2914649 6016422 6649353 5012437 2978856 1070966 -1734986 -5071444
32478 -5071444 -6156596 -3012477 2491055 6286114 6294936 3833825 1283489 -415309 -1946018
32469 -1946018 -4148901 -6574254 -7441722 -5557119 -2317272 -676892 -1660983 -3232371
32461 -3232371 -3329760 -2388449 -1678313 -981775 234955 984165 343284 -577497 -779081
32452 -779081 -1911134 -5354696 -8056864 -5580329 926161 5449184 5551581 5298359 7920843
32443 7920843 10374602 8589358 4292496 2270653 3334367 4417257 3985795 2829608
32435 2829608 525502 -3956820 -8077350 -7163074 -1462798 2592163 601974 -3842499
32427 -3842499 -4496111 -1037575 1508266 447833 -1667644 -1907301 -981824 -1003801 -1981007
32418 -1981007 -2555342 -2510538 -2495201 -2359762 -1736022 -1393457 -1875588 -1486738 1690263 5863459
32408 5863459 6671250 3039861 -1124562 -2561756 -2860315 -4642830 -6561474 -5787811 -3422463
32399 -3422463 -3002317 -4547050 -4668148 -2542209 -1157209 -1924024 -2656969 -2313916 -3161792
32390 -3161792 -6049658 -7933474 -7009208 -6142859 -7575491 -8183958 -4657920 -71157 347460
32381 347460 -2142807 -1496543 3652872 8435392 9931295 10722024 12610441 12585821 8303230
32372 8303230 3243460 2434163 5631433 8348347 8023199 5952357 3967441 2027217
32364 2027217 -750088 -4256604 -6906555 -6820595 -4238057 -2514037 -4819659 -9534530
32356 -9534530 -11276553 -7438766 -1268363 2900554 4857958 6821745 8815341 8690238
32348 8690238 5693736 1473933 -1942565 -3335209 -2338485 -256986 77440 -2548337
32340 -2548337 -5359992 -4624764 -715047 2141248 1309418 -1121466 -1309076 1668269 4945625
32331 4945625 5145165 2111484 -747600 -325876 2227643 2862749 110776 -2978150 -3397972
32322 -3397972 -2201597 -1952501 -2422618 -1688688 -35184 254243 -1817917 -5363267 -9079826
32313 -9079826 -10737834 -7114162 1716712 9533216 10195209 6015008 4533917 6996289
32305 6996289 6570015 -123305 -6561211 -5759176 -720259 445378 -3635815 -7084823
32297 -7084823 -6467115 -4510567 -3801231 -2521880 1422245 6008022 7483333 5014821
32289 5014821 985499 -1908548 -2330369 -142536 3892740 8287340 11281992 11498985
32281 11498985 8897527 5492923 4033481 4924452 5468813 3384689 -94993 -2180802
32273 -2180802 -2252512 -1566759 -571550 713177 532881 -3012839 -8192160 -10665800 -8869074
32264 -8869074 -5562336 -3528214 -2831244 -3175849 -5434102 -8922381 -10270667 -7659299
32256 -7659299 -3917496 -2651187 -3107156 -1925432 1209427 3010699 1603776 -754779
32248 -754779 -743126 2085976 5290200 6358195 4813067 2024195 -508224 -2461983 -4187990
32239 -4187990 -5502720 -6038282 -6455797 -7647125 -8662973 -7499767 -4457458 -2356978
32231 -2356978 -2428865 -2591911 -1384107 -758029 -2481078 -4371634 -3428571 -668916 912929
32222 912929 1566606 3558129 5684193 4142631 -668504 -3238898 -562777 3602554
32214 3602554 4493321 2714643 1831995 2384279 1828828 -942113 -4022696 -4833013 -2088945
32205 -2088945 3615360 9377609 11257848 8020384 2885654 -82103 -367502 -180623
32197 -180623 -643236 -1160997 -1689101 -2923765 -4371824 -4644726 -3909444 -3865662 -4715843
32188 -4715843 -4098562 -134143 5591765 9101386 7731067 2478083 -2917805 -5082191
32180 -5082191 -3507317 -128493 3089890 5172981 5118880 2142326 -2056252 -3550146
32172 -3550146 -760238 2972906 3752569 2361248 2072889 2691410 902568 -3712332 -7439956
32163 -7439956 -8096255 -7788269 -8438256 -8587864 -7125943 -6465238 -8571269 -10834157 -9984739
32154 -9984739 -7864528 -8560443 -11060447 -10081837 -4482310 335035 114086 -2645179 -3484118
32145 -3484118 -2641083 -3101891 -4434978 -3052199 1916668 6831163 8060606 5358198
32137 5358198 290253 -5565375 -9682606 -9045575 -4128726 -361216 -2437896 -7990778
32129 -7990778 -10119133 -6298182 -1504541 -1260630 -4592673 -6500102 -5412270 -4515765
32121 -4515765 -5906042 -7213323 -5729357 -3111713 -3047391 -5413812 -6029707 -2663802 1459212
32112 1459212 1760801 -1829376 -5197363 -5433170 -3722749 -2847643 -3829633 -5785277 -7509868
32103 -7509868 -8065484 -6862481 -4315196 -1722398 274194 1988941 2513654 -848431
32095 -848431 -8522325 -15306919 -14718916 -7125266 -185845 204973 -3576067 -5473318 -3966151
32086 -3966151 -2384121 -2783206 -3472757 -2498534 -189819 2400375 4889358 6589034 6480373
32077 6480373 5075032 4253813 4520287 4690095 5090904 8056153 13301301 15708326 11024819
32068 11024819 2172971 -3652887 -3535718 -1032852 47660 151508 980613 1568516 189377
32059 189377 -1819427 -1340299 1921570 4801610 4967538 3745657 3814375 5566312 6956436
32050 6956436 6263275 3901338 1523609 -75210 -1901694 -5476753 -10446709 -13930477
32042 -13930477 -13188556 -9037096 -5516711 -5511929 -7521613 -7678740 -4388190 180738 3038612
32033 3038612 3613410 3627198 4453557 5336998 4505530 1960066 374751 2062598 5305295
32024 5305295 5756641 2297473 -931622 -385956 1388201 -284464 -4289740 -4812284 -710119
32015 -710119 1598998 -2904483 -10508075 -14081499 -12292519 -9196366 -7180615 -5262538
32007 -5262538 -3110685 -1871801 -1357965 -770535 -1794465 -6187395 -10438457 -8601320
31999 -8601320 -1710070 1656563 -2809145 -8247771 -6113462 1740567 6284381 4170915
31991 4170915 1017648 2098429 5628963 7069924 5753949 4421020 4697856 5938997
31983 5938997 7542426 9900422 12757561 14226993 12582849 8752727 5930187 6103336
31975 6103336 7771887 8171171 6959193 5894209 5392844 4076438 2021816 1373628 2473213
31966 2473213 2449742 -265987 -2892176 -2548968 -1033446 -1822905 -4200799 -4464581 -2039273
31957 -2039273 -165931 -513653 -1038270 112647 1947669 2856135 2646805 1499402 -437535
31948 -437535 -1588912 131347 3869412 5932098 4555952 2004833 536426 -988002
31940 -988002 -4344138 -7972226 -8422954 -4899279 -417806 1215124 -1323378 -5849293
31932 -5849293 -8358602 -6861752 -3867653 -3484320 -5881936 -7035030 -4653937 -1410920
31924 -1410920 -559112 -1133273 -114200 2633675 4421313 3501909 354155 -3660351 -6637729
31915 -6637729 -6381806 -2869479 503534 662832 -1061737 -1136993 947465 2706659 3156713
31906 3156713 3781794 5095370 5772323 5684251 6386116 7727555 7389034 5123132 4063035
31897 4063035 5794549 7228770 5057219 787906 -1732879 -1805568 -1405792 -662120 2115868
31888 2115868 6043203 7249168 4012457 -629347 -2874473 -2513876 -1788801 -1837384 -2102556
31879 -2102556 -1975278 -1283377 42296 1464805 1902256 1475472 1960410 3971954 5112403
31870 5112403 3133757 -235753 -1486114 -649608 -912479 -2754049 -2546300 1401647 5242869
31861 5242869 4959525 2348664 1914217 3830738 4353829 2367903 941689 1914829 3129243
31852 3129243 2482046 1230189 1260852 1844804 1321684 -143170 -1643790 -3492274 -5899435
31843 -5899435 -7420973 -7123817 -6806110 -8344247 -9947762 -8132816 -3028707 1364448
31835 1364448 2509699 2080049 2548373 3684503 4042939 3910044 4547241 5423838 4424192
31826 4424192 986761 -2522585 -3283177 -1095668 1675332 2785587 1966730 205358
31818 205358 -1885174 -4420484 -7512475 -10830230 -13555229 -14289540 -11756091 -6586809
31810 -6586809 -1633764 1070456 3064069 6995448 11630150 12298600 7315921 998372
31802 998372 -1804458 -1746877 -2722731 -5410608 -6836655 -5976203 -5922536 -9144505 -13287182
31793 -13287182 -13855192 -9947462 -5368961 -3965845 -5146128 -5047674 -2004931 701178
31785 701178 -829513 -4927324 -5588908 -769129 3916266 2402493 -3539255 -7011591
31777 -7011591 -5391073 -2444786 -1324494 -462167 1989837 4061128 3389502 1731545
31769 1731545 2357566 4532668 4389807 1110445 -1202122 986882 5577113 7192573
31761 7192573 3802230 -815422 -1600158 1960802 5619156 5631287 2815221 741171 1074762
31752 1074762 2112042 1544779 -742218 -2905037 -3301988 -2080932 -926154 -1195869 -2292776
31743 -2292776 -2501545 -1450361 -386012 409458 2421478 5757532 7389785 4955199
31735 4955199 613295 -1792460 -1991315 -2243211 -2300584 2747 3276057 2924243 -1503761
31726 -1503761 -4208453 -1226924 3444365 3597258 -316591 -2457889 -117558 3475565
31718 3475565 4670739 3926895 3900007 5524576 7286603 7298045 5397875 3454965 3270240
31709 3270240 3993868 2869835 -709451 -3597201 -2959213 -498982 -347463 -3432882 -6306882
31700 -6306882 -5658889 -2077824 1233534 2220092 1690236 1643958 2335682 1561867 -2397237
31691 -2397237 -7612624 -9947060 -7858731 -3941140 -1205108 25483 623187 473694
31683 473694 -630155 -1931143 -3138850 -4869610 -6131042 -4088243 1214703 4563659
31675 4563659 1454662 -5471240 -9378478 -7436699 -2771944 621014 1317343 -496459
31667 -496459 -3788650 -6496426 -7407197 -7916765 -9549108 -11022009 -10745235 -10359772 -11696509
31658 -11696509 -12028640 -7684007 -1294606 804687 -1652051 -2560974 -11384 353079
31650 353079 -4490194 -8730911 -6750463 -2362230 -2627368 -6666564 -7656933 -3720672 -126150
31641 -126150 -1328210 -6448787 -12477084 -16919285 -17192427 -12271268 -5722228 -2883858
31633 -2883858 -4016658 -3984709 198371 5192357 6334802 3705789 1056832 741535 1691828
31624 1691828 1337525 -1734072 -6392163 -9850974 -10642424 -10252949 -10547659 -10559668 -8136322
31615 -8136322 -4087866 -1705333 -2151294 -3433120 -4314208 -5825296 -7895232 -8092769 -5713898
31606 -5713898 -3952944 -5315576 -7390314 -6337991 -2830279 -1070871 -2680405 -4825351
31598 -4825351 -4534588 -2188819 -121660 258041 -738172 -1731452 -1208060 1102557 3508473
31589 3508473 4005229 2713004 1618886 1939166 2998770 3795028 4221334 4321160 3689590
31580 3689590 2328710 1051783 374984 -40015 -304579 108391 900682 522348 -1394064
31571 -1394064 -2543358 -1066858 690252 -1507188 -7364917 -11005329 -8013439 -1191720
31563 -1191720 3133866 2924980 1564476 1942601 2857482 1969247 -582198 -3023143 -4357266
31554 -4357266 -4336004 -2653261 117013 1994038 1642668 31388 -1247586 -2029928 -2453946
31545 -2453946 -1469964 1135430 2561516 -1061 -4601402 -6070853 -2774481 1243597
31537 1243597 1826244 -497035 -2806108 -4165349 -5334727 -6025705 -5260244 -3693421 -3107800
31528 -3107800 -3686853 -3732382 -2290535 -515190 43070 -495935 -491850 1343772 4289945
31519 4289945 5758827 3609023 -1339274 -5672355 -6633650 -4412212 -1109853 1372812
31511 1372812 2051499 1093220 309148 1815813 4892862 5833013 2634031 -1947425 -4394267
31502 -4394267 -5661273 -8896618 -13013574 -13123894 -8058113 -3011750 -2532964 -4456857
31494 -4456857 -3809067 -6957 3470519 4903372 5837996 7223726 7812397 7060484 6552845
31485 6552845 7321567 8094863 7526413 6172715 4818208 2702788 -692871 -3557532 -3782034
31476 -3782034 -2379664 -2502638 -5093804 -7765230 -8469025 -8129330 -8549352 -9592551 -10151450
31467 -10151450 -10556511 -11823109 -13080854 -12068777 -8374838 -4123981 -927195 1749501
31459 1749501 4137626 4290417 783730 -4027004 -5996677 -4164115 -1545409 -854192
31451 -854192 -1502817 -1389089 206287 2424045 4072505 4114197 2158860 -496310 -1370568
31442 -1370568 555608 3437139 4645863 3446606 866686 -1970401 -4213606 -4910154
31434 -4910154 -3653321 -1178838 1588613 4335048 6317913 5829163 2425066 -1204184
31426 -1204184 -1734856 630229 2444922 1507771 -806391 -2036050 -1688556 -1032938 -1042110
31417 -1042110 -1334260 -648705 1739538 4594860 5275754 2748394 -664227 -1990133 -1240762
31408 -1240762 -399969 262420 1957876 3822367 3220540 374559 -891099 1334920 4043821
31399 4043821 4003158 2479094 2525917 4170697 5534242 6577320 8020090 8134005 4743796
31390 4743796 -347192 -3071232 -3037345 -3581000 -5575285 -5740908 -2615620 82978 -1232074
31381 -1232074 -4660980 -6072137 -5332056 -5559548 -7473939 -8440187 -7182855 -5848421 -6102202
31372 -6102202 -5946373 -2695746 2265256 4280190 1160436 -3793479 -5600093 -3378472
31364 -3378472 -893947 -1670002 -5144784 -8060735 -8185115 -5695227 -2084901 854917
31356 854917 1605287 5335 -2233846 -3072863 -2125746 -523078 604060 713000 -243923
31347 -243923 -1422213 -1465345 -484015 -549961 -2678299 -4666065 -4135924 -2455912 -2654312
31338 -2654312 -4212251 -3555402 71617 2875478 1772383 -1696300 -4102690 -4153490 -2597306
31329 -2597306 -615131 256733 -1036765 -2937912 -2420127 418044 1716094 -544384
31321 -544384 -3427362 -3841756 -3311311 -4815863 -7523756 -8385596 -7132114 -5958982 -5534514
31312 -5534514 -4883846 -4208811 -4332480 -4173156 -2185055 437784 1369657 1067855 1385933
31303 1385933 1204554 -2115123 -7205061 -9453095 -7835153 -6142400 -6235620 -5175980 -1344027
31294 -1344027 1537126 159201 -2512641 -1634602 1912918 3201166 1216041 176131
31286 176131 2634008 5616275 5260190 2187061 -37354 -824 505881 47701 -171892
31277 -171892 1557047 4486196 6193632 5917256 5248147 5072730 3856490 484200 -2842698
31268 -2842698 -2961920 -326811 1274771 -327805 -3103548 -3510253 -137346 5361405
31260 5361405 9350887 8530474 3111703 -2667719 -5244363 -6044929 -8255191 -10562886
31252 -10562886 -8820022 -3896330 -2058489 -5543852 -8463124 -5818921 -1573043 -2410683
31244 -2410683 -7126297 -8606967 -4642521 -280693 547334 -232632 226543 1146344 899561
31235 899561 528865 1701125 3588562 4254526 3571975 2841102 2665997 2659572 2284109 978857
31225 978857 -1475811 -3892073 -4174603 -1810254 1147694 2323806 1275141 -959521
31217 -959521 -3189142 -4182160 -2902851 80532 2364584 2191126 673590 495844 2657520
31208 2657520 5352627 6044244 4153107 1577806 514495 720826 -427524 -4420219
31200 -4420219 -8832552 -9565877 -5803430 -1093177 944187 465670 216474 1837207 4400619
31191 4400619 5679642 3893373 -958877 -6384107 -8593339 -5660399 417975 5398793
31183 5398793 6579347 4837333 3320245 4287727 6816427 7633580 4871639 781649
31175 781649 -531526 1833963 4429766 3984533 1252898 -942434 -1714022 -1964360 -1406342
31166 -1406342 1382380 5799739 8683378 7944342 5007202 2624108 1734425 1589786 1579021
31157 1579021 1433511 637773 -730912 -1275125 -81809 1269933 417577 -2304673 -4237127
31148 -4237127 -4346309 -4301890 -4861352 -3960540 -252489 3817931 5107544 4267133 4198954
31139 4198954 5336052 5940822 6301252 8403765 11165285 10567082 6116497 2798303 3822093
31130 3822093 5304715 2105728 -3922830 -6257795 -2829639 1879445 3516252 2299157
31122 2299157 438061 -866448 -840457 1006989 3169371 3177292 1451140 1217005 3417034
31113 3417034 4860048 3135891 289535 -624335 197362 1163051 2751205 5687356 7569643
31104 7569643 5244046 -184459 -4273701 -5005449 -4446666 -4702367 -5567816 -6766743 -9158942
31095 -9158942 -12230468 -13079751 -9891141 -4658081 -735723 818595 871878 -190185 -2296137
31086 -2296137 -4049992 -3575008 -928465 1946051 3529746 3581030 2122206 -562808 -3031652
31077 -3031652 -3839244 -3861753 -5333608 -8005479 -8727319 -6117381 -3035686 -2173287 -1617039
31068 -1617039 1708232 5769295 5223913 -326381 -4553744 -2708136 2211932 4371308
31060 4371308 2924772 1217625 452524 -1302598 -4393017 -6127660 -4725166 -1509283
31052 -1509283 1574040 3781792 4253439 2074794 -907367 -400423 4831680 10027102
31044 10027102 9780131 4953417 1314919 1854348 3530654 2352782 -839288 -1622645
31036 -1622645 1881843 6130975 6032993 668083 -5954390 -9441978 -8843231 -5770466 -1813529
31027 -1813529 1556540 2093400 -1527534 -7261203 -11055134 -10744808 -6982931 -1041357
31019 -1041357 5587792 9744185 8476126 3463158 209593 1082226 2248002 -243739
31011 -243739 -4449528 -5783519 -3779165 -1676414 -763716 606998 2729812 3397967 1752373
31002 1752373 -158713 -877778 -1722486 -3869788 -5569043 -4321827 -558138 2673374
30994 2673374 3119931 1218754 -959454 -1659638 -593200 1037580 1549714 87674 -2936291
30985 -2936291 -6378283 -9001192 -9980176 -9465351 -8481746 -7689006 -6557565 -4512540 -2494867
30976 -2494867 -2264944 -4135551 -6405913 -7312757 -6796156 -5984065 -5365502 -3842900 186177
30967 186177 6385129 11280727 10808599 4892969 -1568613 -3568691 -1139232 1686459
30959 1686459 2294536 1869015 2321562 2989884 1707846 -1751849 -4744347 -4616750 -1944510
30950 -1944510 -66768 -973918 -2501546 -1019688 3428785 6799819 6370204 3997841
30942 3997841 2637394 1956267 -62360 -2747037 -3094411 -110294 3874560 6340020
30934 6340020 6899450 6366684 5397547 4299608 2811143 246185 -2933738 -4562579 -3476737
30925 -3476737 -1656435 -1442705 -1849736 -563305 1457098 1094396 -1569975 -3099368 -2345619
30916 -2345619 -2182924 -4502611 -7331029 -8457329 -8234440 -6931937 -3070936 3043517
30908 3043517 7475901 7375208 4873597 3412251 2866581 1561005 549024 1855439
30900 1855439 4058231 3662277 152303 -3775527 -6422303 -8265627 -9421476 -9197368
30892 -9197368 -8101294 -7411601 -6802479 -5033399 -2702573 -1436233 -520055 2502920 7537693
30883 7537693 11218243 11190339 8604128 5747499 3622933 2459036 2216098 1886129 489203
30874 489203 -773296 285633 3159301 4919126 4686007 4680214 5853275 5990073 3945879
30865 3945879 2284673 2974036 3423537 277811 -4893280 -7355042 -5458983 -1737312
$$ [...]
##END NTUPLES=NMR SPECTRUM
##END=
