##TITLE=31Pdec_BAU-j-1.07
 CDCl3, 24 sc
 1.7.2019
##JCAMPDX= 6.0         $$ Bruker NMR JCAMP-DX V2.0
##DATA TYPE= NMR SPECTRUM
##DATA CLASS= NTUPLES
##ORIGIN= UXNMR, Bruker Analytische Messtechnik GmbH
##OWNER= root
$$ XWIN-NMR		Version 3.5
$$ Mon Jul  1 15:44:01 2019 Russian Standard Time (UT+4h)  she@DPX200
##.OBSERVE FREQUENCY= 81.013821
##.OBSERVE NUCLEUS= ^31P
##.ACQUISITION MODE= SIMULTANEOUS
##.ACQUISITION SCHEME= undefined
##.AVERAGES= 24
##.DIGITISER RES= 17
##SPECTROMETER/DATA SYSTEM= spect
##.PULSE SEQUENCE= zgpg30
##.SOLVENT NAME= CDCl3
##.SHIFT REFERENCE= (INTERNAL, CDCl3, 0, 182.463)
##AUDIT TRAIL= $$ (NUMBER, WHEN, WHO, WHERE, WHAT)
$$ ##TITLE= Audit trail, XWIN-NMR		Version 3.5
$$ ##JCAMPDX= 5.01
$$ ##ORIGIN= Bruker BioSpin GmbH
$$ ##OWNER= she
$$ F:/spectra/data/she/nmr/P31/1/pdata/1/auditp.txt
$$ ##AUDIT TRAIL=  $$ (NUMBER, WHEN, WHO, WHERE, WHAT)
(   1,<2019-07-01 15:43:12.31 +0400>,<she>,<DPX200>,
      <created by zg, POWCHK disabled, PULCHK disabled
       configuration hash MD5:
       00 E9 B6 7A A2 85 ED C7 34 08 36 98 17 FE 4E 26
       data hash MD5: 32K
       C0 1D 01 7A 1B 1D D6 4A 77 D9 62 CA F4 6E 55 B7>)
(   2,<2019-07-01 15:43:14.79 +0400>,<she>,<DPX200>,
      <Start of raw data processing
       efp BC_mod = 2 LB = 1 FT_mod = 6 PKNL = 1 PHC0 = -2580.51 PHC1 = 189.9996 SI = 64K 
       data hash MD5: 64K
       EF A1 1F 18 EE B6 BD A8 6E 10 86 EA EB E9 05 05>)
(   3,<2019-07-01 15:43:31.48 +0400>,<she>,<DPX200>,
      <pk PHC0 = -57.69791 PHC1 = 62.99997 
       data hash MD5: 64K
       97 A2 A3 40 CB B0 2F 86 66 F4 FD A2 9A C5 E8 C6>)
(   4,<2019-07-01 15:43:36.95 +0400>,<she>,<DPX200>,
      <abs ABSG = 5 
       data hash MD5: 64K
       96 D8 1E AC 38 F3 1A FA 65 3F 21 25 57 FB BD 74>)
$$ ##END=
$$ 
$$ hash MD5
$$ D9 ED F0 F6 96 C5 67 9C AC 52 04 12 DC 3D 84 85
##$RELAX= 
##$RELAX= 
##$RELAX= 
##$RELAX= 
##$RELAX= 
##$RELAX= 
##$RELAX= 
##$RELAX= 
$$ Bruker specific parameters
$$ --------------------------
##$DU= <F:/spectra>
##$EXPNO= 1
##$NAME= <P31>
##$PROCNO= 1
##$TYPE= <nmr>
##$USER= <she>
##$AMP= (0..31)
100 100 100 100 100 100 100 100 100 100 100 100 100 100 100 100 100 100 
100 100 100 100 100 100 100 100 100 100 100 100 100 100 
##$AQSEQ= 0
##$AQ_mod= 1
##$AUNM= <au_zg>
##$AUTOPOS= <>
##$BF1= 81.014009
##$BF2= 200.13
##$BF3= 200.13
##$BF4= 200.13
##$BF5= 200.13
##$BF6= 200.13
##$BF7= 200.13
##$BF8= 200.13
##$BYTORDA= 1
##$CFDGTYP= 0
##$CFRGTYP= 5
##$CHEMSTR= <none>
##$CNST= (0..31)
1 1 145 1 1 1 1 1 1 1 1 1 1 1 1 1 1 1 1 1 1 1 1 1 1 1 1 1 1 1 1 1 
##$CPDPRG= <waltz16>
##$CPDPRG1= <>
##$CPDPRG2= <waltz16>
##$CPDPRG3= <>
##$CPDPRG4= <mlev>
##$CPDPRG5= <mlev>
##$CPDPRG6= <mlev>
##$CPDPRG7= <mlev>
##$CPDPRG8= <mlev>
##$CPDPRGB= <>
##$CPDPRGT= <>
##$D= (0..31)
0 1 0 0 0 0 0 0 0 0 0 0.03 2e-05 3e-06 0 0 0 0 0 0 0 0 0 0 0 0 0 0 0 0 
0 0 
##$DATE= 1561981391
##$DBL= (0..7)
120 120 120 11 120 120 24 19 
##$DBP= (0..7)
150 150 150 150 150 150 150 150 
##$DBP07= 0
##$DBPNAM0= <>
##$DBPNAM1= <>
##$DBPNAM2= <>
$$ [...]
##$SUBNAM3= <"">
##$SUBNAM4= <"">
##$SUBNAM5= <"">
##$SUBNAM6= <"">
##$SUBNAM7= <"">
##$SUBNAM8= <"">
##$SUBNAM9= <"">
##$SW= 369.568048894756
##$SWIBOX= (0..15)
0 1 3 0 0 0 0 0 0 0 0 0 0 0 0 0 
##$SW_h= 29940.119760479
##$TD= 32768
##$TD0= 1
##$TE= 0
##$TE2= 300
##$TE3= 300
##$TEG= 300
##$TL= (0..7)
0 120 53 12 22 120 120 120 
##$TP= (0..7)
150 150 150 150 150 150 150 150 
##$TP07= 0
##$TPNAME0= <>
##$TPNAME1= <>
##$TPNAME2= <>
##$TPNAME3= <>
##$TPNAME4= <>
##$TPNAME5= <>
##$TPNAME6= <>
##$TPNAME7= <>
##$TPOAL= (0..7)
0.5 0.5 0.5 0.5 0.5 0.5 0.5 0.5 
##$TPOFFS= (0..7)
0 0 0 0 0 0 0 0 
##$TUNHIN= 0
##$TUNHOUT= 0
##$TUNXOUT= 0
##$USERA1= <user>
##$USERA2= <user>
##$USERA3= <user>
##$USERA4= <user>
##$USERA5= <user>
##$V9= 5
##$VALIST= <valist>
##$VCLIST= <CCCCCCCCCCCCCCC>
##$VD= 0
##$VDLIST= <DDDDDDDDDDDDDDD>
##$VPLIST= <PPPPPPPPPPPPPPP>
##$VTLIST= <TTTTTTTTTTTTTTT>
##$WBST= 1024
##$WBSW= 4
##$XGAIN= (0..3)
0 0 0 0 
##$XL= 0
##$YL= 0
##$YMAX_a= 4523
##$YMIN_a= -4437
##$ZGOPTNS= <>
##$ZL1= 120
##$ZL2= 120
##$ZL3= 120
##$ZL4= 120
##$ABSF1= 182.463
##$ABSF2= -187.1042
##$ABSG= 5
##$ABSL= 3
##$ALPHA= 0
##$AQORDER= 0
##$ASSFAC= 0
##$ASSFACI= 0
##$ASSFACX= 0
##$ASSWID= 0
##$AUNMP= <proc_1d>
##$AZFE= 0.1
##$AZFW= 0.5
##$BCFW= 0
##$BC_mod= 2
##$BYTORDP= 0
##$COROFFS= 0
##$CY= -3
##$DATMOD= 1
##$DC= 0
##$DFILT= <>
##$DTYPP= 0
##$F1P= 0
##$F2P= 0
##$FCOR= 1
##$FTSIZE= 65536
##$FT_mod= 6
##$GAMMA= 0
##$GB= 0
##$INTBC= 1
##$INTSCL= 5.30512e-09
##$ISEN= 30
##$LB= 1
##$LEV0= 0
##$LPBIN= 0
##$MAXI= 10000
##$MC2= 0
##$MEAN= 0
##$ME_mod= 0
##$MI= 50
##$NCOEF= 0
##$NC_proc= -8
##$NLEV= 6
##$NOISF1= 182.463
##$NOISF2= 159.3651
##$NSP= 0
##$NTH_PI= 0
##$NZP= 0
##$OFFSET= 182.463
##$PC= 4
##$PHC0= -2638.208
##$PHC1= 252.9996
##$PH_mod= 1
##$PKNL= yes
##$PPARMOD= 0
##$PSCAL= 0
##$PSIGN= 0
##$REVERSE= no
##$SF= 81.0140089999434
##$SI= 65536
##$SIGF1= 159.3651
##$SIGF2= -187.1042
##$SINO= 113.3802
##$SIOLD= 16384
##$SREGLST= <1H.CDCl3>
##$SSB= 0
##$STSI= 65536
##$STSR= 0
##$SW_p= 29940.119760479
##$SYMM= 0
##$S_DEV= 0
##$TDeff= 32768
##$TDoff= 0
##$TI= <>
##$TILT= no
##$TM1= 0
##$TM2= 0
##$TOPLEV= 0
##$USERP1= <user>
##$USERP2= <user>
##$USERP3= <user>
##$USERP4= <user>
##$USERP5= <user>
##$WDW= 1
##$XDIM= 65536
##$YMAX_p= 153166783
##$YMIN_p= -343648129
$$ End of Bruker specific parameters
$$ ---------------------------------
##NTUPLES= NMR SPECTRUM
##VAR_NAME=  FREQUENCY,     SPECTRUM/REAL,   SPECTRUM/IMAG
##SYMBOL=    X,             R,               I
##VAR_TYPE=  INDEPENDENT,   DEPENDENT,       DEPENDENT
##VAR_FORM=  AFFN,          ASDF,            ASDF
##VAR_DIM=   65536,         65536,           65536
##UNITS=     HZ,            ARBITRARY UNITS, ARBITRARY UNITS
##FACTOR=    0.456856943014862, 1,           1
##FIRST=     14782.0589164792, 0,            0
##LAST=      -15158.0608439998, 0,           0
##MIN=       -15158.0608439998, -343648129,  0
##MAX=       14782.0589164792, 153166783,    0
$$ Real data points
##PAGE= N=1
##DATA TABLE= (X++(R..R)), XYDATA
$$ [...]
##PAGE= N=2
##DATA TABLE= (X++(I..I)), XYDATA
9166 12415921 12281909 10722118 9315023 9083067 8048875 3310216 -4187345 -9278744
9158 -9278744 -8054742 -2553865 1071565 -1147361 -7132786 -11388341 -11060604 -8415177
9150 -8415177 -7034207 -7203153 -6745593 -5126495 -3864053 -3081156 -894997 2842841 5170098
9141 5170098 4047868 1399141 279349 1112563 2702816 4845106 7329909 8022641 5109777
9132 5109777 668442 -953025 1424413 4257141 3725629 -31843 -3973107 -6188418
9124 -6188418 -7564654 -9469474 -10871405 -9071560 -3525533 2664204 6457026 8670520
9116 8670520 11786613 15026360 14936068 11086265 8000592 10274587 17766839 25913405 28864544
9107 28864544 23334654 12847329 7099694 11968269 20336790 19164665 6622180 -5112015
9099 -5112015 -6565819 -2318799 -1027705 -2484812 -2173890 -1828046 -5660593 -10326987 -8937604
9090 -8937604 -2998745 -416737 -2488945 -2901470 -73916 -172459 -5373647 -8825440 -5720240
9081 -5720240 -1226860 -1790508 -5005691 -4520549 -521468 1236905 -1366304 -4248756 -3384835
9072 -3384835 242461 2501211 1093538 -1928648 -2874261 -1884919 -3633472 -10344438 -16793918
9063 -16793918 -16574970 -11156456 -7004078 -5350540 -1999021 3288592 5564176 3842976
9055 3842976 2836610 3481463 927154 -4725211 -5720671 -133374 2121068 -5251149 -12895080
9046 -12895080 -9886699 -2130346 -3649616 -14258193 -20211761 -15774485 -9826153 -9162332
9038 -9162332 -8782692 -3700208 1428015 1823319 2273862 8172963 13452952 7705134 -7597682
9029 -7597682 -19542029 -20247814 -14837251 -11562588 -11266985 -10415449 -9287003 -11447206 -16912722
9020 -16912722 -21113643 -21213519 -19402449 -18220061 -16117827 -10893226 -5182211 -4026919
9012 -4026919 -7423563 -9887937 -8288654 -5472075 -4007730 -1100856 6172373 14093165
9004 14093165 16079509 11576192 5995864 2553040 -337533 -3024269 -1871586 4457692
8996 4457692 10159279 8115269 -931502 -8747044 -9139111 -4313825 -933981 -2161831
8988 -2161831 -5662249 -8366851 -10054528 -11117214 -9688692 -4189578 2524867 5252793
8980 5252793 2610953 -2369028 -7671647 -13682591 -18287522 -16394790 -7644466 391888
8972 391888 1329653 -1650307 -1679121 1155247 1514049 -1146121 -1656658 1821221 4614997
8963 4614997 2701212 -2551982 -8410404 -14462233 -20131005 -22756475 -20580633 -14664886
8955 -14664886 -6559409 2543763 9385444 9698363 3793908 -2533428 -4752797 -3784210
8947 -3784210 -1601019 2984743 10698648 17405265 17644628 10952980 1393235 -7617152
8939 -7617152 -14792267 -18802137 -18542455 -15690221 -14025317 -15312041 -17391064 -16922500 -13194194
8930 -13194194 -8908850 -7336529 -8547442 -9020418 -6017137 -1471250 705931 667699 2578937
8921 2578937 7811339 11900529 10443850 5072233 789331 -459914 -705266 -2120111
8913 -2120111 -5162776 -9319825 -12958921 -13467210 -10244000 -6608132 -5903526 -6719977 -5483914
8904 -5483914 -3199451 -5019796 -11894753 -17091555 -14284294 -6295304 -1715116 -3970295
8896 -3970295 -8017387 -8295447 -5724419 -4483437 -5021547 -4078713 -464747 3027122 3795390
8887 3795390 2499224 1302651 1716171 4778157 10301189 14796555 13524908 6691504
8879 6691504 558354 -178992 1689042 535547 -4243410 -8593863 -9847879 -8659624
8871 -8659624 -6706487 -5996178 -8300356 -11389616 -8575051 2793343 14735717 16900000
8863 16900000 10029194 4282221 4725266 6207624 3550661 -1033153 -3259998 -2695937
8855 -2695937 -309758 3852679 7604482 7231693 4195031 4846259 9885765 11014510 3136396
8846 3136396 -6563051 -8021378 -1472331 5403038 8730172 9462233 7015292 268775
8838 268775 -6718616 -7656870 -2646947 1900219 1637387 -2161306 -6151867 -7173657 -2794262
8829 -2794262 4826486 7411283 -605943 -12545742 -15387169 -5323876 8698561 17194141
8821 17194141 19252139 18095396 14311411 7426326 187666 -2973407 -921800 2680249
8813 2680249 3037688 -404860 -2684356 261600 4157524 511207 -10186893 -16537773
8805 -16537773 -12103525 -5292973 -5570810 -7627022 -1047930 10063224 12192965 4980118
8797 4980118 2156287 8306510 11615056 5340119 169365 5514016 12650061 9458294
8789 9458294 1131804 1141502 8423824 9336854 -259065 -9517125 -9813903 -4910507 -1320002
8780 -1320002 947051 3770394 5002747 2151204 -2890692 -6665312 -8608986 -10356632
8772 -10356632 -13098839 -16872258 -20249563 -20470689 -16251341 -10146682 -5746599 -3594329
8764 -3594329 -2561171 -3311621 -6629133 -10232508 -11760088 -13088737 -16512265 -18529726
8756 -18529726 -14105614 -6390575 -4604373 -11009230 -17230694 -16218954 -11332433 -9586618
8748 -9586618 -11277500 -11295964 -7233558 -1289600 3933499 7361641 8138529 5813220 1938977
8739 1938977 -448175 716727 4827798 8694406 8714718 4559694 273136 -301337 1542232
8730 1542232 1608475 -1086266 -4019104 -5933321 -7137118 -5597729 1174096 9577673 12054304
8721 12054304 8138571 6510933 12113057 17930050 15340376 6829072 1057070 -363409
8713 -363409 -2545376 -6134435 -5853186 -793400 2370930 -730199 -5720216 -6675360 -4709006
8704 -4709006 -4983781 -8427420 -10865167 -9075007 -4331772 -233027 925159 -228185
8696 -228185 -930617 1048696 5018006 8155717 8658909 7008280 4278487 998701 -1889357
8687 -1889357 -2741019 -868594 2473484 5144598 5255297 1690479 -4518918 -9295950 -8508486
8678 -8508486 -2975022 1403156 -171434 -6341829 -11536392 -11394240 -5423702 3635792
8670 3635792 11185060 12929988 8230992 1378753 -2115392 -980210 906895 -625328
8662 -625328 -5014734 -7601928 -5304191 -520734 2022818 1778155 3040406 8151639 13198448
8653 13198448 13349357 9964347 8187152 8951309 8484000 5450886 2871509 1844802 -684062
8644 -684062 -5352522 -7350664 -3963563 -17013 -623486 -2936922 -1617067 912324 -2185595
8635 -2185595 -9493840 -10563149 19956 14464451 21245443 18150349 12174647 9555068
8627 9555068 9666034 7650720 811806 -7344437 -9494185 -2683426 6468464 8013300
8619 8013300 158429 -9292233 -13242388 -12189085 -9495608 -5457418 433720 5876769
8611 5876769 8747440 10312646 11412005 9058790 1887865 -4193703 -2171065 5654938
8603 5654938 9612641 4803424 -4349183 -11796597 -16200714 -18431208 -18422396 -16851317 -15407435
8594 -15407435 -13244089 -7690948 -774736 292101 -6913758 -14429429 -13911955 -8667185
8586 -8667185 -8631117 -14845080 -16971151 -8107497 4838096 10004060 5404077 -451300
8578 -451300 -703845 2624768 3963071 2203652 1034359 3522815 8739885 13203166 14358182
8569 14358182 12738858 11018036 10582928 9535590 5398388 -777034 -5429044 -7581249
8561 -7581249 -9554193 -11691210 -10698264 -5925813 -2834903 -5521456 -9526338 -8325309
8553 -8325309 -4044584 -3654043 -5978422 -2585793 6967080 11725883 6123854 -14600
8545 -14600 3661407 11609639 11600525 4726860 3790497 13567911 24693936 28164507 25220124
8536 25220124 20306592 14102114 7786684 5831374 9109759 11627324 9290763 6391329
8528 6391329 8182773 12141822 12491326 9405989 7497608 7704446 6600861 2572737 -2195684
8519 -2195684 -5284694 -5792960 -3210566 2139073 7829299 10722632 9136244 2913916
8511 2913916 -6201826 -13099482 -12078864 -4035179 2457793 738473 -6032880 -9866763
8503 -9866763 -7732415 -2475647 2860144 6740747 7486906 5086097 3325837 5535995
8495 5535995 9508967 11036871 10800427 12626021 16132377 16713746 12540129 6337597 361361
8486 361361 -4965097 -7250816 -3185258 4756293 8110361 2069538 -8332865 -14437431
8478 -14437431 -13314970 -8195391 -2283907 4062269 10429703 13651554 9866302 -694094
8470 -694094 -12239644 -18407047 -18360833 -15614663 -11277739 -2992537 8157860 15462945
8462 15462945 15203140 12407366 12944740 14749254 13264278 10709982 11502250 12434661 7838545
8453 7838545 2211946 5520941 15516513 17733898 6884015 -3952875 -2074068 7262970
8445 7262970 10471771 4789594 -1759164 -4107407 -4224286 -4248965 -3832947 -3139103 -2308254
8436 -2308254 642729 6326229 10577885 9476320 5146335 1578530 -2045812 -7985709
8428 -7985709 -13287809 -13709676 -11889747 -13610770 -17070563 -14539007 -5569838 -102973
8420 -102973 -5039245 -14188575 -16209171 -8709303 -99625 841071 -6026560 -13244149 -13917844
8411 -13917844 -8335669 -2658142 -1786522 -5097194 -8981654 -10545655 -7990394 -1376553
8403 -1376553 4874988 4723038 -995246 -3642613 1067782 5172577 -621065 -12462239
8395 -12462239 -18305942 -14760940 -9577534 -7956457 -6205227 -871699 4582916 5850150
8387 5850150 4036841 2637686 3450001 7439756 13981020 17692874 12841355 3267596
8379 3267596 544558 8456979 16425289 13444692 2285037 -6187450 -7668903 -6746806
8371 -6746806 -8075003 -11549535 -14385930 -13312665 -6686333 2012203 5783789 2742560
8363 2742560 -689127 800734 3533251 1856173 -1580064 142410 6780014 11099802
8355 11099802 9167739 3741710 -1625545 -5521786 -6651838 -5196694 -5322250 -9979210
8347 -9979210 -14373711 -11820561 -5128576 -3643747 -8709200 -11481138 -7307384 -2679526
8339 -2679526 -3700389 -6544377 -5304681 -1596236 780673 4102113 11167786 16420412
8331 16420412 12052996 426443 -8661999 -11857855 -14375216 -18305573 -18444149 -12379366
8323 -12379366 -6035370 -4308519 -3032156 3525520 12033700 14140211 8766883 3287354
8315 3287354 2576660 3307734 961332 -2856554 -3883741 -2800446 -4570148 -10468834 -14837425
8306 -14837425 -11840581 -3528797 1512463 -2347089 -11566819 -17620277 -15986573 -9372773
8298 -9372773 -2854118 1568797 4667177 6483089 5735015 2604065 -65635 404540 3318242
8289 3318242 5431221 4869411 3097418 2436683 2530273 698306 -4071645 -8980060 -10324462
8280 -10324462 -7656667 -3804159 -1554347 -1923614 -4821299 -8701185 -9537029 -3599018
8272 -3599018 7093756 14963534 14945837 10061170 6213349 4002905 -82597 -5973831
8264 -5973831 -8930606 -6519840 -1785929 1817727 4089747 4818157 1578198 -5922845
8256 -5922845 -12885120 -14365678 -10514991 -4033137 3983746 11711204 13861851 7074467
8248 7074467 -3930354 -11243603 -13453777 -14707562 -15517117 -11861722 -4035958 1142144
8240 1142144 -271692 -3839918 -3941267 -1195558 916125 1966382 2937113 2914375 1900126
8231 1900126 3091916 7508755 9867926 5358422 -2349918 -5972062 -5248222 -5681445 -7559376
8222 -7559376 -4297685 6245361 15742159 15014237 5533311 -3067428 -4728594 -2309459
8214 -2309459 -2067090 -6131005 -11168744 -12729838 -9531154 -3491152 3126835 8714345
8206 8714345 10640166 5878265 -4416122 -13504898 -15626904 -12345593 -8917720 -6421865
8198 -6421865 -2602121 816646 -1202921 -7629576 -9808130 -3299810 4588659 4872670
8190 4872670 223422 988938 9732423 17616182 17320338 12411601 10040615 9660851 5091481
8181 5091481 -4185045 -10238469 -6858640 1789372 5904090 1478555 -6206103 -9831468
8173 -9831468 -7589713 -3003340 -215094 -1217077 -5665527 -10963081 -13254287 -10394320
8165 -10394320 -4029814 2007663 4633922 2497359 -3565843 -9117120 -7721756 2172582
8157 2172582 12952774 14656650 6509042 -1960070 -2166336 4616190 10886828 11941880
8149 11941880 8831253 4854078 2164273 1033439 363181 -1040437 -3129119 -5231876
8141 -5231876 -7809163 -11652982 -15082297 -14510884 -9052800 -2522459 445793 -1368860
8133 -1368860 -6060881 -10752526 -12470236 -9537870 -3738832 984263 3081835 4196107
8125 4196107 4789962 2907571 -963687 -2370260 450658 2592460 -405635 -5061043
8117 -5061043 -4934115 -362274 2862722 2837600 3070365 5199761 6731198 6631280 6985779
8108 6985779 7758012 5876727 1593455 -42483 3047385 6098495 5026565 2846914
8100 2846914 3993170 6494078 5536807 2109064 1927938 6573056 11157385 11228698 7585038
8091 7585038 3432255 534223 -606984 112710 1469782 1257494 -1088698 -3650682 -4459700
8082 -4459700 -3207042 -181037 4422103 9204957 11487069 9980048 6512045 4048894
8074 4048894 3775616 4576722 4104606 -123391 -8692713 -17901788 -21256647 -15854888 -6561058
8065 -6561058 -1376527 -2800930 -6186644 -6757837 -5206090 -4918245 -6531662 -8149684 -9367833
8056 -9367833 -11555518 -14219462 -14342856 -10386157 -4567132 71172 2924279 4959884
8048 4959884 6500785 7316054 7258300 5561984 1599822 -2214208 -1282477 4536114 8114964
8039 8114964 3470092 -4912374 -6961986 -991463 3639047 -436443 -9167020 -14407962
8031 -14407962 -15096819 -15390945 -15612422 -12504839 -7408375 -6585388 -11712513 -16283021 -14595989
8022 -14595989 -9209915 -5235088 -1629092 5538482 13340343 13256732 3766045 -5032958
8014 -5032958 -3782044 3694121 6195931 1005772 -3056786 1119952 9412179 13217773
8006 13217773 10409036 5147532 872587 -1063075 1335917 8173437 13336297 9541664
7998 9541664 -1327836 -9083705 -8258004 -4209936 -3279291 -3180604 1287752 7592849 7812562
7989 7812562 211608 -8061397 -10379004 -7610499 -4469931 -3165032 -2746243 -1917607 -390413
7980 -390413 1052413 704100 -2459427 -6613013 -8045709 -5130776 -242908 2733857 1757348
7971 1757348 -2555652 -7886513 -11422241 -11360786 -8047815 -3305151 1179456 4196516 4658194
7962 4658194 2641715 598812 1609638 5833559 9913354 10361977 6604717 555941
7954 555941 -5492630 -9917573 -11747110 -10859798 -8427806 -6482906 -6007991 -5213510 -1276068
7945 -1276068 4660745 5983589 -2279145 -15139050 -21070958 -15451936 -6359069 -4220210
7937 -4220210 -9637078 -15258105 -16282154 -14324138 -13122746 -15099579 -20528662 -26022758
7929 -26022758 -26029377 -20067940 -15368425 -16987006 -19160914 -13946089 -4790219 -1414293 -3319540
7920 -3319540 -1016313 5451766 3516824 -11010603 -23546425 -20642941 -9406858 -5270643
7912 -5270643 -8682815 -7844362 92058 5379651 2629577 -2268882 -4662291 -8686792
7904 -8686792 -17394200 -24668451 -23410763 -15685782 -8770014 -5229473 -2185607 2336714
7896 2336714 7067624 10223388 11132349 9604258 5832592 946041 -2953948 -3267967 1308735
7887 1308735 7876457 10024435 4590583 -3489123 -6721711 -4312253 -1603759 -1410759
7879 -1410759 -1487008 -567967 -705900 -2228997 -2401621 -1396513 -3788303 -10825210 -16518884
7870 -16518884 -15611769 -11052312 -8937266 -9650346 -9195802 -6947951 -6725891 -10694224 -16167577
7861 -16167577 -18663258 -15919260 -9437400 -3602449 -2084819 -3874323 -4520491 -1920850
7853 -1920850 2019147 6134099 11718535 17205736 16470448 7106661 -3595648 -6384230
7845 -6384230 -974284 5986416 10942819 14895754 16654319 12295356 2330697 -6696372
7837 -6696372 -9615900 -7250203 -2802345 1499871 2950159 -1142461 -8796131 -13189696
7829 -13189696 -9997740 -1982172 5682280 11172458 14731450 15455912 13200872 11138492
7821 11138492 12215114 14281363 12571586 6565954 852560 -1116264 -986625 -2175431
7813 -2175431 -4940523 -6312268 -3709757 2456925 8762826 10459595 4625426 -6424291
7805 -6424291 -15337615 -15599937 -8016760 117730 3071167 2214647 2356767 4809599 6979417
7796 6979417 7560326 8229822 9832136 10561387 9326007 7798237 7286657 6310459 3415490
7787 3415490 13462 -1804356 -2060837 -1314267 1223517 5295977 7743800 6327993 3557799
7778 3557799 3403830 5818371 7748275 7799886 6387070 3246278 -944403 -2230660 2320514
7769 2320514 8991471 11326755 9215478 8533314 11563430 13737845 11302857 6584826
7761 6584826 3233476 1069484 -1441568 -3566173 -4169364 -4185552 -4824478 -5980450 -7930085
7752 -7930085 -11232850 -13520962 -10691703 -3615926 766537 -1757054 -6826532 -8111281
7744 -8111281 -5884770 -4568412 -4993857 -4343948 -1893066 201624 936223 1131327 940359
7735 940359 515195 2127843 7481894 13454426 14666992 10380298 5145887 2398306 1002944
7726 1002944 -1221297 -3917534 -5331303 -4579669 -1788585 2077441 4845711 4388579 926552
7717 926552 -3081645 -5294764 -4594796 -800107 4556034 7828155 6377223 2171406 -201069
7708 -201069 678633 1786716 627001 -1255681 -1028185 1264135 2927223 1750075 -2429019
7699 -2429019 -8222899 -13290338 -14987614 -12011063 -5885898 -121354 2784941 3391032
7691 3391032 3772938 4074305 2082401 -2727320 -6456973 -4806925 705881 3783292 1186004
7682 1186004 -3517196 -5141641 -2829619 665584 2542127 851579 -4988759 -11957867
7674 -11957867 -14541535 -11049427 -6358912 -5541257 -7621169 -8959480 -9518835 -11191248
7666 -11191248 -12626594 -11130398 -7951235 -6207821 -4934710 -1053716 3615762 3744336
7658 3744336 -976778 -4980296 -5147266 -3664793 -1703922 2484421 6898770 4943352
7650 4943352 -4263823 -11471432 -9209002 -2815345 -2526851 -8403305 -11272816 -7144888
7642 -7144888 -2235978 -2366812 -4692038 -3604111 269945 1791802 -631088 -3652473
7634 -3652473 -5173383 -7375497 -11915579 -15434128 -13221992 -6093995 75888 1861984
7626 1861984 1595549 1964127 1577147 -900934 -1952472 2444501 9822965 14051479 13885404
7617 13885404 12719414 10588797 4053007 -4482866 -5602695 4174564 14580358 13098115
7609 13098115 445907 -11599320 -15131235 -12447304 -8941654 -6609330 -5656014 -6938161
7601 -6938161 -10031796 -12025457 -10806648 -8046577 -7123459 -8751146 -9952495 -7641267
7593 -7641267 -2833392 -280248 -2872878 -7379851 -8067497 -4124058 -163907 1026170
7585 1026170 2053203 5512506 9358217 10816031 11216368 12987799 14817758 14122464 11891125
7576 11891125 10543881 9132110 5577079 1735974 566666 -441743 -6425506 -15549321
7568 -15549321 -18961175 -12335593 -1913057 3603273 2524643 -1162663 -4112764 -5025327
7560 -5025327 -3325700 -427819 116042 -2723198 -4848555 -2682846 783458 -8244 -4601042
7551 -4601042 -7211003 -6102932 -6656118 -12659778 -19167848 -18402772 -10372447 -2747758 -751359
7542 -751359 -2076653 -2900125 -4031774 -7819423 -12464968 -13917326 -11604703 -7789319 -2526271
7533 -2526271 5320835 12103833 10621089 -435378 -13265590 -20073493 -21052545 -20281399
7525 -20281399 -18504808 -14706575 -11100304 -10833062 -12571821 -12272729 -8953202 -4496313
7517 -4496313 443988 5805512 9267473 8986542 7518648 7912898 7855353 3698590 -1557287
7508 -1557287 -1706054 2048969 2212712 -2626326 -5326782 -2500417 -557169 -5063178 -11729554
7499 -11729554 -13727650 -11670234 -9921252 -8179957 -3827104 1087216 2485422 1713055
7491 1713055 3587730 8101429 10162470 7367779 2960221 1064374 3004182 7659020
7483 7659020 11582984 10172815 3331322 -1512268 2365527 10626429 12320989 5131895
7475 5131895 -1012944 1887789 8854945 9867615 3935084 -1093936 -599183 1374542
7467 1374542 -651976 -6022858 -10091743 -10904285 -10590976 -11227749 -12419412 -13444622 -15122994
7458 -15122994 -17729988 -18775297 -15470724 -8860886 -2973370 -60596 578317 -778486
7450 -778486 -4934280 -9964572 -11006003 -6584792 -1767029 -1779919 -5487531 -8761069 -11161191
7441 -11161191 -14491647 -17203393 -16063880 -12307696 -10285709 -10259227 -8413667 -4344482
7433 -4344482 -2227732 -3204082 -3114296 -481372 -388820 -6158208 -12532538 -12483411 -6852271
7424 -6852271 -1768671 146618 -17984 -3231223 -11139929 -19650857 -21213598 -14827137
7416 -14827137 -7725159 -5284747 -5030506 -3344717 -2400986 -5873155 -11919035 -15835899
7408 -15835899 -17232796 -19050925 -20616187 -17417306 -8543217 537170 4661896 4935584
7400 4935584 5553435 7161227 6310093 724983 -6994732 -11097206 -7616113 1790719 10773284
7391 10773284 14174197 12990185 11891030 12273868 11091144 7365121 5492538 8776568
7383 8776568 13046146 11585237 4803894 -265619 71214 2094188 1823729 1070161 3219135
7374 3219135 6802796 7477378 4511889 1228328 -498880 -2421892 -5695719 -7311847
7366 -7311847 -3039727 6676049 15621622 17524246 12213958 4975712 200435 -2187334
7358 -2187334 -3529282 -2940390 232366 2946800 1607348 -2425111 -4716068 -4481561 -4711162
7349 -4711162 -5932392 -5572321 -4126848 -5399829 -8645514 -7609423 -1044826 3163238
7341 3163238 30344 -3466940 485326 6085624 1270773 -13037435 -22408667 -18388786
7333 -18388786 -8296293 -2981031 -4104691 -7824105 -12759136 -17953950 -18837118 -12342799
7325 -12342799 -3144886 868290 -2375754 -8549408 -13036470 -13727403 -10073801 -3699009
7317 -3699009 1407620 2888501 2970132 4647061 7111065 8353266 9841108 14125508 19395355
7308 19395355 21137658 18438710 14256292 10169634 5568786 1716523 1480971 4483630
7300 4483630 7405465 9824952 14279267 19086956 17644912 8739829 1697319 5151473
7292 5151473 14557875 18012197 12505408 6505818 6160396 7294675 4492106 870472
7284 870472 2559093 7882418 9441926 5425934 1698380 2136313 3638468 3134222 3444374
7275 3444374 7608129 11731451 9531286 2293301 -1656838 2132470 8843747 11686100
7267 11686100 10594574 10576164 13593112 15630467 11934655 2980868 -5710823 -8933388
7259 -8933388 -6226902 -1106875 3299324 6866361 10656236 13813692 13662403 8881556
7251 8881556 1691704 -3652858 -4751653 -3526621 -4189408 -8036209 -11258376 -9641678
7243 -9641678 -4503668 -1143559 -1812747 -3974861 -5786994 -8390657 -11042458 -9491755
7235 -9491755 -2836496 3104767 4144526 4622248 9653540 14885112 12297765 3609107
7227 3609107 -1438183 493477 3090885 2402039 2481508 6418811 10687191 12198105 12779776
7218 12779776 12477702 6830437 -3806322 -10513374 -8193703 -4052091 -5709130 -8129465
7210 -8129465 -2524168 7282625 9232144 1209662 -6855330 -8804593 -9067424 -11880667
7202 -11880667 -13718228 -10274963 -3411750 2806812 7219971 9682255 9486802 8388673
7194 8388673 9897627 12903900 11469905 4069881 -2446646 -2090417 2002854 3315000
7186 3315000 1928945 3146844 8317374 12522060 11299039 5842690 852052 -667269
7178 -667269 183380 382268 -563404 455952 5006267 8685613 6202914 404265 267674
7169 267674 8115933 15015888 12912619 5967670 3999966 8433418 11814426 9748828
7161 9748828 5996335 4725172 4020509 180762 -5565477 -8313259 -5792862 -747825
7153 -747825 2415838 1731621 -1246179 -3406525 -3190065 -2035676 -2341059 -4005115 -4010039
7144 -4010039 -4553 6493057 11306334 11571225 7680658 1868646 -3378902 -5185133
7136 -5185133 -1109500 7283878 12984245 9570129 -546137 -7539465 -5709564 -166823
7128 -166823 813914 -3349085 -6650464 -5666240 -1797207 4292349 13491590 22472340 23962748
7119 23962748 16333094 7916165 7348684 12873899 15636965 11361851 4132919 -605056
7111 -605056 -2414316 -4252325 -7303168 -9340916 -7881719 -4013311 -2061482 -4747101
7103 -4747101 -9730300 -12666422 -12748553 -12648124 -13633418 -14218152 -13709289 -13171950 -12112842
7094 -12112842 -8431420 -3162286 -763119 -2111933 -1606614 4802824 11987479 10863021
7086 10863021 -75216 -12461690 -17100502 -12679500 -5719900 -3606011 -7346341 -10654101
7078 -10654101 -7340301 749842 6090133 5677214 4271560 6059757 8443392 7455161
7070 7455161 4550150 3378202 3426570 1862104 -902408 -2245354 -1992568 -1919083 -2526703
7061 -2526703 -3792527 -6396883 -8562261 -5333535 4156433 12299710 11706218 5290144
7053 5290144 1570777 2904267 5346610 7469316 10955465 13743538 11442597 5944636
7045 5944636 4314120 7829586 9911346 6787487 2737388 2127542 3083075 2291731 307197
7036 307197 -1064884 -1764598 -1419517 1038006 3936126 3966297 2031336 2591576 6143304
7027 6143304 8511280 8704208 10367102 13834273 14651002 12340478 11998212 13832240 10578319
7018 10578319 437428 -6914342 -4248710 1941992 2400550 -506572 872458 5122273
7010 5122273 4682469 -836070 -4679454 -3890349 -1037745 2627022 6829550 7481280 1523145
7001 1523145 -5254737 -4546992 1762862 4619428 2154856 884666 3089349 3709261 671130
6992 671130 -2104085 -3664546 -7861753 -13993547 -15588439 -11242984 -6744347 -3562394
6984 -3562394 3770799 14571657 18090705 9593829 -282222 -809720 3455507 2182201
6976 2182201 -3992287 -7096857 -5797048 -4252884 -1898853 3618527 6678835 -302368
6968 -302368 -12064409 -14370615 -4225897 5168104 2834513 -6583602 -12134884 -10748229
6960 -10748229 -7025681 -5630367 -8903026 -16543566 -23119906 -20940797 -9763015 1127947
6952 1127947 4572652 3914548 4904988 5169556 -925793 -10942912 -16398650 -14703917 -11286931
6943 -11286931 -9944972 -8546544 -5458557 -3106492 -2505767 -449342 4165143 6383503
6935 6383503 2136966 -4765761 -7591765 -5901360 -4587813 -5386009 -4880961 -881979 4151235
6926 4151235 6941518 6711970 3799411 -1239589 -5924403 -6859672 -3961863 -450104 2401179
6917 2401179 6276852 9995322 8159894 -575292 -9061382 -11160762 -11449604 -17954535
6909 -17954535 -27895276 -29930551 -20959521 -11350798 -10208414 -13606351 -12827853 -7743800
6901 -7743800 -4903321 -6369921 -8003821 -7303609 -6247452 -6348999 -6457602 -6187305 -6912471
6892 -6912471 -8313615 -7846502 -4908383 -2336892 -2604052 -5196368 -8484164 -11281651 -11712746
6883 -11712746 -7695192 -170131 6606989 9563911 9535842 8273670 5208716 -779464
6875 -779464 -8112799 -13191480 -13633231 -9798303 -4165802 87289 1435621 1804407 4388514
6866 4388514 9037070 12116203 11913711 11090040 11723978 11211103 6552687 153949 -3111810
6857 -3111810 -3222081 -4617613 -8900039 -12731716 -13422045 -11790761 -8510056 -2903232 2473663
6848 2473663 1666639 -6211074 -13075065 -11787415 -6361690 -5938242 -11161150 -14209921 -11731722
6839 -11731722 -9267743 -10802167 -11952807 -8156330 -3275449 -3785778 -8344876 -9690138
6831 -9690138 -5076715 879567 2915771 -109080 -6318368 -11981385 -12168880 -5149932
6823 -5149932 3691750 6742686 3259082 -512842 -205644 2493393 4860504 6793603
6815 6793603 7785369 5414801 -441562 -5924690 -8124325 -7925973 -6024032 -859533 6427391
6806 6427391 9768759 5385175 -2081556 -4951828 -1382940 4842722 10232551 12931756
6798 12931756 11240428 6102901 3057865 6340911 12285196 13640523 9381157 4992425
6790 4992425 3749078 3445566 2183420 1818675 3837591 5982362 5140018 1071578 -3863662
6781 -3863662 -6706199 -5539179 -1320124 2413578 3911277 5875943 10760708 15349486
6773 15349486 14307342 7682196 171127 -5704553 -10414146 -12872559 -11506782 -9105487
6765 -9105487 -9480980 -9491561 -2560517 8912054 13775497 7671514 -572875 -2454637 -1000819
6756 -1000819 -2568849 -5691794 -5876160 -4678826 -5050051 -3019450 5985377 15950073 15786184
6747 15786184 4960912 -5716731 -8914459 -7806802 -7737199 -9276871 -11359297 -13767646
6739 -13767646 -14036345 -8513998 790332 6394918 5057479 1588968 269865 -1368728
6731 -1368728 -6236519 -10828836 -10037256 -4982511 -814920 616251 1077237 1113533 -223801
6722 -223801 -2108549 -2942973 -3907685 -7156396 -10689480 -9608406 -3602079 843908 -1748252
6713 -1748252 -8314604 -10648283 -5633496 893650 1536016 -3537533 -7331108 -5399796
6705 -5399796 -1363338 -1491054 -6339260 -10905950 -11896596 -11033367 -10868311 -11045622 -10363474
6696 -10363474 -9605012 -9875779 -9934613 -7692999 -3516653 82542 1712088 2366638 3471182
6687 3471182 5005984 5896460 5482115 4160126 2763464 1665777 867292 771780 1864102
6678 1864102 3379063 3934846 4436925 8009698 14590506 17905299 12267953 1654595
6670 1654595 -3363438 1047393 7013718 6180252 859122 -1124787 796407 -592846
6662 -592846 -8235386 -15076684 -13406990 -5368090 209440 -707996 -3561392 -2817593 656534
6653 656534 1787086 -1518671 -6162472 -8289458 -7449548 -5676539 -4237630 -2731785 -610334
6644 -610334 1933445 4730802 8289899 12931377 17192751 17642473 11533732 573179
6636 573179 -8885704 -11278024 -7489840 -3432336 -2913477 -3955915 -2582933 2116562 7782325
6627 7782325 11599420 12133733 10067887 7851039 6754635 4388284 -1608481 -7540747
6619 -7540747 -6649502 290943 3727457 -1400367 -7304919 -4279265 5149594 10536615
6611 10536615 8386005 4465647 3456009 4707509 7233935 10589802 11166546 5939627
6603 5939627 -72325 1374930 9088152 13470579 10851499 7065605 5555532 3045080
6595 3045080 -69305 2922194 11948501 15973148 8993603 -488303 -3828158 -4814558
6587 -4814558 -7956928 -5824954 7964152 22228383 21416025 10075507 6671487 14908254
6579 14908254 19187283 10715458 991367 2916084 12387459 17384832 15255178 11818623
6571 11818623 10112969 8558225 6284288 3583915 -307978 -5213240 -8403243 -8465324
6563 -8465324 -7829813 -8516148 -8662673 -6263786 -3166478 -2241160 -3108004 -3353960 -2072385
6554 -2072385 -462757 -709279 -4774509 -11727798 -16296156 -13576542 -5354951 1912186
6546 1912186 5060090 5779313 5032844 1928048 -1571389 -1340019 2255308 4698329 5478269
6537 5478269 8697586 13637528 12994135 4569888 -2918991 -1301057 5897461 9561463
6529 9561463 7092304 2554878 -850215 -2508949 -1958002 -40253 253311 -1776259 -2524301
6520 -2524301 -42521 2219591 1269930 -963358 -3083685 -7771437 -14318721 -14712426 -5304119
6511 -5304119 3681428 433576 -10667950 -14551066 -6802567 1689181 1644136 -3874195
6503 -3874195 -7876756 -8805471 -7383387 -2116172 6696637 13832556 15069344 12921907
6495 12921907 12733521 15583831 17920645 16271569 10436871 3766322 1207509 4980687
6487 4980687 11558038 14966955 13098373 8524213 3954307 368883 -868818 1545178
6479 1545178 5517097 6565691 3587060 576716 1284354 4713776 7238425 7232841 6413406
6470 6413406 7513210 10866398 12990828 9861031 2285967 -4301433 -6529152 -6161448
6462 -6161448 -4893101 -1205757 4032143 4775203 -1286207 -6411414 -3471863 1618715
6454 1618715 -1763072 -11115589 -13231241 -4335935 4464887 4454861 386427 -464887 198688
6445 198688 -2133836 -5605116 -6528283 -6626711 -8367459 -8348621 -2718653 4811258 7375562
6436 7375562 4488658 1067855 -460409 -1284083 -1583216 -336626 1383776 1104141 -2133062
6427 -2133062 -7901121 -14569246 -17230400 -10609668 1811846 7215820 -1533999 -14627703
6419 -14627703 -16603466 -5923597 4863543 6833165 3618264 1922623 1730020 -159593
6411 -159593 -2603705 -1350564 3965764 7733256 4215452 -4976697 -10560632 -5143009
6403 -5143009 6870037 12927054 7502064 -1343597 -3978813 -2203073 -4031200 -9847355
6395 -9847355 -12212104 -8025370 -2437537 175091 1738689 4884920 7983741 8684349
6387 8684349 7855532 7225021 6469107 4741896 2252816 -1022559 -5294602 -8715942 -8484871
6378 -8484871 -5316254 -3584051 -5709360 -9285732 -10828176 -9456816 -5907969 -1033912
6370 -1033912 3375197 5089494 4197775 3128911 3029018 2432709 175848 -2852216 -5476991
6361 -5476991 -7383795 -8201513 -7883222 -7831031 -8786570 -8202235 -3515683 2385455 3710759
6352 3710759 73058 -2982704 -2732196 -2680555 -4969394 -5492772 -796515 5047904 5708876
6343 5708876 1506735 -2056033 -2395397 -1422300 -473600 1148018 2551077 582974 -5874924
6334 -5874924 -13348343 -16508702 -12549394 -3283683 6005137 10690102 10907186 10443466 10964104
6325 10964104 9865666 5348198 355018 -1594498 -1742410 -3275978 -5251660 -4135799
6317 -4135799 -470075 1160177 -776894 -2539968 -1434071 -12579 -1545702 -4739636
6309 -4739636 -6103385 -5415853 -5656930 -8420688 -11923649 -13282245 -11123185 -6402132 -1944646
6300 -1944646 -402218 -1301003 -1148869 1844295 4473553 2655327 -1932669 -3020472 1682636
6291 1682636 6767656 6218000 1254925 -2186820 -1778748 -449889 -458937 -424968 741400
6282 741400 1082085 -873429 -2767016 -1417470 2709178 6603740 8726379 9259805 7673830
6273 7673830 3178879 -2765584 -7298205 -9790528 -12202841 -15194226 -16043443 -11826148
6265 -11826148 -3662215 3491200 5419227 2619727 -719779 -1666452 -1213994 -1061177 117795
6256 117795 3840812 6606024 2937452 -5451376 -9450338 -4406595 3441232 6598676
6248 6598676 6629211 8569687 10190776 5638767 -2854060 -6519536 -3099660 816156 1528598
6239 1528598 2917243 6516953 6197049 -1637799 -9764998 -9062257 -1161171 4473944 3292633
6230 3292633 -574573 -1875747 -424675 183065 -3107855 -9535443 -14109476 -12076956
6222 -12076956 -4923368 757528 1614379 1045641 2466610 3620185 1037007 -3869639
6214 -3869639 -7473999 -9589234 -12073917 -14319785 -14399427 -12571769 -9643195 -4098091 4771198
6205 4771198 12700639 13998063 8523084 1776327 -970345 1768660 7608136 10799335
6197 10799335 5877381 -5288844 -13019199 -10722795 -3226267 681469 520598 2284281
6189 2284281 6794607 7924046 2454413 -5539018 -11418957 -14865933 -16230726 -13666856
6181 -13666856 -6845882 200029 2653891 -403645 -5565652 -7720455 -4061220 2114548
6173 2114548 3545951 -1744965 -6282852 -3254824 2429738 621721 -8521137 -14709661
6165 -14709661 -13467941 -11858018 -15326464 -18418010 -14248485 -5718952 -452748 153548
6157 153548 74920 801635 1054552 1826147 5396774 10473300 13412226 13397171 12039127
6148 12039127 8943307 2311538 -6396184 -12719131 -14521140 -13606608 -11581689 -7456930
6140 -7456930 -685720 5898120 8290917 5882748 2435123 2078137 4892469 7470285
6132 7470285 7824497 7728265 8891094 9288759 6343951 1869513 -343232 -677458 -2278113
6123 -2278113 -3842948 -171092 8539154 14387128 12254579 7099298 6093611 7958915
6115 7958915 6014167 -871208 -6834631 -8216799 -8492529 -12015162 -16409146 -14733701
6107 -14733701 -5330800 3144821 85951 -12899235 -20756212 -12483329 3577380 9243294
6099 9243294 -161467 -11251096 -12662497 -9165822 -10513306 -15773267 -17389248 -14205654
6091 -14205654 -10660659 -7060325 -590897 5991436 6421958 1617937 -497821 2925079
6083 2925079 5647230 2655633 -2371744 -3198179 612480 4957452 7085520 7055027 5822714
6074 5822714 4513563 4269186 5294522 6645861 6923808 4401793 -2090736 -10527919 -15622602
6065 -15622602 -13935522 -7463427 172555 8355396 16886011 22137378 21078421 16782342
6057 16782342 14035862 11310850 3863320 -6111469 -10000924 -4408950 4398537 9209547
6049 9209547 9005747 5864426 980818 -3686906 -5224454 -4030741 -3875403 -5672193 -5873824
6040 -5873824 -3008892 -718184 -1755902 -3796690 -3967051 -3025874 -2325137 -1106465 378383
6031 378383 -469499 -3903548 -6269531 -6162367 -7523599 -13018229 -18586870 -18550943 -12766980
6022 -12766980 -5492088 -628759 -681478 -5954297 -11664765 -10674818 -2770170 3554865 2262244
6013 2262244 -2692298 -5193346 -5943915 -7561463 -6846720 32008 9071035 13613572 14750198
6004 14750198 17964003 21996217 20451132 13553723 8972214 10110713 11741021 8851314
5996 8851314 2903441 -2271955 -4776427 -3845947 -458481 1069677 -1805882 -3727557
5988 -3727557 2068364 11571951 13764317 7697313 4963405 11238513 16371744 10055932
5980 10055932 -1884739 -6348188 -1637898 2816436 1306123 -3701756 -9634099 -16037289
5972 -16037289 -18831596 -12304465 587396 7993005 3206442 -7024679 -12210061 -10920229
5964 -10920229 -8973193 -8944303 -7985811 -4920663 -3173632 -4925544 -6892546 -5136840 -1411678
5955 -1411678 -729898 -3418746 -3839430 1775255 9685634 13249408 10748854 6008055 3356909
5946 3356909 4986887 11002177 17901066 18763896 10237228 -1271200 -5876596 -2510347
5938 -2510347 1312571 2155260 4722860 10541993 11859678 3580108 -5959320 -5187812 4126911
5929 4126911 10081632 8083266 5130678 6787148 9775499 9919151 8709590 7816340 4280069
5920 4280069 -3385714 -9578037 -8014776 -564110 5590260 7426595 7908790 9785595
5912 9785595 12289830 13862062 14379131 14110054 13037016 11741299 11151499 11007660 9766637
5903 9766637 6308772 1313420 -2830253 -3679464 -1422976 460733 -787703 -2971170
5895 -2971170 -1844234 1860760 3070610 1413272 3708681 13372649 22803190 22950325
5887 22950325 16848451 15419483 20976884 23679067 16003948 2838801 -6419113 -9297720
5879 -9297720 -9075423 -7435551 -4191127 -1244058 -1041789 -2343732 -2015335 -72296 869201
5870 869201 16648 -1521590 -3897621 -7662601 -10614094 -9836975 -6489856 -4232751 -3190960
5861 -3190960 -338313 3892729 4914383 1394110 -2007399 -1810064 -572594 -1230753 -1454304
5852 -1454304 1677271 5366269 5171812 2659221 2672540 4401298 2039140 -5164282 -10092532
5843 -10092532 -7414435 -888025 2240057 275432 -3109675 -5324316 -7102653 -9461378
5835 -9461378 -11846582 -13390893 -13954856 -13767575 -13082374 -11908353 -9693464 -6410726 -4291707
5826 -4291707 -6285311 -11438556 -14050004 -9722582 -789624 6528261 8994498 7963062
5818 7963062 5585340 2665185 -282998 -3086405 -6964257 -12365724 -15660568 -11749253
5810 -11749253 -1277271 8109541 9853316 5348654 658795 -1104269 -1339978 -1969261
5802 -1969261 -3425967 -5649836 -7529939 -5790324 1491682 9504979 9264111 -1526603
5794 -1526603 -13242641 -14159769 -4350281 4583801 3971135 -2282421 -4764335 -1145222
5786 -1145222 3103890 4669399 6685305 11399387 14227384 9966857 1988890 -690799
5778 -690799 4773957 11759805 13992392 13061318 12706243 10704393 2793519 -7698562 -11768082
5769 -11768082 -7247761 -2399555 -3589764 -5452326 626525 12060520 16939666 9949634
5761 9949634 -1079970 -6682911 -7262445 -8880033 -12658338 -14448572 -12592313 -9928615
5753 -9928615 -8639258 -8421347 -9892155 -14477310 -19777542 -20183482 -14384355 -7944488 -5805571
5744 -5805571 -6311851 -5719255 -4398851 -4383872 -4575147 -3706984 -5046547 -11674737 -18756554
5735 -18756554 -17736584 -8471418 -300748 393783 -2838649 -4180574 -3406866 -2212561
5727 -2212561 1083254 7453535 12241682 10607118 5061756 1650713 970497 -738911
5719 -738911 -3344080 -2793866 963429 3259802 3025731 4910921 10724164 15205096 13945087
5710 13945087 9937467 7852599 6787936 4116826 2292485 4940181 8588108 5929788
5702 5929788 -2660456 -8016676 -4573189 2036737 2945408 -3036417 -10378510 -15131780
5694 -15131780 -17565878 -18569398 -18397818 -18577602 -20543933 -21904563 -18443870 -11414330
5686 -11414330 -8580275 -14754595 -24343615 -27546156 -22306338 -15345614 -11724856 -8888158
5678 -8888158 -2977383 3799135 6017726 2390623 -3804756 -9785963 -14448906 -15554077
5670 -15554077 -10663445 -1670557 5602486 7857878 7433492 7768783 8865828 9093324 8812434
5661 8812434 9694154 11758895 12827560 10134444 2237809 -8637769 -15978135 -14066034
5653 -14066034 -5127805 1927490 1884367 -1232610 -1688582 -975810 -4368742 -11278327 -15130392
5644 -15130392 -12578693 -7526713 -5003810 -5387520 -6370644 -7201724 -8608852 -10368379 -10963976
5635 -10963976 -9272166 -6018316 -3648598 -3929817 -5090343 -3110174 2738018 7896510
5627 7896510 8322994 5779568 4280800 4119424 3773478 4990846 9926533 14785125 13344743
5618 13344743 6853262 3422636 6608544 11592803 14206842 16005090 17525211 14742475
5610 14742475 7271145 2702811 6124598 11292659 9598940 2761515 -1671640 -3350851
5602 -3350851 -7955375 -14835675 -15934938 -8157925 1617245 6112862 5212314 1519846
5594 1519846 -4794080 -12688019 -16998143 -13515475 -5029477 1218370 1065259 -3265322
5586 -3265322 -6102096 -3733182 1850518 4828093 2742446 196008 2244710 6256539
5578 6256539 5589266 93579 -3856836 -4094663 -5643581 -10546189 -12541056 -6882711 765854
5569 765854 1648106 -3897995 -7734394 -4682600 3577111 12975280 19732316 20290177 14336676
5560 14336676 7257311 4706140 5475102 4318128 476649 -2248380 -3072279 -5148651
5552 -5148651 -8083507 -6260621 2637542 12890115 17918831 17787301 15902416 12277530
5544 12277530 4833213 -4980102 -12606098 -15649108 -15230052 -12876388 -9359848 -6168095
5536 -6168095 -5027531 -5906225 -7699954 -10175621 -12655008 -12018632 -6007152 1785232 4910378
5527 4910378 3077052 3281162 9470171 15803847 14498321 6854321 1029829 853062 2872079
5518 2872079 3992612 5671300 9166947 12285663 13276051 13199678 11921566 6809838 -1086877
5509 -1086877 -4724524 -5854 7111458 8284701 4127983 1323779 1387673 342643 -1943208
5500 -1943208 -1237980 1639438 189752 -6291235 -9419928 -4422589 1748921 963160 -4160786
5491 -4160786 -6006364 -4164661 -3603714 -4322788 -1783734 3690994 6282012 3648095 -588745
5482 -588745 -3814811 -6863339 -8327218 -3752201 6421762 14187528 13407893 7636781
5474 7636781 4506796 5766591 7099522 5341131 1498234 -2209222 -4426837 -4070763
5466 -4070763 -833893 3404941 6035158 6925034 8111681 9788005 8893219 3437047 -3210222
5457 -3210222 -5107706 -1125711 3211053 3102857 1253250 3570818 9260267 10539005
5449 10539005 3777545 -4137196 -4280335 3086297 10304196 12775639 12374939 11654486 10328886
5440 10328886 8249351 7235905 8161537 9145317 8063954 5016632 1852544 731771
5432 731771 2454458 4481237 2536083 -2971525 -4854930 1721148 10316806 10043491 528362
5423 528362 -7474612 -7274317 -3989328 -4291070 -6420384 -5844055 -4589288 -7886569 -14908676
5414 -14908676 -19411938 -18220118 -14143194 -11455897 -12209789 -15627161 -17830700 -14031998
5406 -14031998 -4409494 4202575 5961409 2992422 816534 -388000 -4446081 -10707157
5398 -10707157 -13293916 -9489783 -3560900 -457122 264887 2065632 5815628 8870079
5390 8870079 8390184 4031701 -2175322 -7866673 -11997913 -14008318 -12154432 -5391196
5382 -5391196 2501743 4492665 -1286254 -7852275 -7810060 -2929966 -797463 -3752521 -6675556
5373 -6675556 -5659118 -3385942 -3965790 -6332402 -5697392 -114572 6451707 7778146 1906051
5364 1906051 -6312745 -10255526 -8713008 -5601825 -2838302 1854684 8568754 12414166
5356 12414166 10986453 9271737 11682652 14123844 10858703 4987728 3733843 6453682
5348 6453682 6799583 4852872 6541753 11308412 11731070 7178871 6308200 12049388 15171251
5339 15171251 8746408 -883489 -4926022 -5217027 -8027080 -12142912 -12508496 -10106415
5331 -10106415 -8715471 -6417520 -108058 5253465 2401425 -5370085 -7689257 -2776076
5323 -2776076 878190 -800046 -1720939 2543356 6901722 5732102 2150154 2318837 5818438
5314 5818438 7763877 7274732 8285052 13210626 19807778 23891616 22807365 16806670
5306 16806670 8573831 974005 -5151948 -10189655 -13499920 -13960236 -11979078 -8385227
5298 -8385227 -2366973 5994941 12334687 12147207 8232924 8342845 14310817 19410010 18670743
5289 18670743 15663990 15238838 15237803 11047413 4284049 347947 -681494 -4167657 -11950992
5280 -11950992 -18890864 -19956402 -16865054 -15474220 -18673346 -23683271 -25500478 -21768327
5272 -21768327 -14265328 -6307024 130744 4027064 3977605 275959 -2435523 1046949
5264 1046949 9003432 13314242 9482158 2155599 -1808607 -1517368 54520 1822596
5256 1822596 3457880 2311433 -2736068 -7179618 -6759738 -4989122 -7957743 -13600714
5248 -13600714 -14365731 -10103071 -9164975 -14893457 -19908293 -17588556 -11291542 -7126136
5240 -7126136 -4668887 -1192364 838455 -1945641 -6065661 -5320710 -115194 4280439
5232 4280439 6408140 8161260 7538837 425422 -10270231 -15519414 -11874888 -5097409
5224 -5097409 -395300 3352867 6993482 7058345 3409106 3492605 11727451 20009407 17101311
5215 17101311 4399516 -5952704 -7164433 -3708790 -1217138 907184 4288817 6383889
5207 6383889 4922497 2567029 2654403 3926058 3846003 4141679 8041852 13596493 14881487
5198 14881487 10062993 4118780 2400491 4710220 7560561 9873790 13541150 18754799
5190 18754799 21605873 18229584 10473535 4879378 4960519 6627832 3646841 -3832173
5182 -3832173 -9601661 -9769981 -6664618 -3554133 24392 5176066 9796080 11467239
5174 11467239 11401236 11637055 10757187 6734048 1884595 -168766 -927189 -4381535 -8616410
5165 -8616410 -7156805 128339 4888179 2296207 -1688317 -27041 4597551 5586876
5157 5586876 4297800 7298312 13756672 14986997 7620129 -1197355 -4660230 -4955806
5149 -4955806 -6673096 -8026327 -4968480 202577 1388348 -2161436 -5783997 -7540154
5141 -7540154 -9709832 -11722298 -8587927 711893 8840975 8522204 1871077 -3117883
5133 -3117883 -3115409 -1827090 -2814441 -4673421 -4248428 -1233550 2106742 3986772 4593107
5124 4593107 5442774 7693912 10325169 10332605 6117300 304622 -2698859 -1949635 -734927
5115 -734927 -1834428 -4253447 -5497007 -4969973 -3724922 -2428986 -1151904 -176711 246688
5106 246688 136899 -1179899 -5191278 -12085441 -19226048 -23005379 -22110477 -18451052 -15172916
5097 -15172916 -13858589 -13153668 -10486635 -5972556 -3451068 -5553845 -8956512 -8069728
5089 -8069728 -2873219 1704162 4521638 9860978 17639175 19268114 9694464 -1870578
5081 -1870578 -2105538 7921962 13772857 7342703 -3620508 -8225776 -6194101 -3910306
5073 -3910306 -3196423 -653982 5071438 11288163 15307274 16396932 14697340 11338700
5065 11338700 8664656 7986233 8320334 8744063 9427581 8684457 3005078 -6598551 -12291267
5056 -12291267 -8507245 -432485 2397579 -1089632 -3847536 -3173663 -5062837 -13822780
5048 -13822780 -23840930 -26151728 -19531134 -10880257 -6645652 -7413747 -9852999 -10758704
5040 -10758704 -9025676 -5687648 -2822715 -1980392 -3336838 -5778407 -7215202 -5724168
5032 -5724168 -1765291 1525921 1928001 1009405 1257053 1762492 274048 -1342938 1517923
5023 1517923 8616613 13388518 11046655 4120553 -2302283 -6580329 -8684565 -6837606
5015 -6837606 -885470 4052400 2927656 -1822608 -3613999 -1386949 26093 -950960
5007 -950960 -49839 4127305 5421417 -1014123 -9520854 -9635118 568281 12115400
4999 12115400 16094307 12573757 7682462 5536553 5162170 3433032 -827746 -5077184
4991 -5077184 -5016048 598101 7416216 9939654 8518538 8866265 13610226 17881601 15828013
4982 15828013 8443480 1337040 -2916547 -5779712 -7746643 -7714325 -7102368 -8884280 -11396891
4973 -11396891 -8791790 19847 8316265 10789286 10530188 12266924 13741379 10245325
4965 10245325 3977294 1196370 1973892 783525 -3207246 -4747063 -2409150 -1518689
4957 -1518689 -4472265 -6122662 -3162606 -865410 -4550462 -10251271 -10880086 -7306683
4949 -7306683 -5748078 -7048947 -6429130 -2543569 903514 2497540 4742096 7497898
4941 7497898 7010394 3644849 3737558 9933423 15356785 12548374 4431104 730376 5102261
4932 5102261 10962713 10311929 2869444 -4822395 -7165085 -4775677 -2442905 -2853168 -3571155
4923 -3571155 -1129862 3246589 4787768 2065943 -555258 1232949 6290321 10617431
4915 10617431 12779943 13830381 13706438 11353577 7934069 6547804 8196340 10464754
4907 10464754 10927058 9908994 9104052 9183913 9886375 11251540 13447920 15786189 16937350
4898 16937350 16334215 14921694 14074154 13698419 12122024 8738293 6030093 6838933 9371295
4889 9371295 7816687 -105793 -8673431 -10462451 -5681389 -1296632 -1369040 -3045832 -3321562
4880 -3321562 -4567027 -9440590 -13922325 -11211091 -2020097 4446369 1704526 -5545517
4872 -5545517 -7182588 -90489 8265275 8672445 467196 -7960606 -8220239 -456588 7679789
4863 7679789 10062604 8246590 7426694 8382379 7080908 2045107 -2547903 -3386471 -3610453
4854 -3610453 -7686879 -13248909 -13491467 -7351389 -1916016 -3179009 -8825529 -12684832
4846 -12684832 -12765595 -11568469 -10836191 -9685276 -7086094 -3324394 736877 3963288 5121067
4837 5121067 4313088 3262608 2659022 772594 -3250451 -6503699 -5606046 -1472518 2502393
4828 2502393 5812609 10233781 14312885 13512061 7274201 1553401 1767438 6542526 11125879
4819 11125879 13861100 15731799 15965766 12783389 7893166 5679678 6928150 7135413
4811 7135413 3157166 -1427585 -905711 4059231 6615593 3203391 -978583 964612
4803 964612 7362519 9259954 1993755 -8951708 -15356928 -15478794 -12865409 -9712669
4795 -9712669 -6220585 -4373947 -6579506 -10635345 -11245756 -7384091 -3570796 -2863454 -3412825
4786 -3412825 -3528289 -4877223 -7748647 -8065767 -3273864 2634382 4502479 3289182 3181571
4777 3181571 4147823 2868890 -565849 -2588323 -2127603 -1227931 132143 4222674 9906822
4768 9906822 12452663 10720060 9254373 10547093 10016897 2582827 -9127926 -17176144
4760 -17176144 -16785384 -9132472 1952256 12049125 16560093 13738012 7452344 3401191
4752 3401191 2324214 265551 -4188246 -6992249 -4732439 -168632 1363740 -927106
4744 -927106 -3107968 -2653034 -1492493 -2586672 -6105388 -9982000 -12320514 -12263894 -10234033
4735 -10234033 -8416533 -9188779 -11522830 -10673956 -3617678 6305699 12356312 11201865
4727 11201865 4830787 -2926622 -8824484 -10179489 -6367001 -678082 2742775 4167434
4719 4167434 6761604 9412264 6170749 -4814298 -16532720 -21061528 -18716963 -15129903
4711 -15129903 -12365542 -8245179 -2799069 431346 162629 114955 4321217 11817084 16972868
4702 16972868 14490149 4913499 -4206957 -5058233 1039881 4387612 -320918 -6287464
4694 -6287464 -4347453 3667378 8096589 5369071 789100 -1671127 -3721479 -5732325
4686 -5732325 -3736453 3408663 10766243 14832478 18150220 22513476 23599710 17570343
4678 17570343 8344190 2681902 1157135 -919200 -5863717 -11270788 -13495538 -10152254
4670 -10152254 -1426665 7960577 10832830 5175489 -2602107 -5071996 -1801150 2811127
4662 2811127 5945268 6704209 3831206 -1787290 -5014110 -1985119 4211174 7830855
4654 7830855 7967628 6923886 3966302 -3100230 -11753536 -16412580 -15701291 -12673337 -8739388
4645 -8739388 -3141304 2143726 3123401 -149351 -3395869 -4106176 -2943590 -6699 4488035
4636 4488035 6446524 1621326 -6550484 -9692179 -5973816 -1908235 -1505114 -1390488 806024
4627 806024 1193904 -3018420 -7846834 -9244206 -9541375 -11800521 -13031340 -8977158 -1420411
4618 -1420411 5141414 10302052 15083524 15861725 8208577 -4420333 -12396702 -10802282
4610 -10802282 -4084199 406865 -61481 -2643647 -2766194 971477 4517838 2824969
4602 2824969 -2348504 -2991426 4228727 12364702 13930697 11465411 12034897 15086721 13855025
4593 13855025 7036188 682216 -1455085 -1597564 -1321226 749405 2900004 100536
4585 100536 -6759354 -8831898 -1403156 8065842 9605693 3498628 -2719207 -5826989
4577 -5826989 -8215950 -10005477 -7881743 -2332469 716486 -2152793 -7016508 -8404988
4569 -8404988 -6402830 -4973529 -5600269 -5906332 -3820074 -388218 2003857 2780828 3844811
4560 3844811 7243884 12112879 14265907 10101159 1460714 -4886853 -4182613 786395
4552 786395 3084569 173397 -3468834 -2721730 2078575 7094131 10281219 11707668 10599149
4543 10599149 6346340 2025670 2345311 6952322 9819197 7258551 2907298 2013903
4535 2013903 4011658 4464535 2173262 182936 657085 2588610 4556426 6574214 8778209
4526 8778209 10555700 11172952 9673250 4929083 -2070182 -6964748 -5868058 -136012
4518 -136012 5086108 6433980 4006686 -1172822 -7603430 -11645385 -9572223 -2104850
4510 -2104850 6173453 12223286 16222561 18127792 17024824 14722101 15276798 18900670
4502 18900670 20406430 16240151 9543626 5537151 5086468 5753778 6239427 6458938 5604552
4493 5604552 3517593 2242066 3309778 5206381 6103753 6948066 9041687 11101001 12174588
4484 12174588 14844893 21018046 26545275 25380690 18281135 11950589 9440376 6885396
4476 6885396 984406 -5452310 -7797979 -5404175 -576408 4785012 8837069 9176896
4468 9176896 5735015 2205111 1907848 4089864 6462171 8625148 9869189 6641756
4460 6641756 -2779974 -12612038 -14362486 -7797078 -1790473 -2541709 -5896396 -4383749
4452 -4383749 2383586 8581580 10428922 8705667 4835072 -263444 -3871902 -3244989
4444 -3244989 -320123 135820 -1965808 -1664938 1998680 2504811 -4503101 -13231852 -15132534
4435 -15132534 -10626891 -6987404 -7109005 -7787894 -8002010 -10592432 -14566553 -13713411 -6098329
4426 -6098329 1578024 2954166 -185991 -2962444 -4672663 -6262670 -5916619 -3201236
4418 -3201236 -3053298 -8592539 -13573275 -10179523 -2248372 -1652553 -11343461 -20915303 -21316554
4409 -21316554 -15888958 -12725521 -12847713 -11651837 -7595733 -3385063 -708724 1016208
4401 1016208 1472851 -843255 -5606594 -10009183 -11355100 -9065429 -4742455 -1059855
4393 -1059855 749051 2942869 8722406 16905255 22203158 22295817 20932016 21337117 20525503
4384 20525503 14622132 6793966 4118877 7769827 11983107 12643985 11299196 9880349
4376 9880349 7208978 3075646 814304 2331271 4197793 2452858 -1249964 -1938803
4368 -1938803 2004048 7690956 11644772 11774082 7302070 631185 -1977520 3869447
4360 3869447 14270281 20360980 18345540 12184807 6191910 494832 -4182766 -3344682
4352 -3344682 4629005 12683319 12232870 4410541 -1892764 -2614892 -2605464 -6102227 -9971114
4343 -9971114 -10005676 -8308599 -8928863 -9879298 -6058932 1341052 5065038 2050988 -2664384
4334 -2664384 -4406263 -5460300 -9101393 -11629714 -6673409 4191459 11650157 10592876
4326 10592876 6517649 7297820 12654823 15864634 13651595 9832781 9346805 12390248
4318 12390248 15326030 14831414 10390382 4856207 2971196 6718388 11444549 9749041
4310 9749041 818480 -7302325 -7261477 -1260333 3059652 3030398 2627496 5016680 8604345
4301 8604345 10868360 11517675 10710188 8161497 5398390 5007021 5996549 3956666 -1892716
4292 -1892716 -5943218 -3829098 734143 892075 -4195135 -9579210 -11902058 -11610881 -8870924
4283 -8870924 -2741595 4793737 8628974 6398092 1543806 -1260852 -1401637 -1296719 -2064321
4274 -2064321 -2434549 -1237710 877976 2516753 3386482 4279428 5236072 4907023 2916349
4265 2916349 1745387 3805667 7180391 7846630 6426232 7948654 12981168 14461034
4257 14461034 7597595 -1867193 -5194702 -2669420 -902915 -880147 2370072 8524577
4249 8524577 9975329 3784025 -2600813 -1963454 2869741 4792426 2659402 469582
4241 469582 586634 3113958 8411394 14668529 16011156 9149132 39726 -2185228 2955727
4232 2955727 7464484 6638129 4368191 5210491 7026739 5083296 -337756 -4708833 -5964253
4223 -5964253 -6382413 -7631121 -7361686 -2737241 4404026 8773636 8116362 5721831 5137647
4214 5137647 5131338 2808705 -322384 318500 5458948 10669060 12431740 11472095 9345600
4205 9345600 6161621 3198470 3358707 6699037 9191768 7988348 4261912 -643211
4197 -643211 -7002485 -12553223 -12420179 -6759266 -2615587 -3609670 -3819286 2191933 9303550
4188 9303550 9504385 4591350 2219719 3070598 1942469 -786756 305134 4208341 3568119
4179 3568119 -2477391 -6114165 -3982981 -2191505 -4541406 -5961381 -3078521 -1811175
4171 -1811175 -7170104 -13317934 -11991237 -4869284 573048 2517811 3736198 3377862
4163 3377862 -807733 -4421990 -36196 11316544 20402678 22199391 20785571 20728038
4155 20728038 20745525 18543410 15898950 15089787 14302875 10560614 5093939 2525289 5228691
4146 5228691 10299636 12334849 9129019 4596776 4734612 9979704 14008217 12102331
4138 12102331 7629429 6368942 7182048 4242269 -2467102 -5965901 -3256521 -951441
4130 -951441 -5832809 -14332899 -16658229 -9292646 1500103 8161547 9443657 8480524
4122 8480524 6833862 3574426 -562004 -1524903 3247914 9662820 10152764 3217034 -3417543
4113 -3417543 -2052484 4955322 8563814 5202212 449060 85342 2785374 4164847
4105 4164847 3707759 3867875 5087964 5693398 5084759 3426654 -392999 -6475489 -10521410
4096 -10521410 -7586997 67704 3593334 -1627262 -9456974 -10644864 -4356651 2089571
4088 2089571 3600637 2396943 2093214 1748249 -990893 -4194352 -3721794 69422 2245691
4079 2245691 582165 -1068678 1358376 5999975 7592257 4189724 -1666458 -7329388
4071 -7329388 -12241080 -15783514 -16164715 -12729047 -7325888 -1962625 3489252 9741716
4063 9741716 15167472 16297042 11693829 4523498 485092 2795725 9140728 13882280
4055 13882280 13483159 9310045 4820868 1097340 -3280672 -8237767 -10337536 -6419517
4047 -6419517 1811717 8585215 9688973 6179113 2133976 37745 -396447 178325 1961426
4038 1961426 4287456 4888468 2647614 -186998 -683580 463264 -375740 -4580706 -8852194
4029 -8852194 -8713912 -3159429 4567410 9671135 9333163 5031708 1279338 583971 324654
4020 324654 -3168688 -8455943 -10580722 -8633499 -7112226 -8607311 -10000410 -8301623
4012 -8301623 -5432495 -3679595 -1061231 3913986 7051661 4519704 1320501 5982403
4004 5982403 17205687 23483845 17791423 6023994 -2187410 -5231333 -7521848 -10013812
3996 -10013812 -8841426 -2654178 3731344 4838089 1417079 -449383 2707231 6376654
3988 6376654 3011119 -7373993 -14842205 -10708563 1182920 8732932 6415374 869270
3980 869270 679943 5331530 7222207 1685224 -8177665 -15235760 -14507119 -6530488 3425112
3971 3425112 9759607 11293300 11561499 14149315 18305770 19390448 13419653 1703360
3963 1703360 -8747402 -10998178 -5477621 404224 1349191 -49389 664978 1712301
3955 1712301 -1662492 -8055989 -10669624 -7146213 -2501408 -1320035 -2637671 -3918891
3947 -3918891 -4788811 -5081911 -3990941 -2698261 -3348065 -4726050 -4236316 -4174311 -8761811
3938 -8761811 -14159078 -10755945 1297501 8623064 2539506 -8475179 -11842108 -8283502
3930 -8283502 -6705196 -8388003 -7622842 -4183760 -3533533 -5894213 -5755135 -2571250 -2464883
3921 -2464883 -7835806 -13233817 -13333431 -8642835 -2394656 2299552 2199357 -2738885 -5983723
3912 -5983723 -1278105 7212158 8962844 1556376 -6658277 -9015605 -7396267 -5218194
3904 -5218194 -2170495 1240630 1648843 -1408860 -4417987 -6879997 -11913490 -17621258
3896 -17621258 -16666966 -8216736 -1449314 -2300847 -5418345 -4962527 -4223928 -6899097 -7560220
3887 -7560220 -754506 7091848 5846910 -2620608 -7719225 -6300301 -4903863 -7226526
3879 -7226526 -9767119 -10350323 -11626396 -14513995 -16016754 -15296126 -15033705 -15189651 -11975349
3870 -11975349 -4903266 1102551 2550622 987430 -1690133 -5823602 -9959380 -9965358 -5196365
3861 -5196365 -946444 -1558023 -4564927 -4483470 242656 6117154 8151804 3656986 -4697837
3852 -4697837 -9150503 -3801009 7831901 15860910 15421615 10972445 8362846 7598989
3844 7598989 5826816 3001793 1098402 551951 554872 1015419 2158461 3802315 5922587
3835 5922587 7727893 6177287 -936764 -10168760 -15386688 -16337450 -18370873 -21726635
3827 -21726635 -18437249 -4914737 8742414 9530215 -1923045 -13082198 -15630499 -12167077
3819 -12167077 -7613763 -2391755 3689971 7719384 7903913 7154410 8683922 11060817
3811 11060817 10936935 8152027 4873122 1940099 -239667 970134 7447840 14954221
3803 14954221 15785495 8420376 279064 -1872490 -453106 -1902447 -6258890 -8149458
3795 -8149458 -6989752 -8548904 -14465361 -17608328 -12487021 -4244092 -1007681 -2004347
3787 -2004347 -1004173 1605636 -621284 -8246477 -13838338 -13328715 -10962169 -10143523 -7558467
3778 -7558467 -785364 5561115 6960941 6295684 7888414 9358691 6299193 1153012
3770 1153012 61453 3245165 5540576 5030210 4365697 4240753 2298841 -966527 -1260915
3761 -1260915 3044360 8025825 9186964 5901016 304334 -4859837 -6922337 -5107798
3753 -5107798 -2054306 -768562 -421706 1859839 5876928 8639457 9079185 8704277 8215558
3744 8215558 7401840 7568913 9603933 10256602 5260435 -4018482 -11924643 -16190376 -18891292
3735 -18891292 -20058717 -16975662 -10897477 -7675007 -9280348 -10817396 -8757580 -6126243
3727 -6126243 -5979077 -5605634 -1959945 1953597 1475638 -2262867 -4269034 -2720806 98705
3718 98705 1861076 1696235 -285704 -2067055 -804634 2583876 3214875 -427141 -2876206
3709 -2876206 674628 6933958 9418273 7445191 5092919 4190743 4027918 5638940 10273419
3700 10273419 15081127 16146052 14590489 13858690 12277718 5152488 -5878687 -12636691
3692 -12636691 -10926629 -5225805 -1191567 731948 2013409 1977584 412199 -234555 1021714
3683 1021714 798279 -3614564 -8712201 -8140678 -741936 7536644 9639839 3913720 -4957139
3674 -4957139 -10620990 -10860115 -8641641 -7136932 -5417617 -1080341 4668295 8055007
3666 8055007 7973245 6219752 2925789 -3510778 -11167241 -14154770 -9768937 -2547450 1185363
3657 1185363 115523 -2601964 -3968931 -3218316 -1501657 -1206476 -3738271 -7166913 -8400208
3648 -8400208 -7856695 -8436628 -9504410 -6917398 -895349 1691175 -3181158 -9488606 -8715387
3639 -8715387 -1573604 3602650 2733013 408880 1969210 6110321 7618338 4701320
3631 4701320 1039188 994511 4330337 6788724 6044999 5223861 8241006 13116786 14129231
3622 14129231 10701223 8977157 12491391 16244644 13845256 6708275 1582187 1486956
3614 1486956 3674430 4856145 3960347 606128 -4954784 -10253038 -11882007 -8593679
3606 -8593679 -1846969 5424718 9441376 7657782 2231963 -1559811 -2466556 -4741565
3598 -4741565 -9603577 -10755160 -3838286 4786023 6333264 3024160 4284662 11381004
3590 11381004 15549050 11800160 5230935 1621021 452365 337939 3088518 7831949
3582 7831949 8234564 1175972 -7218955 -9631957 -7135402 -5508911 -6128782 -6351469 -6027643
3573 -6027643 -7631974 -11018514 -12708302 -10056354 -3345643 4979726 10921081 10967636 6050627
3564 6050627 1133136 -1279977 -3899644 -8360147 -10645805 -7266318 -2139725 -1642251
3556 -1642251 -5402123 -7905178 -7402005 -7009098 -7874679 -7561359 -5401150 -3583925 -2066538
3547 -2066538 2126650 9083175 14419595 15269629 13346594 10235291 4494126 -3558991
3539 -3558991 -8493218 -5575193 2350335 7738985 6982027 3053028 557597 1458414 5548972
3530 5548972 11890314 18520808 22746705 23337093 21561550 18796772 13887861 4864098
3522 4864098 -6462672 -13996127 -13610824 -8822469 -7486113 -12770889 -19921845 -22306572
3514 -22306572 -17838625 -8760590 1220357 7519779 6155186 -1567711 -8036433 -6787794
3506 -6787794 348556 6685548 9280174 10124394 10590232 9900554 8648233 8523204 8044569
3497 8044569 3788389 -2851218 -5354034 -937277 4900832 5866235 2832799 377572
3489 377572 -1187697 -5050849 -10683119 -12907649 -9048330 -2928132 228429 304337 1335697
3480 1335697 5269722 9163798 8984827 4519004 -661802 -3172467 -2162337 1715176
3472 1715176 7125327 11194844 10674958 6097509 2678050 4379462 8638057 9944652
3464 9944652 7193392 3814798 1666611 -693044 -3594888 -4817646 -3747529 -2779889
3456 -2779889 -2842569 -1371310 3093464 7791395 9672772 9248562 7932043 4871444 -111357
3447 -111357 -3179845 -306134 6903347 12889747 14804510 14184414 12652499 9405428 3271140
3438 3271140 -5182260 -13736100 -18988807 -17674812 -10277878 -2887158 -2197699 -8007248
3430 -8007248 -13347127 -12940980 -8924135 -6696251 -7586765 -8364410 -6823506 -4465934 -2883294
3421 -2883294 -403870 5075498 11309440 13279458 10126289 7235754 9451585 14886203
3413 14886203 18300376 18398554 17990640 18351741 17918451 16252428 14684896 12523082 7201468
3404 7201468 -549841 -5978973 -6395496 -4115314 -2054352 -923037 -2393143 -9405982
3396 -9405982 -19976542 -25933308 -22430535 -14575276 -9958928 -8728272 -6471770 -3049019
3388 -3049019 -1783415 -2327964 -1443578 94593 -1967671 -7960714 -13346848 -15460632 -15780268
3379 -15780268 -15248118 -12896036 -9872459 -9376377 -11170427 -11016848 -7195452 -3242512 -2563721
3370 -2563721 -4239785 -5712038 -5999870 -4881456 -2359049 -232759 -999999 -4160025 -6540016
3361 -6540016 -6647727 -5525065 -3555365 -404297 2162468 2025600 1125789 3051182 6373059
3352 6373059 6285181 3081368 2219446 4933447 6094801 3291003 402697 -414182 -2075552
3343 -2075552 -4375805 -1526864 6613988 9986716 2923862 -4612319 -235013 12235759
3335 12235759 17984737 11278864 -273016 -9132851 -14563963 -16341982 -12234647 -3729828
3327 -3729828 3642937 7316582 8492152 6073495 -2161158 -11640502 -13057911 -4966418
3319 -4966418 3227891 3734337 -1074875 -5260416 -7044732 -6193966 -894932 7429609 11723534
3310 11723534 7284863 -1614451 -7346814 -7379041 -3559149 2250963 7155437 6191531 -2016278
3301 -2016278 -11198286 -13799636 -9253405 -2286375 3868876 8417593 10498314 10573099 11517411
3292 11517411 13620261 11690285 2679538 -6902930 -8042154 -1876656 1935371 -1056013
3284 -1056013 -5336608 -5182251 -2159863 -697567 -2065880 -5582710 -10891108 -15847559
3276 -15847559 -16034211 -9676500 -540528 6165069 8250503 5853567 222814 -4902281
3268 -4902281 -5085767 -1503126 -1454741 -8596992 -16263360 -15650740 -8081656 -3004323 -4682360
3259 -4682360 -7383944 -5051500 195030 2549638 1310437 649239 2439691 3762472
3251 3762472 1887861 -1441395 -2193358 966471 5274686 7107041 5723194 3512174
3243 3512174 2838659 3379798 3206177 1932388 1270652 2162017 3159858 2943018 2879334 4929766
3233 4929766 7825207 7955059 4203959 -521250 -3216752 -4011397 -4607188 -5647054 -6686274
3224 -6686274 -6665654 -3544262 3614194 10769417 11023570 3708992 -2440470 195193 7739674
3215 7739674 10938473 8821070 8029471 9472407 5927638 -4274642 -11382971 -8470231
3207 -8470231 -3199533 -6368336 -14549189 -14953020 -5038543 3933506 3586974 -1621656 -4166430
3198 -4166430 -4053615 -4354488 -3192243 2740316 10291514 11906372 4458382 -7969248
3190 -7969248 -18597283 -22018350 -16363481 -5975553 -211979 -4419713 -12457935 -13100221
3182 -13100221 -4240353 4395476 4305774 -1275585 -3723091 -1767701 -1791445 -6467999 -9894344
3173 -9894344 -6663380 -636227 337028 -4204159 -7206420 -5058359 -2348507 -3398729
3165 -3398729 -4727646 -731751 6687126 9958258 6083743 -150906 -3159836 -2211323
3157 -2211323 492200 3382659 5906690 8051795 10186348 11522035 9786929 5238426
3149 5238426 2915379 6265813 10582133 9270613 5277808 7650457 16138425 19306947
3141 19306947 11477097 1466633 -1586052 -1542259 -5871493 -11418726 -10801760 -7043185
3133 -7043185 -8970094 -15089056 -15371433 -8614989 -4649456 -7252677 -8006922 -1930621 2911761
3124 2911761 -989406 -7267459 -5606180 1774449 4024714 -1323085 -5222714 -823242
3116 -823242 7685353 11872122 9472056 5276292 3926566 4157674 1041510 -6034640 -10329382
3107 -10329382 -6406286 283366 -556594 -8156671 -9601554 1793106 15854552 19778516
3099 19778516 15213123 12318117 12871325 10230880 3051411 -2246017 -2455685 -1109782
3091 -1109782 -325191 1521613 2582662 -2502302 -12381131 -17331139 -12072905 -3021831
3083 -3021831 1612763 2136292 2757792 3083562 663086 -2435430 -2100704 1339711 4277172
3074 4277172 5171454 4314125 809911 -5487250 -10971863 -11700241 -8480925 -5000686 -2691118
3065 -2691118 -1046112 -987775 -3782366 -7874834 -10312661 -10072183 -7254932 -1421092 5748328
3056 5748328 8786564 3998437 -4903766 -10619560 -9897930 -3995404 5076096 13810153
3048 13810153 16428586 11751518 8128794 13375363 21431220 18646837 3877726 -7800660
3040 -7800660 -4514359 8502483 19050869 23396464 24895690 24306911 20069265 14373424
3032 14373424 10953924 8771607 4586225 212626 694979 6081396 11117691 12827072
3024 12827072 12619087 10893436 5672563 -2130327 -7519990 -7627235 -4923337 -2413835
3016 -2413835 294070 3939731 6471753 5882907 3410909 1258382 -411037 -1568377
3008 -1568377 44590 5844526 12464090 14673889 12104908 9883426 12006357 16739414
3000 16739414 19774829 19770560 18605987 17098740 13280095 6213714 -206270 -112641 7109233
2991 7109233 14875958 16597316 13126820 10328783 10384248 9548711 5152400 478108 -104013
2982 -104013 2315489 3458733 2911517 4213974 7896173 9169662 4621954 -2350897 -5924743
2973 -5924743 -5333728 -4225263 -3734481 -852433 5254600 9538085 6969699 -26031 -3861642
2964 -3861642 -1106343 3966264 5813729 4366595 3421501 4647213 5955390 4974428 1715102
2955 1715102 -2169759 -5052940 -6326777 -7171712 -9984523 -15353020 -20039620 -20303004 -17281217
2946 -17281217 -16240882 -19470515 -22849135 -21698349 -17609441 -15952241 -17618357 -17339251
2938 -17339251 -11182326 -2349857 2834250 2724999 1338327 2296852 4739110 5930393
2930 5930393 5610538 5954294 8137779 10622170 10855189 7770765 2741494 -1203828 -1540246
2921 -1540246 1275278 3871301 3970384 3964893 8138145 15842722 20456384 17285417 10011027
2912 10011027 5785747 5428964 3225906 -3188437 -8028225 -5412823 1758885 5638256
2904 5638256 4050024 1894526 2071748 758510 -5709399 -13616392 -15793020 -10694437
2896 -10694437 -3390173 1648531 4570250 6741317 7558741 6424387 4664460 3148179
2888 3148179 513508 -3644041 -6084258 -3731940 1348786 4424099 4574435 4634329 4990935
2879 4990935 2335618 -4087907 -9609339 -10139839 -7284321 -4261344 -260355 6589667
2871 6589667 12926771 12361963 4050917 -5319155 -8986975 -6275465 -704496 4506091
2863 4506091 7480531 6959701 2684022 -4380596 -12680187 -19764426 -22035495 -17612087
2855 -17612087 -9602749 -3489838 -738677 1663576 4599967 4120732 -2299789 -10682839
2847 -10682839 -15084983 -14234129 -10272494 -4260037 2253455 3960334 -3193530 -14015642
2839 -14015642 -17746518 -11457044 -3914510 -3165987 -5907428 -4277601 1134712 2597594
2831 2597594 -1417338 -2328849 5869586 16137269 16777199 7714407 1359051 6207641
2823 6207641 15770750 17752881 10045792 1747451 -250943 848458 -1116598 -5744034
2815 -5744034 -7722057 -5040750 -1105625 485562 -357274 -1817717 -2602733 -2189789 -754170
2806 -754170 439125 -503 -1759388 -3026021 -2734426 -1762940 -2023700 -5029887 -10612262
2797 -10612262 -16044069 -17649992 -14979275 -12061585 -12053353 -11945291 -6440656 3000663 7705088
2788 7705088 2550052 -6514025 -9236218 -3270142 4231488 6453387 4407991 3743658
2780 3743658 7217020 12357578 14855313 12118613 4480108 -4663370 -10027317 -8515694
2772 -8515694 -3357181 -1849669 -6714198 -11369349 -6963647 6590728 20130234 25703565
2764 25703565 23357911 16802910 7900599 -1095838 -4877100 -755293 5468005 5737053
2756 5737053 1090652 428740 7369499 14656950 14057857 6764882 781644 1614997 8437603
2747 8437603 16332197 19526830 15102652 6150838 -898021 -3741882 -6085735 -10705291
2739 -10705291 -15092614 -16761136 -17977053 -20765207 -21670639 -17425359 -12373793 -13081976
2731 -13081976 -17380193 -16508169 -8148733 273427 2781340 2041049 2231381 1218310 -5031109
2722 -5031109 -14257621 -19431927 -16813561 -8931654 -1068938 2440812 410706 -3583034
2714 -3583034 -3487542 2184208 7197645 4927325 -2513952 -6579791 -3350264 2009390 2762412
2705 2762412 -1259508 -5132644 -5766800 -4621339 -4612584 -6558703 -8543306 -7530570 -1910151
2696 -1910151 6442317 12878878 13841183 10035073 5075959 1496877 -505886 -710902 2104705
2687 2104705 7187379 9956260 6425630 -722063 -4011746 -638587 2941978 -1216674
2679 -1216674 -12117512 -20916325 -21786561 -17347248 -12350517 -6710958 1528618 9362815
2671 9362815 10557255 4614551 -697291 1560631 8644212 11773832 7418070 1056139
2663 1056139 -903399 872876 1493769 207199 1365645 6665731 10728994 7513221
2655 7513221 -920962 -5909389 -2665776 4072886 6755797 4952786 4942008 9512742 12563397
2646 12563397 7181904 -3400627 -8348022 -3254234 3913877 3984925 -1306348 -3815848
2638 -3815848 -1874791 -1019534 -3101361 -3401549 -227987 1023951 -2837306 -7064295 -7723272
2629 -7723272 -9031073 -15022017 -20244072 -17644011 -11013460 -9311910 -11445367 -8194031
2621 -8194031 985087 5049058 -1871294 -11456064 -13884996 -10677193 -8845841 -9577721
2613 -9577721 -9630278 -8547787 -7531819 -4883860 1216864 8224682 12755713 15830149 19837963
2604 19837963 23276781 23386334 21172347 19013398 16211714 11800279 8459943 7976508
2596 7976508 5950058 -2255455 -12353198 -14994487 -8143470 704023 4486071 3094479
2588 3094479 115619 -1491854 -393712 1672046 -23546 -6963619 -12745789 -10568725
2580 -10568725 -3827142 -1924728 -6050208 -7363890 -417179 9837383 16695820 19360887
2572 19360887 18675262 13157364 4327003 -740221 1744661 5929818 4758788 436949
2564 436949 143245 4706532 8521432 9059392 9568642 11920910 12455053 7024842 -3012843
2555 -3012843 -11839081 -14985634 -13221101 -11020454 -11353064 -12556354 -11385755 -8125755
2547 -8125755 -6148925 -6939243 -8895546 -11014418 -13749264 -15657027 -13719017 -8512479
2539 -8512479 -4834317 -5408951 -8031912 -10544362 -14066298 -19305600 -24364005 -28354194
2531 -28354194 -32335116 -34760459 -31821777 -24666392 -19745695 -19319708 -19192984 -18739234 -23102074
2522 -23102074 -30695647 -31548796 -27399138 -38512375 -72699951 -98315361 -73345642 -1649809
2514 -1649809 63232740 77680513 52503890 28398138 25150160 31439830 33004412 30273480
2506 30273480 29070651 29599066 29245188 27913271 26639691 25199632 23042776 20120772
2498 20120772 16568627 13331818 11950601 12062425 11220752 8861421 7437735 7700205 6850267
2489 6850267 4138689 3657435 7510291 10767347 8510448 4000483 3676848 7084526 8571317
2480 8571317 6946981 6166312 7156267 6326066 2898662 853167 1652984 1074579 -3790481
2471 -3790481 -9184353 -9808055 -5889747 -1690818 728489 2794865 5405468 6667283
2463 6667283 4474281 33937 -2710435 -1894352 -691775 -2896738 -5985881 -3218759
2455 -3218759 5348551 9337739 760220 -13579505 -19451895 -13269176 -5129017 -3788571
2447 -3788571 -6854788 -8441239 -8788627 -10977766 -13351212 -11399497 -4749577 2618035
2439 2618035 7523943 9040922 6564854 724176 -4625316 -5289064 -1656387 2187320
2431 2187320 3985087 4988612 6184058 6005391 2892033 -1878408 -5108657 -4675635 -1399890
2422 -1399890 1426601 816491 -2703280 -5303335 -4178577 -467739 3491033 8026886
2414 8026886 14552439 21278762 24169721 22384943 19258754 16860872 13141661 6656012
2406 6656012 1045503 1382937 7573892 14651276 18712365 19253997 16337648 9885055 2834607
2397 2834607 560031 4074933 6813197 2079669 -7907770 -14559882 -13931340 -10726304
2389 -10726304 -10427382 -11842584 -10382559 -5947060 -3692106 -7343971 -14509236 -19288543
2381 -19288543 -18216690 -13013808 -7929224 -4922755 -2258819 1721094 5118700 5121214 3085978
2372 3085978 3296100 6362943 7992070 5640625 1992451 -456396 -3346185 -7226945
2364 -7226945 -7553932 -1984327 2421382 -2594876 -12968890 -15999915 -7992856 889917
2356 889917 1972784 -718656 318797 3582882 3098048 153293 1341690 6729283 8620695
2347 8620695 2996016 -4731396 -7509874 -4879385 -824355 2244914 4046267 3985186 1915799
2338 1915799 59703 952570 3644360 4439058 1891036 -944096 -489144 2395845 3456345
2329 3456345 1108687 -709500 2613489 9905354 14902178 13138062 5853873 -3006695
2321 -3006695 -10758816 -15730216 -15993973 -11247314 -4913310 -1797707 -3428734 -6960215
2313 -6960215 -8686798 -7858692 -6973511 -8366684 -10447033 -8569727 -1231796 6116392 6776543
2304 6776543 1593608 -2479265 -2842957 -4396271 -9966410 -14027008 -11020605 -4842219
2296 -4842219 -3269740 -6216797 -6986915 -3536466 -584214 -406145 678811 4711898 7811183
2287 7811183 6586002 3306388 1190837 -778471 -4420304 -7439187 -6141349 -834047
2279 -834047 4801269 7977656 7997132 5277424 1746705 514875 2902777 6946450 9863850
2270 9863850 10221505 7530682 2938787 552649 3460154 7576459 5402538 -2077491
2262 -2077491 -4655022 1639303 6431590 63100 -10205316 -9928750 569046 6531529
2254 6531529 697890 -7703997 -8883193 -5808590 -5542513 -6625897 -3474270 2479707
2246 2479707 4542934 869826 -4189731 -7434898 -9790325 -12490378 -14568851 -13947880
2238 -13947880 -8739633 746666 9333129 9887529 2245106 -4708882 -4346342 -1610223
2230 -1610223 -5007798 -12815842 -15098409 -8055475 1666563 7217398 8499485 7620917
2222 7620917 4728195 1002384 -384529 610206 -104211 -4122966 -8039803 -9886465 -12287678
2213 -12287678 -16228094 -17916225 -15935318 -15214526 -18495372 -19886323 -13945833 -6253028
2205 -6253028 -6525853 -14165269 -19254144 -16622535 -10636546 -6220756 -3232881 -843139
2197 -843139 -106474 -181947 1715504 4657713 4198100 23384 -2715339 -1939358 -2206140
2188 -2206140 -6745152 -12012254 -13765458 -12695669 -10056982 -4023192 4274510 7334042
2180 7334042 1309609 -5214516 -1125526 11090916 18101663 14027016 6999527 5773314
2172 5773314 8206127 7475321 3547036 2191431 5203907 7539156 4792812 -299601
2164 -299601 -1255417 3321842 7025968 3405449 -5310697 -10927663 -10713850 -11005184 -16786396
2155 -16786396 -22941985 -21432097 -13531119 -7596096 -6175602 -3623686 2524287 6294264
2147 6294264 3239974 -1417872 -575960 3746709 4300205 940862 1349934 8943146 16863670
2138 16863670 17071211 10759063 5510181 4753480 4968309 2851295 105336 -928087 -2167162
2129 -2167162 -6216905 -10452100 -10114207 -6771914 -7542865 -14177263 -18970504 -15413719 -7721597
2120 -7721597 -4151843 -4728790 -2682163 3724338 8383354 6879155 2249697 -627516
2112 -627516 -1276018 -2270635 -5759658 -12701055 -21503090 -26476608 -22349990 -11767494 -3568652
2103 -3568652 -2076394 -3206663 -2896459 -3073037 -5830848 -7935219 -6405002 -4666458 -7120090
2094 -7120090 -11204840 -11158970 -7141307 -4281175 -4278312 -4317143 -3671766 -4964957 -8113691
2085 -8113691 -8829823 -5178546 -1112076 -822501 -2796414 -2532929 447001 1274130 -4196931
2076 -4196931 -13563085 -19766155 -19301102 -16779577 -18834591 -24489715 -25833946 -19144177
2068 -19144177 -10572437 -7870918 -10464190 -11892600 -9387274 -6455328 -7201281 -11791475
2060 -11791475 -16834368 -17839475 -12926798 -6253361 -4986621 -10063134 -13469120 -8649893
2052 -8649893 149009 4336693 3525707 4798519 11042982 17143413 17946673 13936274 8355378
2043 8355378 3890595 2582152 4091119 3998558 -1162906 -7478310 -7801523 -2063405 2825593
2034 2825593 3490920 3413936 4543491 3135650 -2996058 -9497136 -11478360 -9461661 -6151413
2025 -6151413 -2176922 1738787 3060953 1297177 -388479 -11133 994920 2288073
2017 2288073 5896982 10441378 10396534 5012022 1678155 5324901 10346740 9288426 4462081
2008 4462081 3609362 7591782 10065227 7586098 3080621 -13593 -1100425 -148932 2993352
1999 2993352 6979255 10061462 11762538 10763574 4202515 -6785498 -14335968 -12314601
1991 -12314601 -4733414 335799 2352398 6347423 11525000 11045370 3730466 -2816949
1983 -2816949 -3210926 -767625 155605 1040274 3863215 5201421 1871671 -1728641 1318108
1974 1318108 9877644 15487675 13585405 8563695 6242379 6021503 3831499 -56930
1966 -56930 -902093 3074892 7828742 10088949 12606742 18568392 23851586 21232493 11586788
1957 11586788 3865063 2691867 3173328 760341 -1368028 293876 1931355 -853548
1949 -853548 -4375036 -3015024 410997 -686176 -4857323 -4907970 -72192 3780466 5187828
1940 5187828 8272780 12486693 11381435 3691077 -3655154 -6291790 -7570935 -10249804
1932 -10249804 -11859836 -11680118 -13323484 -16243015 -13811366 -5070893 747700 -1999735
1924 -1999735 -5845338 -2501689 3276627 1889506 -5052574 -7395236 -1537692 6903000
1916 6903000 13087699 16541634 16460704 12000844 6382221 3450029 1608881 -2069921 -4678978
1907 -4678978 -2671987 -935843 -6156261 -13069910 -9608326 3736577 12574452 9730918
1899 9730918 4943927 7630570 11896120 7746560 -1963797 -6587068 -3986310 -1276348
1891 -1276348 -2374471 -4238174 -4029137 -1921604 2367978 8749219 13383717 12958903 11239163
1882 11239163 14127580 19215576 18644379 12413838 9217664 11676242 10656940 -239654
1874 -239654 -12869269 -14910423 -6475638 1708781 3139797 499114 -2157134 -4063137
1866 -4063137 -4771438 -3636174 -3032440 -6017198 -10045672 -9048364 -2820331 1863292 1197625
1857 1197625 -792896 377793 3772459 7539183 12668210 17881247 17172065 8314954
1849 8314954 -1494550 -4922387 -4589905 -6729955 -9432637 -6285478 1161329 4580592
1841 4580592 1809226 -1116509 -1462569 -3535360 -8625979 -10657519 -6135559 -530650
1833 -530650 367599 -1057961 300115 3949275 6441306 7650290 8912213 8881769 6650530
1824 6650530 5486686 8011734 10668261 8543149 3259788 452989 1143750 1224545 -1345088
1815 -1345088 -4089226 -4817931 -4531835 -4894182 -5833504 -6100900 -4333951 -51552 4850449
1806 4850449 6842641 4653628 882802 -1672654 -3106190 -4348671 -4829818 -3946671 -1756956
1797 -1756956 3352452 13345586 24469546 27761074 19767838 8090737 1570796 -216275
1789 -216275 -2146199 -3601780 -1261771 1948514 -89864 -6216835 -9623105 -9757452 -13343755
1780 -13343755 -21704911 -25851942 -18566066 -5165933 2683407 101959 -8089106 -14698142
1772 -14698142 -16414027 -14003784 -9698526 -5286881 -1960118 -1002681 -3112588 -6509508
1764 -6509508 -7654067 -5277327 -2032059 -926363 -2204768 -4706063 -7186637 -7079375
1756 -7079375 -2133347 4748249 7208474 4623284 3908637 8597743 12728294 10846367
1748 10846367 7248788 8136493 10665555 8141612 1087838 -5381043 -10362021 -14434328
1740 -14434328 -13414858 -5245327 1596202 -1798770 -10013802 -10995254 -5283643 -3973868
1732 -3973868 -9445382 -12835630 -10834382 -10283755 -14025917 -15906910 -12914312 -9894066
1724 -9894066 -9416769 -8778376 -8980240 -14084582 -19805497 -16368859 -5222251 1152353 -1241229
1715 -1241229 -3563550 -2281774 -4899756 -12649760 -14929025 -8229174 -3787627 -7965377
1707 -7965377 -11502047 -7738078 -5116708 -10657650 -16519058 -14678367 -10563937 -10752688
1699 -10752688 -11379772 -9587850 -11425535 -17598052 -17608164 -9118511 -5591748 -13588778 -22289834
1690 -22289834 -26780013 -37633886 -54015027 -56596213 -45448076 -50849649 -81494648 -101765064
1682 -101765064 -96543047 -112435564 -175476629 -207035588 -106935430 89544769 226821222
1675 226821222 217265536 134428740 88894770 89340700 79335299 48124056 31772877
1668 31772877 37109042 34799907 17979282 11127129 21861591 29814154 25743853 23476183
1660 23476183 29335096 32540454 30172524 32869839 41239664 42077844 32416858 24751049
1652 24751049 24865589 25292019 23203891 24344113 26791781 21069055 9503117 6190073
1644 6190073 14303452 21867169 23221883 25880965 31894212 31298763 20516322 10428351
1636 10428351 9043541 10814007 9638387 8612816 10458935 11168375 9341078 9946628
1628 9946628 13452256 12907407 6623611 1866818 1424275 -1037736 -7347896 -9586648 -4503410
1619 -4503410 -495071 -3050095 -4965340 1140101 11103650 17725405 21230505 23718315
1611 23718315 22536084 16928530 12805459 13542298 14019629 10413139 7427266 9044099
1603 9044099 10934951 9451693 9234307 13527585 15481773 8711290 -533414 -1654652
1595 -1654652 5239387 11691790 13543949 12558349 9703857 5397834 3214343 5734424
1587 5734424 9440201 9926590 8587001 8286101 7115228 3247656 1247717 5688671 12254477
1578 12254477 13235512 8998939 6113140 6336230 5421163 1734564 -1329373 -1511536 -309948
1569 -309948 686469 1431505 1666161 1252269 1348531 2211285 1682914 -1156973 -3405533 -2509223
1559 -2509223 -7577 1959262 4088302 6367753 5599695 998319 -2132684 410870
1551 410870 4834764 5163886 2088745 -68801 -1636480 -5901078 -11503725 -13476828 -10932242
1542 -10932242 -7924168 -7211201 -7766079 -7530524 -4723216 1975396 10721145 15870589 13630320
1533 13630320 6399490 -1073996 -6536965 -8763964 -6301775 -1477445 -289978 -3857252
1525 -3857252 -5753087 -2551061 326844 -390386 2313470 13206666 22100181 16568933
1517 16568933 2131347 -4607152 -423658 1846717 -4813647 -12252044 -13064056 -11821792
1509 -11821792 -13928357 -14744760 -8413310 273657 1662161 -5086145 -10931476 -7690573
1501 -7690573 4326422 17668987 24067419 20991022 13235099 6765790 2159748 -2944235
1493 -2944235 -7338464 -7773754 -5691118 -6026428 -9546161 -12574782 -14029307 -15972356 -17228644
1484 -17228644 -13867715 -6791915 -1475901 925520 4754399 10902082 14544366 13642688
1476 13642688 11779526 10318284 5992516 -781703 -3586726 113924 4519194 4905289
1468 4905289 3904794 4504787 5037940 5719117 11257701 20941489 25042462 18780747 11620023
1459 11620023 13548838 19486094 18127680 10575253 7802923 12464046 15848767 13134348
1451 13134348 9998993 11105809 11578721 4969970 -6514960 -14774269 -15279753 -9986694
1443 -9986694 -2999098 3411905 8844666 12563124 12333928 6776300 -881642 -3925131
1435 -3925131 903154 9284216 14200149 13328911 9606196 6238847 3589829 -5206
1427 -5206 -5928949 -12813820 -16137155 -12678186 -5431339 -362788 1929450 5992416 11888005
1418 11888005 12943869 6858569 1961463 6174745 15278493 19515367 17717813 16647474
1410 16647474 18711146 18998412 14596618 9479568 8473246 11339076 14153029 13186294
1402 13186294 7327075 -459241 -4987060 -4815834 -4160577 -5840620 -6200930 -2159036 688536
1393 688536 -5425353 -17728471 -24664434 -20266927 -9745970 -599473 4661067 6083183
1385 6083183 4002287 1600123 3547681 9238336 12300886 9150782 3258217 -1187383
1377 -1187383 -4655880 -8311015 -9484865 -5431703 1232081 4917243 3890392 2030597
1369 2030597 3892276 9208985 12716545 10261021 5082489 5095504 12209838 18415747 16306363
1360 16306363 9174470 4741828 2966546 -1447982 -6953247 -6074777 1161184 5246024
1352 5246024 1324593 -4402720 -6256249 -7411821 -11034185 -12202081 -6619634 -275012
1344 -275012 -1269047 -6747875 -7187584 -851169 4972070 5958994 5431211 6260938 5365264
1335 5365264 -1059132 -11178499 -18757905 -18761219 -11367088 -2244281 1823242 -481808 -3976453
1326 -3976453 -4117325 -2542065 -2824393 -3977434 -2532926 1306587 4494563 6461798 8611090
1317 8611090 9828087 7945949 5028392 5471396 8700792 9560936 6899451 5793758 8997859
1308 8997859 11704622 8503986 1486591 -2767781 -1733915 1371700 2763859 1349016
1300 1349016 -2317502 -7045400 -10879937 -12239867 -11449483 -9741639 -7091579 -2650601
1292 -2650601 2988918 7781296 10498270 11279433 9902974 5835578 820164 -1305251
1284 -1305251 273543 597064 -4809704 -11818583 -11129524 -1398016 6556234 3055918 -7109912
1275 -7109912 -11119830 -5608627 273134 -338934 -2916664 -1139707 1979310 -472042
1267 -472042 -7273330 -10335543 -6507214 -1176589 -13202 -3081091 -7966220 -13099548
1259 -13099548 -15976133 -12972330 -4281455 3875792 5134625 -173733 -5812037 -6009844
1251 -6009844 -22492 7881952 11689036 8531120 1726315 -2273541 -861758 2272283
1243 2272283 2337371 -1161169 -5649546 -9663986 -13119819 -14958104 -13906810 -11507135 -11320397
1234 -11320397 -14132757 -16262672 -14171957 -9119539 -5301507 -4322088 -3804017 -1452926
1226 -1452926 1875550 4194518 5529105 7171575 8899910 9091494 7245798 4404131
1218 4404131 1283373 -1772440 -3049602 -643787 3717705 5209457 2362926 181675
1210 181675 3602568 9809547 11197658 5523749 -1133447 -2494754 623154 3292793
1202 3292793 3757890 4329366 6340513 8006705 7938129 7673008 8650904 8625055 4244833
1193 4244833 -2916072 -6181244 -1456395 6907663 10459210 6055230 -1369666 -4903919
1185 -4903919 -1968405 5256080 12486518 15382494 11804251 4151158 -1954210 -2802133
1177 -2802133 512298 4660524 7458369 7956628 5920760 2980626 1931878 2857461 2177601
1168 2177601 -2219899 -7323921 -9326893 -9291973 -10751434 -13243203 -12688107 -8020187 -3301587
1159 -3301587 -2306336 -4151576 -5510897 -4735302 -2468395 84604 2138536 3289530 3191932
1150 3191932 1369640 -1963591 -4800064 -4918759 -3482986 -4472838 -8477837 -9906307 -3894850
1141 -3894850 6094075 11769613 9820737 3959818 -1653587 -5900474 -7933324 -6698879
1133 -6698879 -4549018 -6188350 -11808223 -15518973 -12991135 -6845391 -1955029 885201
1125 885201 3503255 5745355 6055464 4882952 4332465 5257700 6622899 6690699 3791422
1116 3791422 -2134290 -7700194 -8457187 -4705413 -2081963 -4389636 -8878821 -11114580
1108 -11114580 -11246132 -11905545 -12562191 -10332616 -5140029 -171202 2262924 2263752 490253
1099 490253 -2298295 -4465904 -4845273 -4111499 -2708967 854619 6771153 11044017 9935200
1090 9935200 6060393 5508033 9313591 12469791 11710288 9529900 9198068 10058714 9757458
1081 9757458 7664365 4040241 -1156946 -6533116 -9055949 -7776748 -5422420 -4311395
1073 -4311395 -3123511 130620 4496880 8130151 11662015 16314262 20437181 21522918
1065 21522918 20532441 20385653 20643786 17933569 12334348 9079826 11536926 15538062 14028534
1056 14028534 6112166 -1571423 -2482212 2982461 8538837 8098255 429414 -10211993
1048 -10211993 -16802978 -14542496 -5485273 2082820 1245339 -5853462 -10002117 -6020721
1040 -6020721 269754 -926889 -10545350 -19026778 -18391420 -11602605 -6840803 -6056479 -4545239
1031 -4545239 -484828 1704206 -747061 -3515914 -1671373 2527648 3445951 962075
1023 962075 -487298 -540399 -3671599 -10231910 -13458455 -8802215 -928502 2977385 2683903
1014 2683903 2653422 3772916 3446314 1960710 2273922 4006952 3964014 2862790 4867834
1005 4867834 8982692 7927889 -1011119 -10315776 -12257066 -9248025 -8105013 -8450359
997 -8450359 -4925881 1108785 1417944 -5956484 -11686875 -7912991 -25826 658107 -7264040
988 -7264040 -13975782 -12741176 -8487352 -9115072 -13629806 -14575996 -9953139 -6039425 -7382168
979 -7382168 -10076285 -8593406 -4532599 -2968576 -2987892 1032399 8977701 13156144 9191730
970 9191730 2454796 -154620 567615 189688 -511351 2565211 8344823 10971633 8782634
961 8782634 6941035 9884352 15981412 21320737 24563425 25874380 24557593 20463985
953 20463985 15564281 11903523 9417656 7045040 4253314 412190 -5116748 -10662114
945 -10662114 -12119241 -7470278 -363833 3001675 505314 -3645178 -3463602 2449727
937 2449727 9215992 10673094 6122303 787151 -1193194 -1811880 -4704815 -8128032 -7267815
928 -7267815 -2687509 -396763 -2118760 -1590293 5857508 15090682 17699422 13430446 9441700
919 9441700 9923101 12199537 12821632 12090155 11458221 10811340 9982687 9672519 9333078 6919060
909 6919060 2100128 -2771028 -5885905 -7376235 -6593266 -1796165 5265112 8378843 4404945
900 4404945 -925679 494572 8251722 14165434 13713207 10943189 10329564 9606583 5157683
891 5157683 380938 2207900 10317373 16226152 14572558 9842964 8723703 10272837
883 10272837 8765076 3804465 1249095 3459593 4357198 -2506640 -14451349 -22488584
875 -22488584 -22321392 -18327328 -16143622 -15192445 -11205317 -4098504 454314 -1959392 -8562485
866 -8562485 -12584473 -11117549 -7179892 -4173465 -1571782 2167443 5118992 3739512
858 3739512 -1640432 -6602124 -8260723 -8059468 -8075061 -7664659 -5706268 -3538342 -2916436
849 -2916436 -2770189 -975139 1728097 2735715 1996472 2085789 3673226 4352666 3002960
840 3002960 1924526 2641668 2596695 -912998 -5539849 -6297489 -2415152 1740726 2655810
831 2655810 1206049 -520703 -2566701 -5409005 -7492330 -6883169 -3895047 -56629 4082938
822 4082938 8007634 9646288 7576594 4020411 2749383 4327556 6244768 7497946
814 7497946 9667376 13007395 15082381 14723778 14122368 14972209 15360779 12975290 9057594
805 9057594 6395635 5208734 3830476 1935343 272328 -1303003 -2464406 -598086
797 -598086 5901486 13410073 16182209 13456482 9537219 6986674 4378857 1338769 348918
788 348918 1337126 -244275 -6107397 -10379559 -7415821 -1191811 -405816 -5328786 -6597614
779 -6597614 1340481 11838776 14911682 10164419 5903908 7513150 11940111 13609325
771 13609325 11063524 6301118 1373858 -1824778 -1147616 3280818 7731773 9136247
763 9136247 9453612 12289786 15967064 14515381 6446232 -1870227 -3843010 -2747 5156210
754 5156210 10079187 15440882 18784070 15473389 5498863 -4862751 -9638110 -8822041
746 -8822041 -6539294 -5952303 -7190122 -8585008 -8669628 -7561237 -6667105 -6729998 -7041396
737 -7041396 -7329651 -8741807 -11390707 -12877268 -11444837 -8503372 -5479825 -1053477 4706930
728 4706930 6832689 1906855 -4533015 -4408276 400610 501144 -5997763 -10695502 -9266763
719 -9266763 -7960064 -10667852 -10002757 190621 11806907 12697392 4429937 -1372199
711 -1372199 -851002 -189293 -1671049 -255017 4299919 4074557 -3524364 -9020724 -4163355
702 -4163355 5713488 9823419 6667051 3120105 2916800 3978512 5127243 7570514 9460913
693 9460913 5829537 -3791675 -12408577 -13174537 -7279832 -1656009 -440097 -1368115 -364155
684 -364155 2814912 5163932 5616697 6810440 10284122 12309208 7913429 -1599880 -9108975
675 -9108975 -10467463 -8949051 -8976560 -9377288 -6674699 -2356085 -1739845 -6022207 -10124796
666 -10124796 -9559000 -5764987 -2952702 -2815251 -4795880 -8908175 -14623801 -18119791 -14859637
657 -14859637 -5906870 1561106 2049067 -2159545 -5077682 -5341569 -6938274 -11968438 -16551028
648 -16551028 -15552162 -8831028 -779231 4622916 6323895 5250445 3252887 2561915 4458022
639 4458022 8401940 13028203 16880498 17481051 12050581 1552227 -7722754 -9852857
631 -9852857 -5971824 -2298801 -1910117 -1860494 1065483 5137539 5908808 1551545 -5691225
622 -5691225 -12206931 -16058118 -18056423 -20198386 -22408604 -21467915 -14839697 -5072377 1968105
613 1968105 3457798 1953393 1003977 914521 -37744 -2225264 -4085582 -4006056 -2022777
604 -2022777 -247664 -1310610 -5094307 -7732998 -6028144 -2260868 -1601528 -4708913 -6402014
595 -6402014 -2648538 4401727 9717850 10558560 6769511 -564594 -8117695 -10924742 -7318981
586 -7318981 -1402749 2303146 4725394 9481195 16025944 19658735 17816906 12499979
578 12499979 6401234 560950 -3313362 -2288757 3560170 9231029 10307224 8783229
570 8783229 9857296 13420663 12933218 4566494 -5846188 -8635679 -1823606 7078599
562 7078599 10912032 10387010 10156207 11418232 11923939 10658212 8226276 3942379 -3000668
553 -3000668 -9736268 -11439838 -7591725 -2992311 -1717417 -3302308 -5532160 -7229516
545 -7229516 -6958678 -2833301 4002851 8641775 7722293 3425929 135399 -844928 -1116843
536 -1116843 -1523897 -1022711 1437743 5198332 7709871 6388355 2133687 51448 3750282
527 3750282 9595293 10572389 5650424 456644 -1739568 -3757007 -7467161 -9465092 -7314725
518 -7314725 -4345721 -3763164 -3240075 -510841 759719 -2923215 -7152044 -5331783 733458
509 733458 3557388 1486890 -287635 386734 -381839 -4626962 -8546554 -8486540 -5473499
500 -5473499 -1936390 1328241 3337376 2631527 455854 91024 1571665 1102712 -2954208
491 -2954208 -7594132 -9960064 -10451578 -9728338 -7138808 -4012077 -3988632 -7497414 -9912027
482 -9912027 -8026541 -4725396 -4160429 -5609377 -5605371 -3539996 -1475682 -51031 2070185
473 2070185 5408887 8695129 10173443 8647724 4417974 129759 -1090339 534356
465 534356 1428828 -380819 -2638923 -2650167 -1224615 -808202 -1788762 -2961547 -4054746
456 -4054746 -5455102 -6404135 -5400269 -1911173 3259533 8383548 11118626 10072330 6780119
447 6780119 4365909 3635377 2604100 410806 -1159963 -1183343 -1506751 -3318205 -4761374
438 -4761374 -4336190 -3921827 -5427255 -6639824 -3929062 1972082 6021631 4473423 -1636571
429 -1636571 -8095936 -10906955 -8855654 -4390652 -1356887 -815768 -319445 1814507 3786601
420 3786601 3710989 3318878 5280967 8373867 8682817 5093874 592295 -1829734 -1890747
411 -1890747 -548935 1488737 3017474 2336594 -620155 -3388250 -3463839 -1190322 706261
402 706261 286848 -1579580 -2558534 -1635272 290782 2469110 5403039 8930822 10759246
393 10759246 8948411 5044860 2493656 2411685 3327635 4636592 7206419 10302658 11238976
384 11238976 9263946 7016061 6686305 7087656 5981771 3289276 668943 -349525 1085906
375 1085906 4564973 7630580 7549991 4486952 1107990 -815039 -1050079 990321 5077460
366 5077460 7697138 5576254 1740017 2400223 7043975 8310070 3829658 721495 4102808
357 4102808 8321820 5924835 -494648 -3025009 -941709 -352242 -3546269 -6559961 -6734500
348 -6734500 -5753112 -4912451 -3342827 -1531939 -1494996 -2803963 -2907264 -1830715 -2392394
339 -2392394 -5275424 -7592250 -6740651 -2660886 3416794 9422793 12356895 10845440 6972863
330 6972863 3086430 -1118490 -5379876 -6126475 -1587567 3589886 4568599 4219809 8036597
321 8036597 13681634 13708911 7597045 2601845 2504376 3845782 4119986 5067288 6017604
312 6017604 2713591 -4071925 -6919537 -2856752 1346079 -379870 -4562900 -5172964 -3234354
303 -3234354 -3200127 -4553723 -3551272 -149598 2526001 3227836 2333124 -1001635 -6849678
294 -6849678 -11750933 -12127425 -8807339 -4923422 -1591931 1123714 1689147 -664767 -3391724
285 -3391724 -3919193 -3523693 -4656259 -6480006 -6400153 -4236569 -1824738 -81950 1040966
276 1040966 1491407 1904627 3057633 3059040 -1339486 -8702541 -12656451 -10555319 -7591505
267 -7591505 -8435664 -9812182 -6594593 -799829 1855154 1109708 1176449 2713858 2345810
258 2345810 -893275 -4544405 -7425973 -9980626 -10669792 -7313217 -1628777 2365129 3957357
249 3957357 5267046 6203630 4891248 2332375 1504533 2240514 1898429 540153 411900
240 411900 961932 -172469 -1701535 -75706 3659405 4462673 1376079 -892240 570454
231 570454 3592707 6172479 9005675 11174061 9477586 4503893 1562450 2645861 3022879
222 3022879 -652494 -4123950 -1809632 5019799 11003833 14137573 15610952 14920965 10394369
213 10394369 3523797 -1625272 -3243905 -2897210 -1988916 150938 4198810 8502688 9525604
204 9525604 4857160 -3361032 -8527990 -5392439 3757211 10892706 10720382 5024216 -1580795
195 -1580795 -6660303 -9425361 -8924615 -5562523 -2111092 -635727 -55729 1202106 1933053
186 1933053 -82942 -4221658 -7147029 -6432649 -2744487 1224091 3246316 3271903 2729034
177 2729034 2069631 413569 -1499879 -760812 2633075 3334371 -1897451 -6977991 -3661332
168 -3661332 5238330 8224883 1774963 -4424099 -2383173 2798800 2386941 -2543557 -4858843
159 -4858843 -3318365 -2407162 -3395058 -3613477 -2926022 -3493710 -3929967 -536626 5839487
150 5839487 10365014 11552250 12098794 12396391 9482604 3476561 -760575 -207278 2781952
141 2781952 5021790 6077964 5808693 2924229 -1755342 -4363702 -2634126 1313775 4296271
132 4296271 5242482 4033411 793591 -2038250 -517342 5658556 11630859 13063499 10802779
123 10802779 8134572 6228504 4450833 2668265 917504 -1218995 -3073754 -2957151
115 -2957151 -1490815 -2160577 -6216616 -9752487 -8911020 -5688007 -4944969 -7325960 -9217117
106 -9217117 -8965718 -8784495 -9998666 -10499536 -8722079 -6982481 -8130834 -10733868 -10696646
97 -10696646 -7255883 -4403807 -5428154 -8350760 -8794805 -6097271 -3878676 -4475609 -5536343
88 -5536343 -3547494 1245897 5487308 7139887 7156010 7228594 7817482 8353695 7920863 5826358
78 5826358 2699969 699884 1467337 4333439 7469236 9709613 10034902 7036056 1177032
69 1177032 -3837881 -4658254 -2236003 251868 1729436 2305089 270855 -5090286 -9158409
60 -9158409 -6598629 -253603 1314479 -3592356 -6855950 -2994160 2771915 3756652 2388382
51 2388382 4531276 8158488 6098705 -2215708 -9819733 -12351718 -11709885 -9554541 -4828146
42 -4828146 598910 1092988 -4400450 -8775167 -5696033 1972761 6787445 6545456 5133938
33 5133938 5635957 6883578 6265712 2792029 -2468675 -6920072 -7963993 -5703672 -3233424
24 -3233424 -2674514 -2304521 372341 4121087 5090988 1581139 -4682366 -11150749 -15743747
15 -15743747 -16418741 -12723982 -7737255 -5298061 -5016552 -3294618 164232 883544 -3449220
6 -3449220 -8419609 -8649618 -5375503 -4074241 -6056844 -7138873
0 -7138873
##END NTUPLES=NMR SPECTRUM
##END=
