##TITLE=31Pdec_BAU-j-1NO2
 CDCl3, 24 sc
 1.7.2019
##JCAMPDX= 6.0         $$ Bruker NMR JCAMP-DX V2.0
##DATA TYPE= NMR SPECTRUM
##DATA CLASS= NTUPLES
##ORIGIN= UXNMR, Bruker Analytische Messtechnik GmbH
##OWNER= root
$$ XWIN-NMR		Version 3.5
$$ Mon Jul  1 14:23:15 2019 Russian Standard Time (UT+4h)  she@DPX200
##.OBSERVE FREQUENCY= 81.013821
##.OBSERVE NUCLEUS= ^31P
##.ACQUISITION MODE= SIMULTANEOUS
##.ACQUISITION SCHEME= undefined
##.AVERAGES= 24
##.DIGITISER RES= 17
##SPECTROMETER/DATA SYSTEM= spect
##.PULSE SEQUENCE= zgpg30
##.SOLVENT NAME= CDCl3
##.SHIFT REFERENCE= (INTERNAL, CDCl3, 0, 182.463)
##AUDIT TRAIL= $$ (NUMBER, WHEN, WHO, WHERE, WHAT)
$$ ##TITLE= Audit trail, XWIN-NMR		Version 3.5
$$ ##JCAMPDX= 5.01
$$ ##ORIGIN= Bruker BioSpin GmbH
$$ ##OWNER= she
$$ F:/spectra/data/she/nmr/P31/1/pdata/1/auditp.txt
$$ ##AUDIT TRAIL=  $$ (NUMBER, WHEN, WHO, WHERE, WHAT)
(   1,<2019-07-01 14:22:26.89 +0400>,<she>,<DPX200>,
      <created by zg, POWCHK disabled, PULCHK disabled
       configuration hash MD5:
       00 E9 B6 7A A2 85 ED C7 34 08 36 98 17 FE 4E 26
       data hash MD5: 32K
       93 15 92 98 FF 07 CF 7A 5E D7 EB 54 42 EF 1A 31>)
(   2,<2019-07-01 14:22:31.46 +0400>,<she>,<DPX200>,
      <Start of raw data processing
       efp BC_mod = 2 LB = 1 FT_mod = 6 PKNL = 1 PHC0 = -2569.691 PHC1 = 143.3996 SI = 64K 
       data hash MD5: 64K
       06 3E 06 E2 2A 86 46 D2 A6 84 18 54 66 E1 F6 93>)
(   3,<2019-07-01 14:22:45.20 +0400>,<she>,<DPX200>,
      <pk PHC0 = 1.039946 PHC1 = 0 
       data hash MD5: 64K
       8E 5D 18 A2 18 03 F5 B5 E4 47 D5 A0 96 54 1A 96>)
(   4,<2019-07-01 14:22:51.03 +0400>,<she>,<DPX200>,
      <abs ABSG = 5 
       data hash MD5: 64K
       0A AE D8 2D 47 66 B4 DF DD BB 46 71 74 A1 5E 15>)
$$ ##END=
$$ 
$$ hash MD5
$$ 90 4D B2 DC 3D 7C CF E8 4A 05 7C 61 CB EB C2 35
##$RELAX= 
##$RELAX= 
##$RELAX= 
##$RELAX= 
##$RELAX= 
##$RELAX= 
##$RELAX= 
##$RELAX= 
$$ Bruker specific parameters
$$ --------------------------
##$DU= <F:/spectra>
##$EXPNO= 1
##$NAME= <P31>
##$PROCNO= 1
##$TYPE= <nmr>
##$USER= <she>
##$AMP= (0..31)
100 100 100 100 100 100 100 100 100 100 100 100 100 100 100 100 100 100 
100 100 100 100 100 100 100 100 100 100 100 100 100 100 
##$AQSEQ= 0
##$AQ_mod= 1
##$AUNM= <au_zg>
##$AUTOPOS= <>
##$BF1= 81.014009
##$BF2= 200.13
##$BF3= 200.13
##$BF4= 200.13
##$BF5= 200.13
##$BF6= 200.13
##$BF7= 200.13
##$BF8= 200.13
##$BYTORDA= 1
##$CFDGTYP= 0
##$CFRGTYP= 5
##$CHEMSTR= <none>
##$CNST= (0..31)
1 1 145 1 1 1 1 1 1 1 1 1 1 1 1 1 1 1 1 1 1 1 1 1 1 1 1 1 1 1 1 1 
##$CPDPRG= <waltz16>
##$CPDPRG1= <>
##$CPDPRG2= <waltz16>
##$CPDPRG3= <>
##$CPDPRG4= <mlev>
##$CPDPRG5= <mlev>
##$CPDPRG6= <mlev>
##$CPDPRG7= <mlev>
##$CPDPRG8= <mlev>
##$CPDPRGB= <>
##$CPDPRGT= <>
##$D= (0..31)
0 1 0 0 0 0 0 0 0 0 0 0.03 2e-05 3e-06 0 0 0 0 0 0 0 0 0 0 0 0 0 0 0 0 
0 0 
##$DATE= 1561976546
##$DBL= (0..7)
120 120 120 11 120 120 24 19 
##$DBP= (0..7)
150 150 150 150 150 150 150 150 
##$DBP07= 0
##$DBPNAM0= <>
##$DBPNAM1= <>
##$DBPNAM2= <>
$$ [...]
##$SUBNAM3= <"">
##$SUBNAM4= <"">
##$SUBNAM5= <"">
##$SUBNAM6= <"">
##$SUBNAM7= <"">
##$SUBNAM8= <"">
##$SUBNAM9= <"">
##$SW= 369.568048894756
##$SWIBOX= (0..15)
0 1 3 0 0 0 0 0 0 0 0 0 0 0 0 0 
##$SW_h= 29940.119760479
##$TD= 32768
##$TD0= 1
##$TE= 0
##$TE2= 300
##$TE3= 300
##$TEG= 300
##$TL= (0..7)
0 120 53 12 22 120 120 120 
##$TP= (0..7)
150 150 150 150 150 150 150 150 
##$TP07= 0
##$TPNAME0= <>
##$TPNAME1= <>
##$TPNAME2= <>
##$TPNAME3= <>
##$TPNAME4= <>
##$TPNAME5= <>
##$TPNAME6= <>
##$TPNAME7= <>
##$TPOAL= (0..7)
0.5 0.5 0.5 0.5 0.5 0.5 0.5 0.5 
##$TPOFFS= (0..7)
0 0 0 0 0 0 0 0 
##$TUNHIN= 0
##$TUNHOUT= 0
##$TUNXOUT= 0
##$USERA1= <user>
##$USERA2= <user>
##$USERA3= <user>
##$USERA4= <user>
##$USERA5= <user>
##$V9= 5
##$VALIST= <valist>
##$VCLIST= <CCCCCCCCCCCCCCC>
##$VD= 0
##$VDLIST= <DDDDDDDDDDDDDDD>
##$VPLIST= <PPPPPPPPPPPPPPP>
##$VTLIST= <TTTTTTTTTTTTTTT>
##$WBST= 1024
##$WBSW= 4
##$XGAIN= (0..3)
0 0 0 0 
##$XL= 0
##$YL= 0
##$YMAX_a= 23068
##$YMIN_a= -22707
##$ZGOPTNS= <>
##$ZL1= 120
##$ZL2= 120
##$ZL3= 120
##$ZL4= 120
##$ABSF1= 182.463
##$ABSF2= -187.1042
##$ABSG= 5
##$ABSL= 3
##$ALPHA= 0
##$AQORDER= 0
##$ASSFAC= 0
##$ASSFACI= 0
##$ASSFACX= 0
##$ASSWID= 0
##$AUNMP= <proc_1d>
##$AZFE= 0.1
##$AZFW= 0.5
##$BCFW= 0
##$BC_mod= 2
##$BYTORDP= 0
##$COROFFS= 0
##$CY= -3
##$DATMOD= 1
##$DC= 0
##$DFILT= <>
##$DTYPP= 0
##$F1P= 0
##$F2P= 0
##$FCOR= 1
##$FTSIZE= 65536
##$FT_mod= 6
##$GAMMA= 0
##$GB= 0
##$INTBC= 1
##$INTSCL= 5.30512e-09
##$ISEN= 30
##$LB= 1
##$LEV0= 0
##$LPBIN= 0
##$MAXI= 10000
##$MC2= 0
##$MEAN= 0
##$ME_mod= 0
##$MI= 50
##$NCOEF= 0
##$NC_proc= -3
##$NLEV= 6
##$NOISF1= 182.463
##$NOISF2= 159.3651
##$NSP= 0
##$NTH_PI= 0
##$NZP= 0
##$OFFSET= 182.463
##$PC= 4
##$PHC0= -2568.651
##$PHC1= 143.3996
##$PH_mod= 1
##$PKNL= yes
##$PPARMOD= 0
##$PSCAL= 0
##$PSIGN= 0
##$REVERSE= no
##$SF= 81.0140089999434
##$SI= 65536
##$SIGF1= 159.3651
##$SIGF2= -187.1042
##$SINO= 113.3802
##$SIOLD= 16384
##$SREGLST= <1H.CDCl3>
##$SSB= 0
##$STSI= 65536
##$STSR= 0
##$SW_p= 29940.119760479
##$SYMM= 0
##$S_DEV= 0
##$TDeff= 32768
##$TDoff= 0
##$TI= <>
##$TILT= no
##$TM1= 0
##$TM2= 0
##$TOPLEV= 0
##$USERP1= <user>
##$USERP2= <user>
##$USERP3= <user>
##$USERP4= <user>
##$USERP5= <user>
##$WDW= 1
##$XDIM= 65536
##$YMAX_p= 344510639
##$YMIN_p= -4332897
$$ End of Bruker specific parameters
$$ ---------------------------------
##NTUPLES= NMR SPECTRUM
##VAR_NAME=  FREQUENCY,     SPECTRUM/REAL,   SPECTRUM/IMAG
##SYMBOL=    X,             R,               I
##VAR_TYPE=  INDEPENDENT,   DEPENDENT,       DEPENDENT
##VAR_FORM=  AFFN,          ASDF,            ASDF
##VAR_DIM=   65536,         65536,           65536
##UNITS=     HZ,            ARBITRARY UNITS, ARBITRARY UNITS
##FACTOR=    0.456856943014862, 1,           1
##FIRST=     14782.0589164792, 0,            0
##LAST=      -15158.0608439998, 0,           0
##MIN=       -15158.0608439998, -4332897,    0
##MAX=       14782.0589164792, 344510639,    0
$$ Real data points
##PAGE= N=1
##DATA TABLE= (X++(R..R)), XYDATA
$$ [...]
##PAGE= N=2
##DATA TABLE= (X++(I..I)), XYDATA
38973B90583j83117k23628m8853J26528Q2273p8650j05754K5716J30530J13351
38963A28979M8486J5579L1585R9246J72794J38395k3604j37517n6540R8010J04983
38952F20396l2337j33372j34169j08880o5067L1525P9825l0529j48080k7399K30651
38941B82564K58974M748j50159Q518J85896P6387j39779j26183M7383N6558j24436
38930C80471k14515j04333K1088L4671J5013Q284n4969j34947n3304J98665L58801
38919D54925K39793j3020j52128j53650j52703j79019j38462k098J39691J99109
38909B42438J62182N4357p2948j30838n7055R1555J72246J07501l0227j00156
38899D39055l3981J16080K38449K40130Q8684j55653l29897k70027k283K18393
$$ plain form
38973 290583 107466 -116162 -165015 -38487 43786 -34864 -140618 -114902 15628 128979
38963 128979 177465 193044 224629 323875 496669 635064 611460 473943 417403 515413 620396
38952 620396 588059 454687 320518 211638 146571 178096 257921 227392 79312 51913 282564
38941 282564 541538 546286 396127 404645 590541 666928 527149 400966 448349 504907 380471
38930 380471 165956 61623 82711 117382 132395 140679 85710 -49237 -102541 96124 454925
38919 454925 694718 681698 529570 375920 223217 44198 -94264 -96362 43329 242438
38909 242438 404620 458977 386029 255191 198136 289691 461937 569438 539211 439055
38899 439055 405074 521154 759603 999733 1088417 932764 602867 332840 330557 548950
38889E48950J70645n9139j96144j54102j07868j54031j30425Q3739K89177K12373
38879E03175q9269l02188k67888r5015Q5397K30001K63971J09089j28636k22871
38869H5766j28827j7649K3003Q5364J83643J70197K4364m3211N7121R4068j06089
38858D27750l10959k05902R7395K11920N4576p2556J2166J16060K7735j40441
38848B17744j34061Q2079L05607L51417K03229l1965k22618k89063k38667j21909
38838A21793L2912J89799K45330J17846r1830j61207k5561J17716O8678j04433
38828E11043j65549l2608J17576P4514j51023l29707k52581M2823K91733K64550
38818C70771P48k47928k84951j25149Q8406K25346K19011Q7764m7194n3340N3177
$$ plain form
38889 548950 719595 660456 464312 310210 202342 48311 -82114 1625 290802 503175
38879 503175 413906 111718 -156170 -251185 -165788 64213 328184 437273 308637 85766
38869 85766 -43061 -60710 -37707 47657 231300 401497 425861 382650 439771 533839 427750
38858 427750 116791 -89111 8284 220204 274780 202224 214390 330450 358185 217744
38848 217744 83683 165762 471369 822786 1026015 994050 771432 482369 243702 121793
38838 121793 154705 344504 589834 707680 615850 454643 429082 546798 615476 511043
38828 511043 345494 312886 430462 504976 353953 24246 -228335 -185512 106221 370771
38818 370771 371519 123591 -161360 -286509 -198103 27243 246254 334018 286824 233484 286661
38807B86661J18603O2440k4785m9184n3798r7725j20840o2775n570l1988l7990
38796a6951J07380K80483K27775l5642k11318j49026l4788m7973q5783K781J28777
38785A65715J30451O3522P7844J19517K1291j69837k24027q2860O7291J04567
38775B73474J13515J51195J04293r1315k67442k23464q435J40211Q8780p0095
38765B10717j60422j10743j562M5669K2599L8280J33480J78149O5870q0237p9446
38754B62354l123n9658j87601q2448K87671N23761L40251k1510j76070j38828
38744G44799j67361k52027j61410P9823J66310Q496j05742L0853K22217J85654
38734G51612k7612j42742o4134M1726K3408o9145j02222n4392k9207r5445j73005
$$ plain form
38807 286661 405264 467704 442919 393735 339937 242212 121372 58597 53027 21039 -16951
38796 -16951 90429 370912 598687 563045 351727 202701 167913 119940 34157 36938 165715
38785 165715 296166 359688 437532 557049 578340 408503 184476 101616 168907 273474
38775 273474 386989 538184 642477 551162 283720 60256 51821 192032 280812 210717
38765 210717 50295 -60448 -62010 -16341 6258 44538 178018 356167 422037 341800 262354
38754 262354 259231 199573 11972 -70476 217195 740956 1081207 1059697 883627 744799
38744 744799 577438 325411 164001 243824 410134 418630 312888 343741 565958 751612
38734 751612 724000 581258 517124 558850 582258 513113 410891 356499 327292 231847 58842
38723E8842j28676K5322J15767L8670q0839n2207J16571K33076J72849J1062r2896
38712D17541n7727O6507J42263O4313j09064j92815j03209K5539L4711l9516n4020
38701A94523K0323J02825J53643J71551J07947n5846j98788j89659p9337q395
38691B18787J2901N6562P8153k3623j88783k48767j74419p3979K0023J50430K58596
38680H5881K32336J04443n979q8398j49014m3997K74207M61279J61630l63288
38670F69100m85902j28241J23845l9107j92813L8329L11881J55776k11088k22005
38660A9775J35998L43599J59771j15316j80923r2160j7012Q700k71m6899q0192
38649A35070m4648Q64j3934q952J04127J99389R7640j12710j72788l6789R1052
$$ plain form
38723 58842 -69834 -44512 71255 109925 29086 -23121 93450 326526 499375 510437 417541
38712 417541 359814 426321 568584 632897 523833 331018 227809 253348 288059 248543 194523
38701 194523 214846 317671 471314 642865 750812 694966 496178 306519 227182 218787
38691 218787 231688 288250 366403 342780 153997 -94770 -269189 -343168 -323145 -172715 85881
38680 85881 318217 422660 416681 328283 179269 135272 409479 870758 1032388 669100
38670 669100 183198 54957 178802 139695 -53118 -14789 297092 452868 241780 19775
38660 19775 155773 499372 659143 543827 362904 270744 253732 262432 262161 215262 135070
38649 135070 90422 91286 77352 68400 172527 371916 469556 356846 184058 147269 238321
38638B38321Q4305K0103j7206l5426l2326J5112O5839P6885R9432J58258J41355
38627H14652L17q3494J6751Q2765j24570l85422k78263J38077L47576J20970j95810
38616D53549k42682r0242L6120J09961J73829J58618N0569l552N5451P3648l2726
38605G42543j14170p5558o1409j53081j54110O4213K50210J20817j59738j94622
38595B65095N6101K39324J32813r9899k07840j54568n7978j4207m7132j06479
38585E230q5298N1914J63440Q5325j08964j62182J3561J93816J46609l8844p1733
38574A92874J34868L33654K65892l500j87981j58911o7175p0904j15369q3576
38564B39872j7381k5629p0103l1392O8946J08161Q9262J15859J50638L7442j94924
$$ plain form
38638 238321 322626 342729 325523 290097 257771 272883 338722 415607 515039 673297 814652
38627 814652 814969 731475 748226 830991 706421 320999 42736 180813 528389 649359 453549
38616 453549 210867 120625 156745 266706 440535 599153 649722 646170 701621 775269 742543
38605 742543 628373 552815 491406 338325 184215 248428 498638 619455 459717 265095
38595 265095 321196 560520 693333 593434 385594 231026 173048 158841 111709 5230
38585 5230 -80068 -28154 135286 220611 111647 -50535 -36974 156842 303451 264607 192874
38574 192874 327742 661396 927288 923788 735807 576896 509721 438817 323448 239872
38564 239872 222491 196862 126759 95367 164313 272474 361736 477595 628233 665675 470751
38553D70751k90695j24537J06762J70178R1803K7387n35o4252j36040j05084M9142
38542A94880K17455K74152J71955k7745j82519j94273j26571j08098j23894m7355
38532D7987J05974J48354J2800j16733q0485K7741M5699j106N322N0447L6927
38521B82927k6683n4095l6962k5017n234N9426J15425P7284k5648p6185k7703
38510B57535N3095Q4627M5958k2647n3831k3903J459l6119n8310M8903K00976
38499D97743J72926n0930k00993j11800L0855O260q4108j9245J35074J15404j08944
38488C82242k79386k27699o5863M5695J01770J44699J32344L2026o3981l7092
38478A64755Q7947J63833J07743L823j3015N7667Q4763J2519l5462M6142J34047
$$ plain form
38553 470751 180056 55519 162281 332459 424262 451649 451114 386862 250822 145738 194880
38542 194880 412335 686487 858442 830697 648178 453905 327334 219236 95342 47987
38532 47987 153961 302315 315115 198382 117897 145638 191337 190231 195553 246000 282927
38521 282927 256244 202149 165187 140170 134936 194362 309787 387071 361423 285238 257535
38510 257535 310630 395257 441215 418568 364737 340834 342293 306174 247864 296767 497743
38499 497743 670669 619739 418746 306946 337801 344061 259953 240708 375782 491186 382242
38488 382242 102856 -124843 -190706 -145011 -43241 101458 233802 265828 201847 164755
38478 164755 252702 416535 524278 528101 515086 572753 657516 670035 634573 680715 814762
38467H14762L4265j90820k65262r0572J20711J63921Q4624J4206k6496m2767J1567
38456F28139R0731L4008j61367k45167p0727J49004J47211j7846j15551j02530
38446C35905p9173m0443N7448J07519R327r1942j1000J30828P5154j28657j80545
38435A84421n535J57613J55363Q9074M6214k7671j13376o4081J25246K42897J64840
38424I55005J1914r4897k02708l24369k98098l5362K52140K71918J8137k33197
38414C20483k52457o8445J20832J65481Q6190O874j6869m8124j20359j39071k8328
38403B6207J17007J58977J15095P7810K4267j02103j96859j14451N6001Q4011
38393B45962l8033q2427L0533J00609j5257j69005j52834R982J33342J07597k3029
$$ plain form
38467 814762 849027 658207 392945 302373 423084 587005 671629 685835 659339 616572 628139
38456 628139 718870 752878 591511 346344 275617 424621 571832 553986 438435 335905
38446 335905 256732 216289 273737 381256 390583 298641 287641 418469 493623 364966 184421
38435 184421 178886 336499 491862 580936 627150 599479 486103 422022 547268 790165 955005
38424 955005 966919 872022 669314 344945 46847 11485 263625 535543 553680 320483
38414 320483 68026 -419 120413 285894 372084 378958 362089 313965 193606 54535 26207
38403 26207 143214 302191 417286 495096 519363 417260 220401 105950 161951 245962
38393 245962 207929 125502 156035 256644 241387 72382 -80452 -70470 62872 170469 147440
38382A47440j29080r1048Q2671K20542J76850L5212j6439K7030J8638n0080l1246
38371C90490Q2732R9638n3542j79741r6536J08872K24800J72040K3416j05189
38361F66980j12279J9760J61942J58468K4435r8590j55968j83316j47561j1670
38351C22201Q2191k4238j70489l7682L14578M38607J45874j98314k18013l2504
38341F22211K9912n9868j05432n9334k1910J940P4621J40168R4785j7197o2146
38330F37750k0759J0880k6354j01679j34511m1933J51443K44219P1985k02427
38320E88614k51232o3813L2868r0987j65763k302J96480K23570K01187K44745
38310I13367J56973j78211m20518k29900J49459K26560k184j38920o8436m1855
$$ plain form
38382 147440 18360 -72688 9983 230525 407375 442587 426148 453178 471816 421736 390490
38371 390490 473222 572860 519318 339577 243041 351913 576713 748753 772169 666980
38361 666980 554701 574461 736403 894871 919306 820716 664748 481432 333871 322201
38351 322201 404392 380154 209665 171983 486561 925168 1071042 872728 654715 622211
38341 622211 652123 592255 486823 427489 405579 407519 482140 622308 717093 699896 637750
38330 637750 616991 627871 601517 499838 365327 323394 474837 719056 791041 588614
38320 588614 337382 273569 306437 215450 49687 47385 243865 467435 668622 913367
38310 913367 1070340 892129 471611 241711 391170 617730 615546 476626 408190 366335
38300C66335j28763j00431R6847K13486J34601M3039M1707o518j36910j48126
38290C75267K0255J02877q5116l15649k51448R2378L89611L91303J31212j59540
38280F91150k43494p3082J43160J62306P317q5657j6663O3443J5928j03027j83466
38269C77915k05345j68530m8102R8049J29343J5190j02207j04627k9412M7427
38259I701J17391J69673J56323R0417M8765L2888k4517p9539L745J81652J93883
38248I00382o4190l24709k92663o1855L9501o7618j35575n05J64867J13360j13303
38237A57692k35064r7999J49348K63252J80035J9367j04447j62751j40395k2333
38227F705J21602J56292L8066j31622k33731k15346n1006K14968L65164J73309
$$ plain form
38300 366335 237572 137141 233988 447474 582075 625114 666821 660303 523393 375267
38290 375267 395522 498399 413283 97634 -153814 -61436 328175 719478 850690 691150
38280 691150 447656 374574 517734 680040 687357 601700 585037 648480 664408 561381 377915
38269 377915 172570 4040 -44062 53987 183330 198520 96313 -8314 -37726 9701
38259 9701 127092 296765 453088 543505 592270 625158 600641 521102 524847 706499 900382
38248 900382 836192 511483 218820 156965 196466 128848 -6727 -7232 157635 270995 157692
38237 157692 -77372 -175371 -26023 237229 417264 436631 332184 169433 29038 6705
38227 6705 128307 284599 322665 191043 -42688 -258034 -309040 -94072 271092 444401
38217D44401k31138l98222j21089K58553L21671J32683M5588J25796J20073p1750
38207F26566k46450k29839p4395R6972K03114J62407k2935j56441o8069Q8486
38197C79416L7994j55620j68655M0776J54767L5886n0484Q0311J93129L0958k31646
38186C46832k31041N9339L13327K73434r374k90862l47686j41441J36248K50512
38176C59288J85887J03200M3282j06914l11747l24888o2171K09767K33323R8811
38166D27838L4414N0398J3831o8600p3495J5381R2728Q6673J399j20163j82538
38155B77866r5185P2049J29373M2221j2959L9467L6465j02097j64530J6602K40289
38144D79561K22126K9292o4922k5554l7388j27050j29622j2196O5231K9836j9056
$$ plain form
38217 444401 213263 -184959 -306048 -47495 274176 406859 452447 578243 698316 626566
38207 626566 380116 150277 75882 172854 375968 538375 515440 358999 290930 379416
38197 379416 417410 261790 93135 133911 288678 324564 274080 354391 547520 578478 346832
38186 346832 115791 175130 488457 761891 752517 461655 113969 -27472 108776 359288
38176 359288 545175 648375 691657 584743 272996 -51892 -114063 95704 329027 427838
38166 427838 462252 512650 526481 457881 384386 399767 492495 579168 580567 460404 277866
38155 277866 182681 254730 384103 426324 413365 452832 489297 387200 222670 239272 479561
38144 479561 701687 730979 666057 640503 603115 476065 346443 334247 399478 429314 410258
38133D10258l1040p5376j53758j58029o1873L6646J03599K09108L29552L04700
38123I13787Q1481j56819k11065j08485l0959p4806j61010j50398n614J52057
38113B48169J62349K6103p3673j4263Q1011J5894j75327k48544p1539K08813L46073
38102E05066K40236j4177k33793k74695j29707P0189J84265J87736J46586J13556
38092G95262R8297Q7671L5704j04971k72367k94360r8333J47800K21962J19010
38082G35675Q326k8604o2832j33612j61506q8760J2960M0698k43j0615P3170J94097
38070E78754K25837J16388l9834j15903j06733q3392l3465R4395J92295O5998
38060H94340k17775l04984m2439K34933J48770j71235k85290q1989J23632J07339
$$ plain form
38133 410258 379218 303842 150084 -7945 -69818 -33172 70427 279535 609087 913787
38123 913787 995268 838449 627384 518899 487940 413134 252124 101726 96112 248169
38113 248169 410518 436621 362948 348685 429696 445590 270263 21719 -49820 158993 505066
38102 505066 745302 731125 497332 222637 92930 163119 347384 535120 681706 795262
38092 795262 893559 981230 1016934 911963 639596 345236 246903 394703 616665 735675
38082 735675 744001 715397 652565 518953 357447 268687 281647 322345 322102 311487 384657 578754
38070 578754 804591 920979 881145 765242 658509 575117 541652 636047 828342 894340
38060 894340 676565 371581 329142 564075 712845 541610 256320 174331 297963 405302
38050D05302M654p602J1078m5351r7106k3620J07527J36563N1357k2962k8370
38039D91470l3085r1617j50859j27642k4112P6166J12310J05930J00599Q1971
38029E41131J1443q5452j40475j42179j26310p9939K6455J17153P7985l5380m1526
38018A22906O6236Q0821o3834j38760K0975K31489K43350J07374J9287j3671p7365
38007E98808q9415N2966J90195R8405j18867j77510q2849q7965k15943k17040
37997d9215l1919R4749N2279M3112J83347K65136J10776j15794j65391o0123O067
37986C33024l5538r9564r6754J606J43221J90622P6745l4823M9350K01345J09386
37975H38620j99498l22576q4627J77923J31862q3195j53312p0176j7772j3047
$$ plain form
38050 405302 409956 402354 413432 368081 270975 247355 354882 491445 542802 519840 491470
38039 491470 458385 366768 215909 88267 64155 140321 252631 358561 459160 541131
38029 541131 552574 467122 326647 184468 58158 -21781 4674 121827 199812 164432 122906
38018 122906 189142 269963 206129 67369 88344 319833 563183 670557 689844 676173 598808
38007 598808 509393 562359 752554 850959 732092 554582 471733 383768 167825 -49215
37997 -49215 -81134 13615 65894 109006 292353 557489 668265 552471 387080 326957 333024
37986 333024 297486 197922 101168 102774 245995 436617 513362 478539 527889 729234 838620
37975 838620 639122 316546 231919 409842 541704 458509 305197 235021 217249 204202
37965B04202K9789N7186k102k9533P8104J47733j4880k38597j93732R2689K67183
37954C98042J68993J198l1041L4279P8546O9657J2644p5131j08876k2586R3045
37943F18770J03999M7313M4070N7025k9234j34047o8235J11624J42070j4374r1629
37932G87352L2472J28591J3933j33235p8684Q0557R1425n5487j62563j57011j35588
37921D11762j35183r1566j0868K1564J1414N8245J66817K11054J22040j6935r9741
37910F48603j11734q3310l3321N106n740l8094k0828M3357P0460K8308k0915m0598
37898D41294o9064j00470m2849J17887K28115J61227J1591m4454r904k6402j12341
37887E54630j27187j3968R3355O3898o0530j53131j49799n3213J01212K21167
$$ plain form
37965 204202 233991 291177 289075 259542 337646 485379 470499 231902 38170 130859 398042
37954 398042 567035 568233 537192 571471 650017 719674 732318 657187 548311 525725 618770
37943 618770 722769 770082 814152 871177 841943 707896 639661 751285 893355 878981 787352
37932 787352 819824 948415 962348 829113 750429 830986 922411 866924 704361 547350 411762
37921 411762 276579 185013 174145 195709 207123 265368 432185 643239 765279 748344 648603
37910 648603 536869 453559 420238 425344 419604 381510 360682 404039 474499 502807 481892 441294
37898 441294 372230 271760 228911 346798 574913 736140 747731 703277 693373 666971 554630
37887 554630 427443 413475 506830 570728 510198 357067 207268 154055 255267 476434
37877D76434K03407O9608l9641n7646o0782r1436o8717K6205M6339q2604j72286
37866B48881k8921K09919K37793K3028j60669j39551k6015L7143P1635J08589
37856E81832N8613j12524k36143j39575R9066K49464K25455J38059Q3366L3101
37846I80714l3876l1118R8409K16520J12375j84798l64265k17882N0042Q2871
37836G08992j23002k23054m8199J63707J65961M6362j3450n2424j44757j39802
37826C40334Q0601K66940J07209k42935l37608j00214J03647N9078m4837k2114
37816B10101M4554O4250J07121J72257J11908o7089j35984j9473P5834M9515P8580
37805F91574K22185K22209n0938k93142k11434J4535M2152j07416j71504r7160
$$ plain form
37877 476434 679841 749449 709808 652162 591380 499944 431227 457432 503771 421167 248881
37866 248881 219960 429879 667672 690700 530031 390480 364465 401608 473243 581832
37856 581832 640445 527921 291778 152203 251269 500733 726188 864247 947613 980714
37846 980714 946838 915720 1014129 1230649 1343024 1158226 793961 576079 626121 708992
37836 708992 585990 362936 314737 478444 644405 690767 677317 624893 480136 340334
37826 340334 420935 687875 795084 552149 214541 114327 217974 277052 232215 210101
37816 210101 254655 318905 426026 598283 710191 643102 507118 487645 563479 612994 691574
37805 691574 913759 1135968 1085030 791888 580454 594989 637141 529725 358221 261061
37795B61061l2046j5027J3990K3269j8593j114J20731J51250l4973j95138n0986
37784B22424K51551L57637K23456O1443q1550k82974l95965j94961J63266K64277
37774E88604M5565j28685n3255O1434J8372n9692j3828O8474L5941q2021j60800
37763C20109j45952m5375R3871J64264J06827L0722N2953Q1687j6226j21985l8273
37752D82622J20414P4252j23469j47277K8367P1595j08353j79068K7228K00194
37742D46505P4773j39067j43568j0766O3323J30744K66959K71784j1001l11075
37732F38611k78356l2029M7402o9510q8594N4518J13878J455q3307m8698n2058
37721B03312j43401j20372J03349K85124K06650O546n0905M0485R5643O0797M2700
$$ plain form
37795 261061 229015 213988 227978 251247 232654 231540 352271 503521 468548 273410 222424
37784 222424 473975 831612 1055068 1116511 1034961 751987 356022 161061 324327 588604
37774 588604 634169 505484 452229 513663 532035 472343 458515 526989 562930 480909 320109
37763 320109 174157 128782 222653 386917 493744 524466 577419 659106 642880 520895 482622
37752 482622 603036 677288 553819 406542 434909 506504 398151 219083 246311 446505
37742 446505 521278 382211 238643 227877 291200 421944 688903 960687 949686 638611
37732 638611 360255 328226 375628 306118 217524 272042 385920 387375 304068 255370 203312
37721 203312 59911 -60461 42888 328012 534662 541208 490303 530788 626431 687228 729928
37710G29928Q1709J07542J04709J31337J56273O1730j27938j94893l3927J29506
37700A145976K3292k43195k85405k141K41521J26427j66356k49253r6961n651
37690D88254p0995p3824P8594J57741R782j52815p8684J20426J50370j8624j43525
37679D66700q5002M0470Q1267L4919j8975l4636r505L5917O2365M9080K6677L1160
37667F80437M4816K6276k4142o8360p8079n3968k2847j9847l4944L135J19741
37656E72218K01217J21599n2418j25112m9036K1061j4482o1186j6739O5441Q7274
37645G49837M1422m1732j41903j80137o7747J08958J47070M8603M6362J92681
37635I03414K08532n1744k73672j29837J76422J96612p7312k31981r0108P5402
$$ plain form
37710 729928 811637 919179 1023888 1155225 1311498 1373228 1245290 1050397 1016470 1145976
37700 1145976 1169268 926073 640668 638527 880048 1006475 840119 590866 493905 488254
37690 488254 417259 343435 422029 579770 589552 436737 358053 478479 628849 610225 466700
37679 466700 381698 422168 503435 538354 519379 484743 475238 511155 573520 622600 649277 680437
37667 680437 725253 751529 727387 659027 580948 526980 504133 484286 449342 452477 572218
37656 572218 773435 895034 842616 717504 668468 689529 675047 613861 597122 662563 749837
37645 749837 791259 749527 607624 427487 359740 468698 615768 664371 710733 903414
37635 903414 1111946 1060202 786530 656693 833115 1029727 952415 720434 630326 705728
37625G05728L9629n2439q877P8663K9768j12399j65120p7125M0776P6955R099
37614E64658r6849j18696Q667J76004J97340N2993q4522r7426n4568m5988l7117
37603D64496K1868O8347K2888o8309q9426r828Q4554Q5307l4562j65414j26883
37592B53038J18351L38999K68444k8199j96341n4192J72835J81134k2931k10103
37582H21035k56297k02246q9663O1393J61485J26760L1584K3697R3859R1310k2874
37571H40043j05214n6022L4698L9420l0796q5650r3105o6617R665J43876K65133
37560H95431K74025J49951l9360k04788k73176k09110n8571O8331J11589J14761
37550H29083J17863P2755m8679j38411p8269N6183O8904p8384k10775j91829q3201
$$ plain form
37625 705728 745357 692918 684041 762704 792472 680073 514953 437828 478604 555559 564658
37614 564658 467809 349113 357780 533784 731124 784117 699595 602169 547601 501613 464496
37603 464496 486364 554711 577599 509290 419864 410036 494590 579897 545335 379921 253038
37592 253038 371389 710388 978832 950633 754292 700100 872935 1054069 1031138 821035
37582 821035 564738 362492 272829 334222 495707 622467 654051 677748 771607 862917 840043
37571 840043 734829 678807 713505 752925 722129 636479 543374 476757 486422 630298 895431
37560 895431 1169456 1319407 1280047 1075259 802083 592973 534402 602733 714322 829083
37550 829083 946946 1019701 971022 832611 754342 810525 879429 801045 590270 398441 315240
37539C15240L681P0643J51041J84276J01763k7034n8402L5848J31599J02623m2799
37528I68479j69097j43655J2342J19766N2981q1385r5051n526J6847k4112N7598
37517G09187K49096K59705j4580k54188j90196k8294p3617j92448o8752J91938
37507E87851K09774n434o2160J27296J99182j0406j75581m9517J32576R1686m7350
37496I97917n7929k4659j12955k01187r8067Q3406J07612Qo2731p7470j15591
37485D38354o6759J72829L88468K87233l0712j94214j06653k3896j00985j97437
37475E66228j67923n2454P2797J81436J96650M4955j55026j84251l3603R1674
37465E60483Q7194L9102m634r0446j57123n7794J44444J78899k2124j72240l9467
$$ plain form
37539 315240 318921 389564 540605 724881 826644 799610 741208 777056 908655 1011278 968479
37528 968479 799382 655727 668069 787835 840816 759431 664380 658854 675701 651589 709187
37517 709187 958283 1217988 1203408 949220 759024 730730 657113 464665 395913 587851
37507 587851 797625 792191 730031 857327 1056509 1046103 870522 821005 953581 1045267 997917
37496 997917 939988 915329 802374 601187 503120 586526 694138 694146 631415 553945 438354
37485 438354 371595 544424 932892 1220125 1189413 995199 888546 864650 763665 566228
37475 566228 398305 345851 418648 600084 796734 841689 686663 502412 468809 560483
37465 560483 647677 686779 682145 591699 434576 376782 521226 700125 678001 505761 466294
37454D66294K18592L01863J64930j8360j37362j93673j71511n8274N1895M4492
37444F68886l6434l0844J05170K15937J32834j12490l04929k71873o9853Q4424
37434C80828P0051j4195k4414J2345l1862j44648j56168M295J64662J12635j19326
37423B54203k67552j45145J25032K47517J21943k3272N0636K32692K07164o2851
37413G40367k45312j17088J15029J45366J1086l9505L0841M6498k8073k5362J16709
37402G50556K27935J57243k1325j27452q8025J8015O0359j3076j17500j42460
37392G04270j28897k07732l24976k36724R7658L47900K49240P23l8359J25774
37382E88877K05685J02043m4330j63273k71924k65211n4334J48536O8807j51015
$$ plain form
37454 466294 684886 986749 1151679 1133319 995957 802284 630773 572499 624394 668886
37444 668886 632452 601608 706778 922715 1055549 943059 638130 366257 296404 380828
37434 380828 450879 436684 412270 424615 392753 248105 91937 96232 260894 373529 254203
37423 254203 -13349 -158494 -33462 214055 335998 312726 363362 596054 803218 740367
37413 740367 495055 377967 492996 638362 649448 609943 640784 687282 659209 633847 750556
37402 750556 978491 1135734 1114409 986957 898932 916947 977306 964230 846730 704270
37392 704270 575373 367641 42665 -194059 -96401 251499 500739 501462 463103 588877
37382 588877 794562 896605 852275 689002 417078 151867 97533 246069 314876 163861
37372A63861j24783J42366K52462Q6891j5791J18790J98047N880k02314j46833
37362D78576J6918K6484j8707J07175K89935K37113k9323j94712j04167Q7233
37352H96525J76663J05328o7610k04431j64569P712O7737r8832k52762j14580
37342C51181J97300K88981L0022k62315k34164P4752L10710K36743k2991j84038
37332G86181j63694j26144j66669j34815R6178L45800L38732J07844o6202o3504
37322I53707r863Q267K5788R371j10771k14317j13597Q3146P8373j12415j50016
37311D47673O3571K18674J20050l5464o4036o6099j03283k4091J63726J73851
37301H94572m8536j40046N8794J68100o3948k41269L0472L98105K69838k35389
$$ plain form
37372 163861 39078 181444 433906 520797 505006 623796 821843 827723 625409 478576
37362 478576 495494 521978 503271 610446 900381 1137494 1108171 913459 809292 896525
37352 896525 1073188 1178516 1110906 906475 741906 749618 817355 718523 465761 351181
37342 351181 548481 837462 867484 605169 371005 445757 756467 993210 970219 786181
37332 786181 622487 496343 329674 194859 291037 636837 975569 1083413 1017211 953707
37322 953707 943844 952111 977899 987270 876499 662182 548585 631731 710104 597689 447673
37311 447673 511244 729918 849968 814504 750468 684369 581086 556995 720721 894572
37301 894572 846036 705990 764784 932884 868936 627667 658139 1056244 1326082 1090693
37291A090693m83768k76541J6432J47222K04935K01269L1046j51519o4415J67228
37281H82582J32052j69632k81359l5622J81955P1872j56934k07377j12136q493
37271B96908J26655K79995K70564N4929j20010q8599k1017r1101j60818m7323
37261E00183J29837J46174M1409J4218O9064L7691j04279j81038p9102J08422
37251F82579K22562K03157Q8501o1107j92801k46777j66852K9466K02213J95385
37241I56326L1284r3798p0480k0465q4120j91263j87160p4805L6054J21293K01281
37230F24147K03315O9472p5502p1194L3533Q2643O9487P1422L6425j01755j96335
37219G45658p7895J09792R8370m6293l3518J15204P4224j91795k97626n2356K16797
$$ plain form
37291 1090693 606925 330384 346816 494038 698973 900242 931288 779769 715354 882582
37281 882582 1014634 845002 563643 528021 709976 781848 624914 417537 305401 296908
37271 296908 423563 703558 974122 1029051 909041 820442 799425 708324 547506 500183
37261 500183 630020 776194 817603 831821 900885 938576 834297 653259 574157 682579
37251 682579 905141 1108298 1196799 1135692 942891 696114 529262 558728 760941 956326
37241 956326 987610 893812 823332 802867 718747 527484 340324 265519 301573 422866 624147
37230 624147 827462 896934 821432 750238 783771 866414 935901 1007323 1043748 941993 745658
37219 745658 667763 777555 875925 829632 796114 911318 985542 793747 496121 443765 660562
37208F60562J80200k1631r3670n9705r7808j41007O73K46335L03387Q9719j57040
37197I10015k00602n5620R7220J19433K6287m0796K8667J53712J30633r3226l11203
37186G64520k99301q6955R7037R3838m1533j29984n3952J25546K25708J41447
37176H36371l4290j32943j03925j5057P6100J45510J52089Q5209K1510K2466L0417
37165A083457k0008o8012m2286j7421q6984j69194j26536K045Q0977J00020J12947
37154H49005O6446o8545j11725R0631L37765K98704l284k53211l19254l08523
37144E78009k19278L7436K81802J92129j47212k73416l2776J99520J41763J0106
37134G68083P8338K29485K23711R5944Q194m0952j10438j38214q1229l6271n5401
$$ plain form
37208 660562 840762 819131 725461 665756 567948 426941 427614 673949 977336 1067055 910015
37197 910015 709413 653793 751013 870446 896733 855937 884604 1038316 1168949 1075723 764520
37186 764520 465219 378264 475301 569139 527606 397622 343670 469216 694924 836371
37176 836371 802081 669138 565213 550156 626256 771766 923855 1009064 1030574 1053040 1083457
37165 1083457 1063449 995437 953151 935730 848746 679552 553016 555061 636038 736058 849005
37154 849005 915451 846906 735181 825812 1163577 1462281 1458997 1205786 886532 578009
37144 578009 358731 396167 677969 870098 722886 449470 416694 616214 757977 768083
37134 768083 846421 1075906 1299617 1395561 1403755 1362803 1252365 1114151 1032922 996651 941250
37123I41250m6837J6285L0818R866R8406K31641J30534k01837l61351j41902J23531
37112H30404R2551p8394p5322N4964Q6142L0642J1507l7968j85119k37367l8571
37101D53469J84008J42375l7345m6648Q0230Q3229k6688j6936J09270J23856K481
37090A051301m8433J5897K0749q1446j39835j06548r9828j27672m0875J72642
37080F15952L01784K05474m355j41738j51185q3693K393P4343J32161J78669J53715
37069A283520p620k01245j97192L8853K39717J88395n864j37100k01237k66833
37059G33394k56835j05964M2379N2977M6593J69142K85527J96981P809m2741J3988
37048A143250l1721j71477k08266j13478l5483m200P0368J53312J28887L7493
$$ plain form
37123 941250 894413 910698 941516 951382 1049788 1281429 1411963 1210126 848775 706873 830404
37112 830404 922955 844561 769239 824203 910345 940987 952494 914526 729407 492040 453469
37101 453469 637477 779852 742507 695859 776089 859318 832630 815694 924964 1048820 1051301
37090 1051301 1002868 1018765 1039514 958068 818233 711685 611857 484185 443310 615952
37080 615952 917736 1123210 1118855 977117 825932 742239 744632 818975 951136 1129805 1283520
37069 1283520 1275900 1074655 877463 916316 1156033 1344428 1338564 1201464 1000227 733394
37059 733394 476559 370595 412974 465951 512544 681686 967213 1164194 1172003 1129262 1143250
37048 1143250 1111529 940052 731786 618308 582825 578625 648993 802305 931192 968685
37038I68685r640p4373k48094l54578j52616K11752L33212J34930l7075M6784
37028H18987K16827K47806J64132P5086k6879j58378k37100k09809j42235r7113
37018F51324n0192J6664N4233K0529o1825j25135q7233O9193J98654J13144j19527
37007F79829j94607j3858J38204N4958m1855R5803K68799J51935j31221k06829
36997H01158p3388m1039j32587n6362K15547L37014J49037p7207q7210K7993P8283
36986A141239L8155n0905j69128k22290j05977Q3007J43068Q4259Q0305J23153
36976A144886M4515j17181j21495N9362J69025P4005p3897j41433j69624j69954
36966F98209p5259M7609L8768n2498j0152J67078K41433J27208j4654r4525j66274
$$ plain form
37038 968685 959045 884672 636578 282000 129384 341136 674348 809278 772203 818987
37028 818987 1035814 1283620 1447752 1522838 1495959 1337581 1100481 890672 748437 651324
37018 651324 601132 617796 672029 692558 630733 505598 418365 487558 686212 799356 679829
37007 679829 485222 471364 609568 664526 622671 718474 987273 1139208 1007987 801158
36997 801158 727770 686731 554144 497782 713329 1050343 1199380 1122173 1034963 1062956 1141239
36986 1141239 1179394 1128489 959361 737071 631094 714101 857169 941428 1021733 1144886
36976 1144886 1189401 1072220 950725 1010087 1179112 1253117 1179220 1037787 868163 698209
36966 698209 622950 670559 709327 656829 646677 813755 1055188 1182396 1167742 1073217 906943
36955I06943j69579K0863K55904K23239m1729j61310m005J50130J19998O1879
36945A362333P6963K1296j35759j84749p4144k5920r5954m8880J55465K04410
36935A255061k5035k13504j28457L3140P9529J41967K72916K04269j37383l28155
36925A154348p5466K55490J93948j15306k19564p9454J6139J0472N0025P5515
36915A266147p0364k48987j91768K8168J06614J6261O87J07368J20098l5879j68609
36904I29736j43980n7363k7678l0866J2784J17496K07370J56432o4503k47478
36894H51950j36795J74219K88517O8122j48152q0136O4879j8419k10605j92807
36884F60773K4711J75090J81778J71337J53470L5873j12411j23902j2077P1273
$$ plain form
36955 906943 737364 758227 1014131 1237370 1195641 1034331 1030326 1180456 1300454 1362333
36945 1362333 1439296 1460592 1324833 1140084 1065940 1040020 944066 895186 1050651 1255061
36935 1255061 1230026 1016522 888065 921205 1000734 1142701 1415617 1619886 1482503 1154348
36925 1154348 1078882 1334372 1528320 1413014 1193450 1113996 1130135 1140607 1190632 1266147
36915 1266147 1195783 946796 755028 783196 889810 906071 906758 1014126 1134224 1098345 929736
36904 929736 785756 728393 700715 669849 682633 800129 1007499 1163931 1099428 851950
36894 851950 715155 889374 1177891 1246013 1097861 1017725 1082604 1064185 853580 660773
36884 660773 685484 860574 1042352 1213689 1367159 1403032 1290621 1166719 1154642 1225915
36874A225915R4006J22570J26253L7519p3424j01813r4424j30571j32896q036
36864A065099J40931J52016M2893o9302j49142j77532q6183O4169N5778j35842
36854I02885k12251o830K08828J61482K7584Q7040J95698L9277k83261l90177
36844G30275k09251m579R9193J96195K64942J72522m408m0982N8132Q3483M883
36833A350405m929Q3784J14483M2698k3487o5220j44737j87243o9961R7888Q3086
36822A276767r8836k01661j25105j0204J8941l4102j41217k34620j67364P9328
36812C61927K63045K01082P2485J16053K08223R1457j43694k03730q7121j7024
36802H62703O666J42538K80203J52795j50233k46347m9004J38256J35036P2416
$$ plain form
36874 1225915 1319921 1442491 1568744 1606263 1532839 1431026 1336602 1206031 1073135 1065099
36864 1065099 1206030 1358046 1400939 1331637 1182495 1004963 918780 982949 1038727 902885
36854 902885 690634 683804 892632 1054114 1081698 1168738 1364436 1403713 1120452 730275
36844 730275 521024 516445 615638 811833 1076775 1249297 1244889 1203907 1262039 1345522 1350405
36833 1350405 1345476 1429260 1543743 1586441 1562954 1497734 1352997 1165754 1095793 1193681 1276767
36822 1276767 1177931 976270 851165 840961 859902 825800 684583 449963 282599 361927
36812 361927 624972 826054 898539 1014592 1222815 1314272 1170578 966848 879727 862703
36802 862703 869369 1011907 1292110 1444905 1294672 1048325 999321 1137577 1272613 1345029
36792A345029M6093o865n6126K400O4895m6028j86529p2164J69441J29596j75527
36781A214215k74630j1374K05216R0797r3561m1878J34905K01091J53120N1500
36771A629401j30982k82433j54691J90750L26339Q1740j63551o8646J73250K24124
36761A825301J17089M2254n0594k49364l49099j38917J59461J42150j81199l97441
36751I19641k65927J1352J19077J2766q6092K1133K64390L59459J59288j11445
36741A403642j28265P8622J76315K6743j49740j58778q9655q3539j06879q5081
36731H83385m0157J6287J19332J98387J14643p7308j52465p1046l6622j11879
36721H42557q0065J69641M00778L49670O4926k19837l53496l00646j14385M0216
$$ plain form
36792 1345029 1391122 1384257 1328131 1330531 1395426 1349398 1162869 1090705 1260146 1389742 1214215
36781 1214215 939585 928211 1133427 1224224 1130663 1088785 1223690 1424781 1577901 1629401
36771 1629401 1498419 1215986 1061295 1252045 1578384 1660124 1496573 1427927 1601177 1825301
36761 1825301 1942390 1984644 1934050 1684686 1335587 1196670 1356131 1498281 1317082 919641
36751 919641 653714 665066 784143 796909 710817 731950 996340 1355799 1515087 1403642
36741 1403642 1275377 1353999 1530314 1557057 1407317 1248539 1158884 1075345 968466 883385
36731 883385 843228 859515 978847 1177234 1291877 1214569 1062104 991058 954436 842557
36721 842557 762492 932133 1332911 1682581 1747507 1527670 1174174 873528 759143 799359
36711G99359M1992K5793J91521M10956L62981P3180r1628l0288m6259k50894l29253
36700A157460j27017K6845r8218j93437M7184L42900K55076r4988k25030j8775
36690A072000K02859K21880J24009K0503p7552j29382q5226j4317q878k4536J3916
36679A315276N6856M4517L5846N5819j3710k03322l02736j51534R4677K06442
36669A138131K06104K21490K04389N9785j04880j31675q0404q6958q6874M7767
36659A386875K06992J62564p1556k48765k25127q1440M9227R8775N2219l1541
36649A298223l4210P3628J68205J40554K6205r8223k04011k33499j19860M0505
36639A057517M9420p2954p6542J04958K14122R3231n3355j9605P2157L9804l4241
$$ plain form
36711 799359 841351 867144 1058665 1469621 1832602 1905782 1814154 1783866 1737607 1486713 1157460
36700 1157460 1030443 1057288 959070 765633 812817 1155717 1410793 1315805 1090775 1072000
36690 1072000 1274859 1496739 1620748 1641251 1563699 1434317 1349091 1334774 1325896 1301360 1315276
36679 1315276 1372132 1416649 1452495 1508314 1494604 1291282 988546 837012 931689 1138131
36669 1138131 1344235 1565725 1770114 1829899 1725019 1593344 1512940 1425982 1339108 1386875
36659 1386875 1593867 1756431 1684875 1436110 1210983 1129543 1178770 1277545 1329764 1298223
36649 1298223 1264013 1337641 1505846 1646400 1672605 1574382 1370371 1136872 1017012 1057517
36639 1057517 1106937 1033983 957441 1062399 1276521 1369752 1316397 1296792 1368949 1408753 1374512
36628A374512j3761N739r3409j77564q8177N4243N8145o202L8364J51958J76713
36617A480561J07994K4485q6020j99846j52183R0097K54577J36762n2219p239
36607A596969J89102K26197N3512j13622j62135j55060j24888n5546N019K1268
36597A480816N5475J13480P1178q0189j35840j4952O2429l9976j05890L9757J73895
36586A620183N5462j22512n6221J36310J30151n3013j36026q0239o8560j10659
36576A314876o2281N1212Q5599N4366M0095k3814j65138j66305Q7132K70326O0795
36565A546863k88222k98792j7789J18159L8612P2551K65910K73757J1170j49268
36555A572951N121J89960J12080r5517j48913k1000J29429K05263J82968N9872
$$ plain form
36628 1374512 1360751 1366490 1273081 1095517 1007340 1061583 1119728 1113526 1151890 1303848 1480561
36617 1480561 1588555 1613040 1527020 1327174 1174991 1265088 1519665 1656427 1604208 1596969
36607 1596969 1786071 2012268 2065780 1952158 1790023 1634963 1510075 1454529 1459548 1480816
36597 1480816 1536291 1649771 1720949 1640760 1504920 1489968 1552397 1512421 1406531 1446288 1620183
36586 1620183 1675645 1553133 1496912 1633222 1763373 1710360 1574334 1494095 1425535 1314876
36576 1314876 1252595 1303807 1389406 1443772 1483867 1460053 1294915 1128610 1215742 1486068 1546863
36565 1546863 1258641 959849 942060 1060219 1098831 1171382 1437292 1711049 1722219 1572951
36555 1572951 1578072 1768032 1880112 1784595 1635682 1614682 1744111 1949374 2132342 2192214
36545B192214q5438j24589m9330J1203k6098j11445j57071j20063k6686J2927
36535A515624q7187j98296p1448K70608M63112K79966n7267k35035k41780j91449
36525A446848n9815J29826J66740J0909k0833K31625M06416J69429k02824k54586
36515B023735o0999L882o2879r990J00602J8637j61442j49933j3290l7953j68995
36504A481375j20879O7428J19129M7276P0212J24382j194j73573j11293O3645
36494A566508L9642o6082Q2304L47359L00392j95r9907L9734K5562j83524j94527
36483A857266O6232K04084N3387j05093j07441r3152p8424O5711J89066K3303
36473B074939k38920j63390J54195K22475K4879O22J67352Q9368k26157k67873
$$ plain form
36545 2192214 2106776 1982187 1932857 1944060 1917962 1806517 1649446 1529383 1502697 1515624
36535 1515624 1428437 1230141 1158693 1429301 1892413 2172379 2115112 1880077 1638297 1446848
36525 1446848 1387033 1516859 1683599 1694508 1673675 1905300 2311716 2481145 2278321 2023735
36515 2023735 1962736 1966618 1903739 1893749 1994351 2012988 1851546 1701613 1688323 1650370 1481375
36504 1481375 1360496 1427924 1547053 1594329 1664541 1788923 1787729 1614156 1502863 1566508
36494 1566508 1606150 1540068 1622372 1969731 2270123 2269928 2170021 2209755 2235317 2051793 1857266
36483 1857266 1923498 2127582 2180969 2075876 1968435 1875283 1796859 1862570 2051636 2074939
36473 2074939 1836019 1672629 1826824 2049299 2074178 2074800 2242152 2331520 2105363 1837490
36463A837490K2715J10312j41125k24572K6312J13998j50383k45782R3477L60805
36453A803247J77706p9072k7213Q7845J24m2594J45908K45958N7189p5221O2671
36442B356548J05165j73295l54694j24132J28696J6392j61488k6474J81946J22244
36432B070908n96Q5373J33038j08754l16110j56666O9900l361j09553J12918L65503
36421B142600K02328j27591j06394J41020J24351j10728j21987Q9583J12488j14409
36411B231261k31714r5980P3549J41190J74068J71522P6959j8171r991O957o2987
36400B456663j08149n0612l2940j13970r4436R5819J95281O0726p5003n5954o2838
36389B214587j49698m3007K80328L83929J05035j10795j2399r263l43878n10960
$$ plain form
36463 1837490 1860205 1970517 1829392 1604820 1631132 1745130 1594747 1348965 1442442 1803247
36453 1803247 1980953 1901881 1874668 1962513 1962637 1920043 2065951 2311909 2369098 2293877 2356548
36442 2356548 2461713 2288418 1933724 1809592 1938288 1954680 1793192 1766718 1948664 2070908
36432 2070908 2070312 2155685 2288723 2179969 1863859 1707193 1777093 1773732 1664179 1777097 2142600
36421 2142600 2344928 2217337 2110943 2251963 2376314 2265586 2143599 2233182 2345670 2231261
36411 2231261 1999547 1903567 1977116 2118306 2292374 2463896 2540855 2522684 2512693 2519650 2456663
36400 2456663 2348514 2297902 2264962 2150992 2056556 2152375 2347656 2408382 2333379 2277425 2214587
36389 2214587 2064889 2021882 2302210 2686139 2791174 2680379 2667980 2658717 2314839 1803879
36379A803879j22861L28046K81844M4832J34229L00699P4478k52518j34414J77524
36369B635738O8695k93798k43404J89854L44586O7774j32143l1526N3296k8075
36359B630997n0888M7896O7704m676O298O7171L4923J6665J40841J88695k9577
36348C116049k14195n5528J55142K3171j97063o0246K03361P6125k78692k80850
36338B487274M9574J89748O7476O8531K05864J22041j41284j81308l655R381j41583
36327B732059r2635J41415J76091j9178j04146l1006m9576j21517j891J86535
36317B816151J28025n9481l8323Q1745j2351j45392L2012K72877J11035k14442
36307B971856j12683K72129K85520o7958j79780K3878K5493k24272k24173O3450
$$ plain form
36379 1803879 1681018 2009064 2290908 2335740 2469969 2770668 2845146 2592628 2458214 2635738
36369 2635738 2704433 2410635 2167231 2357085 2701671 2769445 2637302 2605776 2659072 2630997
36359 2630997 2580109 2628005 2695709 2691033 2697331 2764502 2799425 2816090 2956931 3145626 3116049
36348 3116049 2901854 2846326 3001468 3024639 2827576 2767330 2970691 3046816 2768124 2487274
36338 2487274 2536848 2726596 2794072 2862603 3068467 3190508 3049224 2867916 2864261 2873642 2732059
36327 2732059 2639424 2780839 2956930 2937752 2833606 2802600 2753024 2631507 2629616 2816151
36317 2816151 2944176 2884695 2846372 2928117 2915766 2770374 2802386 3075263 3186298 2971856
36307 2971856 2859173 3131302 3416822 3348864 3169084 3192962 3218455 2994183 2770010 2833460
36297B833460J32487o7238n9851J51734N3830k87764j88718L93164O33586J83268
36287C777958k84945k33980r309k1516p3382N3645J32841L5556L2991J99393J97838
36276C807090l9903j16307P9924J40247q4132k00205l8761L6105j33132j80595
36266C270331N6013K00037M2998q1273O2286K15149J45011j3828j39401k76872
36256C480451l03900m2133K57838K00589j6065R7596L59911J60703l66166m42552
36246C386272J2762K32535l9576j62793J47116L05401M214j96299Q4306L75821
36236D149759K52695K3466K3036K9697j36159j92880p481R5879n342J4765K28917
36225D476352K58298K1616r2208P085j4814j42892p345K55743J31859k02576m2570
$$ plain form
36297 2833460 2965947 2898709 2838858 2990592 3044422 2756658 2567940 2961104 3594690 3777958
36287 3777958 3493013 3259033 3249724 3228208 3154826 3208471 3341312 3376868 3409859 3609252 3807090
36276 3807090 3767187 3650880 3730804 3871051 3786919 3586714 3547953 3584058 3450926 3270331
36266 3270331 3326344 3526381 3569379 3488106 3550392 3765541 3910552 3896724 3757323 3480451
36256 3480451 3176551 3134418 3392256 3592845 3576780 3674376 4034287 4194990 3828824 3386272
36246 3386272 3399034 3631569 3591993 3429200 3576316 3881717 3885931 3689632 3773938 4149759
36236 4149759 4402454 4425920 4448956 4478653 4342494 4149614 4142133 4238012 4232670 4247435 4476352
36225 4476352 4734650 4756266 4664058 4671143 4656329 4513437 4506092 4761835 4893694 4691118 4648548
36214D648548N10035N82046M8796k81152j94673l68856q46004p39602P4871N09459
36204C943468R2293k62482K7781K57485m1640j56194L26459N74937N4268l98030
36194D418345q9391K91451N2790k13344J12000M07757L1126l95917j68973J71629
36184D617473m4230k88682Q1880M89091K08046k31341n6929L02543J33444j49532
36174E061763J15185M41468R3716m44430l08061J92731K25301o5133l7576J47634
36164E422598N314j71791P2673L26933Q6634j77861Q6009L58140P801m28390k08818
36153E379242K13825P4902k56259o6945K86508J38349j25262J35356M57119J37217
36143F374052l38830j64526K75532J93464r7533Q8480L87204J50802j84847L5082
$$ plain form
36214 4648548 5158583 5740629 5789425 5508273 5313600 4944744 4098740 3359138 3434009 3943468
36204 3943468 4035761 3773279 3801060 4058545 4016905 3860711 4187170 4762107 4816375 4418345
36194 4418345 4328954 4620405 4673195 4459851 4571851 4979608 5010734 4614817 4445844 4617473
36184 4617473 4573243 4284561 4366441 4855532 5063578 4832237 4775308 5077851 5211295 5061763
36174 5061763 5176948 5618416 5712132 5267702 4959641 5152372 5377673 5312540 5274964 5422598
36164 5422598 5427912 5256121 5328794 5655727 5742361 5564500 5650509 6008649 6016450 5588060 5379242
36153 5379242 5593067 5667969 5411710 5344765 5631273 5769622 5644360 5779716 6236835 6374052
36143 6374052 6035222 5870696 6146228 6339692 6242159 6330639 6717843 6868645 6683798 6718880
36133F718880L16972N200k93066J67275O86206L19496l05159j18383M01235K00838
36123H099494l10653j18260L75845J56531l81749k05277L32126K23685j92438
36114G979304K1834M43171J25709l94056n0057N96693L48246k86381l0911O51839
36104I405391L97553m19568l66679L41476L36071k45076j33110N05948M25807
36095A0247813j96794j35122M20560K79014l04209j25399M89288K77868l89525
36086A0563494j74508N35896L23475m33443k45884N47362M45985k05475Q0252
36077A1437154Q41504M74073m79535k08321P80030M89952o64699n16979P16266
36068A2869445Q27001j55491j23054R16983R03702j16298p2389R21190P25600
$$ plain form
36133 6718880 7035852 7041052 6747986 6915261 7601467 7920963 7615804 7497421 7898656 8099494
36123 8099494 7788841 7670581 8046426 8202957 7821208 7615931 7948057 8171742 7979304
36114 7979304 8001138 8444309 8570018 8175962 8125905 8722598 9070844 8784463 8753552 9405391
36104 9405391 9802944 9383376 9016697 9358173 9694244 9449168 9316058 9822006 10247813
36095 10247813 10051019 9915897 10336457 10615471 10311262 10185863 10675151 10953019 10563494
36086 10563494 10388986 10924882 11248357 10814914 10569030 11116392 11562377 11356902 11437154
36077 11437154 12278658 12752731 12273196 12064875 12844905 13334857 12670158 12153179 12869445
36068 12869445 13696446 13540955 13417901 14334884 15238586 15122288 15049899 15971089 16696689
36059A6696689m53496k85098J054106J053906k33247k44274J012502R32112m17050
36050A9116150k53077J359093J403894j80155k46267J349416J348658l82711l42603
36041B3172398J667030J848581j68088l25345J984312K511238L75752j32951J963854
36032C2896781K313923O1796o0311K791913L343429O02057M35319M026218M667841
36023E1078966O30541n44802L881116O171798L095176K726012Q254168J0227784
36015H5520759M910617L498004J0548813J2577385M904128P111931K5602279K3104165
36007A77778081l4508948j11915725j31654295p2579037J978983K8199207J3838188
36000a28863546L888294J0816489J4178743P009541L665219Q738043J0420882
$$ plain form
36059 16696689 16243193 15958095 17012201 18066107 17832860 17588586 18601088 19533200 19116150
36050 19116150 18863073 20222166 21626060 21445905 21199638 22549054 23897712 23515001 23172398
36041 23172398 24839428 26688009 26519921 26194576 28178888 30690126 31065878 30932927 32896781
36032 32896781 35210704 35272500 35212189 38004102 41347531 41949588 42384907 46411125 51078966
36023 51078966 51709507 51164705 55045821 61217619 64312795 67038807 75292975 85520759
36015 85520759 90431376 93929380 104478193 117055578 121959706 129071637 154673916 177778081
36007 177778081 143269133 31353408 -100300887 -172879924 -170900941 -142701734 -128863546
36000 -128863546 -124975252 -114158763 -99980020 -92970479 -89305260 -80567217 -70146335
35993g0146335M771297J604151M456166N228623J222674j48224L476887M994094
35985d4540667J717391k9415K536845L869225J264767l62789J563594K680422
35977c1300627O27929n89019J244559K409396P49912l62723J069970J933108M13719
35968b3803776m96152R18225J748916K93983o49224O52831J575213L82013n02238
35959a9880209N89679J378053K74789n30256N03864J261649K26580n53719M32940
35950a6296630J206355K35389n85248L01503J106407K47893o22234O2227P83926
35941a3560412M1870p07798K4442Q53646K66111m83512J08752R43375N66036j17586
35931a2065076J65739O04836J68421k48578K61058O78196J06669l62745J76726
$$ plain form
35993 -70146335 -65375038 -63770887 -59314721 -54086098 -52863424 -53011648 -49534761 -44540667
35985 -44540667 -42823276 -42852691 -40315846 -36446621 -35181854 -35544643 -33981049 -31300627
35977 -31300627 -30672698 -31261717 -30017158 -27607762 -26857850 -27220573 -26150603 -24217495 -23803776
35968 -23803776 -24299928 -23381703 -21632787 -21338804 -21988028 -21335197 -19759984 -19377971 -19880209
35959 -19880209 -19290530 -17912477 -17637688 -18167944 -17664080 -16402431 -16175851 -16729570 -16296630
35950 -16296630 -15090275 -14854886 -15440134 -15138631 -14032224 -13784331 -14406565 -14344338 -13560412
35941 -13560412 -13518542 -14226340 -14201898 -13348252 -13082141 -13565653 -13456901 -12513526 -11947490 -12065076
35931 -12065076 -11899337 -11294501 -11126080 -11374658 -11113600 -10435404 -10328735 -10691480 -10514754
35922a0514754N83883n7590n20134K01722Q28824J86409n27658k5136O37554J48641
35912i058239n40906r8054O43842L38780l55463j84406L42908J92013r6508L20130
35902h495903O70716L7938o64105k71237M32321J78108m41421j93250M64625L77301
35892g904907j03901K7733M15520J67565k71825j1053M63835K22153k74914r5223
35882g365017L29759J01964l26678n0448M63154K60096k35162n6384M13603K07113
35872f258000l32687k32391K37368J58347k22187m7153L94855K28777k51179j19591
35862f443841L91455L42593j30541j48719K06447J38733k72256k80099N8592R3678
35852f043958q0674R2069L83600J95789j73285l6645L33323K16822j47580m2218
$$ plain form
35922 -10514754 -9930871 -9988461 -10508595 -10306873 -9478049 -9291640 -9819298 -9844434 -9206880 -9058239
35912 -9058239 -9599145 -9697199 -9053357 -8714577 -9070040 -9254446 -8911538 -8719525 -8816033 -8495903
35902 -8495903 -7825187 -7787249 -8451354 -8722591 -8290270 -8112162 -8553583 -8746833 -8282208 -7904907
35892 -7904907 -8008808 -7981075 -7565555 -7397990 -7669815 -7680868 -7217033 -6994880 -7269794 -7365017
35882 -7365017 -7035258 -6933294 -7259972 -7310420 -6847266 -6587170 -6822332 -6878716 -6465113 -6258000
35872 -6258000 -6590687 -6823078 -6585710 -6427363 -6649550 -6696703 -6301848 -6073071 -6324250 -6443841
35862 -6443841 -6052386 -5709793 -5840334 -5989053 -5782606 -5643873 -5916129 -6196228 -6137636 -6043958
35852 -6043958 -6124632 -6032563 -5648963 -5453174 -5626459 -5663104 -5329781 -5112959 -5260539 -5302757
35842e302757L04623J69128k34415j69569J97879J76238q5349J0997K13733o7500
35832d786992m23580r1245N08228L96487j98754k67490J49167J53191k53346k30367
35822e044701K40123L40485j2565r6303J66263J41448j61746r6779K80521K66415
35812c976839j09640j24343K27892K19357k00756l11995K4675K00337O2457L6637
35802c952218P1155k70275p01756n00082J34565L09540j3785n2869K63254K24029
35792d488442j77389j64844K93673L48516j41184l22777P9856L21792P7043n5649
35782d229405J55981J36032k39307k63127K47462M84139N5744l32526j55943J04913
35772d036037j2416j60393O49J50730L1956m8640Q5581J21947j2760O7462L48003
$$ plain form
35842 -5302757 -4998134 -4829006 -5063421 -5232990 -5035111 -4858873 -4944222 -4933225 -4719492 -4786992
35832 -4786992 -5210572 -5301817 -4793589 -4397102 -4595856 -4863346 -4714179 -4560988 -4814334 -5044701
35822 -5044701 -4804578 -4464093 -4476658 -4572961 -4406698 -4265250 -4426996 -4523775 -4243254 -3976839
35812 -3976839 -4086479 -4210822 -3982930 -3763573 -3964329 -4276324 -4251649 -4051312 -3988855 -3952218
35802 -3952218 -3881063 -4151338 -4853094 -5353176 -5218611 -4909071 -4922856 -4975725 -4712471 -4488442
35792 -4488442 -4665831 -4830675 -4537002 -4188486 -4329670 -4652447 -4572591 -4250799 -4173756 -4229405
35782 -4229405 -4073424 -3937392 -4176699 -4439826 -4192364 -3708225 -3652481 -3985007 -4140950 -4036037
35772 -4036037 -4048453 -4208846 -4208197 -4057467 -4025511 -4074151 -3988570 -3866623 -3879383 -3811921 -3463918
35761c463918K54021k81434n30648j56774K38076J71213j9248L4071J12626L0827
35751c611188L6888J79955Q7518k52615l14271J6365J71026p4149k00066N4337
35741c906200K16237K5888o4366J88580L00193j6780k63585m3134K53594J95182
35731c114391Q138P563L0573p0721m6628J82211K32262n3079k71971j79016n6451
35720c331510o7380K6396K16216J19499k05756j80849K45763L91975L1554j97260
35710b951352J7299J12077j95094k85551J73169M74440Q1880l83594k25289J48400
35700c033615N2266k49146j26018K40225K40655q0519k16887q9499K1493Q3002
35690c158043J87362J82267j3656j18307J2288N9706j46321k54972o2681Q8089
$$ plain form
35761 -3463918 -3209897 -3491331 -4021979 -4178753 -3940677 -3769464 -3788712 -3754641 -3642015 -3611188
35751 -3611188 -3574300 -3394345 -3306827 -3559442 -3873713 -3857348 -3686322 -3760471 -3960537 -3906200
35741 -3906200 -3689963 -3664075 -3728441 -3539861 -3239668 -3256448 -3520033 -3563167 -3309573 -3114391
35731 -3114391 -3106253 -3098690 -3068117 -3138838 -3185466 -3003255 -2770993 -2824072 -3096043 -3275059 -3331510
35720 -3331510 -3398890 -3372494 -3156278 -3036779 -3242535 -3423384 -3177621 -2785646 -2754092 -2951352
35710 -2951352 -2934053 -2821976 -3017070 -3302621 -3129452 -2655012 -2573132 -2956726 -3182015 -3033615
35700 -3033615 -2981349 -3230495 -3356513 -3116288 -2875633 -2956152 -3173039 -3262538 -3241045 -3158043
35690 -3158043 -2970681 -2788414 -2802070 -2920377 -2908089 -2848383 -2994704 -3249676 -3312357 -3224268
35680c224268K2085J11808M53664M79314k4087l59467o5879K50604O059l18349
35670b668516j13340K21434P7638j96922j3818K69406K2712m00106k67577J76248
35660b892841J75490j46793r2558K56649K36304r1901p0434K62232K36975j46162
35650b273039j90128J84283K62118j76787m78845k60054N1356Q7767P3536J88714
35640b531079J91880j5093j25231M080J17800R2768J22770K26125J46693j14486
35630a883773k24575r3686Q426j3976K3380J04032m159k19539j83329R3454J95855
35619b197890R057j17651j8485M7231o2689j34678n9992k8809j09040j02630L7871
35608b737705J01362M6910Q9880K46210K46074K8597j24435q7766q8386k40330
$$ plain form
35680 -3224268 -3202183 -3090375 -2636711 -2157397 -2181484 -2540951 -2606830 -2356226 -2350167 -2668516
35670 -2668516 -2781856 -2560422 -2482784 -2679706 -2693524 -2424118 -2401406 -2801512 -3069089 -2892841
35660 -2892841 -2717351 -2864144 -2956702 -2700053 -2463749 -2555650 -2626084 -2363852 -2126877 -2273039
35650 -2273039 -2463167 -2278884 -2016766 -2193553 -2672398 -2932452 -2881096 -2793329 -2719793 -2531079
35640 -2531079 -2339199 -2354292 -2479523 -2475443 -2357643 -2264875 -2142105 -1915980 -1769287 -1883773
35630 -1883773 -2108348 -2202034 -2193608 -2207584 -2184204 -2080172 -2084331 -2303870 -2487199 -2393745 -2197890
35619 -2197890 -2188833 -2306484 -2324969 -2277738 -2340427 -2475105 -2535097 -2563906 -2672946 -2775576 -2737705
35608 -2737705 -2636343 -2589433 -2499553 -2253343 -2007269 -1978672 -2103107 -2190873 -2279259 -2519589
35598b519589k99314q6639J84874K19613K7498j51468j30681Q7974L13656L15436
35588b038640J09503j7583O6715J17516m5391j69402k589K08747J16604j08673
35578a763193q6296Q3506K5300k01012k22623n1569j2911p1646R3658L87608L60998
35567a458180K230k08607j05181l7059j66118k11975n1939M3408l7838l4682J48465
35556b117476K25129N4979j08382r3916o5952j20550r1013O8040J46625Q6640
35546b015876Q5222J60296P5071j68278k38898l5933J37302J14379R6735J74882
35536a615098J22034j19466k31227n0481J32016O3247q8400r5602m4229q8425
35526b015631j55213j15721J7002J95225L65290L46823L3274k83224k20828O1664
$$ plain form
35598 -2519589 -2818903 -2905542 -2720668 -2501055 -2473557 -2625025 -2755706 -2667732 -2354076 -2038640
35588 -2038640 -1929137 -1946720 -1880005 -1762489 -1807880 -1977282 -1979871 -1771124 -1654520 -1763193
35578 -1763193 -1849489 -1765983 -1740683 -1941695 -2164318 -2215887 -2228798 -2300444 -2206786 -1819178 -1458180
35567 -1458180 -1455950 -1664557 -1769738 -1806797 -1972915 -2184890 -2236829 -2193421 -2231259 -2265941 -2117476
35556 -2117476 -1892347 -1837368 -1945750 -2039666 -2105618 -2226168 -2317181 -2249141 -2102516 -2015876
35546 -2015876 -1930654 -1770358 -1695287 -1863565 -2102463 -2138396 -2001094 -1886715 -1789980 -1615098
35536 -1615098 -1493064 -1612530 -1843757 -1894238 -1762222 -1698975 -1787375 -1882977 -1927206 -2015631
35526 -2015631 -2170844 -2286565 -2269563 -2074338 -1709048 -1362225 -1328951 -1612175 -1833003 -1771339
35516a771339O6306j95316j87837K01990M03313R7314k61471k21001j0753j0669
35506a889463r2124J6639J63742Q5623p4788m7619O4544J7777j02125o4536O9414
35495a852916Q4586K136p171O5453J19706J36301R6114p2291k75414k57495j0377
35484a971368J36193L6298k6650J38647K63565R0517j69098k13579j38867j54484
35474b008826j37391R3891L29533K48767m5325j94289j26853m1923O17Q6741J63096
35463a631962J04721k0628o5988q1812j88509k85384j82519O5454K26308K13775
35453a846544J17890R022p7969o9008M8069J53619J71413J63323J31633m5908
35443a244460l27491m16675j70539J48245K45662J74023J15392O1542l5060o1155
$$ plain form
35516 -1771339 -1705033 -1900349 -2088186 -1886196 -1482883 -1385569 -1647040 -1868041 -1878794 -1889463
35506 -1889463 -1981587 -1964948 -1801206 -1715583 -1790371 -1837990 -1773446 -1755669 -1857794 -1922330 -1852916
35495 -1852916 -1768330 -1766194 -1773365 -1707912 -1588206 -1451905 -1355791 -1428082 -1703496 -1960991 -1971368
35484 -1971368 -1835175 -1798877 -1825527 -1686880 -1423315 -1332798 -1501896 -1715475 -1854342 -2008826
35474 -2008826 -2146217 -2052326 -1722793 -1474026 -1519351 -1713640 -1840493 -1882416 -1881799 -1795058 -1631962
35463 -1631962 -1527241 -1547869 -1613857 -1695669 -1884178 -2169562 -2352081 -2286627 -2060319 -1846544
35453 -1846544 -1728654 -1719632 -1797601 -1866609 -1818540 -1664921 -1493508 -1330185 -1198552 -1244460
35443 -1244460 -1571951 -1988626 -2159165 -2010920 -1765258 -1591235 -1475843 -1414301 -1449361 -1510516
35433a510516K8112L7328j31123k32595o9765J46428J46002L6741M6799J03254
35423a399335M2738k3511L9414L8309j96351l56331p5835L81248M24135K8813
35413a096706k46420j25315P3343O3275k328P2980J68321J11452k1626r1118j28136
35402a222278j93673k03819p4982R9462J68470J25314P8490Q1039P1578k7000
35392a097399j80225k42449j37903r591n0948j91412j57144R9363K80914J84671
35382a502123L749r61J06522J09082j800r2155j41707j78554j18616O7812J81763
35371a566988O2806j05742m3699J86597K74304J10932j21142k47148k45032j48690
35361a843802j6621N8998P0429J20922K07699J63280k8803j05433O3958J99827
$$ plain form
35433 -1510516 -1482404 -1445076 -1576199 -1808794 -1878559 -1732131 -1586129 -1549388 -1502589 -1399335
35423 -1399335 -1356597 -1380108 -1340694 -1302385 -1498736 -1855067 -1930902 -1549654 -1125519 -1096706
35413 -1096706 -1343126 -1468441 -1395098 -1331823 -1334151 -1261171 -1092850 -981398 -1003024 -1094142 -1222278
35402 -1222278 -1415951 -1619770 -1694752 -1595290 -1426820 -1301506 -1223016 -1141977 -1070399 -1097399
35392 -1097399 -1277624 -1520073 -1657976 -1667567 -1718515 -1909927 -2067071 -1967708 -1686794 -1502123
35382 -1502123 -1498374 -1499335 -1392813 -1283731 -1285531 -1377686 -1519393 -1697947 -1816563 -1748751 -1566988
35371 -1566988 -1504182 -1609924 -1653623 -1467026 -1192722 -1081790 -1202932 -1450080 -1695112 -1843802
35361 -1843802 -1860423 -1801425 -1730996 -1610074 -1402375 -1239095 -1267898 -1373331 -1309373 -1109546
35351a109546L7326k24227k38962n1865O0539P6795J36308J38900q8883l39784
35341a603399k27815J90734M56564L68547J70689N9433n3664k09905k47376j11869
35331a208061J1106N812j6356K3147K1716p8628j53867j04540j3396R48n3055
35320a565174q4758k8375J00648J81669R1228r1422j28610J5058P8388n7140j19601
35309a608089Q5861K66400R3887j95243j41261J82957K96034Q5214r7857q8165
35299a120262r1068j70556j03270J35579K40058R0728l8404L5005J11473j1982
35289i22699k29305l61349l83135k79726R89L25233M21349K62160R0743M727j19149
35278a190162k32650r7201K18412K93412P993k13252o1565J88198J73686L752
$$ plain form
35351 -1109546 -1072220 -1296447 -1535409 -1587274 -1526735 -1449940 -1313632 -1174732 -1263615 -1603399
35341 -1603399 -1831214 -1640480 -1183916 -815369 -644680 -585247 -638911 -848816 -1096192 -1208061
35331 -1208061 -1196955 -1191143 -1207499 -1184352 -1162636 -1241264 -1395131 -1499671 -1513067 -1512119 -1565174
35320 -1565174 -1649932 -1678307 -1577659 -1395990 -1304762 -1396184 -1524794 -1509736 -1431348 -1488488 -1608089
35309 -1608089 -1522228 -1255828 -1161941 -1357184 -1498445 -1315488 -1019454 -934240 -1032097 -1120262
35299 -1120262 -1211330 -1381886 -1485156 -1349577 -1109519 -1018791 -1057195 -1022190 -910717 -922699
35289 -922699 -1152004 -1513353 -1896488 -2176214 -2175225 -1849992 -1428643 -1166483 -1075740 -1071013 -1190162
35278 -1190162 -1422812 -1520013 -1301601 -1008189 -1000196 -1213448 -1275013 -1086815 -913129 -909377
35268i09377l8349k602q4040j94448j25361M5376P4980m9465j46249j43751p6312
35257a649598Q7211L34604M54409K68942o2846k24596j51790m1563k9557p2521
35247a087305r8875q6128k4431N5876P3738J9513l894M1597M1990o2653j35838
35236a266410n6839O6914O7296k6334o7004k3823L0278P3458J17585J13410K2616
35225i48853p8818r7514o0345m5408m6340j0961N1315R2860R5990N3790l5025
35214a029309j01232m1977J21223K36224K23159J54363Q6719k4667j77744k60029
35204h13270k24229j62331j14581Q916J98915K42485K6403k20180k02647K3644
35194a236875J35459l806j77806j32730R1402K24226J03431j28258j97422l6739
$$ plain form
35268 -909377 -947726 -950328 -1034368 -1228816 -1354177 -1308801 -1233821 -1283286 -1429535 -1573286 -1649598
35257 -1649598 -1562387 -1227783 -773374 -504432 -567278 -791874 -943664 -985227 -1014784 -1087305
35247 -1087305 -1186180 -1272308 -1296739 -1240863 -1167125 -1147612 -1151506 -1109909 -1067919 -1130572 -1266410
35236 -1266410 -1323249 -1256335 -1189039 -1215373 -1282377 -1306200 -1275922 -1202464 -1084879 -971469 -948853
35225 -948853 -1027671 -1125185 -1185530 -1230938 -1277278 -1288239 -1236924 -1144064 -1048074 -994284 -1029309
35214 -1029309 -1130541 -1172518 -1051295 -815071 -591912 -437549 -350830 -375497 -553241 -813270
35204 -813270 -1037499 -1199830 -1314411 -1305495 -1106580 -864095 -837692 -1057872 -1260519 -1236875
35194 -1236875 -1101416 -1105222 -1283028 -1415758 -1324356 -1100130 -996699 -1124957 -1322379 -1359118
35184a359118J47140J67276Q4723M8683N3826K0977r236K5606K8759r3263j87388
35173a072015o1250J44847J22968j09192k36805j56147o8191m4261P5022K60753
35163a144271K18345j01770l24429j97918M5734J13940Q3736J35226J77812N9316
35153i34279j04812j21983m3756k4165m1065o502K7306L373J3936J02016J17557
35142a012374j603l4643J69229L58381K08000j79000m07602l18628j07231M190
35132a321281k6140j14918j32232M994J91901K06376K0108j36553j18882m4345
35122a470972o719R7484K82729L24787J29540m7758j4096L1796j18289k71385
35112a062883j62497O8419J16840J4860O14P1272N5276k7530n2280q2614k13324
$$ plain form
35184 -1359118 -1211978 -1044702 -959979 -911296 -857470 -836493 -845729 -820123 -791364 -884627 -1072015
35173 -1072015 -1133265 -988418 -865450 -974642 -1211447 -1367594 -1435785 -1480046 -1405024 -1144271
35163 -1144271 -925926 -1027696 -1352125 -1550043 -1504309 -1390369 -1306633 -1171407 -993595 -934279
35153 -934279 -1039091 -1161074 -1204830 -1228995 -1270060 -1276562 -1249256 -1245883 -1231947 -1129931 -1012374
35142 -1012374 -1013977 -1048620 -879391 -521010 -313010 -492010 -899612 -1218240 -1325471 -1321281
35132 -1321281 -1347421 -1462339 -1594571 -1589577 -1397676 -1191300 -1171192 -1307745 -1426627 -1470972
35122 -1470972 -1477691 -1380207 -1097478 -772691 -643151 -690909 -705005 -673209 -791498 -1062883
35112 -1062883 -1225380 -1156961 -1040121 -1025261 -1024647 -953375 -898099 -925629 -977909 -1060523 -1273847
35101a273847k83721j24891P6015N6011n1797M1396K31712J96805l218j7028J63333
35090i89230J85449l4103j68699m2602J21216J14420O707r5785j90715k06712
35080a300054m5111J51745J33463k0770J0703K22299K37538n8407k88636j68483
35070a125713Q4140J48752O1114J8391J6468n2535j53006j86012j56260r4472
35060a439133K4515J61918J95415J27063J10084J67923J17831j00005k58644j75716
35050a068749N866N3131k4085o7456m5272l4148l1531K6161J11784J20634J8940
35039i34725j03889j20319J5706J94470K20380L4880j76505k12929j27405j05645
35029a315981j46198q8459O5626J18354O131p9822J0735J68841K02170P6872r6055
$$ plain form
35101 -1273847 -1557568 -1682459 -1606444 -1550433 -1602230 -1560834 -1329122 -1132317 -1135535 -1152563 -989230
35090 -989230 -803781 -837884 -1006583 -1049185 -927969 -813549 -806842 -902627 -1093342 -1300054
35080 -1300054 -1345165 -1193420 -1059957 -1080727 -1070024 -847725 -610187 -668594 -957230 -1125713
35070 -1125713 -1041573 -892821 -831707 -813316 -796848 -849383 -1002389 -1188401 -1344661 -1439133
35060 -1439133 -1414618 -1252700 -1057285 -930222 -820138 -652215 -534384 -634389 -893033 -1068749
35050 -1068749 -1062883 -1009752 -1033837 -1101293 -1146565 -1180713 -1212244 -1186083 -1074299 -953665 -934725
35039 -934725 -1038614 -1158933 -1143227 -948757 -728377 -693497 -870002 -1082931 -1210336 -1315981
35029 -1315981 -1462179 -1550638 -1485012 -1366658 -1360527 -1440349 -1429614 -1260773 -1058603 -981731 -1077786
35018a077786j91462j36918L5847J81398J87663J15854P8013M2911o3596j42367
35008i70443m1385J46576J67302r682j43729r0411K7091O2684L8779K9136L7262
34997g46820M3089K2951p6176k34362k87474j42747K4129J8528l6316R5415L23884
34986i95899L54886J80343N5914K5181j04813l05318l01873p7118N8109L263J6820
34975a090505J81626K02549l9668j94782m569K40617J51791j71607l52725k82196
34965a359469j24489J3701J19666J44594R2338R1048J80629K03040P1203o5025
34955f32764q5215q5635j27926q0848Q0485J15487q6754k39653p9827K01703K61434
34944g59513J06811k4018p6441j36462j51169l5831P4347L796j40835j24274M2211
$$ plain form
35018 -1077786 -1269248 -1406166 -1370319 -1188921 -1001258 -885404 -807391 -764480 -828076 -970443
35008 -970443 -1011828 -865252 -697950 -707632 -851361 -941772 -914681 -851997 -813218 -784082 -746820
34997 -746820 -703731 -680780 -756956 -991318 -1278792 -1421539 -1397410 -1378882 -1415198 -1319783 -995899
34986 -995899 -641013 -460670 -404756 -379575 -484388 -789706 -1091579 -1168697 -1110588 -1107325 -1090505
34975 -1090505 -908879 -706330 -745998 -940780 -945349 -704732 -552941 -724548 -1077273 -1359469
34965 -1359469 -1483958 -1470257 -1350591 -1205997 -1113659 -1022611 -841982 -638942 -567739 -632764
34955 -632764 -717979 -803614 -931540 -1012388 -931903 -816416 -903170 -1142823 -1222650 -1020947 -759513
34944 -759513 -652702 -676720 -753161 -889623 -1040792 -1076623 -1002276 -998480 -1139315 -1263589 -1221378
34933a221378J53011J33107N5404n2301j67179j62637P966J47460Q2747n1103
34923a074903n4193j6078j18141k42054j33730J46082K97946K50504K01743K27537
34913e15287J96026P9612K4716O1705K9308j41654l00878l03887j85208o1857
34903a117404n958k2729l7649N6792K28379K71795R1990j02825q0148P1693J03752
34892e42312l776p1303n2227o0067j13171j17018p1558n0768j0186J36971K86371
34881f69044K46383N6025o6165q2114j57815l01511k82333j6831K22522J56581
34871h94302j05552j98401L8434L67379M31070J55862j76790k71809j52927n0870
34861h57906l6041K4651J51942J71969L4906o2769j5621Q411r5607j39111J4763
$$ plain form
34933 -1221378 -1068367 -935260 -879856 -932157 -1099336 -1261973 -1254007 -1106547 -1023800 -1074903
34923 -1074903 -1129096 -1145174 -1263315 -1505369 -1639099 -1493017 -1195071 -944567 -742824 -515287
34913 -515287 -319261 -239649 -214933 -153228 -123920 -265574 -566452 -870339 -1055547 -1117404
34903 -1117404 -1123362 -1146091 -1183740 -1126948 -898569 -626774 -534784 -637609 -717757 -646064 -542312
34892 -542312 -546088 -617391 -669618 -729685 -842856 -959874 -1031432 -1082200 -1092386 -955415 -669044
34881 -669044 -422661 -366636 -432801 -514915 -672730 -974241 -1256574 -1273405 -1050883 -894302
34871 -894302 -999854 -1198255 -1159821 -792442 -361372 -205510 -382300 -654109 -807036 -857906
34861 -857906 -893947 -869296 -717354 -545385 -510479 -573248 -588869 -580458 -676065 -815176 -800413
34850h00413J53614N7195j11027q0084Q1121J41194J25921J78940J85198m0767
34840a09108l18887l00077l2133J00758k2398j35044o7619L7156M1719K640j3939
34829h16932j7560K7436J42774J81538J3232j89617j59998K9420Q0224m0235q9728
34818h39446J949N8257J6069j3303l1912j29549j93189l8891J88940J75104k4132
34807h30103n3013J27718J93067O1449K1088J50041J46327r9605k74521j85979
34797g43531n4266m7242j685J50216J52348r1022k47568q6366J34127J25467K2541
34786f86981M4033P8157l2163j31627m5977P3159M6113P214J02202J49564k5089
34775d21395k04407j17574R4457J36675L9629j479k5752j44891k08504m8260J39516
$$ plain form
34850 -800413 -646799 -589604 -700631 -780715 -699594 -558400 -432479 -253539 -68341 -109108
34840 -109108 -427995 -728072 -760205 -659447 -681845 -816889 -884508 -847352 -805633 -802993 -816932
34829 -816932 -834492 -807056 -664282 -482744 -469512 -659129 -819127 -789707 -709483 -749718 -839446
34818 -839446 -837497 -779240 -763171 -776474 -808386 -937935 -1131124 -1170015 -981075 -805971 -830103
34807 -830103 -883116 -755398 -562331 -500882 -479794 -329753 -183426 -283031 -557552 -743531
34797 -743531 -797797 -845039 -846724 -696508 -544160 -635182 -882750 -969116 -834989 -709522 -686981
34786 -686981 -642948 -564791 -596954 -728581 -774558 -701399 -655286 -648072 -545870 -396306 -421395
34775 -421395 -625802 -743376 -648919 -512244 -472615 -474094 -499846 -644737 -853241 -901501 -761985
34764g61985P1475j39384j88228r0824o6936p9259N5514K26148J66466n2261j25755
34753i85029m2621m2174j01849L2890K98064L02524l1291k86103j72416P4027
34743i53978J21654K7118M4522J95392K76797J69104m3966j98860k05141j20910
34733f88268q5826j26096r8429O6067J83479O7195j55394k12226q7679R187J5961
34722a112029O3726J68323J71685L2190q1363m5082P4141J64571J84142J24910
34712b54786L1284K0643J12357J17894q5932k90816k42083o7322o5579j69795
34702h94135o4250J90119J66078j93731l76258p2357L13603K72226o2774j89506
34692i10985r847J22612J8884j02511j8614J73115K38421J20125l9088r1329k4888
$$ plain form
34764 -761985 -690510 -829894 -1018122 -1108946 -1175882 -1255141 -1199627 -973479 -807013 -859274 -985029
34753 -985029 -1027650 -1069824 -1171673 -1138783 -840719 -538195 -569486 -855589 -1028005 -953978
34743 -953978 -832324 -805206 -760684 -565292 -288495 -119391 -163357 -362217 -567358 -688268
34733 -688268 -774094 -900190 -998619 -932552 -749073 -681878 -837272 -1049498 -1137177 -1127990 -1112029
34722 -1112029 -1048303 -879980 -708295 -676105 -757468 -802550 -728409 -563838 -379696 -254786
34712 -254786 -223502 -202859 -90502 27392 -58540 -349356 -591439 -658761 -724340 -894135
34702 -894135 -958385 -768266 -602188 -795919 -1172177 -1244534 -930931 -658705 -721479 -910985
34692 -910985 -920832 -798220 -779336 -881847 -900461 -727346 -488925 -368800 -407888 -499217 -524105
34681e24105N9566P8541M7852J3037m8720j61891k30093j33849M9777J01475k8155
34670g76565j39065p9049N6905J14731R8329Q3099O2484J0423k5411j4840k0646
34659f29605p5104r6962l9059Q268j7279j4939R8649J97690J18534o5197j34432
34648f49436m5233L2707j1222r1112q4101J3332J27191J95226J75456N3542j14225
34637c97875k22611k14604j24545k2859M0689M6309J2620P07N8407J47258J67729
34626e08775P6493n3671j14443q1905k7941j8195l5817l1845k1467o7772j63538
34615a048876k03880j21048J9104J20107J88159K64987K83324J35588j10468k17219
34605f90222o6202J66571K15332L9877j55044j83217o9184L2046L5876m973j5683
$$ plain form
34681 -524105 -464539 -385998 -338146 -325109 -373829 -535720 -765813 -899662 -849885 -748410 -776565
34670 -776565 -915630 -994679 -937774 -823043 -724714 -641615 -579131 -568708 -594119 -608959 -629605
34659 -629605 -704709 -801671 -840730 -832462 -849741 -864680 -766031 -568341 -449807 -515004 -649436
34648 -649436 -694669 -661962 -673184 -764296 -848397 -835065 -707874 -512648 -337192 -283650 -397875
34637 -397875 -620486 -835090 -959635 -982494 -941805 -895496 -882876 -882169 -823762 -676504 -508775
34626 -508775 -432282 -485953 -600396 -682301 -710242 -728437 -764254 -796099 -817566 -885338 -1048876
34615 -1048876 -1252756 -1373804 -1354700 -1234593 -1046434 -781447 -498123 -362535 -473003 -690222
34605 -690222 -756424 -589853 -374521 -334644 -489688 -672905 -742089 -710043 -674167 -679140 -694823
34594f94823j1176m1623o8201L557J49097J99083O2968j18085j51634n3961N751
34583g19047k6680m0378K3603O9116R478r6297j45338j30006r4619k9700R3456
34572a086412K14893K07073L1168j70036j84380M1320L07162L48104J25046j32032
34562b98094j93415o5621Q4383J47128J25839M8264o1529j52207j78840j52050
34552f96142r7596j4164P1614Q2877L356o9053o4166m1175n4614l9234M6064R4579
34540g77654L5000n052P4257J03408r6192l31451k60220O0609K28256J09295K350
34529h57394R6587J79473P5357q054J36947K94837J47568j81892k88865r4356
34519d99792P3479j55j44828j29633L538O4675K842p3773p8140k8980J5038L0231
$$ plain form
34594 -694823 -705999 -747622 -815823 -812266 -663169 -464086 -401118 -519203 -670837 -724798 -719047
34583 -719047 -745727 -786105 -762502 -693386 -683908 -780205 -925543 -1055549 -1150168 -1179868 -1086412
34572 -1086412 -871519 -664446 -633278 -803314 -987694 -946374 -639212 -291108 -166062 -298094
34562 -298094 -491509 -557130 -472747 -325619 -199780 -151516 -213045 -365252 -544092 -696142
34552 -696142 -793738 -807902 -736288 -653411 -650055 -719108 -783274 -824449 -879063 -918297 -872233 -777654
34540 -777654 -742654 -747706 -673449 -570041 -666233 -997684 -1257904 -1197295 -969039 -859744 -857394
34529 -857394 -760807 -581334 -505977 -514031 -377084 -82247 65321 -116571 -405436 -499792
34519 -499792 -426313 -426468 -571296 -700929 -697391 -632716 -629874 -703647 -781787 -810767 -795729 -765498
34507g65498L3778M4358M7482Q618p3227j42377j32298k7268J18383K05600J56511
34496e25938J045j15199o8355R8916K21649J92345M2720j25357k09827j37862
34486f25863O1575K14488J49855p9785k26277j31219R9293K36535J70717j7963
34476a48644j64769j68219o8239K0641N8716R3780J01123l9015k93347l76666
34466i84639j12317K38231K76229J8439j54482p2020M2472O045m8090L8102J61388
34455e90642J34074m9310k54218l49475k34355Q0391L59854L43486J15490J5722
34445d28983J23760J55238k5680j64657p4368L9991k5242r8763K1305J54345M2365
34434b80689j77836k02519o4841n905k801J43470L49088L15377L0702j95209k08472
$$ plain form
34507 -765498 -731720 -687362 -639880 -631262 -704489 -846866 -979164 -1006432 -888049 -682449 -525938
34496 -525938 -524893 -640092 -708447 -609531 -387882 -195537 -152817 -278174 -488001 -625863
34486 -625863 -564288 -349800 -199945 -279730 -506007 -637226 -537933 -301398 -130681 -148644
34476 -148644 -313413 -481632 -549871 -529230 -470514 -376734 -275611 -314626 -607973 -984639
34466 -984639 -1096956 -858725 -582496 -564057 -718539 -790559 -748087 -742042 -790132 -752030 -590642
34455 -590642 -456568 -505878 -760096 -1109571 -1343926 -1263535 -903681 -560195 -444705 -428983
34445 -428983 -305223 -149985 -175665 -340322 -414690 -374699 -399941 -498704 -477399 -323054 -280689
34434 -280689 -458525 -661044 -725885 -731790 -734591 -591121 -242033 73344 104046 -91163 -299635
34423b99635j56535j33876m4167J16592J67775L8533j09474j43749j17227r6149
34413g77912m9407K9917Q9471J40566K24446K52302J02402j17178j53804J0664
34403b48533J20689L7227r0033j12972q9746r3098n4254O1428J22123K6627j14265
34392d34807j31043j9927R2579J16759N2699m2498q9959o1021k1916l1993m0278
34381f11405O963L4841k1146l9916R4401K12477O6427k24220k76077j5552K09453
34370e63754J72612N7481N7402M9670j02497k32289j36905O6116J32922O6342
34360d32900K2538m698j20845k51196k06921J098J48530J02524l0974p0711M6442
34349g97113K21451K69059R3758j58567k33778j07536k1194r0858j06144J02848
$$ plain form
34423 -299635 -456170 -590046 -634213 -517621 -349846 -311313 -420787 -564536 -681763 -777912
34413 -777912 -827319 -797402 -707931 -567365 -342919 -90617 11785 -105393 -259197 -248533
34403 -248533 -127844 -90617 -180650 -293622 -383368 -476466 -530720 -469292 -347169 -320542 -434807
34392 -434807 -565850 -585777 -493198 -376439 -323740 -366238 -456197 -517218 -539134 -571127 -611405
34381 -611405 -604442 -569601 -590747 -630663 -536262 -323785 -257358 -481578 -757655 -773207 -563754
34370 -563754 -391142 -333661 -276259 -226589 -329086 -561375 -698280 -632164 -499242 -432900
34360 -432900 -410362 -415060 -535905 -787101 -994022 -992924 -844394 -741870 -772844 -843555 -797113
34349 -797113 -575662 -306603 -212845 -371412 -605190 -712726 -733920 -824778 -930922 -828074
34339h28074L22000K49222k4922j51493n4299Q135r6686j83768r8181K8591J0638
34328h18837j07014j49220o3879O1528J46362J67151J25183N3704J1564R062p130
34317e71526m9126m6272K1497L4599j01468k51702j72322J39976L78363L01854
34307c16127N1034o7500j7387k6624j66452k17015m8833J33747J21614L7169P8893
34296d37481J31518k5241k55678k24052L7376J54779L7377P620J82447K14070
34286a77265r2061l49628j64953K13785K76549L4795p4332O3971J07959j16505
34276b77685l25937k40983J9213J73181J52544P6392K6995m036m5886j07307j41974
34265f95483n8473J39747K69291J66159o9566j91720j30875k0441N1685J03137
$$ plain form
34339 -828074 -506074 -256852 -281774 -433267 -487566 -479431 -576117 -759885 -858066 -829475 -818837
34328 -818837 -925851 -1075071 -1138950 -1077422 -931060 -763909 -638726 -585022 -573458 -564396 -571526
34317 -571526 -620652 -666924 -645427 -610828 -712296 -963998 -1136320 -996344 -617981 -316127
34307 -316127 -265093 -332593 -349980 -376604 -543056 -760071 -808904 -675157 -553543 -516374 -437481
34296 -437481 -305963 -331204 -586882 -810934 -773558 -618779 -581402 -573782 -391335 -177265
34286 -177265 -269326 -618954 -783907 -570122 -293573 -258778 -333110 -269139 -161180 -277685
34276 -277685 -603622 -844605 -825392 -652211 -499667 -423275 -396280 -400316 -446202 -553509 -695483
34265 -695483 -753956 -614209 -344918 -178759 -248325 -440045 -570920 -591361 -539676 -436539
34255d36539J02114k821r8852j0497J86952K16606J7781j51308j16487k6433n6529
34244c76013j22535o7924O0856J15139P1845k987q2044j21390k4012J82907K78212
34233h7946J28722r1030j47090q7516j19564k44097k60433j03043O2176J01590
34223h48231Q1421J18051J99299K12909P4763j86173m09150m01132j44374J36435
34213a166182K18624J43219J06101J46063J21173j6360j23490r7341k9005l6646
34203g33844q1370n6240M0721J29347J71591J76036J38304P3526N6850J24182
34193C9103J64885L4488k19661l62658k51854k5922O1182n5663k01697j98089
34183a015886n4963R4097J62695J51075P6320l7442j11285n4660J10109K34744
$$ plain form
34255 -436539 -334425 -337246 -436098 -446595 -259643 -43037 -25256 -176564 -293051 -319484 -376013
34244 -376013 -498548 -566472 -505616 -390477 -318632 -321619 -403663 -525053 -549065 -366158 -87946
34233 -87946 40776 -50254 -197344 -284860 -404424 -648521 -908954 -1011997 -949821 -848231
34223 -848231 -766810 -648759 -449460 -236551 -161788 -347961 -757111 -1158243 -1302617 -1166182
34213 -1166182 -947558 -804339 -698238 -552175 -431002 -447362 -570852 -668193 -697198 -733844
34203 -733844 -815214 -871454 -830733 -701386 -529795 -353759 -215455 -141929 -85079 39103
34193 39103 203988 238476 18815 -343843 -595697 -621619 -560437 -616100 -817797 -1015886
34183 -1015886 -1070849 -976752 -814057 -662982 -586662 -624104 -735389 -790049 -679940 -445196
34173d45196J97856K8509j45410k21463j76148o2479R349m1182j47529j35592
34163a139285N7029K71911L18753K06065Q6429L3541j673m7715o2574k9771J1449
34152b95841L9816N4423J3153j09163k08600j50771p05J9111j38434k32779p2686
34141a082476J85411K35816K5661k04032k31985p0902J09760J64170Q6600J8353
34131g63624R7291K52287K49457K4015j77569j32515L0043N0150m3721k6982Q2997
34120c58171L6171j77008k35292n322J93064O9350j71977j48580J10585K31447
34110d55733O1272j58492j88121p6709J2731M6585Q2651J24743J20532N1344k9731
34099d08928l9291M3909J22159Q5564n250K6081J73457J85096o5939l38491l59698
$$ plain form
34173 -445196 -247340 -218831 -364241 -585704 -761852 -824331 -814982 -856164 -1003693 -1139285
34163 -1139285 -1082256 -810345 -491592 -285527 -199098 -165557 -167230 -214945 -277519 -307290 -295841
34152 -295841 -256025 -201602 -188449 -297612 -506212 -656983 -657688 -638577 -777011 -1009790 -1082476
34141 -1082476 -897065 -661249 -635588 -839620 -1071605 -1142507 -1032747 -868577 -781977 -763624
34131 -763624 -666333 -414046 -164589 -140574 -318143 -450658 -420615 -370465 -414186 -441168 -358171
34120 -358171 -322000 -499008 -734300 -739622 -546558 -477208 -649185 -797765 -687180 -455733
34110 -455733 -394461 -552953 -741074 -817783 -805052 -758467 -675816 -551073 -430541 -379197 -408928
34099 -408928 -448219 -404310 -282151 -196587 -201837 -175756 -2299 182797 116858 -221633 -581331
34088e81331k25551j83110j66773O9816M22806M74580J30099j90556j56423L4344
34078c72099L9510j09298j53578m7817M5093N5660L4571k3463j38886k03701j01239
34067i75247Q2317J58251R4127R41o4618j02666n6342R5143J94441Q4570j10548
34056e99631j24386M4085J15664l5595j83306q7532J66587L09268K33942O7953
34046i2951k8363j7717K7421J8190o3389j45922j54387j05130p1777p1046m4254
34035g49325M8803J68701K25499J40718p8941k89784l02003r3960J32193J90026
34025f08073J22273P5030O1857N873o6301o3958k4520o8442j68057j51665L9663
34014h46320K62867L61106K96639J01752j38095k59294j61706K3331R0448O1954
$$ plain form
34088 -581331 -806882 -989992 -1156765 -1086949 -664143 -189563 -59464 -250020 -406443 -372099
34078 -372099 -332589 -441887 -595465 -643282 -598189 -542529 -507958 -531421 -670307 -874008 -975247
34067 -975247 -892930 -734679 -640552 -639611 -704229 -806895 -863237 -768094 -573653 -489083 -599631
34056 -599631 -724017 -679932 -564268 -599863 -783169 -870701 -704114 -394846 -160904 -92951
34046 -92951 -121314 -139031 -111610 -93420 -156809 -302731 -457118 -562248 -634025 -705071 -749325
34035 -749325 -700522 -531821 -306322 -165604 -244545 -534329 -836332 -930292 -798099 -608073
34025 -608073 -485800 -410770 -348913 -343040 -409341 -473299 -497819 -566261 -734318 -885983 -846320
34014 -846320 -583453 -222347 74292 176044 37949 -221345 -383051 -359720 -269272 -207318
34004b07318J01612J56541M992k94461l69088r6315J54260P7154j01543l3360
33994f07526J58473J09450j38558j85464P3681K90157K20531M8924J2488M2268
33984B4424k4672j36410j53557r9094o6818k7125O4250Q6942q0054k90681k75756
33973i78551m0896J18472M2488p7609j6881J40138J51787L826p3267L7388J62962
33962e30143J04140o9245j26039j2864P5910j0339j54906j36151O1174K20717
33952e77746J76957J1198q1819l8115N0423J07215J48463J73444R6482j20599
33942e4097l32198l27887r4473J41389J72060L4947p2259l8567P1008J36674J13405
33931b49998L9270k5263m9027m9111o2565q6807p0394J0121R3538J00494M0658
$$ plain form
34004 -207318 -105706 50835 55827 -238634 -607722 -704037 -549777 -472623 -574166 -607526
33994 -607526 -449053 -339603 -478161 -663625 -589944 -299787 -79256 -30332 -17844 24424
33984 24424 -248 -136658 -290215 -389309 -456127 -483252 -419002 -332060 -412114 -702795 -978551
33973 -978551 -1019447 -900975 -858487 -936096 -952977 -812839 -661052 -657226 -730493 -693105 -530143
33962 -530143 -426003 -495248 -621287 -634151 -558241 -568580 -723486 -859637 -798463 -577746
33952 -577746 -400789 -389591 -471410 -509525 -459102 -351887 -203424 -29980 66502 -54097
33942 -54097 -386295 -714182 -808655 -667266 -495206 -460259 -532518 -571085 -500077 -363403 -249998
33931 -249998 -210728 -235991 -285018 -334129 -396694 -483501 -553895 -543774 -450236 -349742 -309084
33920c09084J990L2410P8875O3457o854l8737K4788R8112L0229j73983k86172
33909d84969j23092J59414K15115k4568k28950j15935J65707K70738J23020p0361
33899a13881j66187j94944j68793m3044J11417J36410L8248m470N9134P0914l4236
33888c09432q7041J3237Q2294n6220k41217j93242M4151J56779K7028j14661n4383
33877g32707J15279J80941J15850M7608J5484o2835j91343k25475p4927J29687
33867f82438J86565Q6462l713k461K367l7285k5490O5351O4871j24452k78828
33856g49051j33442J76554K54495R726k20681j71569K8779J47354J73404J90625
33846b93806J68788Q5181N2738J16745J03998r9307k84796j96873N5377J42674
$$ plain form
33920 -309084 -307094 -274684 -195809 -132352 -139206 -177943 -153155 -55043 -24814 -198797 -484969
33909 -484969 -608061 -448647 -233532 -258100 -487050 -602985 -437278 -166540 -43520 -113881
33899 -113881 -280068 -475012 -643805 -686849 -575432 -439022 -400774 -405244 -346110 -275196 -309432
33888 -309432 -396473 -383236 -300942 -357162 -598379 -791621 -747470 -590691 -563663 -678324 -732707
33877 -732707 -617428 -436487 -320637 -273029 -257545 -320380 -511723 -737198 -812125 -682438
33867 -682438 -495873 -409411 -413124 -415585 -413218 -450503 -475993 -410642 -345771 -470223 -749051
33856 -749051 -882493 -705939 -451444 -441718 -662399 -833968 -805189 -657835 -484431 -293806
33846 -293806 -125018 -39837 12901 129646 233644 134337 -150459 -347332 -291955 -149281
33836a49281n13j18543m1796J10436J59173P7175o9994k10887k56672j59987j5264
33825f76153L7403J3932M3901J31814J37341J7688q6905o3879K6340P5363O5648
33814b77507K6414l1333q0973q4461o9992j02737j52932j14684J0242Q2164L4540
33803g61259j3656O1307J98530K36030J16202o5559j68640j18609L4562J38414
33793c42678P8462q3709j81330j54826r5272o6064j3963Q7964J39059N2418r0159
33782f70098j32385m5621N4398O9238K3391R009O2479J03875J5328j91507l25513
33771a027406k13471P3314K88358K94550J64631J1668j18573j61311l2651J90437
33761e30454K65716J01020p2464j1503J77875J99577R590j42475j05974k0582
$$ plain form
33836 -149281 -149794 -268337 -310133 -199697 -40524 36651 -33343 -244230 -500902 -660889 -676153
33825 -676153 -638750 -624818 -580917 -449103 -311762 -294074 -380979 -444858 -418518 -343155 -277507
33814 -277507 -251093 -282426 -363399 -447860 -517852 -620589 -773521 -888205 -877963 -795799 -761259
33803 -761259 -774915 -713608 -515078 -279048 -162846 -228405 -397045 -515654 -481092 -342678
33793 -342678 -264216 -347925 -529255 -684081 -779353 -845417 -859380 -771416 -632357 -579939 -670098
33782 -670098 -802483 -848104 -793706 -724468 -701077 -692068 -629589 -525714 -510386 -701893 -1027406
33771 -1027406 -1240877 -1167563 -879205 -584655 -420024 -408356 -526929 -688240 -720891 -530454
33761 -530454 -264738 -163718 -236182 -247685 -69810 129767 139357 -3118 -109092 -129674
33751a29674m6371j10296n4656R8413J82656J20658r923j13355j68575j88850
33741d19973j75169j23429l0276R8699K04472J80441O524j53541j10512Q5111
33731d37653J72536L1039j37427q7725J21453K24819J30744Q598o612N44q9717
33720f9401k18158k32190r6689Q0880J80433J54729M1171n4667m4150L4427N8723
33709a64892n90m6737l0692k0850m0800N3J13330J40081K49j27126o3070P1535
33697a69509M0452j33108k26238j72147q7559K866J70652L18666K32142m4973
33687f8756j91434p8070L0792r7423k99849k92588j01293K7773Q801l5311k4508
33676a121866O151M9306J36435K06354J38830m6523j59842o4699J48739K63695
$$ plain form
33751 -129674 -176045 -286341 -340997 -242584 -59928 60730 50807 -62548 -231123 -419973
33741 -419973 -595142 -718571 -748847 -650148 -445676 -265235 -258711 -412252 -522764 -437653
33731 -437653 -265117 -234078 -371505 -459230 -337777 -112958 17786 26384 19772 20316 -69401
33720 -69401 -287559 -519749 -616438 -535558 -355125 -200396 -159225 -213892 -258042 -223615 -164892
33709 -164892 -165482 -212219 -242911 -263761 -304561 -304508 -191178 -51097 -50848 -177974 -241044 -169509
33697 -169509 -129057 -262165 -488403 -660550 -748109 -745243 -574591 -255925 -23783 -68756
33687 -68756 -260190 -338260 -307468 -404891 -704740 -997328 -1098621 -1070848 -1062047 -1097358 -1121866
33676 -1121866 -1115715 -1066409 -929974 -723620 -584790 -631313 -791155 -855854 -707115 -443420
33666d43420J72641j6473j03220j6449J08737J02573k9651j40552j47988r6457
33656f10259k5145P9350J71671J41158j7184j53582j57015q2625k5109N841J6285
33645f56614k2286o9907j6070J17986J37152l6781j96289j36178M2510J16731
33635g19746R3866J37439K32179J95405L713j43397j14484Q565J08617J60189
33625c7654J38122j520j76600j94158r769J72113J60098J5978p4689o5055n1103
33614a24237p9829q8742l0788L8177K5493q1717j81587j40501O6894K96640L51691
33603E1494J81535n6590j53774n6169R0153R6227o2940k08474j63025J2647P7013
33592a91903o2217j91872p8890J77808K55104M6832j89382j80587K4539J71219
$$ plain form
33666 -443420 -270779 -287252 -390472 -406921 -298184 -195611 -225262 -365814 -513802 -610259
33656 -610259 -635404 -556054 -384383 -243225 -260409 -413991 -571006 -653631 -678740 -672899 -656614
33645 -656614 -678900 -748807 -764877 -646891 -509739 -546520 -742809 -878987 -836477 -719746
33635 -719746 -625880 -488441 -256262 -60857 -57144 -200541 -315025 -306460 -197843 -37654
33625 -37654 100468 98948 -77652 -271810 -281579 -109466 50632 66610 -8079 -73134 -124237
33614 -124237 -204066 -292808 -323596 -285419 -259926 -341643 -523230 -663731 -596837 -300197 51494
33603 51494 233029 176439 22665 -33504 56649 152876 89936 -118538 -281563 -268916 -191903
33592 -191903 -254120 -445992 -524882 -347074 -91970 -45138 -234520 -415107 -390568 -219349
33582b19349J36789J8477n8295p4337n4932J716P7282R4163O948r7296p8846O1228
33570a86452J50195O0577j07537j53651n3204J5511o1039j64955j24613L7865
33560e87303J49760J27873N3823J6992j135m8183r4190p3785L028N3055L4394
33549c65671j802o876k9392j35074k50408k05882J7985K10781K02638J04638J21863
33538c37200K14164J62718n3582k01484j56757p2684q4106q6836K6088J24098
33528d65581N0592q7774q0499N1639J19404Q0021M4955K8613n2315j40901o3633
33517e15479J63716K88573J65852m0920j03707k0051N2860L7172j0109j7013J7853
33506A8747L4224k9874j54961k21463j38542J6531P3455j4019j16670j07621m358
$$ plain form
33582 -219349 -82560 -64083 -122378 -196715 -251647 -249931 -172649 -78486 -71538 -168834 -247680 -186452
33570 -186452 -36257 24320 -83217 -236868 -290072 -274561 -335600 -500555 -625168 -587303
33560 -587303 -437543 -309670 -255847 -238855 -239990 -288173 -382363 -456148 -453120 -400065 -365671
33549 -365671 -367473 -374349 -403741 -538815 -789223 -995105 -977120 -766339 -563701 -459063 -337200
33538 -337200 -123036 39682 -13900 -215384 -372141 -444825 -528931 -615767 -589679 -465581
33528 -465581 -414989 -502763 -583262 -531623 -412219 -332198 -287243 -258630 -310945 -451846 -515479
33517 -515479 -351763 -63190 102662 61742 -41965 -62016 -9156 28016 17907 894 18747
33506 18747 52971 23097 -131864 -353327 -491869 -475338 -401883 -415902 -532572 -640193 -644551
33495f44551Q5436Q3692p166j07735j15044j3891Q5531R1087O4323J08973J73533
33484a95812J15152n2610j43251o2918N6721N3933n3491j25881q1605M4510J59191
33473b86061J81073J01756l21m7719n4254p1138q1105l9968J1181k754m4639n265
33461c39214J07664J58587Q4260k3005o2521l8393N024N0639P8792O4638K6202
33450A12673m566m4625j00989r6373J2747R9010K3526j11124q6321P1523J10667
33439a3852l6730j38040l5783J22993J56142J01363N2663k7331j52436j78730
33429a49741l0595J13020O9149o3191q0933j959J6788k7765j3658O1411R1177
33418a6297N9765K2822m6214j76143k30537o6375J74975K01261O079r6512N6780
$$ plain form
33495 -644551 -559115 -475423 -482589 -590324 -705368 -719259 -633728 -542641 -478318 -369345 -195812
33484 -195812 -80660 -133270 -276521 -339439 -282718 -228785 -282276 -408157 -489762 -445252 -286061
33473 -286061 -104988 -3232 -3553 -51272 -105526 -176664 -257769 -297737 -286556 -289310 -333949 -339214
33461 -339214 -231550 -72963 11297 -11708 -74229 -112622 -107598 -56959 21833 86471 112673
33450 112673 108107 63482 -37507 -133880 -121133 -22123 1403 -109721 -196042 -124519 -13852
33439 -13852 -50582 -188622 -224405 -101412 54730 156093 208756 181425 28989 -149741
33429 -149741 -180336 -67316 1833 -61358 -142291 -144250 -127462 -155227 -168885 -107474 -16297
33418 -16297 43468 66290 20076 -156067 -386604 -452979 -278004 -76743 -70664 -167176 -110396
33407a10396K24595J16203j89139l56299k27723K3940J49846J01332J7992O343
33397b43306M421r9641k58146k80115r1102J35733J97033J12120L7417J0165o0252
33386e35673j81373k31190j40258J7897J44835K08655J96556R5151m4747j23367
33376e93514j06555m2035M7078J74595K77316K23966O851j85924j83340m1125
33366d22687N5528M1054J0699L1009K6579r2362k53937k63673l8370K56326L67335
33355b82499K42367P6943M6741Q6155K1374j43908k18447j04717N0894O0916n1044
33344b15225j07798l2540P9183J32110J42095J30140L6000j51577k70402j52221
33334d10235J13141K51451J58083M916m9450n6293q7334o3323N8005J15341j0640
$$ plain form
33407 -110396 114199 230402 41263 -315036 -542759 -518819 -368973 -267641 -249649 -243306
33397 -243306 -238885 -338526 -596672 -876787 -967889 -832156 -635123 -523003 -485586 -475421 -535673
33386 -535673 -717046 -948236 -1088494 -1070597 -925762 -717107 -520551 -425400 -470147 -593514
33376 -593514 -700069 -742104 -695026 -520431 -243115 -19149 -12298 -198222 -381562 -422687
33366 -422687 -367159 -326105 -315406 -284397 -257818 -350180 -604117 -867790 -906160 -649834 -282499
33355 -282499 -40132 36811 83552 169707 191081 47173 -171274 -275991 -225097 -164181 -215225
33344 -215225 -323023 -355563 -276380 -144270 -2175 127965 163965 12388 -258014 -410235
33334 -410235 -297094 -45643 112440 117356 67906 11613 -75721 -139044 -81039 34302 23662
33323B3662j49476j01572L689o8649k00905q4139K15501K97179O5632j30765j06732
33312b36575r8474k20528j67891K10930M96464K92643j18604k11401l0608k9047
33302a13091k65420l40028q9710J84078K28624J29787K3797p1848p3421J24005
33292b63227L36665K26201j49246l16064o3036K50170K51221N2459m8906l6662
33282B39575n3491p2403P614J15460J21209N8193J8835k7277j15185j38999k6605
33271A26926Q7472O6237M490N1547J35658Q6275p5711j79773j52584m7854P1682
33260A74365J27653L4312j28285j20344R8065K32645J19832O0040L15835N14201
33250A428319P6131q37566j382127j112030m75575n3556J62638M10192N49069
$$ plain form
33323 23662 -125814 -227386 -223697 -292346 -493251 -577390 -361889 -64710 922 -129843 -236575
33312 -236575 -335049 -555577 -723468 -512538 -16074 276569 157965 -53436 -84044 -113091
33302 -113091 -378511 -718539 -808249 -624171 -395547 -265760 -241963 -313811 -387232 -263227
33292 -263227 73438 299639 150393 -165671 -228707 21463 272684 325143 276237 239575
33282 239575 186084 113681 121295 236755 357964 416157 434992 407715 292530 153531 126926
33271 126926 214398 280635 285125 336672 472330 558605 482894 303121 150537 102683 174365
33260 174365 302018 336330 208045 87701 185766 418411 538243 598283 914118 1428319
33250 1428319 1504450 666884 -715243 -1827273 -2302848 -2356404 -2193766 -1783574 -1234505
33241a234505L16393q8986k04955J3598J84508J40496J18313K39325K52339o084
33231b69558k58844j79312J12249K44453J26021j9736n3651m8565m8898J836O0075
33220c33930k1377k13646k66362o2516J80722K08079N7664n6532n3441j0851Q355
33209e63835p708p2737j44152j00321P8005K04406J31703m539J2100J26551J04165
33198b36362p6314j86627j12918l566k130n2691m4670K9258J24997J99281J71185
33187a90557l002j89052j90790l3465O6446L8703L4857J20219J50931N1471m2347
33176a86586m1033n2627j34807j49453l4643L2152n6085j15843m78J04459O192
33165f28752j06028M5609L16946L23745M0185j86594j88616j45760j75171j41293
$$ plain form
33241 -1234505 -918112 -1007098 -1212053 -1198455 -1013947 -873451 -755138 -515813 -263474 -269558
33231 -269558 -528402 -707714 -595465 -351012 -224991 -244727 -298378 -346943 -395841 -394005 -333930
33220 -333930 -355307 -568953 -835315 -897831 -717109 -509030 -451366 -507898 -561339 -572190 -563835
33209 -563835 -571543 -644280 -788432 -888753 -810748 -606342 -474639 -479178 -467078 -340527 -236362
33198 -236362 -312676 -499303 -612221 -615787 -617917 -670608 -715278 -686020 -561023 -361742 -190557
33187 -190557 -193559 -382611 -573401 -606866 -540420 -501717 -466860 -346641 -195710 -144239 -186586
33176 -186586 -227619 -280246 -415053 -564506 -599149 -566997 -623082 -738925 -739403 -634944 -628752
33165 -628752 -734780 -689171 -372225 -48480 -8295 -194889 -383505 -529265 -704436 -845729
33155h45729K2972J46560J16715O4958J07962J50611J01034N1887P5720M6737
33145C9427j36779l17670k76204n1609J19787J12166M19r0082q7054J4173J22299
33134e51127J02138m3907j34880n7741N9784O0337J3229O6686J50925P9707r7172
33123c52021j21384O3796K01953J18353k0239L750J13386Q7437q6082k27808k52925
33112d71784k23953j70633p1206J2022n865m1193O0549K21359J87123m2059j21566
33101f67206J37232M30967L67355J6413k19286j67777k9278n009p0028j30905
33091c37522j61902j33827r910J33602J54164N1986k4832q037K1816J0916j785
33080c05331j6331q0907j39609p0253Q5588J39752N7131J5978R6388J42217L9584
$$ plain form
33155 -845729 -822757 -676197 -559482 -494524 -386562 -235951 -134917 -83030 -7310 39427
33145 39427 -97352 -415022 -691226 -742835 -623048 -510882 -510463 -600545 -687599 -673426 -551127
33134 -551127 -448989 -492896 -627776 -685517 -625733 -565396 -552167 -485481 -334556 -254849 -352021
33123 -352021 -473405 -409609 -207656 -89303 -109542 -105792 7594 95031 8949 -218859 -471784
33112 -471784 -695737 -866370 -937576 -925554 -931419 -972612 -912063 -690704 -503581 -545640 -667206
33101 -667206 -529974 -99007 268348 284761 65475 -102302 -131580 -136589 -206617 -337522
33091 -337522 -499424 -633251 -643161 -509559 -355395 -303409 -328241 -336278 -314462 -303546 -305331
33080 -305331 -321662 -402569 -542178 -612431 -526843 -387091 -329960 -313982 -217594 -75377 -35793
33069c5793r2855j22830j04122j15281r7934j0988L8417k0778p6458k4354N7189
33058f05787O6463M0636K3184l6482j09844m1233J57757K13653K890j95227j13742
33047e97732Q4511J10569L2774Q9141K07397J26678j15619k30801j55000q9664
33037e37746r7230l6509R8888J40272O3013J1169p288j09134k11827r3451J77528
33026f02315K54509M7761j21523l3418J14410P5440p1586j20984o1095M485N8164
$$ plain form
33069 -35793 -128648 -251478 -355600 -470881 -568815 -579803 -541386 -562164 -638622 -662976 -605787
33058 -605787 -539324 -498688 -475504 -511986 -621830 -663063 -505306 -291653 -288763 -483990 -597732
33047 -597732 -513221 -402652 -369878 -280737 -73340 53338 -62281 -293082 -448082 -537746
33037 -537746 -634976 -671485 -572597 -432325 -369312 -358143 -365431 -474565 -686392 -779843 -602315
33026 -602315 -347806 -300045 -421568 -454986 -340576 -265136 -336722 -457706 -518801 -514316 -456152
$$ [...]
##END NTUPLES=NMR SPECTRUM
##END=
