##TITLE=31Pdec_BAU-j-17AF
 DMSO-d6, 24 sc
 17.12.2019
##JCAMPDX= 6.0         $$ Bruker NMR JCAMP-DX V2.0
##DATA TYPE= NMR SPECTRUM
##DATA CLASS= NTUPLES
##ORIGIN= UXNMR, Bruker Analytische Messtechnik GmbH
##OWNER= root
$$ XWIN-NMR		Version 3.5
$$ Tue Dec 17 16:37:31 2019 Russian Standard Time (UT+4h)  she@DPX200
##.OBSERVE FREQUENCY= 81.013821
##.OBSERVE NUCLEUS= ^31P
##.ACQUISITION MODE= SIMULTANEOUS
##.ACQUISITION SCHEME= undefined
##.AVERAGES= 24
##.DIGITISER RES= 17
##SPECTROMETER/DATA SYSTEM= spect
##.PULSE SEQUENCE= zgpg30
##.SOLVENT NAME= DMSO
##.SHIFT REFERENCE= (INTERNAL, DMSO, 0, 182.463)
##AUDIT TRAIL= $$ (NUMBER, WHEN, WHO, WHERE, WHAT)
$$ ##TITLE= Audit trail, XWIN-NMR		Version 3.5
$$ ##JCAMPDX= 5.01
$$ ##ORIGIN= Bruker BioSpin GmbH
$$ ##OWNER= she
$$ F:/spectra/data/she/nmr/P31/1/pdata/1/auditp.txt
$$ ##AUDIT TRAIL=  $$ (NUMBER, WHEN, WHO, WHERE, WHAT)
(   1,<2019-12-17 16:36:31.81 +0400>,<she>,<DPX200>,
      <created by zg, POWCHK disabled, PULCHK disabled
       configuration hash MD5:
       00 E9 B6 7A A2 85 ED C7 34 08 36 98 17 FE 4E 26
       data hash MD5: 32K
       13 8D E8 47 5A 94 42 9A 45 C4 2D E6 E8 4F 66 2C>)
(   2,<2019-12-17 16:36:44.06 +0400>,<she>,<DPX200>,
      <Start of raw data processing
       efp BC_mod = 2 LB = 1 FT_mod = 6 PKNL = 1 PHC0 = -1307.025 PHC1 = 15.60095 SI = 64K 
       data hash MD5: 64K
       B9 97 31 09 97 2A 19 CD 6B 2E 64 1F D2 DD 63 55>)
(   3,<2019-12-17 16:37:04.14 +0400>,<she>,<DPX200>,
      <pk PHC0 = -2.66546 PHC1 = 42.8 
       data hash MD5: 64K
       AF 96 A4 B9 37 46 98 50 5E F5 B2 96 74 46 FF 65>)
(   4,<2019-12-17 16:37:06.26 +0400>,<she>,<DPX200>,
      <abs ABSG = 5 
       data hash MD5: 64K
       BD 8A 82 5A 69 D5 2C 6E 5D A9 AC 2E 3F AE 57 A2>)
$$ ##END=
$$ 
$$ hash MD5
$$ B1 A0 CB 50 B1 A6 FB 21 D7 8D 35 5A 24 11 D1 A7
##$RELAX= 
##$RELAX= 
##$RELAX= 
##$RELAX= 
##$RELAX= 
##$RELAX= 
##$RELAX= 
##$RELAX= 
$$ Bruker specific parameters
$$ --------------------------
##$DU= <F:/spectra>
##$EXPNO= 1
##$NAME= <P31>
##$PROCNO= 1
##$TYPE= <nmr>
##$USER= <she>
##$AMP= (0..31)
100 100 100 100 100 100 100 100 100 100 100 100 100 100 100 100 100 100 
100 100 100 100 100 100 100 100 100 100 100 100 100 100 
##$AQSEQ= 0
##$AQ_mod= 1
##$AUNM= <au_zg>
##$AUTOPOS= <>
##$BF1= 81.014009
##$BF2= 200.13
##$BF3= 200.13
##$BF4= 200.13
##$BF5= 200.13
##$BF6= 200.13
##$BF7= 200.13
##$BF8= 200.13
##$BYTORDA= 1
##$CFDGTYP= 0
##$CFRGTYP= 5
##$CHEMSTR= <none>
##$CNST= (0..31)
1 1 145 1 1 1 1 1 1 1 1 1 1 1 1 1 1 1 1 1 1 1 1 1 1 1 1 1 1 1 1 1 
##$CPDPRG= <waltz16>
##$CPDPRG1= <>
##$CPDPRG2= <waltz16>
##$CPDPRG3= <>
##$CPDPRG4= <mlev>
##$CPDPRG5= <mlev>
##$CPDPRG6= <mlev>
##$CPDPRG7= <mlev>
##$CPDPRG8= <mlev>
##$CPDPRGB= <>
##$CPDPRGT= <>
##$D= (0..31)
0 1 0 0 0 0 0 0 0 0 0 0.03 2e-05 3e-06 0 0 0 0 0 0 0 0 0 0 0 0 0 0 0 0 
0 0 
##$DATE= 1576586191
##$DBL= (0..7)
120 120 120 11 120 120 24 19 
##$DBP= (0..7)
150 150 150 150 150 150 150 150 
##$DBP07= 0
##$DBPNAM0= <>
##$DBPNAM1= <>
##$DBPNAM2= <>
$$ [...]
##$SUBNAM3= <"">
##$SUBNAM4= <"">
##$SUBNAM5= <"">
##$SUBNAM6= <"">
##$SUBNAM7= <"">
##$SUBNAM8= <"">
##$SUBNAM9= <"">
##$SW= 369.568048894756
##$SWIBOX= (0..15)
0 1 3 0 0 0 0 0 0 0 0 0 0 0 0 0 
##$SW_h= 29940.119760479
##$TD= 32768
##$TD0= 1
##$TE= 0
##$TE2= 300
##$TE3= 300
##$TEG= 300
##$TL= (0..7)
0 120 53 12 22 120 120 120 
##$TP= (0..7)
150 150 150 150 150 150 150 150 
##$TP07= 0
##$TPNAME0= <>
##$TPNAME1= <>
##$TPNAME2= <>
##$TPNAME3= <>
##$TPNAME4= <>
##$TPNAME5= <>
##$TPNAME6= <>
##$TPNAME7= <>
##$TPOAL= (0..7)
0.5 0.5 0.5 0.5 0.5 0.5 0.5 0.5 
##$TPOFFS= (0..7)
0 0 0 0 0 0 0 0 
##$TUNHIN= 0
##$TUNHOUT= 0
##$TUNXOUT= 0
##$USERA1= <user>
##$USERA2= <user>
##$USERA3= <user>
##$USERA4= <user>
##$USERA5= <user>
##$V9= 5
##$VALIST= <valist>
##$VCLIST= <CCCCCCCCCCCCCCC>
##$VD= 0
##$VDLIST= <DDDDDDDDDDDDDDD>
##$VPLIST= <PPPPPPPPPPPPPPP>
##$VTLIST= <TTTTTTTTTTTTTTT>
##$WBST= 1024
##$WBSW= 4
##$XGAIN= (0..3)
0 0 0 0 
##$XL= 0
##$YL= 0
##$YMAX_a= 3717
##$YMIN_a= -4030
##$ZGOPTNS= <>
##$ZL1= 120
##$ZL2= 120
##$ZL3= 120
##$ZL4= 120
##$ABSF1= 182.463
##$ABSF2= -187.1042
##$ABSG= 5
##$ABSL= 3
##$ALPHA= 0
##$AQORDER= 0
##$ASSFAC= 0
##$ASSFACI= 0
##$ASSFACX= 0
##$ASSWID= 0
##$AUNMP= <proc_1d>
##$AZFE= 0.1
##$AZFW= 0.5
##$BCFW= 0
##$BC_mod= 2
##$BYTORDP= 0
##$COROFFS= 0
##$CY= -3
##$DATMOD= 1
##$DC= 0
##$DFILT= <>
##$DTYPP= 0
##$F1P= 0
##$F2P= 0
##$FCOR= 1
##$FTSIZE= 65536
##$FT_mod= 6
##$GAMMA= 0
##$GB= 0
##$INTBC= 1
##$INTSCL= 5.30512e-09
##$ISEN= 30
##$LB= 1
##$LEV0= 0
##$LPBIN= 0
##$MAXI= 10000
##$MC2= 0
##$MEAN= 0
##$ME_mod= 0
##$MI= 50
##$NCOEF= 0
##$NC_proc= -8
##$NLEV= 6
##$NOISF1= 182.463
##$NOISF2= 159.3651
##$NSP= 0
##$NTH_PI= 0
##$NZP= 0
##$OFFSET= 182.463
##$PC= 4
##$PHC0= -1309.69
##$PHC1= 58.40095
##$PH_mod= 1
##$PKNL= yes
##$PPARMOD= 0
##$PSCAL= 0
##$PSIGN= 0
##$REVERSE= no
##$SF= 81.0140089999434
##$SI= 65536
##$SIGF1= 159.3651
##$SIGF2= -187.1042
##$SINO= 113.3802
##$SIOLD= 16384
##$SREGLST= <1H.CDCl3>
##$SSB= 0
##$STSI= 65536
##$STSR= 0
##$SW_p= 29940.119760479
##$SYMM= 0
##$S_DEV= 0
##$TDeff= 32768
##$TDoff= 0
##$TI= <>
##$TILT= no
##$TM1= 0
##$TM2= 0
##$TOPLEV= 0
##$USERP1= <user>
##$USERP2= <user>
##$USERP3= <user>
##$USERP4= <user>
##$USERP5= <user>
##$WDW= 1
##$XDIM= 65536
##$YMAX_p= 284647672
##$YMIN_p= -110650637
$$ End of Bruker specific parameters
$$ ---------------------------------
##NTUPLES= NMR SPECTRUM
##VAR_NAME=  FREQUENCY,     SPECTRUM/REAL,   SPECTRUM/IMAG
##SYMBOL=    X,             R,               I
##VAR_TYPE=  INDEPENDENT,   DEPENDENT,       DEPENDENT
##VAR_FORM=  AFFN,          ASDF,            ASDF
##VAR_DIM=   65536,         65536,           65536
##UNITS=     HZ,            ARBITRARY UNITS, ARBITRARY UNITS
##FACTOR=    0.456856943014862, 1,           1
##FIRST=     14782.0589164792, 0,            0
##LAST=      -15158.0608439998, 0,           0
##MIN=       -15158.0608439998, -110650637,  0
##MAX=       14782.0589164792, 284647672,    0
$$ Real data points
##PAGE= N=1
##DATA TABLE= (X++(R..R)), XYDATA
$$ [...]
$$ plain form
37910 10233249 9260563 4537605 -3008969 -12080972 -18154949 -17971750 -15377323 -16533934
37902 -16533934 -20619717 -21782638 -19226092 -17872045 -18784980 -16658047 -8735798 595912
37894 595912 6849790 10928351 14096096 12969444 4447844 -7553548 -14843558 -13164382
37886 -13164382 -5101783 3524498 8056291 7629480 5512686 5464235 6746778 5144044
37878 5144044 -36637 -3699114 -2364010 -250354 -3559095 -10824978 -14139934 -9699379
37870 -9699379 -2297913 1664082 1405971 91062 -450791 -515998 -610846 -1709975 -5342985
37861 -5342985 -10184198 -10603504 -3065687 7050390 10325891 5422203 737214 2200982
37853 2200982 5407825 3651437 -1777845 -4999253 -4883494 -4083154 -1926427 3569878
$$ packed form
37910A0233249r72686m722958p546574r072003o073977J83199K594427j156611
37902a6533934m085783j162921K556546J354047r12935K126933P922249R331710
37894E95912O253878M078561L167745j126652q521600j2001392p290010J679176
37886a3164382Q062599Q626281M531793m26811k116794m8451J282543j602734
37878E144044n180681l662477J335104K113656l308741p265883l314956M440555
37870i699379P401466L961995k58111j314909n41853o5207r4848j099129l633010
37861e342985m841213m19306P537817J0116077L275501m903688m684989J463768
37853B200982L206843j756388n429282l221408J15759Q00340K156727N496305
$$ plain form
37845 3569878 8253410 5602981 -1637892 -3055627 3869857 9242597 6016483 430096
37837 430096 548715 2881939 -215864 -5976878 -5196026 2155071 6490058 3592919 -312788
37828 -312788 -152036 940359 -296541 -504091 3604617 8163737 8008404 5452486 6889927
37819 6889927 12732904 16509678 13748525 7446302 4072934 6852443 13428066 18241462
37811 18241462 16946740 9929712 1872670 -2604962 -2516300 332398 4243955 8597841
37803 8597841 12962129 16474770 17749488 15263847 9236719 3438792 2763477 7385716
37795 7385716 11396700 9609750 4115310 1084539 2166597 2998352 517566 -2568612
37787 -2568612 -2718315 -1240212 -1296812 -1586077 2006538 8704785 11951534 8138009 2059799
$$ packed form
37845C569878M683532k650429p240873j417735O925484N372740l226114n586387
37837D30096J18619K333224l097803n761014P80852P351097M334987k897139l905707
37828c12788J60752J092395j236900k07550M108708M559120j55333k555918J437441
37819F889927N842977L776774k761153o302223l373368K779509O575623M813396
37811A8241462j294722p017028q057042m477632Q8662K848698L911557M353886
37803H597841M364288L512641J274718k485641o027128n797927o75315M622239
37795G385716M010984j786950n494440l030771J082058Q31755k480786l086178
37787b568612j49703J478103n6600k89265L592615O698247L246749l813525o078210
$$ plain form
37778 2059799 450967 3048432 3983322 184896 -5796682 -10304273 -11455076 -7841150
37770 -7841150 626196 9417427 11693354 6493805 1025700 1817429 6421652 7188182
37762 7188182 1254734 -6647735 -10359409 -8343941 -3906001 -1454323 -2520040 -4597034
37754 -4597034 -4564117 -3227150 -4244297 -8054828 -10123204 -6888647 -274164 5888647
37746 5888647 10516576 13524157 13070120 8638121 3993909 2582314 2354756 -152242
37738 -152242 -3042446 -2007854 1777484 3227196 2105408 3158101 6685224 6125837
37730 6125837 -2136381 -12332336 -16348731 -13060704 -7339159 -3397968 -2488890 -4074583
37722 -4074583 -5757530 -4383910 -347240 1431031 -2008782 -6290932 -4566983 3349175
$$ packed form
37778B059799j608832K597465R34890l798426n981578m507591j150803L613926
37770g841150Q467346Q791231K275927n199549n468105P91729M604223P66530
37762G188182n933448p902469l711674K015468M437940K451678j065717k076994
37754d597034L2917J336967j017147l810531k068376L234557O614483O162811
37746E888647M627929L007581m54037m431999m644212j411595k27558k506998
37738a52242k890204J034592L785338J449712j121788J052693L527123n59387
37730F125837q262218j0195955m016395L288027N721545L941191R09078j585693
37722d074583j682947J373620M036670J778271l439813m282150J723949P916158
$$ plain form
37714 3349175 10378937 10634524 5430017 331372 -1268094 -349646 378687 -552378 -3088418
37705 -3088418 -6702348 -10055314 -9980795 -3480758 7576296 15739758 14742144 6307452
37697 6307452 -2010332 -4850111 -2571445 1597548 4178402 2140394 -4435333 -10145204
37689 -10145204 -9198291 -3360636 -443486 -3617245 -7139049 -5022625 793088 4305015
37681 4305015 3424585 97162 -4205735 -8436120 -9581244 -5216953 2156874 7205656
37673 7205656 8013399 7184910 7030334 6726845 4542488 418631 -4187134 -7365061 -7487758
37664 -7487758 -4425705 -396176 1470805 17758 -2512580 -2078584 3209051 9818870
37656 9818870 10824909 3410112 -6740712 -11609365 -10402222 -8697257 -8716044 -6590935
$$ packed form
37714C349175P029762K55587n204507n098645j599466R18448P28333r31065k536040
37705c088418l613930l352966P4519O500037J1057054Q163462r97614q434692
37697F307452q317784k839779K278666M168993K580854k038008o575727n709871
37689a0145204R46913N837655K917150l173759l521804K116424N815713L511927
37681D305015q80430l327423m302897m230385j145124M364291P373827N048782
37673G205656Q07743q28489j54576l03489k184357m123857m605765l177927j22697
37664g487758L062053M029529J866981j453047k530338M33996N287635O609819
37656I818870J006039p414797j0150824m868653J207143J704965j8787K125109
$$ plain form
37648 -6590935 -674781 4210172 4524774 3981474 6546834 8576345 4511734 -3131175
37640 -3131175 -6676501 -4285573 -1039845 100919 1455076 4337775 6101265 5083124
37632 5083124 3320806 2464439 1178790 -1709694 -5011392 -7365533 -8460544 -7504735
37624 -7504735 -4011786 -453723 -46536 -1311064 644637 6356304 10349152 9109800
37616 9109800 5972584 5371404 6498612 5982957 3269520 -237137 -4299409 -8231031
37608 -8231031 -8609355 -2842052 6188392 12595395 13812272 11585623 7917321 3645219
37600 3645219 740337 2135733 7667924 12272824 10208194 1035555 -9286531 -13677745
37592 -13677745 -10410009 -3855934 1274979 4571602 7139807 6695105 -23958 -10322001
$$ packed form
37648f590935N916154M884953L14602n43300K565360K029511m064611p642909
37640c131175l545326K390928L245728J140764J354157K882699J763490j018141
37632E083124j762318q56367j285649k888484l301698k354141j095011R55809
37624g504735L492949L558063M07187j264528J955701N711667L992848j239352
37616I109800l137216o01180J127208n15655k713437l506657m062272l931622
37608h231031l78324N767303R030444O407003J216877k226649l668302m272102
37600C645219k904882J395396N532191M604900k064630r172639j0322086m391214
37592a3677745L267736O554075N130913L296623K568205m44702o719063j0298043
$$ plain form
37584 -10322001 -16366070 -14716513 -10417249 -9037900 -9298175 -7472045 -4840238 -5156276
37576 -5156276 -7228931 -6145114 -1169193 3109602 3695907 2191238 145465 -3587962
37568 -3587962 -8967616 -12480364 -11584155 -8753427 -8496272 -11942682 -16152871 -17380113
37560 -17380113 -13855847 -7067440 -1484981 -1293760 -6044927 -10798650 -11273635 -7329987
37552 -7329987 -1321846 4145023 6092602 2556536 -3624918 -5740184 -1200380 4010385
37544 4010385 2669576 -4053638 -8848288 -8765770 -8059129 -10282715 -12985486 -12312651 -8655749
37535 -8655749 -5018036 -2833687 -1899766 -1722742 -618764 3459857 8444171 8047005 272063
37526 272063 -7255291 -6273728 -101690 442852 -6755077 -11443358 -6710522 -347726 -3691253
$$ packed form
37584a0322001o044069J649557M299264J379349k60275J826130K631807l16038
37576e156276k072655J083817M975921M278795N86305j504669k045773l733427
37568c587962n379654l512748Q96209K830728K57155l446410m210189j227242
37560a7380113L524266O788407N582459J91221m751167m753723m74985L943648
37552g329987O008141N466869J947579l536066o181454k115266M539804N210765
37544D010385j340809o723214m794650Q2518P06641k223586k702771O72835L656902
37535h655749L637713K184349R33921J77024J103978M078621M984314l97166p774942
37526B72063p527354R81563O172038N44542p197929m688281M732836O362796l343527
$$ plain form
37517 -3691253 -14284625 -18495242 -10165482 1792282 6206893 3108573 500790 2518393
37509 2518393 5995669 6862396 5169535 3355591 2459398 1215922 -2080266 -7243498
37501 -7243498 -11635599 -12649824 -11016669 -10215880 -11751847 -12707295 -9683649 -3889228
37493 -3889228 -75943 -804959 -3710085 -4562882 -1758893 2179526 2725209 -2201796 -8671834
37484 -8671834 -9019491 -20675 12077914 17542862 13797385 7006115 3352360 3014675
37476 3014675 3778889 5527913 7714014 6414188 -1024985 -10487962 -15410932 -15659956
37468 -15659956 -16815560 -20681607 -22379762 -18558563 -12889737 -10019242 -8585505 -4668709
37460 -4668709 1228208 5723661 8626881 11641744 12311827 6125843 -4370762 -9450550
$$ packed form
37517c691253j0593372m210617Q329760J1957764M414611l098320k607783K017603
37509B518393L477276Q66727j692861j813944q96193j243476l296188n163232
37501g243498m392101j014225J633155Q00789j535967r55448L023646N794421
37493c889228L813285p29016k905126q52797K803989L938419N45683m927005o470038
37484h671834l47657Q998816J2098589N464948l745477o791270l653755l37685
37476C014675P64214J749024K186101j299826p439173r462977m922970k49024
37468a5659956j155604l866047j698155L821199N668826K870495J433737L916796
37460d668709N896917M495453K903220L014863O70083o185984j0496605n079788
$$ plain form
37452 -9450550 -4748619 1521270 -822914 -9724468 -13763936 -7906883 580336 3229057
37444 3229057 875389 -798018 -1173428 -3907621 -8335580 -8662158 -2907792 3103971
37436 3103971 3590865 216606 -1957530 -2019810 -1925387 -875483 2709057 5289448 1692084
37427 1692084 -5229605 -6245032 700933 6473175 4531473 984469 4047167 9998739
37419 9998739 9044220 1423659 -2682686 1496105 7816953 9982807 8702996 5935349
37411 5935349 704369 -5609121 -7441319 -3101737 1798682 3531222 6392474 14145344
37403 14145344 21385353 20515674 13175692 7602360 7298577 8865892 9169607 8502695 7702487
37394 7702487 7277408 8437277 10859852 11167159 7510349 3093569 1049648 -644950
$$ packed form
37452i450550M701931O269889k344184q901554m039468N857053Q487219K648721
37444C229057k353668j673407l75410k734193m427959l26578N754366O011763
37436C103971M86894l374259k174136o2280R4423J049904L584540K580391l597364
37427A692084o921689j015427O945965N772242j941702l547004L062698N951572
37419I998739r54519p620561m106345M178791O320848K165854j279811k767647
37411E935349n230980o313490j832198M339582M900419J732540K861252P752870
37403A4145344P240009q69679p339982n573332l03783J567315L03715o66912q00208
37394G702487m25079J159869K422575L07307l656810m416780k043921j694598
$$ plain form
37386 -644950 -4200998 -6287260 -3766481 -839070 -2297462 -3432560 3298996 13775934
37378 13775934 15702560 6599884 -3034024 -6135294 -7265434 -11198964 -14662110 -14776004
37370 -14776004 -15476452 -18705993 -18082772 -9088312 1793057 6039980 4893476 4372757
37362 4372757 4513231 2155435 -568725 415449 3030762 2919325 2067902 4967835 9303707
37353 9303707 9478791 6584087 5134851 2339311 -8093424 -22047505 -26940412 -19615800
37345 -19615800 -11245122 -10802083 -13782871 -12138715 -6121176 -254390 4320948 6679259
37337 6679259 2552118 -8115530 -15801404 -12385823 -3724500 -2423501 -10230840 -16568147
37329 -16568147 -14398619 -8893974 -7942110 -10850681 -10612437 -3625285 6602111 13859097
$$ packed form
37386f44950l556048k086262K520779K927411j458392j135098O731556J0476938
37378A3775934J926626r102676r633908l101270j130140l933530l463146j13894
37370a4776004p00448l229541O23221Q994460J0881369M246923j146504n20719
37362D372757J40474k357796k724160R84174K615313j11437q51423K899933M335872
37353I303707J75084k894704j449236k795540j0432735j3954081m892907P324612
37345a9615800Q370678M43039k980788J644156O017539N866786M575338K358311
37337F679259m127141j0667648p685874L415581Q661323J300999p807339o337307
37329a6568147K169528N504645R51864k908571K38244O987152J0227396P256986
$$ plain form
37321 13859097 14930614 11437081 7141767 3700613 102275 -3046341 -1335785 7975739
37313 7975739 19622317 23959432 17834835 8497691 5329905 10236442 17431843 20267203
37305 20267203 16705703 10012242 5628723 6080340 8215126 7177840 3335320 2236726
37297 2236726 6660157 12558827 15401635 16410688 18027930 16723076 7261001 -6698324
37289 -6698324 -13794081 -8806145 883399 5714864 5145777 4299474 4935747 5842059 8127795
37280 8127795 12766255 15193602 10279328 1877773 -891441 2485787 2671087 -4302067
37272 -4302067 -9800509 -6143542 611391 -504254 -9221380 -15766827 -15589424 -12942315
37264 -12942315 -10821768 -6987212 -1680339 -681822 -6569975 -13038995 -12641835 -6365670
$$ packed form
37321A3859097J071517l493533m295314l441154l598338l148616J710556R311524
37313G975739J1646578M337115o124597r337144l167786M906537P195401K835360
37305B0267203l561500o693461m383519M51617K134786j037286l842520j098594
37297B236726M423431N898670K842808J009053J617242j304854r462075j3959325
37289f698324p095757M987936R689544M831465n69087q46303O36273R06312K285736
37280H127795M638460K427347m914274q401555k769214L377228J85300o973154
37272d302067n498442L656967O754933j115645q717126o545447J77403K647109
37264a2942315K120547L834556N306873R98517n888153o469020L97160O276165
$$ plain form
37256 -6365670 -1446092 -2288746 -6847568 -9959198 -7670553 -196351 7225213 8408382
37248 8408382 3170365 -1834522 -1125904 3089771 4626798 1115453 -4726902 -9586015
37240 -9586015 -12034753 -11851622 -10231542 -10075038 -12885731 -15474403 -12816950 -4750392
37232 -4750392 2926422 5262472 3850647 3743987 5926379 5617982 -984260 -10188472
37224 -10188472 -13754199 -8770635 -1880919 -1263553 -6151294 -8196389 -3313083 2283527
37216 2283527 355817 -8168906 -14158271 -11447461 -3353971 2694910 4156498 4682286
37208 4682286 7326303 9373379 6151050 -897170 -3700403 2526667 11562386 12764680
37200 12764680 4708539 -2756713 -1269711 6135301 10857325 10353948 9288164 11113152
$$ packed form
37256f365670M919578q42654m558822l111630K288645P474202P421564J183169
37248H408382n238017n004887P08618M215675J537027l511345n842355m859113
37240i586015k448738J83131J620080J56504k810693k588672K657453Q066558
37232d750392P676814K336050j411825j06660K182392l08397o602242r204212
37224a0188472l565727M983564O889716O17366m887741k045095M883306N596610
37216B283527j927710q524723n989365K710810Q093490O048881J461588N25788
37208D682286K644017K047076l222329p048220k803233O227070R035719J202294
37200A2764680q056141p465252J487002P405012M722024n03377j065784J824988
$$ plain form
37192 11113152 13437833 12019784 6086962 -1079246 -5209921 -4836781 -3234799 -5504264
37184 -5504264 -12231411 -17820274 -17347295 -13040832 -10783992 -12012123 -13210486 -12305736
37176 -12305736 -10665182 -8781277 -5095319 -225194 2524607 2737927 4144660 7537520
37168 7537520 7308748 -446063 -10106306 -12525482 -6953782 -1162640 -348344 -2012816
37160 -2012816 -2713657 -3545760 -5704237 -5873987 -1333957 3306343 605392 -8790869 -15266911
37151 -15266911 -11851626 -2344983 4684949 6347471 6100504 6515393 6464823 5333475 5084291
37142 5084291 6325870 6251953 3500102 2132084 6608760 14123435 16668121 11417972
37134 11417972 4846666 4323819 8912866 11864879 10238119 7860835 8826044 11846795
$$ packed form
37192A1113152K324681j418049n932822p166208m130675L73140J601982k269465
37184e504264o727147n588863M72979M306463K256840j228131j198363R04750
37176a2305736J640554J883905L685958M870125K749801K13320J406733L392860
37168G537520k28772p754811r660243k419176N571700N791142Q14296j664472
37160b012816p00841q32103k158477j69750M540030M640300k700951r396261o476042
37151a5266911L415285R506643P029932J662522k46967M14889n0570j131348k49184
37142E084291J241579p3917k751851j368018M476676P514675K544686n250149
37134A1417972o571306n22847M589047K952013j626760k377284R65209L020751
$$ plain form
37126 11846795 12529213 8809686 2531173 -2773784 -4514154 -3163348 -2836364 -7622831
37118 -7622831 -15826887 -20321390 -16944817 -10011155 -6258467 -5868315 -4063915 367343
37110 367343 4209257 6774679 10568248 13867996 10418470 -72775 -8598996 -9331030
37102 -9331030 -8537922 -13791278 -20323491 -17877539 -7396195 372755 2052608 5653930
37094 5653930 15127310 22044898 18322634 8713727 3537153 4706272 6065276 3952665
37086 3952665 863910 358647 3235482 7641072 9873727 6996311 989501 -2599762
37078 -2599762 -2254605 -2578527 -6126418 -8465885 -5699124 -1625872 -1663016 -4214335 -4701530
37069 -4701530 -4202947 -6532052 -9728717 -8746589 -5005852 -4918829 -9231042 -11751512 -9265224
$$ packed form
37126A1846795O82418l719527o278513n304957j740370J350806L26984m786467
37118g622831q204056m494503L376573O933662L752688L90152J804400M431258
37110C67343L841914K565422L793569L299748l449526j0491245q526221p32034
37102i331030P93108n253356o532213K445952J0481344P768950J679853L601322
37094E653930R473380O917588l722264r608907n176574J169119J359004k112611
37086C952665l088755n05263K876835M405590K232655k877416o006810l589263
37078b599762L45157l23922l547891k339467K766761M073252l7144k551319m87195
37069d701530M98583k329105l196665R82128L740737Q7023m312213k520470K486288
$$ plain form
37060 -9265224 -5449765 -3930655 -4101312 -4900150 -6423677 -6841115 -3882733 10977 504486
37051 504486 -585536 2201328 6950925 5268799 -3414798 -8272718 -2350967 7689776
37043 7689776 12883525 14339903 16998801 18885171 15807760 11029002 10426024 11771817
37035 11771817 8489384 1667491 -1303483 833629 1375606 -3270846 -9193992 -13154294
37027 -13154294 -17258171 -22597381 -24883427 -20529040 -12727228 -7689297 -7447058 -9061848
37019 -9061848 -8997963 -6226714 -2228469 861997 2633754 4706908 8008558 11179060
37011 11179060 12910431 13532641 12444120 7448633 -44362 -3086468 2462739 10999804
37003 10999804 14604437 14096755 15065089 15773497 9307028 -2425911 -8155976 -3877151
$$ packed form
37060i265224L815459J519110j70657p98838j523527m17438K958382L893710M93509
37051E04486j090022K786864M749597j682126q683597m857920N921751J0040743
37043G689776N193749J456378K658898J886370l077411m778758o02978J345793
37035A1771817l282433o821893k970974K137112N41977m646452n923146l960302
37027a3154294m103877n339210k286046M354387P801812N037931K42239j614790
37019i061848O3885K771249L998245L090466J771757K073154L301650L170502
37011A1179060J731371O22210j088521m995487p492995l042106N549207Q537065
37003A0999804L604633n07682R68334P08408o466469j1732939n730065M278825
$$ plain form
36995 -3877151 296033 -4730339 -13878479 -16731478 -12204935 -6499553 -2129210 2192857
36987 2192857 4350542 530139 -7082277 -11935029 -12071955 -10807970 -8713294 -1928991
36979 -1928991 10038060 20626545 22934854 16660906 6839465 -1243235 -4704303 -3657053
36971 -3657053 -926650 280612 -774983 -2441280 -2711191 -119301 5456246 10977837
36963 10977837 11723881 7304178 3273023 3139029 2456319 -3509225 -9662730 -6755682
36955 -6755682 4111120 11853749 11299531 9262168 11446142 12693511 6661639 -2264159
36947 -2264159 -5105145 -1674750 856010 264273 1346469 5840005 8466386 5417370
36939 5417370 797147 1178961 7263382 13833881 15909773 12911263 8131168 5461040
$$ packed form
36995c877151M173184n026372r148140k852999M526543N705382M370343M322067
36987B192857K157685l820403p612416m852752j36926J263985K094676O784303
36979a928991J1967051J0588485K308309o273948r821441q082700l461068J047250
36971c657053K730403J207262j055595j666297k69911K591890N575547N521591
36963A0977837P46044m419703m031155j33994o82710n965544o153505K907048
36955f755682J0866802P742629n54218k037363K183974J247369o031872q925798
36947b264159k840986L430395K530760n91737J082196M493536K626381l049016
36939E417370m620223L81814O084421O570499K075892k998510m780095k670128
$$ plain form
36931 5461040 5829444 6468048 4465199 491494 -2411032 -2900462 -2207626 -1735818 -2144540
36922 -2144540 -4069978 -6876934 -7078454 -1338925 8382096 15489456 15421772 9714699 3413787
36913 3413787 778548 3105933 7481710 7640853 -39133 -10604912 -14569258 -9183444
36905 -9183444 -1468607 1861385 2660977 6037729 11217480 13108520 10571875 7437793
36897 7437793 5842005 3585893 -1204202 -6672421 -9527579 -8072867 -2676660 4004246
36889 4004246 7312178 4611007 -246786 -30140 6745682 13045733 11971544 5494717
36881 5494717 1421100 3249162 6663043 6086640 1427449 -3211909 -5361542 -6127359
36873 -6127359 -6674413 -5490161 -824112 5576383 9667591 9967172 8772304 7973441 6415791
$$ packed form
36931E461040L68404O38604k002849l973705k902526m89430O92836M71808m08722
36922b144540j925438k806956k01520N739529R721021P107360o7684n707073o300912
36913C413787k635239K327385M375777J59143p679986j0565779l964346N385814
36905i183444P714837L329992P99592L376752N179751J891040k536645l134082
36897G437793j595788k256112m790095n468219k855158J454712N396207O680906
36889D004246L307932k701171m857793K16646O775822O300051j074189o476827
36881E494717m073617J828062L413881n76403m659191m639358k149633p65817
36873f127359n47054J184252M666049O400495M091208K99581j194868p98863j557650
$$ plain form
36864 6415791 3054503 79378 86730 1924811 2574162 1999793 2603190 4432717 4779045
36855 4779045 2737470 414363 -1073685 -2941287 -4862527 -3885341 374681 3040751
36847 3040751 -192934 -7037099 -11828811 -12847121 -12778115 -13212985 -12726374 -10366146 -7512303
36838 -7512303 -5488509 -3950218 -2531109 -2031902 -3017682 -4621391 -5341036 -4090958 -752255
36829 -752255 2785187 2649053 -3443438 -12311509 -17609925 -17030224 -14760945 -15198521 -16715225
36820 -16715225 -14530712 -8261407 -2832919 -1457993 -1011660 3605126 12267579 19017424
36812 19017424 18141217 9417168 -1982675 -9085307 -7341708 1906104 11358085 13448178
36804 13448178 7657991 800940 -902546 1982088 5052280 6179061 5649095 2811186
$$ packed form
36864F415791l361288k975125P352J838081O49351n74369O03397J829527L46328
36855D779045k041575k323107j488048j867602j921240R77186M260022K666070
36847C040751l233685o844165m791712j018310O9006m34870M86611K360228K853843
36838g512303K023794J538291J419109M99207r85780j603709p19645J250078L338703
36829g52255L537442j36134o092491q868071n298416N79701K269279m37576j516704
36820a6715225K184513O269305N428488J374926M46333M616786Q662453O749845
36812A9017424q76207q724049j1399843p102632J743599R247812R451981K090093
36804A3448178n790187o857051j703486K884634L070192J126781n29966k837909
$$ plain form
36796 2811186 -2707039 -7421711 -6798800 -2091068 547737 -1048509 -2078436 1362457
36788 1362457 6740585 10532874 13745007 17139990 16006771 6801400 -3953185 -5554337
36780 -5554337 2417394 9003395 6425053 -970061 -4491277 -1735985 3735511 8202013
36772 8202013 9464796 6762621 2714182 1949516 4537130 4609445 -699046 -5313933 -2652381
36763 -2652381 3707647 4964805 891378 558027 8404788 17257140 18505323 13137467
36755 13137467 7892910 4791819 415745 -6154808 -10491573 -8801144 -2890669 2596070
36747 2596070 5588623 7187797 7885863 5583487 -1432892 -10408354 -15120267 -12122605
36739 -12122605 -4705307 1116599 3485471 4993403 6820068 6579827 3232921 298942
$$ packed form
36796B811186n518225m714672O22911M707732K638805j596246j029927L440893
36788A362457N378128L792289L212133L394983j133219r205371j0754585j601152
36780e554337P971731O586001k578342p395114l521216K755292N471496M466502
36772H202013J262783k702175m048439p64666K587614P2315n308491m614887K661552
36763b652381O360028J257158m073427l33351P846761Q852352J248183n367856
36755A3137467n244557l101091m376074o570553m336765J690429N910475N486739
36747B596070K992553J599174O98066k302376p016379q975462m711913K997662
36739a2122605P417298N821906K368872J507932J826665k40241l346906k933979
$$ plain form
36731 298942 1250609 4145451 3997926 -1044218 -8693727 -16058266 -20979077 -21282366 -16586762
36722 -16586762 -10376576 -6697595 -5192007 -3065837 -1222333 -3442225 -9101453 -12275124
36714 -12275124 -9934571 -5828131 -3651112 -1731242 1675032 2983722 -1352196 -7912552
36706 -7912552 -10765038 -10047554 -9889252 -10211027 -7821125 -4298870 -4610985 -7473495 -5534720
36697 -5534720 2412469 7286778 2019616 -8466839 -14669376 -14615085 -12899044 -11857735
36689 -11857735 -10182195 -8031926 -7480829 -8665271 -10127585 -12094404 -15174392 -16828367
36681 -16828367 -13664974 -6941719 -1702923 -381270 -680797 308071 3083094 6453459
36673 6453459 8043534 4556432 -4848019 -15356597 -19966660 -16509764 -8763385 -1136527
$$ packed form
36731B98942R51667K894842j47525n042144p649509p364539m920811l03289M695604
36722a6586762O210186L678981J505588K126170J843504k219892n659228l173671
36714a2275124K340553M106440K177019J919870L406274J308690m335918o560356
36706g912552k852486P17484J58302l21775K389902L522255l12115k862510J938775
36697e534720P947189M874309n267162j0486455o202537N4291J716041J041309
36689a1857735J675540K150269N51097j184442j462314j966819l079988j653975
36681a6828367L163393O723255N238796J321653k99527R88868K775023L370365
36673F453459J590075l487102r404451j0508578m610063L456896P746379P626858
$$ plain form
36665 -1136527 4702581 8508260 10393426 11231476 11204180 8349556 1651543 -5277985 -7513153
36656 -7513153 -5419231 -3963113 -5741819 -8856308 -11302165 -12704507 -11817506 -7567778
36648 -7567778 -2852254 -1630214 -1752538 2692389 10515484 12537062 4942662 -3830046
36640 -3830046 -4809268 -891419 -1054548 -6855977 -11799650 -11270635 -6372344 349242 6828234
36631 6828234 10252737 9533147 8199989 9731691 11046582 6285765 -3304232 -9164347
36623 -9164347 -6006695 2374656 9123754 11682274 11451925 10036120 8283093 6765181
36615 6765181 5295588 3208393 848991 -495801 -390357 196355 -80125 -2232007 -6143844
36606 -6143844 -9357721 -8495810 -3520686 1666567 4662347 7325068 10460466 10120840
$$ packed form
36665a136527N839108L805679J885166Q38050k7296k854624o698013o929528k235168
36656g513153K093922J456118j778706l114489k445857j402342Q87001M249728
36648g567778M715524J222040j22324M444927P823095K021578p594400q772708
36640c830046r79222L917849j63129n801429m943673N29015M898291O721586O478992
36631F828234L424503p19590j333158J531702J314891m760817r589997n860115
36623i164347L157652Q381351O749098K558520k30349j415805j753027j517912
36615F765181j469593k087195k359402j344792J05444N86712k76480k151882l911837
36606f143844l213877Q61911M975124N187253K995780K662721L135398l39626
$$ plain form
36598 10120840 4028077 -2214761 -1811830 3049902 4956452 3243487 3892630 8084344
36590 8084344 10015598 7469498 5521707 6731113 6163752 618326 -4831956 -5074757
36582 -5074757 -3304837 -4953712 -8467310 -8550294 -4590327 286427 5130548 10098503
36574 10098503 12442987 9755311 5141085 3539726 4703137 4971067 3806112 2989287
36566 2989287 1420693 -3096039 -8240186 -9514469 -7345556 -5871362 -5549616 -3605310
36558 -3605310 -1533096 -4616847 -12335232 -16148703 -10106572 1352045 9337803 10307008
36550 10307008 7158265 4023677 2915151 3358390 3273830 1498765 -442705 -1211595 -3108672
36541 -3108672 -8530734 -13818780 -12442635 -4997566 209902 -1391385 -4627152 -3023602
$$ packed form
36598A0120840o092763o242838M02931M861732J906550j712965O49143M191714
36590H084344J931254k546100j947791J209406n67361n545426n450282k42801
36582e074757J769920j648875l513598q2984L959967M876754M844121M967955
36574A0098503K344484k687676m614226j601359J163411K67930j164955q16825
36566B989287j568594m516732n144147j274283K168913J474194L21746J944306
36558c605310K072214l083751p718385l813471O042131J1458617P985758R69205
36550A0307008l148743l134588j108526M43239q4560j775065j941470p68890j897077
36541c108672n422062n288046J376145P445069N207468j601287l235767J603550
$$ plain form
36533 -3023602 2453946 7006459 9156441 9703789 8010819 4276126 1672568 1284458
36525 1284458 -1274624 -8822823 -16043609 -16385185 -12358200 -11627220 -14937989 -15893486 -11903001
36516 -11903001 -6994308 -3168674 2423890 9342662 11299009 6247366 1950465 5340138
36508 5340138 11567020 10839751 3092701 -1900997 1337758 6858817 6442729 630454
36500 630454 -3292242 -1704050 1285587 298454 -4187739 -7394875 -7301881 -6720904 -7642330
36491 -7642330 -7024868 -1383969 6408310 9351046 5545081 1123893 2332865 7812857
36483 7812857 11128621 8956510 4199690 1652042 2444909 3200547 552932 -3784825
36475 -3784825 -4352511 167434 3308120 -616956 -6443705 -3615899 7853088 15012167
$$ packed form
36533c023602N477548M552513K149982N47348j692970l734693k603558l88110
36525A284458k559082p548199p220786l41576M026985P30980l310769r55497L990485
36516a1903001M908693L825634N592564O918772J956347n051643m296901L389673
36508E340138O226882p27269p747050m993698L238755N521059m16088n812275
36500F30454l922696J588192K989637r87133m486193l207136R2994N80977r21426
36491g642330O17462N640899P792279K942736l805965m421188J208972N479992
36483G812857L315764k172111m756820k547648P92867P55638k647615m337757
36475c784825n67686M519945L140686l925076n826749K827806J1468987P159079
$$ plain form
36467 15012167 9275869 -1327540 -3509315 3397279 8888028 7027932 1855404 -1790013
36459 -1790013 -4065965 -5646298 -5081196 -3177395 -3960125 -8330845 -11514847 -9444315
36451 -9444315 -3599591 2513007 7354262 9751768 7956397 3006658 -1111676 -3106403
36443 -3106403 -5670762 -8721891 -7156360 409918 6325618 3397616 -4611176 -8722044
36435 -8722044 -7505661 -6414332 -6722911 -4180086 1135423 2665603 -2016906 -5906642
36427 -5906642 -2350534 5416079 9671391 9236527 9381544 12490583 14393542 10813999
36419 10813999 3859818 48670 2798708 8138355 8514329 1056297 -8857185 -13368285
36411 -13368285 -10467008 -4710160 -836308 67610 -1653899 -5980427 -11097512 -12959389
$$ packed form
36467A5012167n736298j0603409k181775O906594N490749j860096n172528l645417
36459a790013k275952j580333N65102J903801p82730m370720l184002K070532
36451i444315N844724O112598M841255K397506j795371m949739m118334j994727
36443c106403k564359l051129J565531P566278N915700k928002q008792m110868
36435h722044J216383J091329l08579K542825N315509J530180m682509l889736
36427e906642L556108P766613M255312m34864J45017L109039J902959l579543
36419A0813999o954181l811148K750038N339647L75974p458032r913482m511100
36411a3368285K901277N756848L873852R03918j721509m326528n117085j861877
$$ plain form
36403 -12959389 -9499021 -3236301 2073969 5206941 6357376 5220074 2747292 2234088
36395 2234088 5361453 8864904 8340423 4023108 -314375 -2793741 -4172095 -4309100
36387 -4309100 -2274363 36947 -1074892 -5096209 -6034213 611742 12036225 21152562
36379 21152562 23447484 19370617 12343117 6659232 5416051 7651951 8384060 3977308
36371 3977308 -2988983 -6455938 -4089208 732444 4152598 6185839 8645242 11165792
36363 11165792 11618626 9517317 6874969 5721792 6240190 7400524 8149382 7764719 6188207
36354 6188207 4399549 3599154 3713062 3421294 1718983 -1338557 -5050105 -7777772 -6805802
36345 -6805802 -1275420 4249038 2769778 -6171477 -13569805 -10794267 -346595 7796961
$$ packed form
36403a2959389L460368O262720N310270L132972J150435j137302k472782n13204
36395B234088L127365L503451n24481m317315m337483k479366j378354j37005
36387d309100K034737K311310j111839m021317r38004O645955J1424483R116337
36379B1152562K294922m076867p027500n683885j243181K235900P32109m406752
36371C977308o966291l466955K366730M821652L420154K033241K459403K520550
36363A1165792M52834k101309k642348j153177N18398J160334P48858l84663j576512
36354F188207j788658q00395J13908k91768j702311l057540l711548k727667R71970
36345f805802N530382N524458j479260q941255p398328K775538J0447672Q143556
$$ plain form
36337 7796961 9534894 10608135 16173235 22182543 20907336 11500769 704256 -5415930
36329 -5415930 -6689312 -6344223 -6486778 -6659373 -5268457 -1966122 1249896 2303843 2472410
36320 2472410 5181973 10351844 12851778 8803711 765736 -6135728 -10519684 -13487612
36312 -13487612 -13612917 -8474323 -378782 4790109 5048881 4142753 5101438 6451332 6257501
36303 6257501 5587475 5690104 5288437 3106010 111588 -2950070 -7233925 -12565164 -15524907
36294 -15524907 -13759760 -9865943 -8017380 -8652203 -9201597 -8130171 -5590289 -2199508
36286 -2199508 -1591 -2201757 -8453705 -12774878 -10409157 -4865607 -3309129 -6404645
36278 -6404645 -8432081 -7098966 -6843156 -10845894 -15563528 -16211595 -13223021 -9765395
$$ packed form
36337G796961J737933J073241N565100O009308j275207r406567j0796513o120186
36329e415930j273382L45089j42555j72595J390916L302335L216018J053947J68567
36320B472410K709563N169871K499934m048067q037975o901464m383956k967928
36312a3487612j25305N138594Q095541N168891K58772r06128R58685J349894j93831
36303F257501o70026J02629m01667k182427k994422l061658m283855n331239k959743
36294a5524907J765147L893817J848563o34823n49394J071426K539882L390781
36286b199508K197917k200166o251948m321173K365721N543550J556478l095516
36278f404645k027436J333115K55810m002738m717634o48067K988574L457626
$$ plain form
36270 -9765395 -6303700 -1535828 3436266 5590386 3730712 -810797 -6316679 -11425709
36262 -11425709 -14613290 -14810819 -12116847 -7155196 -980833 3923188 4785428 1744656
36254 1744656 -2222148 -5209384 -7298355 -7218473 -3020784 1993202 167651 -9153426
36246 -9153426 -15046355 -8715702 2936679 6415722 1304399 -70801 7479936 14285284
36238 14285284 11477029 3478583 -1496240 -4117498 -8476408 -11085471 -5894146 3438204
36230 3438204 6812038 2299609 -1786678 164206 4545810 6488616 6515482 6497665 5661071
36221 5661071 4162050 5214341 9870854 13966236 13714906 10624133 7767571 5106176
36213 5106176 2156713 1796770 7041633 15994670 23429744 25830145 22574619 14674908
$$ packed form
36270i765395L461695M767872M972094K154120j859674m541509n505882n109030
36262a1425709l187581j97529K693972M961651O174363M904021Q62240l040772
36254A744656l966804k987236k088971P9882M197689N013986j825551r321077
36246i153426n892929O330653J1652381L479043n111323j375200P550737O805348
36238A4285284k808255p998446m974823k621258m358910k609063N191325R332350
36230C438204L373834m512429m086287J950884M381604J942806K6866j7817q36594
36221E661071j499021J052291M656513M095382k51330l090773k856562k661395
36213E106176k949463l59943N244863Q953037P435074K400401l255526p899711
$$ plain form
36205 14674908 5046100 -2528414 -7385485 -12173449 -16730350 -16122022 -8914044 -2912510
36197 -2912510 -6230096 -15226577 -18323051 -10902047 200811 6926720 8099403 6443650
36189 6443650 3915502 2223776 2933940 4727324 4516202 2556750 2002456 2528593 232038
36180 232038 -4226444 -4042287 3314845 10197554 8657501 1301166 -3879276 -5494351
36172 -5494351 -8278415 -12904045 -14144400 -9512261 -3225645 -83620 -350587 -2201938
36164 -2201938 -4895204 -7650179 -8772455 -7671532 -5343582 -2048964 2778077 7675954
36156 7675954 9269404 6360921 1453947 -2467840 -4156238 -2943531 1193512 5583085
36148 5583085 6320291 3026236 -956049 -3856117 -6925235 -9429185 -7445811 -781524
$$ packed form
36205A4674908r628808p574514m857071m787964m556901O08328P207978O001534
36197b912510l317586q996481l096474P421004J1102858O725909J172683j655753
36189F443650k528148j691726P10164J793384k11122j959452n54294N26137k296555
36180B32038m458482J84157P357132O882709j540053p356335n180442j615075
36172e494351k784064m625630j240355M632139O286616L142025k66967j851351
36164b201938k693266k754975j122276J100923K327950L294618M827041M897877
36156G675954J593450k908483m906974l921787j688398J212707M137043M389573
36148E583085P37206l294055l982285k900068l069118k503950J983374O664287
$$ plain form
36140 -781524 3810343 1030319 -5155901 -7698948 -7549731 -11651051 -20719393 -26409835
36132 -26409835 -22548944 -13189328 -6076810 -2584755 1309425 6530846 8577805 4158282
36124 4158282 -3430883 -7633569 -6022317 -2305496 -819111 -973597 961001 5493670
36116 5493670 8458301 6804229 2804371 346683 -254719 -576179 452393 4910917
36108 4910917 10643652 12453212 8955313 4041084 874709 -1227174 -2935857 -2817275
36100 -2817275 -1245116 -1689524 -4926352 -6216748 -2285107 2589676 2354363 -1704766
36092 -1704766 -3078688 390333 4684252 6687559 7344249 7275377 4852948 492005 -1807977
36083 -1807977 172885 3439042 4252160 3149743 2925328 4056613 4863296 4332837 2218220
$$ packed form
36140g81524M591867k780024o186220k543047J49217m101320r068342n690442
36132b6409835L860891R359616P112518L492055L894180N221421K046959m419523
36124D158282p589165m202686J611252L716821J486385j54486J934598M532669
36116E493670K964631j654072l999858k457688o01402l21460J028572M458524
36108D910917N732735J809560l497899m914229l166375k101883j708683J18582
36100b817275J572159m44408l236828j290396L931641M874783k35313m059129
36092a704766j373922L469021M293919K003307O56690o8872k422429m360943k299982
36083a807977J980862L266157Q13118j102417k24415J131285Q06683n30459k114617
$$ plain form
36074 2218220 -1936681 -7035654 -9151947 -5496601 678786 2694260 -1086994 -4429276
36066 -4429276 -1040187 6824204 10885250 7689115 3068562 3649285 7167748 5931938
36058 5931938 -1110012 -5877715 -2839378 2535777 1841823 -3844037 -6243339 -2731436
36050 -2731436 510016 -1142787 -4257208 -4023124 -1795730 -1849940 -4323888 -5675920 -4259917
36041 -4259917 -2136301 -2291071 -5804398 -10504467 -11906946 -8074398 -3813892 -5870076
36033 -5870076 -12852108 -15342287 -8786518 -565664 394150 -4019501 -5222836 -571164
36025 -571164 5039589 7799627 8184359 6866491 4323609 3842662 7958496 12010533 8635277
36016 8635277 -342738 -4100751 2544948 11599654 12792601 6288927 81792 -713830
$$ packed form
36074B218220m154901n098973k116293L655346O175387K015474l781254l342282
36066d429276L389089P864391M061046l196135m620553N80723L518463j235810
36058E931938p041950m767703L038337N375155o93954n685860k399302L511903
36050b731436L241452j652803l114421K34084K227394n4210k473948j352032J416003
36041d259917K123616j54770l513327m700069j402479L832548M260506k056184
36033e870076o982032k490179O555769Q220854R59814m413651j203335M651672
36025e71164N610753K760038L84732j317868k542882m80947M115834M052037l375256
36016H635277q978015l758013O645699R054706J192947o503674o207135p95622
$$ plain form
36008 -713830 2839482 7582942 10935277 11439615 10295454 10800086 13764811 15798738 14611548
35999 14611548 12984090 14111370 15863366 13936602 8856362 5475429 6392891 9725439
35991 9725439 12857207 14781000 14949079 13279256 11636279 12418851 15180829 16966687
35983 16966687 16279746 14580724 13671035 13685058 13895119 13475333 11223030 6673821 2091774
35974 2091774 1235034 4850088 8791967 8206571 3179092 -1043919 172966 5497796
35966 5497796 8910235 6512841 975704 -1990380 -732009 959980 -372143 -3243372
35958 -3243372 -3620180 65646 5930053 11193523 14026600 13956674 12160201 10759020 10605024
35949 10605024 10352578 8495705 5356210 2375825 695127 993869 2995094 4500274
$$ packed form
36008g13830L553312M743460L352335N04338j144161N04632K964725K033927j187190
35999A4611548j627458J127280J751996j926764n080240l380933R17462L332548
35991I725439L131768J923793J68079j669823j642977P82572K761978J785858
35983A6966687o86941j699022r09689J4023K10061m19786k252303m549209m582047
35974B091774q56740L615054L941879n85396n027479m223011J216885N324830
35966E497796L412439k397394n537137k966084J258371J691989j332123k871229
35958c243372l76808L685826N864407N263470K833077o9926j796473j401181j53996
35949A0605024k52446j856873l139495k980385j680698K98742K001225J505180
$$ plain form
35941 4500274 3318876 1212242 2809815 8504210 11831517 7655687 465607 -332338
35933 -332338 7365738 15509879 15770731 8324881 -433262 -5686541 -7709967 -9357296
35925 -9357296 -11708612 -11987096 -6191314 5157767 15201085 17221693 12242435 7107151
35917 7107151 5458006 4721592 2744332 2499420 6966061 12791625 13627772 8566755 2973840
35908 2973840 707109 -651340 -5224081 -12346938 -17207922 -16704275 -12242952 -7096895
35900 -7096895 -3239058 -1048316 60765 1767560 5834464 11515840 15367119 15273376
35892 15273376 13381866 12999960 13655029 11745354 5611608 -2469679 -9013806 -11693169
35884 -11693169 -9642264 -4434691 -417902 -624821 -2292123 -126581 5736202 9264612
$$ packed form
35941D500274j181398k106634J597573N694395L327307m175830p190080p97945
35933c32338P698076Q144141K60852p445850q758143n253279k023426j647329
35925i357296k351316k78484N795782J1349081J0043318K020608m979258n135284
35917G107151j649145p36414j977260k44912M466641N825564Q36147n061017n592915
35908B973840k266731j358449m572741p122857m860984N03647M461323N146057
35900g096895L857837K190742J109081J706795M066904N681376L851279r3743
35892A5273376j891510l81906O55069j909675o133746q081287o544127k679363
35884a1693169K050905N207573M016789k06919j667302K165542N862783L528410
$$ plain form
35876 9264612 6784914 1168454 -3428533 -5942374 -5560380 -160694 8823455 14911514
35868 14911514 14304195 11124343 10915512 13237716 15209960 17556364 21186140 22096150
35860 22096150 16827621 9860266 8139567 10676743 11263888 9294696 9046800 9315026
35852 9315026 3735433 -7240818 -14057453 -10826223 -2575761 3642181 7588939 11701825
35844 11701825 14800284 15074304 14414147 14883727 14665535 11628315 7522270 5062372 4108965
35835 4108965 3745294 4466543 5250460 2469869 -4603988 -10728753 -10806391 -6079437 -1192742
35826 -1192742 1479842 1609484 -785529 -3016621 15668 8481540 14338036 10872486
35818 10872486 2469006 -1203335 1392014 2671790 -2190439 -8857971 -10684605 -7024580
$$ packed form
35876I264612k479698n616460m596987k513841L81994N399686Q984149O088059
35868A4911514o07319l179852k08831K322204J972244K346404L629776R10010
35860B2096150n268529o967355j720699K537176N87145j969192k47896K68226
35852I315026n579593j0976251o816635L231230Q250462O217942L946758M112886
35844A1701825L098459K74020o60157M69580k18192l037220m106045k459898r53407
35835D108965l63671P21249P83917k780591p073857o124765p7638M726954M886695
35826a192742K672584J29642k395013k231092L032289Q465872N856496l465550
35818A0872486q403480l672341K595349J279776m862229o667532j826634L660025
$$ plain form
35810 -7024580 -2333280 -56515 90080 -9811 248671 75801 -242916 1650403 6796338
35801 6796338 11734504 12288785 10324401 12063784 18583345 23187462 20792653 14962117
35793 14962117 12033359 12715944 13650634 13116918 10415068 3420664 -7641424 -16832472
35785 -16832472 -18614620 -15347824 -13416060 -13779777 -11923998 -6023699 142214 2061056
35777 2061056 -1633945 -8929627 -14595704 -13092254 -5578440 -917607 -4529576 -9977759
35769 -9977759 -8604533 -3945253 -6940554 -17858691 -23570095 -15220808 154174 9364260
35761 9364260 7450384 -1297099 -10317020 -14416693 -11539967 -5384077 -2737333 -5100632
35753 -5100632 -6735993 -3645445 256643 -370732 -4065482 -5535066 -3675473 -1716531
$$ packed form
35810g024580M691300K276765J46595r9891K58482j72870l18717J893319N145935
35801F796338M938166N54281j964384J739383O519561M604117k394809n830536
35793A4962117k928758O82585R34690n33716k701850o994404j1062088r191048
35785a6832472j782148L266796J931764l63717J855779N900299O165913J918842
35777B061056l695001p295682n666077J503450P513814M660833l611969n448183
35769i977759J373226M659280k995301j0918137n711404Q349287J5374982R210086
35761I364260j913876q747483r019921m099673K876726O155890K646744k363299
35753e100632j635361L090548L902088o27375l694750j469584J859593J958942
$$ plain form
35745 -1716531 -1289620 -878504 731863 3212465 6477292 10687484 14614953 16372327
35737 16372327 15775079 14278011 12763590 10916422 8719666 7124168 6563049 5420896
35729 5420896 1284081 -5188587 -8495840 -3173070 8692957 17822245 17620863 10862361
35721 10862361 4164964 -375244 -3956738 -5356343 -2740286 949618 1238002 -185977
35713 -185977 2128153 7648987 9830439 6290687 1402250 -2534345 -8424614 -15838350
35705 -15838350 -17606282 -9998742 54874 3293857 -1139352 -7724071 -12285462 -13068679
35697 -13068679 -9244007 -3800728 -3497829 -10159195 -15864561 -12895932 -5259055 -3647115
35689 -3647115 -10659393 -17404170 -14863686 -4085191 5498932 5635563 -2278525 -7569575
$$ packed form
35745a716531M26911M11116J610367K480602L264827M210192L927469J757374
35737A6372327n97248j497068j514421j847168k196756j595498n61119j142153
35729E420896m136815o472668l307253N322770J1866027R129288k01382o758502
35721A0862361o697397m540208l581494j399605K616057L689904K88384j423979
35713a85977K314130N520834K181452l539752m888437l936595n890269p413736
35705a5838350j767932P607540J0053616L238983m433209o584719m561391p83217
35697a3068679L824672N443279L02899o661366n705366K968629P636877J611940
35689c647115p012278o744777K540484J0778495R584123J36631p914088n291050
$$ plain form
35681 -7569575 -1928696 8868605 10346068 -1573979 -14072747 -14600247 -6924612 -2759024
35673 -2759024 -4320382 -5281377 -4263202 -5424529 -7260417 -2995567 6459870 11021691
35665 11021691 6517801 1944947 6553317 16851798 22180372 18288271 10116544 4406830
35657 4406830 3968806 7116673 9488850 7858683 3862571 2142079 4123362 6410298
35649 6410298 5873854 2935891 -732964 -3736892 -3403017 2536559 11035314 15172067
35641 15172067 12640568 8208851 5476107 1694686 -5369274 -10875477 -9256835 -3673272
35633 -3673272 -2310838 -6444769 -8722573 -4239770 2007461 1360147 -7620843 -16989462
35625 -16989462 -17438731 -7583618 4531171 9437993 5997495 1763511 2759717 5521720
$$ packed form
35681g569575N640879J0797301J477463j1920047j2498768n27500P675635M165588
35673b759024j561358r60995J018175j161327j835888M264850R455437M561821
35665A1021691m503890m572854M608370J0298481N328574l892101q171727n709714
35657D406830m38024L147867K372177j630167l996112j720492J981283K286936
35649F410298n36444k937963l668855l003928L33875N939576Q498755M136753
35641A5172067k531499m431717k732744l781421p063960n506203J618642N583563
35633c673272J362434m133931k277804M482803O247231o47314q980990r368619
35625a6989462m49269R855113J2114789M906822l440498m233984R96206K762003
$$ plain form
35617 5521720 2503830 -6297309 -12175450 -9213805 -2203964 437482 -1490210 -569197
35609 -569197 6207134 11908763 9171114 889903 -3823698 -2454214 -1554997 -5730179
35601 -5730179 -10569922 -10121885 -6368178 -5815657 -9606810 -13130430 -14283452 -15690575
35593 -15690575 -17912966 -16498061 -8718090 909575 5359204 3070792 -1591926 -4107251
35585 -4107251 -3459030 -1279242 184303 -386904 -2177492 -2769269 -902357 1747826 2435375
35576 2435375 469008 -2368775 -4085140 -4299280 -3910790 -3630617 -3263982 -2509913 -1950026
35567 -1950026 -2318319 -2933252 -2435078 -1549937 -3072439 -7704103 -11861777 -11747945 -8086318
35558 -8086318 -4468951 -2432490 -1032790 -274611 -1649736 -5324951 -9513073 -12746694
$$ packed form
35617E521720l017890q801139n878141K961645P009841K641446j927692R21013
35609e69197O776331N701629k737649q281211m713601J369484Q99217m175182
35601e730179m839743M48037L753707N52521l791153l523620j153022j407123
35593a5690575k222391J414905P779971R627665M449629k288412m662718k515325
35585d107251O48221K179788J463545n71207j790588n91777J866912K650183O87549
35576B435375j966367k837783j716365k14140L88490K80173L66635P54069N59887
35567a950026l68293o14933M98174Q85141j522502m631664m157674J13832L661627
35558h086318L617367K036461J399700P58179j375125l675215m188122l233621
$$ plain form
35550 -12746694 -14640589 -14721215 -12640789 -9100790 -4814101 71079 3479546 1051969
35542 1051969 -7764198 -15548521 -14182617 -5291037 2014273 3079358 1230107 -420955
35534 -420955 -3206542 -7184593 -8568847 -6382150 -5307205 -7706656 -8746289 -4659869
35526 -4659869 -532845 -3339384 -10990079 -15277168 -13507518 -10342848 -9124299 -8306944
35518 -8306944 -7058297 -7879126 -11233885 -12543446 -8036870 -622995 3663270 3654422 3929088
35509 3929088 7397186 10264104 7139910 -49726 -2432246 4622431 14129446 15473285
35501 15473285 8050827 1740031 3628187 9641183 11274115 6088765 -1350783 -5606908
35493 -5606908 -4564472 -107756 3023372 1409180 -2323939 -1822719 4442204 10650083
$$ packed form
35550a2746694j893895q0626K080426L539999M286689M885180L408467k427577
35542A051969q816167p784323J365904Q891580P305310J065085j849251j651062
35534d20955k785587l978051j384254K186697J074945k399451j039633M086420
35526d659869M127024k806539p650695m287089J769650L164670J218549Q17355
35518h306944J248647q20829l354759j309561M506576P413875M286265q848K74666
35509C929088L468098K866918l124194p189636k382520P054677R507015J343839
35501A5473285p422458o310796J888156O012996J632932n185350p439548m256125
35493e606908J042436M456716L131128j614192l733119N01220O264923O207879
$$ plain form
35485 10650083 11765154 10126581 10939895 15010240 19479329 22435291 23149634 20809269
35477 20809269 16632573 14296264 14802251 14081143 9127571 2863710 -885587 -3104636
35469 -3104636 -5764760 -6751588 -4225312 -1874929 -3282769 -4693660 -699967 5859449
35461 5859449 7641189 4328041 2185800 3492382 4933453 5867272 9253935 13877972
35453 13877972 14398870 10476848 7608784 7556494 6662660 5478340 10195476 20606736
35445 20606736 26329778 21306329 14223346 17146706 29586709 41301792 46762407 49593005
35437 49593005 55122956 64799786 76920136 88670540 98654568 109783101 126873404
35430 126873404 149500292 171869490 192361717 216797475 247239097 273786525 284647672
$$ packed form
35485A0650083J115071j638573Q13314M070345M469089K955962P14343k340365
35477B0809269m176696k336309N05987p21108m953572o263861l749297k219049
35469c104636k660124r86828K526276K350383j407840j410891L993693O559416
35461E859449J781740l313148k142241J306582J441071R33819L386663M624037
35453A3877972N20898l922022k868064n2290q93834j184320M717136J0411260
35445B0606736N723042n023449p082983K923360J2440003J1715083N460615K830598
35437D9593005N529951R676830J2120350J1750404R984028J1128533J7090303
35430A26873404K2626888K2369198K0492227K4435758L0441622K6547428J0861147
$$ plain form
35423 284647672 279788401 267099860 249308591 223899462 193568455 166458177 145352443
35416 145352443 125490886 104943337 89075874 81482059 77222087 69408241 57969965
35409 57969965 48109771 43518761 44184684 47622859 49098687 43479907 30503127 16770658
35401 16770658 9673936 10138751 13279333 15023625 15714386 17409325 19814903 20244323
35393 20244323 17366726 13648701 12558832 13781582 13807831 11902855 11890467 15625124 18523649
35384 18523649 16065567 11826659 12974024 19016690 21823548 17359305 10624128 6859789
35376 6859789 4299753 -721477 -6895920 -10707016 -11746942 -10502293 -4756044 6011586
35368 6011586 15420372 15986968 9241822 3951095 4199290 5340282 3075601 382731
$$ packed form
35423B84647672m859271j2688541j7791269k5409129l0331007k7110278k1105734
35416A45352443j9861557k0547549j5867463p593815m259972p813846j1438276
35409E7969965r860194m591010O65923L438175J475828n618780j2976780j3732469
35401A6770658p096722M64815L140582J744292O90761J694939K405578M29420
35393B0244323k877597l718025j089869J222750K6249j904976j2388L734657K898525
35384A8523649k458082m238908J147365O042666K806858m464243o735177l764339
35376F859789k560036n021230o174443l811096j039926J244649N746249J0767630
35368F011586R408786N66596o745146n290727K48195J140992k264681k692870
$$ plain form
35360 382731 1855980 5640213 5902789 1452896 -2595057 -1763999 2434523 4974318 3132135
35351 3132135 -1287682 -4536253 -4650892 -2680894 -831577 -76508 37908 -43681 -141520
35342 -141520 833534 4492139 10327423 14864772 15169316 12549049 11013576 12326197 14503085
35333 14503085 15420605 15732625 16949100 18231650 17145081 13239225 9094713 7313300
35325 7313300 7567976 7430040 5619864 3424250 2470312 1839855 -1063568 -6208711 -9323320
35316 -9323320 -6880607 -1827832 -927276 -5712294 -9781363 -7265857 -463956 4644518
35308 4644518 7544961 12425961 19462310 23096923 20110069 13868811 8358309 3108828
35300 3108828 -2712673 -5919377 -3728789 669589 2040245 673860 1289253 5636189
$$ packed form
35360C82731J473249L784233K62576m449893m047953Q31058M198522K539795j842183
35351C132135m419817l248571j14639J969998J849317P55069J14416q1589r7839
35342a41520R75054L658605N835284M537349L04544k620267j535473J312621K176888
35333A4503085R17520L12020J216475J282550j086569l905856m144512j781413
35325G313300K54676j37936j810176k195614r53938o30457k903423n145143l114609
35316i323320K442713N052775R00556m785018m069069K515506O801901N108474
35308D644518K900443M881000P036349L634613k986854o241258n510502n249481
35300C108828n821501l206704K190588M398378J370656j366385O15393M346936
$$ plain form
35292 5636189 10642583 12977211 11248470 4875663 -4366078 -10528065 -8773016 -2584358
35284 -2584358 -133005 -2910929 -4078851 405200 5668048 6126832 3678704 3015636
35276 3015636 3689704 2337604 -723610 -2677924 -3499494 -4898510 -6007128 -4928215
35268 -4928215 -2521847 147780 5613494 15511188 24531045 25512015 19064877 11090665
35260 11090665 2373676 -10357421 -23256008 -26274312 -18544867 -12369171 -15932596 -21356441
35252 -21356441 -17916097 -8964865 -5252546 -7153153 -5757151 647472 3605971 -874016
35244 -874016 -5719225 -4336367 39973 1035145 -1716758 -4690103 -6136787 -5352310 -1293332
35235 -1293332 3949464 5227973 2229612 2127859 8905327 14944402 10560860 -1162475
$$ packed form
35292E636189N006394K334628j728741o372807r241741o161987J755049O188658
35284b584358K451353k777924j167922M484051N262848M58784k448128o63068
35276C015636O74068j352100l061214j954314q21570j399016j108618J078913
35268d928215K406368K669627N465714R897694R019857R80970o447138p974212
35260A1090665q716989j2731097j2898587l018304P729445O175696l563425n423845
35252b1356441L440344Q951232L712319j900607J396002O404623K958499m479987
35244h74016m845209J382858M376340R95172k751903k973345j446684P84477M058978
35235a293332N242796J278509k998361j01753O777468O039075m383542j1723335
$$ plain form
35227 -1162475 -7352219 -2738363 3638080 988617 -9991217 -19581483 -20578809 -13782170
35219 -13782170 -4349641 3417912 7570918 7593341 4306803 817564 1328597 6586407
35211 6586407 11453911 10336892 4857987 1910357 3556666 4506615 1777576 -4031
35203 -4031 2099769 1483496 -8355259 -20919673 -23659318 -16159891 -10787756 -14286381 -19192778
35194 -19192778 -17076858 -10931943 -8564206 -10659506 -11993335 -9876466 -5581763 -836081
35186 -836081 2360643 1898320 -258067 1790665 8883436 12638426 6341211 -4234369
35178 -4234369 -8249593 -4897117 -2669925 -5152403 -6772906 -3483222 1231270 3917351
35170 3917351 6959547 12257870 15298175 11419847 4141883 1307697 4857362 9682456
$$ packed form
35227a162475o189744M613856O376443k649463j0979834r590266r97326O796639
35219a3782170R432529P767553M153006K2423l286538l489239N11033N257810
35211F586407M867504j117019n478905k947630J646309R49949k729039j781607
35203d031K103800o16273r838755j2564414k739645P499427N372135l498625m906397
35194a9192778K115920O144915K367737k095300j333829K116869M294703M745682
35186h36081L196724m62323k156387K048732P092771L754990o297215j0575580
35178d234369m015224L352476K227192k482478j620503L289684M714492K686081
35170C917351L042196N298323L040305l878328p277964k834186L549665M825094
$$ plain form
35162 9682456 11746693 12266709 13286034 13564085 11046233 6702920 3270248 1321568
35154 1321568 -925497 -3911868 -5174786 -2820063 890875 1709113 -845640 -2087659
35146 -2087659 2388915 11321871 19126246 21583131 18960388 14497893 11275865 9907625
35138 9907625 8048294 2934080 -4424679 -8807030 -6290993 936934 7451674 11113158
35130 11113158 13637863 15172626 12490010 4310434 -4797249 -8831894 -7166551 -4038661
35122 -4038661 -1917524 1318610 7631281 14024575 15057722 9221833 412394 -6718729
35114 -6718729 -10319286 -10025421 -5617061 845655 4476874 2723193 -513175 457056
35106 457056 5514028 9806909 11376847 12687618 14737698 15408183 14661853 15263058 16214893
$$ packed form
35162I682456K064237N20016J019325K78051k517852m343313l432672j948680
35154A321568k247065k986371j262918K354723L710938Q18238k554753j242019
35146b087659M476574Q932956P804375K456885k622743m462495l222028j368240
35138I907625j859331n114214p358759m382351K516037P227927O514740L661484
35130A1113158K524705J534763k682616q179576r107683m034645J665343L127890
35122d038661K121137L236134O312671O393294J033147n835889q809439p131123
35114f718729l600557K93865M408360O462716L631219j753681l236368R70231
35106D57056N056972M292881J569938J310771K050080O70485p46330O01205R51835
$$ plain form
35097 16214893 12018098 2203260 -4758191 -2576659 3072340 2436103 -4694207 -10347325
35089 -10347325 -10258489 -6741200 -1788387 4334994 8120946 4966782 -2244523 -4187555
35081 -4187555 2687942 11061055 12577965 7487689 1683423 -998283 -290453 2761495
35073 2761495 6231051 7917445 7500629 5955879 2622936 -3355120 -8459066 -6987633
35065 -6987633 487996 6141173 4984402 1122863 936317 4744049 8883568 11649013
35057 11649013 12766978 10684499 5356164 1145625 1976314 5097512 4226260 -1771611
35049 -1771611 -7291908 -7197221 -2659411 830953 -274124 -3897365 -4907500 -1534246
35041 -1534246 2325129 3106725 3425899 7378435 11869484 9754331 2031165 -1289214
$$ packed form
35097A6214893m196795r814838o961451K181532N648999o36237p130310n653118
35089a0347325Q8836L517289M952813O123381L785952l154164p211305j943032
35081d187555O875497Q373113J516910n090276n804266k681706P07830L051948
35073B761495L469556J686394m16816j544750l332943n978056n103946J471433
35065f987633P475629N653177j156771l861539j86546L807732M139519K765445
35057A1649013J117965k082479n328335m210539Q30689L121198q71252n997871
35049a771611n520297R4687M537810L490364j105077l623241j010135L373254
35041a534246L859375P81596L19174L952536M491049k115153p723166l320379
$$ plain form
35033 -1289214 4554959 11714088 11165878 4257630 -2905490 -9449981 -16364081 -19011229
35025 -19011229 -12435407 -881160 6885982 9553378 11963364 13796022 9273266 -1549196
35017 -1549196 -10243662 -10796933 -5915884 -924055 2204793 3308888 2820689 3562919 7859265
35008 7859265 11909399 9506229 2321925 -884582 2874885 6617999 4911180 1410724
35000 1410724 534189 -380070 -4350466 -6956886 -2747537 5477691 11248687 14244625
34992 14244625 17746170 19656324 15134297 7111113 5132313 12217923 20142923 20231554
34984 20231554 13091682 5078208 212548 -1167336 243703 3002667 4738028 4210563
34976 4210563 1885146 -2531381 -9836925 -16907367 -16862447 -7665018 2616938 4351454
$$ packed form
35033a289214N844173P159129n48210o908248p163120o544491o914100k647148
35025a9011229O575822J1554247P767142K667396K409986J832658m522756j0822462
35017a549196q694466n53271M881049M991829L128848J104095m88199P42230M296346
35008G859265M050134k403170p184304l206507L759467L743114j706819l500456
35000A410724q76535r14259l970396k606420M209349Q225228N770996K995938
34992A4244625L501545J910154m522027q023184j978800P085610P925000Q8631
34984B0231554p139872q013474m865660j379884J411039K758964J735361n27465
34976D210563k325417m416527p305544p070442M4920R197429J0281956J734516
$$ plain form
34968 4351454 -1536775 -5747284 -4405554 -3700088 -8466639 -13082547 -9613811 -772351
34960 -772351 2853074 -2468364 -9025869 -9206011 -4886086 -1886609 -772571 1258792
34952 1258792 2727162 -1370607 -11451595 -21089148 -24063000 -20674372 -16292941 -15770259
34944 -15770259 -19418116 -22542001 -19244467 -8730088 2724430 8168513 7282367 4687000
34936 4687000 2496197 -1254243 -6957372 -10775810 -9200251 -3282203 3036925 6605983
34928 6605983 6426879 3693499 1033689 -309952 -2305998 -6685206 -10665451 -10037511
34920 -10037511 -6085463 -4564662 -7131559 -8921970 -6319015 -2059047 1587 476159
34912 476159 1337267 1223164 -2096457 -7420389 -11972070 -15153279 -17172851 -16483914 -12134566
$$ packed form
34968D351454n888229m210509J341730P05466m766551m615908L468736Q841460
34960g72351L625425n321438o557505j80142M319925K999477J114038K031363
34952A258792J468370m097769j0080988r637553k973852L388628M381431N22682
34944a5770259l647857l123885L297534J0514379J1454518N444083q86146k595367
34936D687000k190803l750440n703129l818438J575559N918048O319128L569058
34928F605983j79104k733380k659810j343641j996046m379208l980245O27940
34920a0037511L952048J520801k566897j790411K602955M259968K060634M74572
34912D76159Q61108j14103l319621n323932m551681l181209k019572O88937M349348
$$ plain form
34903 -12134566 -6526685 -2517315 64546 1880166 876657 -4276931 -9936340 -11409875
34895 -11409875 -9627105 -9199832 -10958562 -11362001 -8893813 -6013384 -4283735 -2234765
34887 -2234765 766315 2650175 2331550 1862818 3021812 4522785 4671531 4680757 7110262
34878 7110262 12027027 16451524 17477827 15214893 12499661 11448659 10481335 6324091
34870 6324091 -428167 -4363385 -2217918 1526602 -156539 -7056143 -11322667 -6989787
34862 -6989787 3922303 15267032 22593807 23810648 18447922 9484346 3112532 2974595
34854 2974595 5744562 5412583 1224602 -1661413 529794 5274180 7534496 6428862
34846 6428862 5831495 8782675 13459390 15529560 13194975 8692100 5510224 5318402
$$ packed form
34903a2134566N607881M009370K581861J815620j003509n153588n659409j473535
34895a1409875J782770M27273j758730m03439K468188K880429J729649K048970
34887b234765L001080J883860l18625m68732J158994J500973J48746R226K429505
34878G110262M916765M424497J026303k262934k715232j051002r67324m157244
34870F324091o752258l935218K145467L744520j683141o899604m266524M332880
34862f989787J0912090J1344729P326775J216841n362726q963576o371814j37937
34854B974595K769967l31979m187981k886015K191207M744386K260316j105634
34846F428862n97367K951180M676715K070170k334585m502875l181876j91822
$$ plain form
34838 5318402 7073838 7872511 5267558 272502 -2632303 -438518 4219785 6363613
34830 6363613 5205369 3719003 2273622 -2025552 -8494989 -11126322 -6745634 71371
34822 71371 3994951 5898814 8054109 7471809 912068 -7095540 -9208414 -6347016 -5664727
34813 -5664727 -8257848 -7680692 -1717174 3118643 1860050 -1731536 -2386742 -1312376
34805 -1312376 -2122161 -3951309 -3789301 -1917933 -456784 247548 -223607 -4195160 -11417437
34796 -11417437 -16152493 -13777666 -7670078 -4592909 -5774654 -7920339 -10638679 -16170448
34788 -16170448 -22487469 -23519358 -17401415 -8877082 -1945185 4530538 11461794 14931339
34780 14931339 11308028 4051265 663840 3322560 6087780 2303454 -7196250 -14538476
$$ packed form
34838E318402J755436P98673k604953m995056k904805K193785M658303K143828
34830F363613j158244j486366j445381m299174o469437k631333M380688O817005
34822G1371L923580J903863K155295n82300o559741q007608k112874K861398O82289
34813e664727k593121N77156N963518M835817j258593l591586o55206J074366
34805a312376q09785j829148J62008J871368J461149P04332m71155l971553p222277
34796a1417437m735056K374827O107588L077169j181745k145685k718340n531769
34788a6170448o317021j031889O117943Q524333O931897O475723O931256L469545
34780A4931339l623311p256763l387425K658720K765220l784326r499704p342226
$$ plain form
34772 -14538476 -13133361 -4964153 954776 -2051049 -10718309 -14715697 -7674372 5367524
34764 5367524 12538600 7318514 -4501572 -10813417 -6012341 3630065 8393150 7001483
34756 7001483 6842859 12623218 19400413 19581631 13378014 7848731 7115061 8539875 8787096
34747 8787096 8426825 8202772 5202004 -2832772 -11699778 -14425374 -10686121 -7650148
34739 -7650148 -9790303 -12478871 -9490637 -3465475 -3008300 -9949806 -15675716 -12268251
34731 -12268251 -2309502 5936996 9159735 10157610 11063908 10969072 9577640 8151069 6368712
34722 6368712 2439117 -2988255 -6694455 -7264401 -6164269 -4237724 -993595 2293891
34714 2293891 3081398 1823486 1280253 947945 -2473121 -7777263 -8606627 -2829588 3473220
$$ packed form
34772a4538476J405115Q169208N918929l005825q667260l997388P041325J3041896
34764E367524P171076n220086j1820086o311845M801076R642406M763085j391667
34756G001483j58624N780359O777195J81218o203617n529283p33670J424814K47221
34747H787096l60271k24053l000768q034776q867006k725596L739253L035973
34739g650148k140155k688568K988234O025162M57175o941506n725910L407465
34731a2268251R958749Q246498L222739R97875R06298r4836j391432j426571j782357
34722F368712l929595n427372l706200n69946J100132J926545L244129L287486
34714B293891P87507j257912n43233l32308l421066n304142q29364N777039O302808
$$ plain form
34705 3473220 5132782 5116459 7816171 10696900 8970735 4529821 3503882 7437842
34697 7437842 12751951 16652564 18207981 16291879 12074339 10541505 13467290 14299755
34689 14299755 7178294 -2405127 -4482351 750381 5025704 6574513 10820472 16674897
34681 16674897 15400125 6276504 450162 3276171 4807011 -3789761 -14846236 -15922695
34673 -15922695 -8982745 -5793215 -9166430 -11219556 -8257520 -5442173 -5949581 -5857188
34665 -5857188 -2381516 1135012 1813942 2273154 5456689 9356507 10325519 8090377 4700687
34656 4700687 1449587 -688936 51877 4414828 10216023 13588934 11793734 5233984
34648 5233984 -2127414 -5303290 -2949563 1573566 5222461 8761770 12534509 12293573
$$ packed form
34705C473220J659562j6323K699712K880729j726165m440914j025939L933960
34697G437842N314109L900613J555417j916102m217540j532834K925785Q32465
34689A4299755p121461r583421k077224N232732M275323J548809M245959N854425
34681A6674897j274772r123621n826342K826009J530840q596772j1056475j076459
34673a5922695O939950L189530l373215k053126K962036K815347n07408R2393
34665e857188L475672L516528O78930M59212L183535L899818R69012k235142l389690
34656D700687l251100k138523P40813M362951N801195L372911j795200o559750
34648E233984p361398l175876K353727M523129L648895L539309L772739k40936
$$ plain form
34640 12293573 4569090 -6001088 -11175866 -10267242 -10028310 -13064182 -13820843 -8420189
34632 -8420189 -1458535 982791 -622129 -2757976 -5452699 -9928734 -13403969 -12165480
34624 -12165480 -7814614 -5220889 -5568759 -6071515 -5354994 -4316702 -2321122 2484262
34616 2484262 8668919 11656179 9310467 3932358 -2009741 -8479016 -14856298 -17753442
34608 -17753442 -14358536 -6340194 1377340 4825065 3263517 -1161770 -4822899 -4816936
34600 -4816936 -1203603 2986428 4314571 1579435 -3302178 -6348933 -4643929 112938
34592 112938 2450216 -377321 -4233128 -3679047 -354808 -713316 -5136687 -5678697 2077078
34583 2077078 10592357 9720441 1030107 -4388399 -1418312 3390612 3163108 451700
$$ packed form
34640A2293573p724483j0570178n174778R08624K38932l035872p56661N400654
34632h420189O961654K441326j604920k135847k694723m476035l475235J238489
34624a2165480M350866K593725l47870n02756P16521J038292J995580M805384
34616B484262O184657K987260k345712n378109n942099o469275o377282k897144
34608a7753442L394906Q018342P717534L447725j561548m425287l661129N963
34600d816936L613333M190031J328143k735136m881613l046755J705004M756867
34592A12938K337278k827537l855807N54081L324239l58508m423371n42010P755775
34583B077078Q515279q71916q690334n418506K970087M808924k27504k711408
$$ plain form
34575 451700 1282788 4934946 6042728 4250164 4924992 10118670 14710927 13527971 7948142
34566 7948142 2839450 293574 -532284 86916 2375032 4687143 4829730 3759626 5093355
34557 5093355 10379850 16924926 20720430 19737350 14160016 5602832 -2963284 -8229466
34549 -8229466 -8880490 -6490214 -3924449 -3463121 -5777761 -9140303 -10281529 -8280080
34541 -8280080 -7020651 -10690152 -16982006 -18820795 -13756206 -7172120 -4196029 -3353305
34533 -3353305 -1815411 -2003817 -7197800 -14013595 -16168882 -13959368 -12773307 -13043618
34525 -13043618 -9955429 -4042419 -2901493 -8533961 -11482508 -4144762 6546822 7893496
34517 7893496 -1179789 -10058552 -11623307 -8722385 -5676559 -2112296 2392154 4763654
$$ packed form
34575D51700Q31088L652158J107782j792564O74828N193678M592257j182956n579829
34566G948142n108692k545876q25858O19200K288116K312111J42587j070104J333729
34557E093355N286495O545076L795504r83080n577334q557184q566116n266182
34549h229466o51024K390276K565765M61328k314640l362542j141226K001449
34541h280080J259429l669501o291854j838789N064589O584086K976091Q42724
34533c353305J537894j88406n193983o815795k155287K209514J186061k70311
34525a3043618L088189N913010J140926n632468k948547P337746J0691584J346674
34517G893496r073285q878763j564755K900922L045826L564263M504450K371500
$$ plain form
34509 4763654 3287388 845562 -133270 -1525696 -4920299 -7351196 -5589198 -1393980
34501 -1393980 1481304 2772954 4306106 5634121 5192806 3781141 2850430 1197008
34493 1197008 -2542282 -6121739 -7115651 -8147101 -12860640 -17794083 -15223574 -4978494
34485 -4978494 3287191 2069374 -5377828 -11233628 -12477043 -10410713 -6037306 -1035935
34477 -1035935 423437 -3541658 -8183088 -7560845 -2440511 1989688 4123513 6015566
34469 6015566 7110050 4648762 327724 -265784 3715531 6663193 5726698 5419337 9174656
34460 9174656 11906305 6526926 -5684468 -16873653 -22487906 -23768410 -21773512 -15174516
34452 -15174516 -5022131 3254024 5146347 1940996 -1372474 -1541012 438762 952211
$$ packed form
34509D763654j476266k441826r78832j392426l394603k430897J761998M195218
34501a393980K875284J291650J533152J328015m41315j411665r30711j653422
34493A197008l739290l579457r93912j031450m713539m933443K570509J0245080
34485d978494Q265685j217817p447202n855800j243415K066330M373407N001371
34477a035935J459372l965095m641430O22243N120334M430199K133825J892053
34469F015566J094484k461288m321038n93508L981315K947662r36495l07361L755319
34460I174656K731649n379379j2211394j1189185n614253j280504J994898O598996
34452a5174516J0152385Q276155J892323l205351l313470j68538J979774N13449
$$ plain form
34444 952211 -2454423 -7935925 -10532852 -7952733 -4007995 -3730421 -5969778 -4479367
34436 -4479367 3326884 12386635 16183716 13978043 10032983 7987421 8024929 7986755 5504936
34427 5504936 199815 -5142958 -7119353 -6324858 -7238588 -12060861 -17056026 -17222376 -12577352
34418 -12577352 -7240442 -3964148 -2426665 -1559175 -325200 2944916 8516135 12804481
34410 12804481 11544776 5865309 1804983 2716702 5304669 4809571 1169976 -2359820
34402 -2359820 -4312426 -5468541 -5409836 -2288204 3310311 7093042 5534159 301693
34394 301693 -3873926 -5529831 -8344713 -15320330 -22872572 -23830774 -16593660 -8112223
34386 -8112223 -5819612 -9045950 -11278955 -9033013 -4573536 -648876 2832707 5983032
$$ packed form
34444I52211l406634n481502k596927K580119L944738K77574k239357J490411
34436d479367P806251R059751L797081k205673l945060k045562L7508l8174k481819
34427E504936n305121n342773j976395P94495r13730m822273m995165j66350M645024
34418a2577352N336910L276294J537483Q67490J233975L270116N571219M288346
34410A2804481j259705n679467m060326R11719K587967m95098l639595l529796
34402b359820j952606j156115N8705L121632N598515L782731j558883n232466
34394C01693m175619j655905k814882o975617p552242r58202P237114Q481437
34386h112223K292611l226338k233005K245942M459477L924660L481583L150325
$$ plain form
34378 5983032 7120678 5977340 5336279 6794021 7664518 5196906 1614012 1294319 4275244
34369 4275244 6353332 5201072 2715143 929660 -943310 -3960728 -6375709 -5111181
34361 -5111181 426794 7013591 10028382 7622663 3115582 2179548 6233885 10000176
34353 10000176 8025354 2336926 -176417 2187876 3291810 -1492287 -7554196 -6712860
34345 -6712860 1530833 8874815 8338684 1909006 -3169195 -3219983 -1040420 -800155 -2435303
34336 -2435303 -2428063 861945 4992737 7251739 8190251 9048216 7798246 1898167 -5662735
34327 -5662735 -8205880 -4524312 -1087695 -2347508 -3975853 -507360 4680687 4014894
34319 4014894 -1749383 -3621657 2317854 9181492 9661321 5720924 3432612 3284219
$$ packed form
34378E983032J137646j143338o41061J457742Q70497k467612l582894l19693K980925
34369D275244K078088j152260k485929j785483j872970l017418k414981J264528
34361e111181N537975O586797L014791k405719m507081r36034M054337L766291
34353A0000176j974822n688428k513343K364293J103934m784097o061909Q41336
34345f712860Q243693P343982n36131o429678n078201n0788K179563K40265j635148
34336b435303P240L290008M130792K259002R38512Q57965j249970n900079p560902
34327e662735k543145L681568L436617j259813j628345L468493N188047o65793
34319D014894n764277j872274N939511O863638M79829l940397k288312j48393
$$ plain form
34311 3284219 1807711 26138 3197516 11635233 17491752 13546430 2384082 -5970340
34303 -5970340 -4723744 3131067 8739801 6631184 -459546 -5427647 -4284331 838915
34295 838915 5148676 5994070 4389316 3398052 5128919 7970504 7401619 1793832 -3538299
34286 -3538299 -2121739 3729650 4228691 -4340114 -13050808 -11834254 -2788332 4045584
34278 4045584 4444794 2056034 -844559 -5490437 -9410545 -6658812 1777898 6338782
34270 6338782 2378572 -2236714 716882 6567480 4775542 -5137148 -13707025 -15454466
34262 -15454466 -13433743 -9948560 -2247516 9512986 17932024 17196330 11257473 8171154
34254 8171154 9889348 12658336 14672808 17280059 19170425 15268288 3639358 -9850254
$$ packed form
34311C284219j476508j781573L171378Q437717N856519l945322j1162348q354422
34303e970340J246596P854811N608734k108617p090730m968101J143316N123246
34295H38915M309761Q45394j604754r91264J730867K841585n68885n607787n332131
34286c538299J416560N851389M99041q568805q710694J216554R045922O833916
34278D045584L99210k388760k900593m645878l920108K751733Q436710M560884
34270F338782l960210m615286K953596N850598j791938r912690q569877j747441
34262a5454466K020723L485183P701044J1760502Q419038p35694n938857l086319
34254H171154J718194K768988K014472K607251J890366l902137j1628930j3489612
$$ plain form
34246 -9850254 -16493738 -13255239 -4831276 1807365 3369780 1257128 -1397965 -2660946
34238 -2660946 -2523040 -1957406 -1584771 -1007054 274621 959900 -1852106 -8745302 -14948126
34229 -14948126 -14313017 -7191646 -1112534 -1530816 -5077747 -5492721 -3539285 -5650047
34221 -5650047 -13330736 -19734377 -18556029 -11757438 -5607989 -2455761 14904 3305537
34213 3305537 5634752 4859743 1428430 -2178311 -3929619 -3824795 -3166963 -2359955 -330568
34204 -330568 2955481 4890009 3548637 1607235 3472589 8586265 11447854 8940756
34196 8940756 3456395 -2516449 -10008736 -18978736 -24824246 -24005848 -19858361 -17739413
34188 -17739413 -16599696 -10982780 -818409 6209269 3491772 -6630095 -15238295 -15449239
$$ packed form
34246i850254o643484L238499Q423963O638641J562415k112652k655093j262981
34238b660946J37906N65634L72635N77717J281675O85279k812006o893196o202824
34229a4948126O35109P121371O079112m18282l546931m14974J953436k110762
34221e650047p680689o403641J178348O798591O149449L152228K470665L290633
34213C305537K329215p75009l431313l606741j751308J04824O57832Q07008K029387
34204c30568L286049J934528j341372j941402J865354N113676K861589k507098
34196H940756n484361n972844p492287q970000n845510Q18398M147487K118948
34188a7739413J139717N616916J0164371P027678k717497j0121867q608200k10944
$$ plain form
34180 -15449239 -8457230 -2253308 -3640283 -10434905 -13435932 -7624741 1646114 6372096
34172 6372096 6071179 5648422 6521106 6429865 6194689 9060640 13341767 13358803 9061650
34163 9061650 7175495 10151304 11429608 5915779 -1614492 -4256147 -3511398 -5184514
34155 -5184514 -8610115 -7568490 -418245 7505602 11490305 11760947 9841338 5709824
34147 5709824 -217827 -6067149 -10548442 -13387512 -13913589 -12330144 -11645409 -14078898
34139 -14078898 -15735741 -10016120 2466005 12508619 13422752 9046571 7225342 9232159
34131 9232159 10473653 9168657 8486791 10244900 11891364 11447433 11117356 13028023 14499038
34122 14499038 11665642 6558490 6084190 13064235 21953154 25616238 23521516 20040170
$$ packed form
34180a5449239O992009O203922j386975o794622l001027N811191R270855M725982
34172F372096l00917m22757Q72684r1241k35176K865951M281127J7036m297153
34163I061650j886155K975809J278304n513829p530271k641655P44749j673116
34155e184514l425601J041625P150245P923847L984703K70642j919609m131514
34147E709824n927651n849322m481293k839070n26077J583445O84735k433489
34139a4078898j656843N719621J2482125J0042614R14133m376181j821229K006817
34131I232159J241494j304996o81866J758109J646464m43931l30077J910667J471015
34122A4499038k833396n107152m74300O980045Q888919L663084k094722l481346
$$ plain form
34114 20040170 16689851 10760219 1801731 -5308048 -6202623 -2570314 1306952 4972612
34106 4972612 10525984 16239842 16721577 10741794 4513489 4162618 7811842 8940977
34098 8940977 5969478 3748628 5106361 5840512 1243520 -5695585 -7309268 -1550775
34090 -1550775 5359393 7219927 4519885 1236054 -774986 -1218770 1056402 5675168
34082 5675168 8569310 6967741 4658299 6934843 11523979 10821024 3394296 -3271857
34074 -3271857 -3302886 303187 1657531 -269776 -3328078 -6596608 -8947863 -7457596
34066 -7457596 -1748594 3518166 4605874 3650023 3690677 3098052 24863 -2012156 461127
34057 461127 3406981 490430 -6790853 -11639331 -12337931 -11942587 -9609211 -1975638 7155875
$$ packed form
34114B0040170l350319n929632q958488p109779q94575L632309L877266L665660
34106D972612N553372N713858M81735n979783o228305l50871L649224J129135
34098H940977k971499k220850J357733P34151m596992o939105j613683N758493
34090a550775O910168J860534k700042l283831k011040m43784K275172M618766
34082E675168K894142j601569k309442K276544M589136p02955p426728o666153
34074c271857l1029L606073J354344j927307l058302l268530k351255J490267
34066g457596N709002N266760J087708r55851M0654n92625l073189k037019K473283
34057D61127K945854k916551p281283m848478o98600L95344K333376P633573R131513
$$ plain form
34048 7155875 9091155 3914320 1526254 5951509 9183894 5596130 1747943 4030302
34040 4030302 5971583 -1499027 -13454316 -16384153 -7397591 2844352 5678690 3010904
34032 3010904 -454703 -4228113 -8249223 -9321573 -5476077 494273 4877283 7017047
34024 7017047 7407504 5316393 674232 -4260123 -7143741 -7677607 -6414941 -3352795
34016 -3352795 1334138 6536308 10453563 10708729 5658609 -2322225 -6879346 -4401719
34008 -4401719 1032846 3379585 3087774 4378072 6153481 3443037 -2167607 -2591488
34000 -2591488 3686857 7522225 3111003 -2014131 1677534 10691787 13808110 8556074
33992 8556074 2850513 1610997 1187900 -1841914 -4582704 -3373349 658233 4491298
$$ packed form
34048G155875J935280n176835k388066M425255L232385l587764l848187K282359
34040D030302J941281p470610j1955289k929837Q986562J0241943K834338k667786
34032C010904l465607l773410m021110j072350L845496N970350M383010K139764
34024G017047L90457k091111m642161m934355k883618n33866J262666L062146
34016c352795M686933N202170L917255K55166n050120p980834m557121K477627
34008d401719N434565K346739k91811J290298J775409k710444n610644m23881
34000b591488O278345L835368m411222n125134L691665R014253L116323n252036
33992H556074n705561j239516m23097l029814k740790J209355M031582L833065
$$ plain form
33984 4491298 6863453 6694360 2591662 -3528343 -6892352 -6788364 -8461919 -14492226
33976 -14492226 -18634202 -13256891 -196833 10800365 12954230 7504831 -437596 -6131163
33968 -6131163 -5966265 673268 9111099 12797817 10386001 6493517 4811568 4095898
33960 4095898 2333977 889602 1569040 2588369 1487827 675204 5602262 16536994
33952 16536994 25533504 24094411 12687008 395949 -4886463 -3906688 -2737358 -4050162
33944 -4050162 -4705895 -1951909 1717399 2361014 772771 1121983 4212896 6039210 3754710
33935 3754710 -211330 -1411601 1746054 7656042 13476451 15799441 12046680 3902716
33927 3902716 -2226414 -931705 6548136 14097909 17138159 15510595 11329611 6627205
$$ packed form
33984D491298K372155j69093m102698o120005l364009J03988j673555o030307
33976a4492226m141976N377311J3060058J0997198K153865n449399p942427n693567
33968f131163J64898O639533Q437831L686718k411816l892484j681949p15670
33960D095898j761921j444375O79438J019329j100542q12623M927058J0934732
33952A6536994Q996510j439093j1407403j2291059n282412R79775J169330j312804
33944d050162o55733K753986L669308O43615j588243L49212L090913J826314k284500
33935C754710l966040j200271L157655N909988N820409K322990l752761q143964
33927C902716o129130J294709P479841P549773L040250j627564m180984m702406
$$ plain form
33919 6627205 2832842 287144 -2025947 -4838258 -6804483 -5719133 -1388411 3889756
33911 3889756 7463145 7970892 5519528 1641901 -1094319 -525445 3860643 10925320
33903 10925320 18094228 21842881 20242676 15602235 12020871 9506318 3937810 -5483273
33895 -5483273 -12967329 -13605335 -10207418 -8259304 -7577969 -4634038 -367908 1266407
33887 1266407 1303980 4924538 12213842 16717702 14656466 9333546 4662813 527172
33879 527172 -3110945 -3589603 -218449 3619445 5935735 8548052 11376203 10381045 4855942
33870 4855942 556281 798734 461964 -5282413 -11839164 -11878419 -6695389 -3119804 -2339984
33861 -2339984 51548 4841279 8149230 8878279 9712364 10779961 9369533 6280460
$$ packed form
33919F627205l794363k545698k313091k812311j966225J085350M330722N278167
33911C889756L573389N07747k451364l877627k736220N68874M386088P064677
33903A0925320P168908L748653j600205m640441l581364k514553n568508r421083
33895e483273p484056o38006L397917J948114O81335K943931M266130J634315
33887A266407L7573L620558P289304M503860k061236n322920m670733m135641
33879E27172l638117m78658L371154L837894K316290K612317K828151r95158n525103
33870D855942m299661K42453l36770n744377o556751l9255N183030L575585P79820
33861b339984K391532M789731L307951P29049Q34085J067597j410428l089073
$$ plain form
33853 6280460 5695464 7925663 8559847 5788835 2660131 1237172 541428 1139942 5340757
33844 5340757 11462486 14445939 13977413 15335100 19931217 22232716 19514584 17359780
33836 17359780 20317462 23465097 19777231 11271637 5946937 6561717 9012826 10230170
33828 10230170 11600942 14703095 18188522 19286751 15939657 8486728 1286410 216256
33820 216256 5689264 10940606 10647380 7972715 8596241 11192611 10103408 5342285 2663684
33811 2663684 3873138 4248972 1007563 -2378537 -3212961 -5049997 -11563259 -18799648
33803 -18799648 -18839375 -9949825 1104200 6987151 6990653 5389099 4622642 2299531 -4324543
33794 -4324543 -12193671 -13717680 -5817997 4712063 8343061 4168643 -204534 -162960
$$ packed form
33853F280460n84996K230199O34184k771012l128704j422959o95744N98514M200815
33844E340757O121729K983453m68526J357687M596117K301499k718132k154804
33836A7359780K957682L147635l687866q505594n324700O14780K451109J217344
33828A0230170J370772L102153L485427J098229l347094p452929p200318j070154
33820B16256N473008N251342k93226k674665O23526K596370j089203m761123k678601
33811B663684J209454L75834l241409l386100q34424j837036o513262p236389
33803a8799648l9727Q889550J1054025N882951L502j601554p66457k323111o624074
33794d324543p869128j524009P899683J0530060L630998m174418m373177M1574
$$ plain form
33786 -162960 -49537 -5050562 -12050869 -13738164 -9238568 -4577282 -2809603 -47766
33778 -47766 6291293 10906242 7517228 -701470 -4148830 -126640 3494508 550516
33770 550516 -3434526 897984 12450040 20336910 18325820 11688903 7998625 7540608
33762 7540608 6669390 5395035 5850382 6099812 1769895 -6534612 -12616688 -12142696 -6645515
33753 -6645515 442635 7239435 11248076 8418529 -1553189 -11397061 -12481644 -4974671
33745 -4974671 1976308 1586264 -2195435 -566096 7722493 14173138 11444179 2339953
33737 2339953 -4744177 -6083569 -4175411 -1257726 3027879 7578877 9289080 8314037
33729 8314037 8837933 12202649 14082400 11434233 7294685 4862127 2044821 -2859321
$$ packed form
33786a62960J13423n001025p000307j687295M499596M661286J767679K761837
33778d7766O339059M614949l389014q218698l447360M022190L621148k943992
33770E50516l985042M332510J1552056P886870k011090o636917l690278m58017
33762G540608q71218j274355M55347K49430m329917q304507o082076M73992N497181
33753f645515P088150O796800M008641k829547r971718r843872j084583P506973
33745d974671O950979l90044l781699J629339Q288589O450645k728959r104226
33737B339953p084130j339392J908158K917685M285605M550998J710203r75043
33729H314037N23896L364716J879751k648167m139548k432558k817306m904142
$$ plain form
33721 -2859321 -5194475 -888869 4548254 2703713 -4165236 -5756326 393390 5789861
33713 5789861 5577844 5864037 11805304 17683596 15973790 9306245 5303282 4625257 2929784
33704 2929784 1383109 5579741 14379578 18567584 12605260 1219864 -7898051 -12361309
33696 -12361309 -13438956 -11233127 -5472866 1798490 7900351 12444730 16260565 18769999
33688 18769999 18484725 15157085 9965384 4484283 448986 -806503 128261 995629
33680 995629 705233 509929 1175251 735458 -2851474 -7913874 -10388781 -8827993 -6031640
33671 -6031640 -5311925 -6785863 -8079639 -7453507 -5267855 -3078389 -2250558 -3233910 -5438243
33662 -5438243 -7691970 -9099686 -9394300 -8342189 -5414888 -1003443 2149101 291240
$$ packed form
33721b859321k335154M305606N437123j844541o868949j591090O149716N396471
33713E789861k12017K86193N941267N878292j709806o667545m002963o78025j695473
33704B929784j546675M196632Q799837M188006n962324j1385396r117915m463258
33696a2361309j077647K205829N760261P271356O101861M544379L815835K509434
33688A8769999k85274l327640n191701n481101m035297j255489R34764Q67368
33680I95629k90396j95304O65322m39793l586932n062400k474907J560788K796353
33671f031640P19715j473938j293776O26132K185652K189466Q27831r83352k204333
33662e438243k253727j407716k94614J052111K927301M411445L152544j857861
$$ plain form
33654 291240 -7167440 -15344692 -17501247 -11643987 -2542127 3398167 4128393 1975169
33646 1975169 -732899 -3601196 -5876392 -5008089 649433 8738585 14267251 14140628
33638 14140628 9521640 3961226 230933 -893603 228333 3163864 7250797 10571288
33630 10571288 10062559 4128100 -4593730 -10717646 -11571679 -9819289 -9043914 -8457781 -5123920
33621 -5123920 -417965 462821 -3418234 -6077306 -3302188 291560 -1882072 -7467314
33613 -7467314 -8143813 -2808989 278420 -3110101 -5374336 1778302 14069675 20039138
33605 20039138 16761024 12070134 11640410 12169884 9577457 6325054 5697198 4392090
33597 4392090 -2574155 -12351494 -16408522 -11821612 -4527159 -475641 886978 2096017
$$ packed form
33654B91240p458680q177252k156555N857260R101860N940294P30226k153224
33646A975169k708068k868297k275196Q68303N657522Q089152N528666j26623
33638A4140628m618988n560414l730293j124536J121936K935531M086933L320491
33630A0571288n08729n934459q721830o123916q54033J752390P75375N86133L333861
33621e123920M705955Q80786l881055k659072K775118L593748k173632n585242
33613g467314o76499N334824L087409l388521k264235P152638J2291373N969463
33605B0039138l278114m690890m29724N29474k592427l252403o27856j305108
33597D392090o966245r777339m057028M586910P294453M051518J362619J209039
$$ plain form
33589 2096017 2009441 -749883 -2165134 3305711 13752916 20219752 17498149 10151734
33581 10151734 5524319 4657657 3733079 1713680 1800046 5949380 12045697 16821402 18333547
33572 18333547 15400963 8259851 747431 -1646783 2275272 7809619 9880685 7682271
33564 7682271 3060186 -2073458 -4911967 -2268274 4872502 10213819 8903247 3060614
33556 3060614 -2429168 -6581483 -10740838 -13341865 -11791031 -8078953 -6642050 -6748128
33548 -6748128 -2641345 7611128 18167481 22038686 18117185 10285076 2902048 -1290547
33540 -1290547 -1564612 853563 4577555 9540356 14782736 16437441 11755920 4015084
33532 4015084 -1184615 -3639168 -7180490 -11328709 -11183762 -6361183 -2624544 -2492603
$$ packed form
33589B096017q6576k759324j415251N470845J0447205O466836k721603p346415
33581A0151734m627415q66662r24578k019399Q6366M149334O096317M775705J512145
33572A8333547k932584p141112p512420k394214L922055N534347K071066k198414
33564G682271m622085n133644k838509K643693P140776N341317j310572n842633
33556C060614n489782m152315m159355k601027J550834L712078J436903j06078
33548f748128M106783J0252473J0556353L871205l921501p832109p383028m192595
33540a290547k74065K418175L723992M962801N242380J654705m681521p740836
33532D015084n199699k454553l541322m148219J44947M822579L736639J31941
$$ plain form
33524 -2492603 -1652182 2143157 4340612 2337828 1298858 4956908 7697042 3828152
33516 3828152 -1194281 1525410 9405007 11802800 6701290 3237587 6877099 12101843
33508 12101843 12543894 9619657 7025126 3996118 -861296 -4621032 -4342935 -2495409
33500 -2495409 -3158477 -5710838 -6932370 -7194455 -9823681 -15243185 -19956816 -21487992
33492 -21487992 -21033208 -20448176 -18998553 -14456516 -6445049 2303928 7927453 8442742
33484 8442742 5095106 1294574 319599 2922845 5825204 3560745 -5358993 -14091821
33476 -14091821 -13106112 -1787570 9514591 11822750 7892135 6121058 8093480 8433119
33468 8433119 4778937 771628 -602592 -66829 1945250 5879153 8657682 5344802
$$ packed form
33524b492603Q40421L795339K197455k002784j038970L658050K740134l868890
33516C828152n022433K719691P879597K397793n101510l463703L639512N224744
33508A2101843M42051k924237k594531l029008m857414l759736K78097J847526
33500b495409o63068k552361j221532k62085k629226n419504m713631j531176
33492b1487992M54784N85032J449623M542037Q011467Q748977N623525N15289
33484H442742l347636l800532r74975K603246K902359k264459q919738q732828
33476a4091821R85709J1318542J1302161K308159l930615j771077J972422L39639
33468H433119l654182m007309j374220N35763K012079L933903K778529l312880
$$ plain form
33460 5344802 -2690905 -7429090 -4672971 832871 3540776 4368520 6149726 7600353
33452 7600353 6589876 4746151 4076140 3261522 1788335 2935205 7324797 8472501
33444 8472501 1476679 -8066042 -11442640 -9628914 -10036664 -12909310 -11046257 -2963108
33436 -2963108 4021015 6079555 8582827 15343628 20825979 19084817 13524594 10689572
33428 10689572 9645006 5410088 -626889 -2341408 254813 38734 -6278773 -13191074
33420 -13191074 -14633176 -11477670 -8002093 -5867305 -5086709 -6537785 -8995623 -7205005
33412 -7205005 1463265 10404330 10019671 474732 -7631101 -6474680 687771 6488620
33404 6488620 8843036 9392151 7871452 4217076 2991084 8582490 17176324 20479348
$$ packed form
33460E344802q035707m738185K756119N505842K707905Q27744J781206J450627
33452G600353j010477j843725o70011q14618j473187J146870M389592J147704
33444H472501o995822r542721l376598J813726m07750k872646J863053Q083149
33436b963108O984123K058540K503272O760801N482351j741162n560223k835022
33428A0689572j044566m234918o036977j714519K596221k16079o317507o912301
33420a3191074j442102L155506L475577K134788P80596j451076k457838J790618
33412g205005Q668270Q941065l84659r544939q105833J156421P162451N800849
33404F488620K354416N49115j520699l654376j225992N591406Q593834L303024
$$ plain form
33396 20479348 17479625 15280952 16745906 14896344 3760983 -11180262 -19069916 -16732364
33388 -16732364 -10484512 -7114255 -7660362 -8825784 -6818513 -750917 5377466 6199700
33380 6199700 2670576 2484326 9263791 15934433 14718205 9675381 11105358 19395359
33372 19395359 23828669 18332295 9384700 5152481 4771051 3335810 1053870 1074427
33364 1074427 2353819 1184266 -2127964 -3642821 -2038174 40711 701699 1166880
33356 1166880 3003652 5574543 6819645 5399449 2338101 1020416 4020083 9162828
33348 9162828 11098191 8179585 4949379 5557044 7720909 6625083 2428501 -275184
33340 -275184 795079 3490043 5273516 5506048 3801284 -116984 -4297357 -5417395
$$ packed form
33396B0479348k999723k198673J464954j849562j1135361j4941245p889654K337552
33388a6732364O247852L370257n46107j165422K007271O067596O128383Q22234
33380F199700l529124j86250O779465O670642j216228n042824J429977Q290001
33372A9395359M433310n496374q947595m232219l81430j435241k281940K0557
33364A074427J279392j169553l312230j514857J604647K078885O60988M65181
33356A166880J836772K570891J245102j420196l061348j317685K999667N142745
33348I162828J935363k918606l230206O07665K163865j095826m196582k703685
33340b75184J070263K694964J783473K32532j704764l918268m180373j120038
$$ plain form
33332 -5417395 -2625436 1717175 5316520 7597100 8275144 7347617 6839928 9384507 14154860
33323 14154860 17123495 16485444 15013299 15626154 17407729 17980876 17411821 17264910 17432803
33314 17432803 16521693 14588370 13254769 13394775 14416222 15585814 16471873 16093847 13220338
33305 13220338 8236309 3895446 3163392 5964605 8550728 7027018 1715430 -3046337
33297 -3046337 -4030725 -2677795 -2396964 -3968798 -5674962 -6503196 -6354549 -4208623 224390
33288 224390 3523103 1651022 -3415008 -4831355 -207672 4964941 5697544 4454564
33280 4454564 5842750 8760141 9212096 7854397 8517651 10679978 9653939 4287853
33272 4287853 -1032442 -2724467 -1518485 982423 4300900 6627559 5395887 1938392
$$ packed form
33332e417395K791959M342611L599345K280580O78044r27527n07689K544579M770353
33323A4154860K968635o38051j472145O12855J781575N73147n69055j46911J67893
33314A7432803r11110j933323j333601J40006J021447J169592Q86059l78026k873509
33305A3220338m984029m340863p32054K801213K586123j523710n311588m761767
33297c046337r84388J352930K80831j571834j706164q28234J48647K145926M433013
33288B24390L298713j872081n066030j416347M623683N172613P32603j242980
33280D454564J388186K917391M51955j357699O63254K162327j026039n366086
33272D287853n320295j692025J205982K500908L318477K326659j231672l457495
$$ plain form
33264 1938392 746124 2188472 976787 -5677395 -13623140 -18712938 -22633044 -27202576
33256 -27202576 -28331380 -22293591 -13970330 -10968763 -11867221 -8899445 -1696138 1063869
33248 1063869 -4225287 -9296587 -6100726 1484225 4507431 2410910 1999157 5398106
33240 5398106 6832354 1902894 -6121608 -11331171 -12274660 -11721201 -12108105 -13448561 -14302650
33231 -14302650 -13316496 -10445463 -6974461 -3638844 419034 5154664 7467937 4794421
33223 4794421 212653 -291736 3746099 6195545 3406547 -579815 -1217446 -1107135 -5144636
33214 -5144636 -11370217 -13329554 -10277440 -8108804 -9619647 -10532666 -7346654 -3162216
33206 -3162216 -2266868 -3741062 -4452091 -4514344 -5433691 -5949980 -4321488 -2381926 -2695931
$$ packed form
33264A938392j192268J442348j211685o654182p945745n089798l920106m569532
33256b7202576j128804O037789Q323261L001567q98458K967776P203307K760007
33248A063869n289156n071300L195861P584951L023206k096521m11753L398949
33240E398106J434248m929460q024502n209563r43489N53459l86904j340456q54089
33231a4302650R86154K871033L471002L335617M057878M735630K313273k673516
33223D794421m581768n04389M037835K449446k788998l986362o37631J10311m037501
33214e144636o225581j959337L052114K168636j510843r13019L186012M184438
33206c162216Q95348j474194p11029o2253r19347n16289J628492J939562l14005
$$ plain form
33197 -2695931 -3501349 -1231220 3125803 4913060 2530278 -1035898 -3134654 -3960245
33189 -3960245 -4432716 -5269318 -7569961 -10574944 -10004775 -3224699 5007417 7280502 3306932
33180 3306932 -811509 -2291705 -3521804 -4208026 -258172 7290859 10681310 6631686
33172 6631686 1527463 974100 1641435 -1107855 -4746917 -5140759 -3746804 -2210032 3238998
33163 3238998 13328825 18259288 9530580 -5167501 -10443271 -3982166 2798061 3372306
33155 3372306 2789312 4769918 4532941 -1585957 -9249801 -13316480 -14074811 -12814152 -8868500
33146 -8868500 -4467130 -4792871 -9386757 -10863991 -6134733 -1621901 -3060944 -7348192
33138 -7348192 -9344252 -9795712 -10987737 -10800232 -7059220 -2810833 -1980675 -4065436 -6882732
$$ packed form
33197b695931q05418K270129M357023J787257k382782l566176k098756q25591
33189c960245m72471q36602k300643l004983N70169O780076Q232116K273085l973570
33180C306932m118441j480196j230099o86222L949854P549031L390451m049624
33172F631686n104223n53363O67335k749290l639062l93842J393955J536772N449030
33163C238998J0089827M930463q728708j4698081n275770O461105O780227N74245
33155C372306n82994J980606k36977o118898p663844m066679p58331J260659L945652
33146h868500M401370l25741m593886j477234M729258M512832j439043m287248
33138g348192j996060m51460j192025J87505L741012M248387Q30158k084761k817296
$$ plain form
33129 -6882732 -9327801 -8332671 -286818 10283585 11576221 -2044 -12821513 -14962468
33121 -14962468 -8496935 -2102965 1668996 2967643 -2307801 -14398662 -22193108 -17011399
33113 -17011399 -8052563 -10109459 -20663783 -24793342 -19938341 -18390113 -24562022 -27342850
33105 -27342850 -19487613 -8911520 -3853261 -342301 7087925 13407556 11456598 4304705
33097 4304705 362277 1971250 6078275 10717780 14015084 11849239 3404633 -4702212
33089 -4702212 -5631739 -547794 4530867 6204484 4378966 281347 -2218638 1685990
33081 1685990 10480411 15749413 12922777 7183781 4537960 3347355 -42422 -3850795
33073 -3850795 -5468939 -7260483 -10415200 -8971120 1333985 13067199 15421840 9068298
$$ packed form
33129f882732k445069R95130Q045853J0570403J292636j1578265j2819469k140955
33121a4962468O465533O393970L771961J298647n275444j2090861p794446N181709
33113a7011399Q958836k056896j0554324m129559M855001J548228o171909k780828
33105b7342850P855237J0576093N058259L510960P430226O319631j950958p151893
33097D304705l942428J608973M107025M639505L297304k165845q444606q106845
33089d702212r29527N083945N078661J673617j825518m097619k499985L904628
33081A685990Q794421N269002k826636n738996k645821j190605l389777l808373
33073c850795j618144j791544l154717J444080J0305105J1733214K354641o353542
$$ plain form
33065 9068298 3200326 747852 -2817922 -7253314 -5618842 3612016 12272246 13489380
33057 13489380 9156258 3556829 -2748824 -8692598 -9364505 -2550441 5914539 8673672
33049 8673672 5902604 3393431 3845440 4534274 2718031 -575834 -2590694 -2149619 -173964
33040 -173964 1644830 1985712 683037 -629798 825751 5920231 10591365 8196951
33032 8196951 -2567603 -13845885 -16706396 -12241338 -9419013 -11622677 -12081277 -5474665
33024 -5474665 2857919 4908928 1896897 1040164 3685035 4319593 409249 -3723425
33016 -3723425 -3307124 1964144 9764844 17003583 19434714 14065779 3086566 -7778327
33008 -7778327 -15009600 -18619224 -18891909 -15753371 -10776514 -5984469 -1222882 3875549
$$ packed form
33065I068298n867972k452474l565774m435392J634472R230858Q660230J217134
33057A3489380m333122n599429o305653n943774o71907O814064Q464980K759133
33049H673672k771068k509173M52009O88834j816243l293865k014860M41075J975655
33040a73964J818794L40882j302675j312835J455549N094480M671134k394414
33032H196951j0764554j1278282k860511M465058K822325k203664m58600O606612
33024e474665Q332584K051009l012031q56733K644871O34558l910344m132674
33016c723425M16301N271268P800700P238739K431131n368935j0979213j0864893
33008g778327p231273l609624k72685L138538M976857M792045M761587N098431
$$ plain form
33000 3875549 6857471 5639210 3055544 3163653 4482958 2749241 -658674 108386
32992 108386 5424014 8237642 3862221 -3949743 -8711883 -8116769 -3483013 3019122
32984 3019122 8497541 10461302 9501285 8130382 7074811 6099529 6954987 10132847 10208637
32975 10208637 1787483 -9974257 -13012919 -4197631 6294395 8848169 4930217 739608
32967 739608 -1638681 -2383425 -576232 2213519 1362725 -2958925 -3937345 775391 3302552
32958 3302552 -2395985 -9325163 -6561283 5171701 15113316 15964960 8267567 -4814097
32950 -4814097 -18584272 -25352324 -20584306 -9746550 -2348339 -932341 -2330093 -6284615
32942 -6284615 -13841481 -19489264 -15478029 -4294130 2939048 1814293 -947204 -136956
$$ packed form
33000C875549K981922j218261k583666J08109J319305j733717l407915P67060
32992A08386N315628K813628m375421p811964m762140N95114M633756O502135
32984C019122N478419J963761r60017j370903j055571r75282Q55458L177860P5790
32975A0208637q421154j1761740l038662Q815288J0492026K553774l917952m190609
32967G39608k378289p44744J807193K789751q50794m321650r78420M712736K527161
32958C302552n698537o929178K763880J1732984R941615Q51644p697393j3081664
32950d814097j3770175o768052M768018J0837756P398211J415998j397752l954522
32942f284615p556866n647783M011235J1183899P233178j124755k761497Q10248
$$ plain form
32934 -136956 1048075 413248 2888859 10688816 15482049 8782652 -4778641 -12613440
$$ packed form
32934a36956J185031o34827K475611P799957M793233o699397j3561293p834799
$$ [...]
##END NTUPLES=NMR SPECTRUM
##END=
