##TITLE=31Pdec_BAU-Typ-2023
 CDCl3, 24 sc
 7.7.2023
##JCAMPDX= 6.0         $$ Bruker NMR JCAMP-DX V2.0
##DATA TYPE= NMR SPECTRUM
##DATA CLASS= NTUPLES
##ORIGIN= UXNMR, Bruker Analytische Messtechnik GmbH
##OWNER= root
$$ XWIN-NMR		Version 3.5
$$ Fri Jul  7 13:52:24 2023 Russian Standard Time (UT+4h)  she@DPX200
##.OBSERVE FREQUENCY= 81.013821
##.OBSERVE NUCLEUS= ^31P
##.ACQUISITION MODE= SIMULTANEOUS
##.ACQUISITION SCHEME= undefined
##.AVERAGES= 24
##.DIGITISER RES= 16
##SPECTROMETER/DATA SYSTEM= spect
##.PULSE SEQUENCE= zgpg30
##.SOLVENT NAME= CDCl3
##.SHIFT REFERENCE= (INTERNAL, CDCl3, 0, 248.564)
##AUDIT TRAIL= $$ (NUMBER, WHEN, WHO, WHERE, WHAT)
$$ ##TITLE= Audit trail, XWIN-NMR		Version 3.5
$$ ##JCAMPDX= 5.01
$$ ##ORIGIN= Bruker BioSpin GmbH
$$ ##OWNER= she
$$ F:/spectra/data/she/nmr/P31/1/pdata/1/auditp.txt
$$ ##AUDIT TRAIL=  $$ (NUMBER, WHEN, WHO, WHERE, WHAT)
(   1,<2023-07-07 13:51:23.46 +0400>,<she>,<DPX200>,
      <created by zg, POWCHK disabled, PULCHK disabled
       configuration hash MD5:
       00 E9 B6 7A A2 85 ED C7 34 08 36 98 17 FE 4E 26
       data hash MD5: 32K
       D5 EB 34 0C A8 BF 91 CE 70 82 B8 F2 A0 36 5B F3>)
(   2,<2023-07-07 13:51:26.87 +0400>,<she>,<DPX200>,
      <Start of raw data processing
       efp BC_mod = 2 LB = 1 FT_mod = 6 PKNL = 1 PHC0 = -10684.21 PHC1 = 58.28481 SI = 64K 
       data hash MD5: 64K
       0E 18 9D B6 6B 4A 22 3C 85 91 FC 8A A1 10 D4 F1>)
(   3,<2023-07-07 13:51:45.42 +0400>,<she>,<DPX200>,
      <pk PHC0 = 8.735733 PHC1 = 0 
       data hash MD5: 64K
       FB AA 0F 26 26 8A D3 1A A0 EC B7 76 C5 BC 55 49>)
(   4,<2023-07-07 13:51:52.98 +0400>,<she>,<DPX200>,
      <abs ABSG = 5 
       data hash MD5: 64K
       7D 06 84 49 D8 3E 07 0F D6 EE CD 39 D6 60 A3 97>)
$$ ##END=
$$ 
$$ hash MD5
$$ 29 B0 F1 65 22 C7 FA EF FC 1A 79 DD 24 E6 51 42
##$RELAX= 
##$RELAX= 
##$RELAX= 
##$RELAX= 
##$RELAX= 
##$RELAX= 
##$RELAX= 
##$RELAX= 
##$RELAX= 
$$ Bruker specific parameters
$$ --------------------------
##$DU= <F:/spectra>
##$EXPNO= 1
##$NAME= <P31>
##$PROCNO= 1
##$TYPE= <nmr>
##$USER= <she>
##$AMP= (0..31)
100 100 100 100 100 100 100 100 100 100 100 100 100 100 100 100 100 100 
100 100 100 100 100 100 100 100 100 100 100 100 100 100 
##$AQSEQ= 0
##$AQ_mod= 1
##$AUNM= <au_zg>
##$AUTOPOS= <>
##$BF1= 81.014009
##$BF2= 200.13
##$BF3= 200.13
##$BF4= 200.13
##$BF5= 200.13
##$BF6= 200.13
##$BF7= 200.13
##$BF8= 200.13
##$BYTORDA= 1
##$CFDGTYP= 0
##$CFRGTYP= 5
##$CHEMSTR= <none>
##$CNST= (0..31)
1 1 145 1 1 1 1 1 1 1 1 1 1 1 1 1 1 1 1 1 1 1 1 1 1 1 1 1 1 1 1 1 
##$CPDPRG= <waltz16>
##$CPDPRG1= <>
##$CPDPRG2= <waltz16>
##$CPDPRG3= <>
##$CPDPRG4= <mlev>
##$CPDPRG5= <mlev>
##$CPDPRG6= <mlev>
##$CPDPRG7= <mlev>
##$CPDPRG8= <mlev>
##$CPDPRGB= <>
##$CPDPRGT= <>
##$D= (0..31)
0 1 0 0 0 0 0 0 0 0 0 0.03 2e-05 3e-06 0 0 0 0 0 0 0 0 0 0 0 0 0 0 0 0 
0 0 
##$DATE= 1688723482
##$DBL= (0..7)
120 120 120 11 120 120 24 19 
##$DBP= (0..7)
150 150 150 150 150 150 150 150 
##$DBP07= 0
##$DBPNAM0= <>
##$DBPNAM1= <>
$$ [...]
##$SUBNAM3= <"">
##$SUBNAM4= <"">
##$SUBNAM5= <"">
##$SUBNAM6= <"">
##$SUBNAM7= <"">
##$SUBNAM8= <"">
##$SUBNAM9= <"">
##$SW= 501.771253377433
##$SWIBOX= (0..15)
0 1 3 0 0 0 0 0 0 0 0 0 0 0 0 0 
##$SW_h= 40650.406504065
##$TD= 32768
##$TD0= 1
##$TE= 0
##$TE2= 300
##$TE3= 300
##$TEG= 300
##$TL= (0..7)
0 120 53 12 22 120 120 120 
##$TP= (0..7)
150 150 150 150 150 150 150 150 
##$TP07= 0
##$TPNAME0= <>
##$TPNAME1= <>
##$TPNAME2= <>
##$TPNAME3= <>
##$TPNAME4= <>
##$TPNAME5= <>
##$TPNAME6= <>
##$TPNAME7= <>
##$TPOAL= (0..7)
0.5 0.5 0.5 0.5 0.5 0.5 0.5 0.5 
##$TPOFFS= (0..7)
0 0 0 0 0 0 0 0 
##$TUNHIN= 0
##$TUNHOUT= 0
##$TUNXOUT= 0
##$USERA1= <user>
##$USERA2= <user>
##$USERA3= <user>
##$USERA4= <user>
##$USERA5= <user>
##$V9= 5
##$VALIST= <valist>
##$VCLIST= <CCCCCCCCCCCCCCC>
##$VD= 0
##$VDLIST= <DDDDDDDDDDDDDDD>
##$VPLIST= <PPPPPPPPPPPPPPP>
##$VTLIST= <TTTTTTTTTTTTTTT>
##$WBST= 1024
##$WBSW= 4
##$XGAIN= (0..3)
0 0 0 0 
##$XL= 0
##$YL= 0
##$YMAX_a= 4373
##$YMIN_a= -5158
##$ZGOPTNS= <>
##$ZL1= 120
##$ZL2= 120
##$ZL3= 120
##$ZL4= 120
##$ABSF1= 248.5645
##$ABSF2= -253.2056
##$ABSG= 5
##$ABSL= 3
##$ALPHA= 0
##$AQORDER= 0
##$ASSFAC= 0
##$ASSFACI= 0
##$ASSFACX= 0
##$ASSWID= 0
##$AUNMP= <proc_1d>
##$AZFE= 0.1
##$AZFW= 0.5
##$BCFW= 0
##$BC_mod= 2
##$BYTORDP= 0
##$COROFFS= 0
##$CY= -3
##$DATMOD= 1
##$DC= 0
##$DFILT= <>
##$DTYPP= 0
##$F1P= 0
##$F2P= 0
##$FCOR= 1
##$FTSIZE= 65536
##$FT_mod= 6
##$GAMMA= 0
##$GB= 0
##$INTBC= 1
##$INTSCL= 6.047779e-11
##$ISEN= 30
##$LB= 1
##$LEV0= 0
##$LPBIN= 0
##$MAXI= 10000
##$MC2= 0
##$MEAN= 0
##$ME_mod= 0
##$MI= 50
##$NCOEF= 0
##$NC_proc= -5
##$NLEV= 6
##$NOISF1= 182.463
##$NOISF2= 159.3651
##$NSP= 0
##$NTH_PI= 0
##$NZP= 0
##$OFFSET= 248.5645
##$PC= 4
##$PHC0= -10675.47
##$PHC1= 58.28481
##$PH_mod= 1
##$PKNL= yes
##$PPARMOD= 0
##$PSCAL= 0
##$PSIGN= 0
##$REVERSE= no
##$SF= 81.0140089999694
##$SI= 65536
##$SIGF1= 159.3651
##$SIGF2= -187.1042
##$SINO= 113.3802
##$SIOLD= 16384
##$SREGLST= <1H.CDCl3>
##$SSB= 0
##$STSI= 65536
##$STSR= 0
##$SW_p= 40650.406504065
##$SYMM= 0
##$S_DEV= 0
##$TDeff= 32768
##$TDoff= 0
##$TI= <>
##$TILT= no
##$TM1= 0
##$TM2= 0
##$TOPLEV= 0
##$USERP1= <user>
##$USERP2= <user>
##$USERP3= <user>
##$USERP4= <user>
##$USERP5= <user>
##$WDW= 1
##$XDIM= 65536
##$YMAX_p= 283863728
##$YMIN_p= -143708070
$$ End of Bruker specific parameters
$$ ---------------------------------
##NTUPLES= NMR SPECTRUM
##VAR_NAME=  FREQUENCY,     SPECTRUM/REAL,   SPECTRUM/IMAG
##SYMBOL=    X,             R,               I
##VAR_TYPE=  INDEPENDENT,   DEPENDENT,       DEPENDENT
##VAR_FORM=  AFFN,          ASDF,            ASDF
##VAR_DIM=   65536,         65536,           65536
##UNITS=     HZ,            ARBITRARY UNITS, ARBITRARY UNITS
##FACTOR=    0.620285442955139, 1,           1
##FIRST=     20137.2065510682, 0,            0
##LAST=      -20513.1999529968, 0,           0
##MIN=       -20513.1999529968, -143708070,  0
##MAX=       20137.2065510682, 283863728,    0
$$ Real data points
##PAGE= N=1
##DATA TABLE= (X++(R..R)), XYDATA
$$ [...]
##PAGE= N=2
##DATA TABLE= (X++(I..I)), XYDATA
$$ plain form
13457 321290 482167 347875 326892 750726 1251961 1191055 575757 5809 -254644 -499717
13447 -499717 -801403 -750965 -265797 53646 -192569 -587110 -643578 -543392 -544063 -297914
13437 -297914 453948 1036163 630244 -399635 -925798 -646362 -318660 -438332 -620521
13428 -620521 -445227 -97941 97519 155417 201157 253700 349097 443352 242456 -339676
13418 -339676 -706301 -276171 469029 515655 -129369 -429513 16471 426708 298691 249726
13408 249726 762605 1170765 791244 200675 322235 863307 810902 139091 -125850 502669
13398 502669 1318891 1524474 1191852 874714 837180 944795 943617 648693 109682 -317493
13388 -317493 -275196 193025 710211 970364 895277 521469 -16908 -471790 -656452 -574251
$$ packed form
13457C21290J60877j34292k0983M23834N01235o0906o15298n69948k60453k45073
13447d99717l01686N0438M85168L19443k46215l94541n6468J00186o71K46149
13437b97914P51862N82215m05919j029879n26163K79436L27702j19672j82189
13428f20521J75294L47286J95460N7898M5740N2543R5397R4255k00896n82132
13418c39676l66625M30130P45200M6626o45024l00144M45984M10237j28017m8965
13408B49726N12879M08160l79521n90569J21560N41072n2405o71811k64941O28519
13398E02669Q16222K05583l32622l17138l7534J07615j178k94924n39011m27175
13388c17493M2297M68221N17186K60153p5087l73808n38377m54882j84662Q2201
$$ plain form
13378 -574251 -288883 124381 409316 273744 -79871 21319 816821 1613993 1633952 1033925
13368 1033925 593930 652784 885995 934527 704964 185954 -497030 -933269 -818841 -402019
13358 -402019 -104070 98499 378959 400849 -300909 -1357347 -1780579 -1248396 -459918 -53804
13348 -53804 114500 372296 616065 685672 759473 936720 917240 543976 227811 357367
13338 357367 657063 618331 247366 -112253 -392398 -662113 -621856 75858 1048691 1409117
13328 1409117 913174 311903 310064 673680 739704 415997 168684 207763 235741 38547
13318 38547 -167635 -181823 -203285 -427617 -558848 -213332 314286 271149 -456904 -1038158
13308 -1038158 -822108 -298932 -391265 -1072097 -1371178 -775946 9098 -17071 -888242 -1694046
$$ packed form
13378e74251K85368M13264K84935j35572l53615J01190P95502P97172J9959o00027
13368A033925m39995N8854K33211M8532k29563n19010o82984m36239J14428M16822
13358d02019K97949K02569K80460K1890p01758j056438m23232N32183P88478M06114
13348e3804J68304K57796K43769O9607P3801J77247j9480l73264l16165J29556
13338C57367K99696l8732l70965l59619k80145k69715M0257O97714R72833L60426
13328A409117m95943o01271j839L63616O6024l23707k47313L9079K7978j97194
13318C8547k06182j4188k1462k24332j31231L45516N27618m3137p28053n81254
13308a038158K16050N23176r2333o80832k99081N95232P85044k6169q71171q05804
$$ plain form
13298 -1694046 -1674415 -971693 -328427 -253121 -553614 -652526 -308965 94261 70543 -319660
13288 -319660 -574860 -431863 -140675 -51754 -236000 -591084 -1017753 -1327749 -1230222 -643406
13278 -643406 94518 487446 302205 -297684 -891492 -1055753 -697062 -198442 -17956 -88577
13268 -88577 101379 734735 1316393 1303152 766226 161813 -248140 -399518 -146536 526539
13258 526539 1150667 1152262 615630 224567 362976 679839 684260 387785 123530 15572
13248 15572 -94896 -342958 -657788 -789142 -438171 437178 1344500 1563681 957879 247543
13238 247543 187827 651487 871722 487156 -56484 -177258 140675 478456 569587 537943
13228 537943 629975 860016 959729 697027 233709 16014 204662 413277 252023 -56955
$$ packed form
13298a694046J9631P02722O43266P5306l00493r8912L43561M03226k3718l90203
13288c19660k55200J42997K91188Q8921j84246l55084m26669l09996R7527N86816
13278f43406P37924L92928j85241n99889n93808j64261L58691M98620J80486p0621
13268h8577J89956O33356N81658j3241n36926o04413m09953j51378K52982O73075
13258E26539O24128J595n36632l91063J38409L16863M421k96475k64255j07958
13248A5572j10468k48062l14830j31354L50971Q75349R07322K19181o05802p10336
13238B47543n9716M63660K20235l84566n43640j20774L17933L37781R1131l1644
13228E37943R2032K30041R9713k62702m63318k17695J88648K08615j61254l08978
$$ plain form
13218 -56955 17527 504305 894887 934446 924515 1088435 1172448 977202 799559 932944 1138409
13207 1138409 1096555 1026808 1273161 1539158 1218600 397694 -149176 -20628 354229 438567
13197 438567 218038 -60731 -274440 -331059 -139291 116134 88247 -145870 -65183 494596
13187 494596 1004134 1019469 815718 826442 894317 622385 159492 38104 367094 712243
13177 712243 726673 461466 102613 -180985 -166991 213197 579880 426022 -187767 -615578
13167 -615578 -430237 39058 129911 -373970 -1020889 -1165527 -611666 179826 547181 292063
13157 292063 -237880 -698179 -1044031 -1167112 -712622 336641 1255210 1302399 650748 41592
13147 41592 -286868 -644200 -966422 -724314 37314 417286 -69501 -586293 -40229 1326465
$$ packed form
13218e6955P4482M86778L90582L9559r931J63920Q4013j95246j77643J33385K05465
13207A138409m1854o9747K46353K65997l20558q20906n46870J28548L74857Q4338
13197D38567k20529k78769k13709n6619J91768K55425k7887k34117Q0687N59779
13187D94596N09538J5335k03751J0724O7875k71932m62893j21388L28990L45149
13177G12243J4430k65207l58853k83598J3994L80188L66683j53858o13789m27811
13167f15578J85341M69295R0853n03881o46919j44638N53861P91492L67355k55118
13157B92063n29943m60299l45852j23081M54490J049263R18569M7189o51651o09156
13147D1592l28460l57332l22222K42108P61628L79972m86787n16792N46064J366694
$$ plain form
13137 1326465 2163186 1723079 675168 117391 332906 771183 887611 672512 478585
13128 478585 554890 754909 658801 47459 -743285 -1071370 -628435 289454 1151362 1619149
13118 1619149 1549261 896381 -86103 -762939 -672223 -145499 48987 -261410 -463137 -180954
13108 -180954 85993 -179465 -522794 -139842 754572 1075248 452561 -209241 -88291 430402
13098 430402 534137 244261 166139 376848 361352 -72903 -529429 -696178 -694772 -660102
13088 -660102 -472704 -72557 336421 549199 555897 404504 138884 -85077 -108044 -38898
13078 -38898 -136293 -373224 -412872 -95382 322369 504223 368615 -1734 -533416 -1090600
13068 -1090600 -1387459 -1145610 -365050 541815 922500 422954 -501594 -870185 -245555
$$ packed form
13137A326465Q36721m40107j047911n57777K15515M38277J16428k15099j93927
13128D78585P6305K00019r6108o11342p90744l28085M42935R17889Q61908M67787
13118A619149o9888o52880r82484o76836R0716N26724J94486l10397k01727K82183
13108a80954K66947k65458l43329L82952Q94414L20676o22687o61802J20950N18693
13098D30402J03735k89876p8122K10709j5496m34255m56526j66749J406L4670
13088f60102J87398M00147M08978K12778O698j51393k65620k23961k2967O9146
13078c8898r7395k36931l9648L17490M17751J81854j35608l70349n31682n57184
13068a090600k96859K41849P80560R06865L80685m99546r24548l68591O24630
$$ plain form
13059 -245555 693789 976237 505806 -16369 -132581 -25768 45490 84354 47933 -214750
13049 -214750 -547045 -535728 -180761 13134 -125306 -56466 604973 1333403 1347147 701811
13039 701811 146460 58997 116877 8677 -108701 -39763 32074 -113357 -261096 -40448
13029 -40448 408968 477171 -74071 -663983 -611479 -76156 189066 -27489 -94021 433420
13019 433420 1058943 1079954 619994 309658 225646 -112967 -756018 -1084790 -735602 -149675
13009 -149675 67458 -132972 -422431 -583053 -538621 -252130 106907 153724 -287422 -933959
12999 -933959 -1382883 -1484442 -1265373 -773989 -189535 173513 196140 127367 269347 621005
12989 621005 915648 882362 476612 21541 27109 603739 1185084 1188575 786955 547189
$$ packed form
13059b45555R39344K82448m70431n22175j16212J06813P1258L8864l6421k62683
13049b14750l32295J1317L54967J93895j38440O8840O61439P28430J3744o45336
13039G01811n55351q7463N7880j08200j17378O8938P1837j45431j47739K20648
13029d0448M49416O8203n51242n89912N2504N35323K65222k16555o6532N27441
13019D33420O25523K1011m59960l10336q4012l38613o43051l28772L49188N85927
13009a49675K17133k00430k89459j60622M4432K86491L59037M6817m41146o46537
12999i33959m48924j01559K19069M91384N84454L63048K2627o8773J41980L51658
12989F21005K94643l3286m05750m55071N568N76630N81345L491m01620k39766
$$ plain form
12979 547189 492783 206826 -218990 -191482 307453 548093 263834 143205 632467 1103326
12969 1103326 877125 330570 192626 362976 301935 90870 157088 308792 35920 -443426
12959 -443426 -436102 385 66087 -472367 -895594 -650058 -46735 398983 590418 548804
12949 548804 200460 -210833 -167359 286103 380654 -253224 -895324 -725006 2738 424656
12939 424656 343015 295752 523551 615736 264212 -238439 -472210 -436432 -386561 -423867 -475744
12928 -475744 -479312 -388601 -148849 176155 377968 337214 157937 -37311 -268386 -508240
12918 -508240 -558659 -364210 -235031 -398598 -508355 -94795 571430 694809 132933 -340556
12908 -340556 -254544 -177532 -654986 -1094047 -607655 456435 891884 403113 -90239 -20914
$$ packed form
12979E47189n4406k85957m25816K7508M98935K40640k84259j20629M89262M70859
12969A103326k26201n46555j37944J70350o1041k11065O6218J51704k72872m79346
12959d43426P324M36487O5702n38454m23227K45536O03323M45718J91435m1614
12949E48804l48344m11293M3474M53462R4551o33878o42100J70318P27744M21918
12939D24656q1641m7263K27799R2185l51524n02651k33771L5778M9871l7306n1877
12928d75744l568R0711K39752L25004K01813m0754j79277j95248k31075k39854
12918e08240n0419J94449J29179j63567j09757M13560O66225J23379n61876m73489
12908c40556Q6012P7012m77454m39061M86392J064090M35449m88771m93352O9325
$$ plain form
12898 -20914 44704 -434790 -1015164 -1053121 -689260 -404958 -220041 15803 79550 -175973
12888 -175973 -280823 211683 891139 1035965 733745 701174 1127316 1439119 1229586 782507
12878 782507 560593 631254 706141 470591 -94355 -518997 -208142 727987 1369691 1127099
12868 1127099 566891 535231 880971 822733 283602 -50527 99286 295849 296472 392228
12858 392228 676596 812761 780492 1051736 1669830 1901519 1269985 303749 -249981 -414233
12848 -414233 -634983 -905071 -864253 -501305 -164253 7648 171348 354022 361123 131703
12838 131703 -138444 -292493 -401873 -571649 -700549 -570706 -185436 101917 -15360 -275887
12828 -275887 -56782 693119 1100207 415049 -816184 -1242316 -348771 985746 1658708
$$ packed form
12898b0914O5618m79494n80374l7957L63861K84302J84917K35844O3747k55523
12888a75973j04850M92506O79456J44826l02220l2571M26142L11803k09533m47079
12878G82507k21914P0661P4887k35550n64946m24642L10855R36129O41704k42592
12868A127099n60208l1660L45740n8238n39131l34129J49813J96563O23R5756
12858C92228K84368J36165l2269K71244O18094K31689o31534r66236n53730j64252
12848d14233k20750k70088M0818L62948L37052J71901J63700J82674P101k29420
12838A31703k70147j54049j09380j69776j28900J29843L85270K87353j17277k60527
12828b75887K19105P49901M07088o85158j231233m26132Q93545J334517O72962
$$ plain form
12819 1658708 1471181 882588 238015 -337153 -654149 -539465 -75544 496089 998197
12810 998197 1309118 1322644 1069501 730679 451128 296458 375928 745956 1195399 1424510
12800 1424510 1420686 1325946 1015724 299231 -478059 -643863 -154280 259195 131052 -139595
12790 -139595 -46824 251661 356626 304142 300460 198693 -188249 -554539 -458006 -19083
12780 -19083 268613 298776 420814 803509 1179621 1235677 906860 290075 -417346 -880309
12770 -880309 -813395 -279179 351901 758282 909076 1008721 1257349 1586527 1660254 1310035
12760 1310035 871676 749340 729273 264635 -510886 -738759 -83707 654138 649995 178912
12750 178912 29874 316720 600905 803965 1168453 1517768 1385007 839291 441215 354132
$$ packed form
12819A658708j87527n88593o44573n75168l16996J14684M63921N71633N02108
12810I98197L10921J3526k53143l38822k79551j54670P9470L70028M49443K29111
12800A424510l824r4740l10222p16493p77290j65804M89583M13475j28143k70647
12790a39595R2771K98485J04965n2484l682j01767l86942l66290R6533M38923
12780a9083K87696L0163J22038L82695L76112N6056l28817o16785p07421m62963
12770h80309O6914N34216O31080M06381J50794R9645K48628L29178P3727l50219
12760A310035m38359j22336k0067m64638p75521k27873O55052P37845m143m71083
12750A78912j49038K86846K84185K03060L64488L49315j32761n45716l98076q7083
$$ plain form
12740 354132 196219 -166095 -380136 -301353 -245213 -313678 -107783 545057 1107970 988020
12730 988020 296028 -401410 -753901 -711994 -285281 336559 628647 174022 -746812 -1345325
12720 -1345325 -1140014 -355231 477675 1032479 1216255 976160 375539 -212762 -334643
12711 -334643 -24154 125251 -263766 -730748 -582636 -8452 55771 -674065 -1274997 -922455
12701 -922455 -137255 -1578 -529433 -716753 -108855 610830 775391 633672 676968 740676
12691 740676 388591 -196864 -358902 90871 583577 527101 10407 -359335 -174307 337599
12681 337599 587652 296444 -192361 -337957 -44135 297059 352608 204525 112205 127604
12671 127604 74543 -179253 -524311 -689663 -542816 -292337 -255834 -407868 -401356 -133939
$$ packed form
12740C54132j57913l62314k14041P8783N6140o8465K05895O52840N62913j19950
12730I88020o91992o97438l52491M1907M26713O21840K92088m54625r20834n98513
12720a345325K05311P84783Q32906N54804J83776k40095o00621n88301j21881
12711c34643L10489J49405l89017m66982J48112N74184O4223p29836o00932L52542
12701i22455P85200J35677n27855j87320O07898P19685J64561j41719M3296O3708
12691G40676l52085n85455j62038M49773M92706n6476n16694l69742J85028N11906
12681C37599K50053k91208m88805j45596K93822L41194N5549j48083r2320J5399
12671A27604n3061k53796l45058j65352J46847K50479L6503j52034O512K67417
$$ plain form
12661 -133939 51673 -27748 20831 552512 1178145 1235941 756642 334883 181575 11432
12651 11432 -177405 -18728 406686 486762 86504 -130844 221381 596021 432784 43962
12641 43962 -43034 -82 -197298 -305786 204651 990233 1192399 755206 486123 772942
12631 772942 1101543 1032514 859644 947790 1064049 821420 342977 46977 66019 242979
12621 242979 469192 691418 745606 485729 16819 -376612 -476961 -251323 122719 295951
12611 295951 27875 -473707 -699360 -420286 85456 457867 625021 627105 402248 -782
12601 -782 -253434 -105599 222668 279526 -63050 -491056 -604843 -242938 424045 964567
12591 964567 994672 579777 178941 62489 34941 -88287 -104335 109662 127142 -436177
$$ packed form
12661a33939J85612p9421M8579N31681O25633N7796m79299m21759j53308j70143
12651A1432j88837J58677M25414Q0076m00258k17348L52225L74640j63237l88822
12641D3962q6996M2952j97216j08488N10437P85582K02166m37193k69083K86819
12631G72942L28601o9029j72870Q8146J16259k42629m78443k96000J9042J76960
12621B42979K26213K22226N4188k59877m68910l93431j00349K25638L74042J73232
12611B95951k68076n01582k25653K79074N05742L72411J67154K084k24857m03030
12601g82k52652J47835L28267N6858l42576m28006j13787L61905O66983N40522
12591I64567L0105m14895m00836j16452k7548j23228j6048K13997J7480n63319
$$ plain form
12581 -436177 -1087547 -957903 -132203 315038 -159186 -779197 -635116 30490 395562 399931
12571 399931 635475 1121643 1142618 424604 -352613 -547872 -392863 -393701 -449539 -140166
12561 -140166 469077 921625 1080080 1165454 1185007 909739 444349 241737 393725 416795
12551 416795 -17797 -586662 -837862 -801629 -715625 -520696 -116987 153441 -125435 -681277
12541 -681277 -751323 -120684 557709 658360 342934 158937 251598 326032 169267 -129884
12531 -129884 -379349 -453265 -336824 -169273 -134057 -178278 -19292 417988 806524 879644
12521 879644 831201 950419 1105983 992289 692943 532765 511611 417656 408691 825182
12511 825182 1372994 1231016 264886 -540100 -334513 445424 763377 402815 18053 2799
$$ packed form
12581d36177o51370J29644Q25700M47241m74224o20011J44081O65606L65072M369
12571C99931K35544M86168K0975p18014p77217j95259J55009q38n5838L09373
12561a40166O09243M52548J58455Q5374J9553k75268m65390k02612J51988K3070
12551D16795m34592n68865k51200L6233Q6004J94929M03709K70428k78876n55842
12541f81277p0046O30639O78393J00651l15426j83997R2661P4434j56765k99151
12531a29884k49465p3916J16441J67551L5216m4221J58986M37280L88536P3120
12521H79644m8443J19218J55564j13694k99346j60178k1154r3955q965M16491
12511H25182N47812j41978r66130q04986K05587P79937L17953l60562l84762j5254
$$ plain form
12501 2799 44198 -183783 -511391 -628157 -516606 -361795 -311480 -401792 -481501 -241905 378679
12490 378679 891073 740680 61570 -469848 -499704 -231559 171873 773357 1306793 1156206
12480 1156206 287678 -392532 -149516 549564 701087 139877 -375164 -262759 309789
12471 309789 888364 1188738 1069988 576900 113046 133244 530813 693031 284571 -358134
12461 -358134 -725913 -696321 -449144 -132964 182402 433834 618568 777970 845784 684439
12451 684439 327238 -13330 -220080 -329650 -293723 17590 479949 692105 462142 77856
12441 77856 -67652 90752 346727 457004 201792 -462215 -1105339 -1023201 -58197 1021939
12431 1021939 1317925 806751 237394 184523 565485 986695 1171093 1024555 594723 55178
$$ packed form
12501B799M1399k27981l27608j16766J11551J54811N0315r0312p9709K39596O20584
12490C78679N12394j50393o79110n31418k9856K68145M03432O01484N33436j50587
12480A156206q68528o80210K43016O99080J51523n61210n15041J12405N72548
12471C09789N78575L00374j18750m93088m63854K0198L97569J62218m08460o42705
12461c58134l67779K9592K47177L16180L15366K51432J84734J59402O7814j61345
12451F84439l57201l40568k06750j09570L5927L11313M62359K12156k29963l84286
12441G7856j45508J58404K55975J10277k55212o64007o43124Q2138R65004J080136
12431A021939K95986n11174n69357n2871L80962M21210J84398j46538m29832n39545
$$ plain form
12421 55178 -408198 -675281 -600061 -79248 590174 744142 137460 -559150 -549826 -5473
12411 -5473 245320 -651 -103458 284235 695896 785136 974541 1584913 1975545 1369848
12401 1369848 168247 -436470 -55766 492461 457515 73913 -80156 -18620 -167098 -597862
12391 -597862 -925177 -852801 -479836 -80777 179515 283366 254393 67774 -337882 -914385
12381 -914385 -1382384 -1383410 -825515 -18092 572667 668987 333108 -111030 -335505 -314493
12371 -314493 -337234 -578345 -748476 -429881 272814 752077 658128 322856 246057 437820
12361 437820 535180 380289 172973 112942 154778 142814 27755 -80303 -3961 323315
12351 323315 724523 915368 829033 674772 607458 534655 387368 356387 612714 960144
$$ packed form
12421E5178m63376k67083P5220N20813O69422J53968o06682o96610R324N44353
12411e473K50793k45971j02807L87693M11661Q9240J89405O10372L90632o05697
12401A369848j201601o04717L80704N48227l4946l83602j54069O1536j48478m30764
12391e97862l27315P2376L72965L99059K60292J03851k8973j86619m05656n76503
12381i14385m67999j026N57895Q07423N90759R6320l35879m44138k24475K1012
12371c14493k2741k41111j70131L18595P02695M79263r3949l35272p6799J91763
12361D37820R7360j54891k07316o0031M1836j1964j15059j08058P6342L27276
12351C23315M01208J90845q6335j54261o7314p2803j47287l0981K56327L47430
$$ plain form
12341 960144 1069600 964700 951722 1104890 1170687 1030012 906848 973875 1059719 982865
12331 982865 934402 1193493 1561939 1464115 715508 -103817 -292133 105821 387695 145988
12321 145988 -228312 -182156 188851 367837 281989 397429 880323 1211953 942356 397019
12311 397019 199195 384264 492547 366866 289649 340450 193624 -271511 -643533 -557653
12301 -557653 -246813 -159652 -265078 -144506 297193 607499 383423 -162726 -427576 -111662
12291 -111662 484309 862352 876652 779710 803585 863527 712873 268097 -288818 -653566
12281 -653566 -612142 -221527 173511 224021 -63157 -355380 -393113 -187681 169399 602465
12271 602465 888796 767322 400195 356183 855546 1395466 1473341 1289763 1266123 1269426
$$ packed form
12341I60144J09456j04900j2978J53168O5797j40675j23164O7027Q5844p6854
12331I82865m8463K59091L68446r7824p48607q19325j88316L97954K81874k41707
12321A45988l74300M6156L71007J78986q5848J15440M82894L31630k69597n45337
12311C97019j97824J85069J08283j25681p7217N0801j46826m65135l72022Q5880
12301e57653L10840Q7161j05426J20572M41699L10306k24076n46149k64850L15914
12291a11662N95971L78043J4300r6942K3875N9942j50654m44776n56915l64748
12281f53566M1424L90615L95038N0510k87178k92223l7733K05432L57080M33066
12271F02465K86331j21474l67127m4012M99363N39920P7875j83578k3640L303
$$ plain form
12261 1269426 977211 702014 1006333 1593240 1504484 578598 -165989 44153 700539 889210
12251 889210 554572 288239 347073 536339 756054 1031597 1176079 983324 659710 574936
12241 574936 653699 483991 15316 -299415 -141442 245188 396299 173224 -163814 -318684
12231 -318684 -296407 -345105 -544257 -591798 -233487 210083 178423 -240662 -304868 290604
12221 290604 885820 803249 288937 -13317 -50865 -166012 -283596 -65413 338659 490585
12211 490585 510159 892040 1470688 1448819 648837 -107428 -197909 23877 116354 421394
12201 421394 1313519 2157380 1944349 769876 -177507 -156896 288845 226120 -489304 -1218197
12191 -1218197 -1360541 -868167 -136896 367141 462321 363579 371443 451647 329917 29344
$$ packed form
12261A269426k92215k75197L04319N86907q8756r25886p44587K10142O56386J88671
12251H89210l34638k66333N8834J89266K19715K75543J44482j92755l23614q4774
12241E74936P8763j69708m68675l14731J57973L86630J51111k23075l37038j54870
12231c18684K2277m8698j99152m7541L58311M43570l1660m19085o4206N95472
12221B90604N95216q2571n14312l02254l7548j15147j17584K18183M04072J51926
12211D90585J9574L81881N78648k1869p99982p56265r0481K21786R2477L05040
12201D21394Q92125Q43861k13031j174473r47383K0611M45741o2725p15424p28893
12191a218197j42344M92374P31271N04037R5180r8742P864Q0204j21730l00573
$$ plain form
12181 29344 -24724 358981 709655 475488 -143211 -389489 46620 670945 916679 772741
12171 772741 471008 5631 -641125 -1127348 -1091965 -687817 -330990 -92060 171603 260379
12161 260379 -130740 -651738 -515649 347778 1047828 930900 371721 6162 -144618 -254375
12151 -254375 -48839 654270 1204943 785913 -360858 -1154002 -1061806 -567702 -255535 -133394
12141 -133394 6745 168254 308848 485444 675666 783539 864145 1005041 1035817 764038
12131 764038 412518 338036 417724 288704 96142 300432 776459 927253 768448 960725
12121 960725 1509789 1462255 437352 -498373 -283163 585849 891709 505210 296838 597099
12111 597099 852148 727298 522659 399141 127991 -179622 26898 750092 1131619 621491
$$ packed form
12181B9344n4068L83705L50674k34167o18699k46278M36109O24325K45734j43938
12171G72741l01733m65377o46756m86223L5383M04148L56827K38930K63663Q8776
12161B60379l91119n20998J36089Q63427P00050j16928n59179l65559j50780j09757
12151b54375K05536P03109N50673m19030j146771p93144R2196M94104L12167J22141
12141a33394J40139J61509J40594J76596J90222J07873Q0606J40896L0776k71779
12131G64038l51520p4482P9688j29020j92562K04290M76027J50794j58805J92277
12121I60725N49064m7534j024903r35725K15210Q69012L05860l86499k08372L00261
12111E97099K55049j24850k04639j23518k71150l07613K06520P23194L81527n10128
$$ plain form
12101 621491 -153373 -254656 297593 735513 712492 597140 688423 757092 515309 117527
12091 117527 -51991 107866 302054 166950 -368231 -983050 -1199070 -804663 -99981 354262
12081 354262 295391 23946 56829 554363 1172389 1479667 1416977 1266560 1239156 1242971 1096116
12070 1096116 829022 646270 636324 662157 577790 449062 455862 592097 582324 202299 -347060
12059 -347060 -544888 -133084 513528 779011 535937 264028 384858 717450 785072 497478
12049 497478 242621 321523 570912 643033 442513 134907 -93752 -72270 391821 1231387
12039 1231387 1846545 1575193 623269 84488 636195 1566869 1684630 971662 535992
12030 535992 869254 1097641 444610 -411535 -329581 453128 566131 -477651 -1561824
$$ packed form
12101F21491p74864j01283N52249M37920k3021j15352R1283O8669k41783l97782
12091A17527j69518J59857J94188j35104n35181o14819k16020L94407P04682M54243
12081C54262n8871k71445L2883M97534O18026L07278o2690j50417k7404L815j46855
12070A096116k67094j82752r946K5833q4367j28728O800J36235r773l80025n49359
12059c47060j97828M11804O46612K65483k43074k71909J20830L32592O7622k87594
12049D97478k54857P8902K49389P2121k00520l07606k28659K1482M64091Q39566
12039A231387O15158k71352r51924n38781N51707R30674J17761p12968m35670
12030E35992L33262K28387o53031q56145Q1954P82709J13003j043782j084173
$$ plain form
12021 -1561824 -1540593 -666125 47220 231031 301858 564296 810673 740567 361090 -40483
12011 -40483 -135824 128616 344062 9353 -761400 -1231857 -984560 -491948 -378807 -493108
12001 -493108 -267524 241862 374937 -75755 -503460 -398420 -61510 -41950 -267432 -205104
11991 -205104 305272 844730 1017907 859433 558333 157934 -240337 -285983 205847 777867
11981 777867 740595 112528 -330324 -146021 144288 -62044 -410826 -126292 670228 1025209
11971 1025209 574571 63264 178534 625381 794548 675509 530771 230652 -373597
11962 -373597 -807705 -490589 284647 617193 212991 -304189 -328559 54441 425431 562661
11952 562661 463411 204397 -82857 -324074 -575623 -779300 -643703 -132644 171046 -278374
$$ packed form
12021a561824K1231Q74468P13345J83811P0827K62438K46377p0106l79477m01573
12011d0483r5341K64440K15446l34709p70753m70457K47297M92612J13141j14301
12001d93108K25584N09386J33075m50692m27705J05040L36910J9560k25482O2328
11991b05104N10376N39458J73177j58474l01100m00399l98271m5646M91830N72020
11981G77867l7272o28067m42852J84303K90309k06332l48782K84534P96520L54981
11971A025209m50638n11307J15270M46847J69167j19039j44738l00119o04249
11962c73597m34108L17116P75236L32546m04202n17180k4370L83000L70990J37230
11952E62661r9250k59014k87254k41217k51549k03677J35597N11059L03690m49420
$$ plain form
11942 -278374 -1136909 -1582919 -1465908 -1342845 -1405161 -1191173 -534412 3556 -13740 -290397
11932 -290397 -418457 -481478 -632001 -667193 -491033 -442951 -664393 -675936 -147939 416077
11922 416077 402963 46200 -36913 127259 69969 -191091 -238837 -83608 -83514 -148825 137030
11911 137030 630779 728459 426271 399532 818567 968113 413222 -278639 -491392 -502876
11901 -502876 -816282 -1136866 -807235 76169 764503 933849 952683 1088364 1118004 887500
11891 887500 697322 823373 1024515 889726 482074 260052 372875 397899 -15844 -492311
11881 -492311 -316811 536768 1227730 1102561 491683 90724 -17370 -149779 -211069 94282
11871 94282 430167 179996 -345023 -113041 967512 1732028 1595551 1491697 2129713 2502401
$$ packed form
11942b78374q58535m46010J17011J23063o2316K13988O56761N37968j7296k76657
11932b90397j28060o3021j50523l5192J76160M8082k21442j1543N27997N64016
11922D16077j3114l56763q3113J64172n7290k61060m7746J55229R4o5311K85855
11911A37030M93749R7680l02188k6739M19035J49546n54891o91861k12753j1484
11901e02876l13406l20584L29631Q83404O88334J69346J8834J35681K9640k30504
11891H87500j90178J26051K01142j34789m07652k22022J12823K5024m13743m76467
11881d92311J75500Q53579O90962j25169o10878m00959j08094j32409o1290L05351
11871I4282L35885k50171n25019K31982J080553P64516j36477j03854O38016L72688
$$ plain form
11861 2502401 1455232 -137763 -421736 626624 1173590 337475 -666032 -595154 129233
11852 129233 522365 539816 564224 396730 -209064 -714796 -500617 83318 253930 -22217
11842 -22217 -215550 -229074 -341645 -430408 -131772 353213 434856 74129 -195239 -168983
11832 -168983 -170878 -298644 -184424 307423 729450 644989 170537 -248992 -312640 -60644
11822 -60644 131937 -164047 -843999 -1151066 -583468 304827 593138 283640 163877 475667
11812 475667 596350 168774 -322138 -404644 -273205 -204843 -53503 206030 118153 -487856
11802 -487856 -957741 -685129 -43603 230760 172124 343140 750297 821426 393131 -16361
11792 -16361 9341 309626 529048 475655 51721 -675479 -1257626 -1199052 -621472 -162529
$$ packed form
11861B502401j047169j592995k83973J048360N46966q36115j003507P0878P24387
11852A29233L93132J7451K4408j67494o05794n05732K14179N83935J70612k76147
11842b2217j93333j3524j12571q8763K98636M84985Q1643l60727k69368K6256
11832a68983j895j27766J14220M91847M22027q4461m74452m19529o3648K51996
11822f0644J92581k95984o79952l07067N67598Q88295K88311l09498j19763L11790
11812D75667J20683m27576m90912q2506J31439O8362J51340K59533q7877o06009
11802d87856m69885K72612O41526K74363n8636J71016M07157P1129m28295m09492
11792a6361K5702L00285K19422n3393m23934p27200n82147N8574N77580M58943
$$ plain form
11782 -162529 -103145 -44986 384845 951845 1178061 930165 401980 -171936 -538806 -466359
11772 -466359 -45688 283388 276546 215384 402740 583611 289461 -362376 -675523 -250374
11762 -250374 493365 820942 495318 -61436 -294332 -70580 265596 334474 169216 126121
11752 126121 341242 499563 315941 24809 65125 399010 550544 321490 38273 -16580
11742 -16580 16409 -29853 6484 254814 455667 367873 239936 411914 677629 576995
11732 576995 181160 -1495 131568 138324 -184495 -478695 -467684 -362682 -372432 -333341 -148023
11721 -148023 -99442 -340198 -512598 -317479 -68815 -200877 -564672 -721857 -626867 -465981
11711 -465981 -104583 659678 1463641 1662823 1199447 601903 188616 -98789 -126859 393123
$$ packed form
11782a62529N9384N8159M29831N67000K26216k47896n28185n73916l66870P2447
11772d66359M20671L29076o842o1162J87356J80871k94150o51837l13147M25149
11762b50374P43739L27577l25624n56754k32896K23752L36176O8878j65258m3095
11752A26121K15121J58321j83622k91132M0316L33885J51534k29054k83217n4853
11742a6580L2989m6262L6337K48330K00853q7794j27937J71978K65715j00634
11732E76995l95835j82655J33063O756l22819k94200J1011J05002r750L9091J85318
11721a48023M8581k40756j72400J95119K48664j32062l63795j57185R4990J60886
11711d65981L61398P64261Q03963J99182m63376n97544m13287k87405k8070N19982
$$ plain form
11701 393123 1150369 1266589 441860 -508407 -676710 -180227 170163 -32624 -481528 -731214
11691 -731214 -651583 -369080 -88582 -14547 -264616 -780910 -1328835 -1589201 -1367428 -834521
11681 -834521 -435741 -387553 -434709 -330660 -282278 -509143 -639538 -177125 550353 643436
11671 643436 -97734 -867829 -996192 -691277 -396951 -138726 91419 -7072 -460780 -673164
11661 -673164 -249148 313422 359302 53758 -33337 87245 16729 -142551 77554 594607
11651 594607 797821 527838 311911 484432 714357 624403 340444 165706 142372 196846
11641 196846 365876 619029 723001 508448 88578 -315973 -576887 -615740 -411099 -128213
11631 -128213 22746 137937 520310 1110166 1384922 1083663 699115 841832 1306119 1275985
$$ packed form
11701C93123P57246J16220q24729r50267j68303M96483L50390k02787m48904k49686
11691g31214P9631K82503K80498P4035k50069n16294n47925k60366K21773N32907
11681h34521L98780M8188m7156J04049M8382k26865j30395M62413P27478R3083
11671F43436p41170p70095j28363L04915K94326K58225K30145r8491m53708k12384
11661f73164M24016N62570M5880l05544q7095J20582p0516j59280K20105N17053
11651E94607K03214k69983k15927J72521K29925q9954k83959j74738k3334N4474
11641A96846J69030K53153J03972k14553m19870m04551k60914l8853K04641K82886
11631a28213J50959J15191L82373N89856K74756l01259l84548J42717M64287l0134
$$ plain form
11621 1275985 503733 -200488 47614 1029541 1663931 1364612 696683 497852 753667
11612 753667 773340 278530 -239238 -309346 -108136 -18710 35890 384863 918320 1071440
11602 1071440 565480 -152259 -388976 -54 476236 507241 246409 305798 832704 1173281
11592 1173281 768329 77639 31780 660325 993906 508162 -84688 54488 626121 722895
11582 722895 214984 -189419 -104702 105899 127348 196202 540038 864368 788943 470745
11572 470745 408985 774483 1239629 1435511 1336741 1133375 883247 471104 -68310 -385904
11562 -385904 -197073 257668 435853 196614 -64973 -75628 -53086 -193637 -243251 14244
11552 14244 223799 -30997 -425292 -240849 531146 1052408 719633 -121575 -725231 -785410
$$ packed form
11621A275985p72252p04221K48102R81927O34390k99319o67929j98831K55815
11612G53667J9673m94810n17768p0108K01210Q9426N4600L48973N33457J53120
11602A071440n05960p17739k36717L88922M76290L1005k60832N9389N26906L40577
11592A173281m04952o90690m5859O28545L33581m85744n92850J39176N71633R6774
11582G22895n07911m04403Q4717K10601K1449O8854L43836L24330p5425l18198
11572D70745o1760L65498M65146J95882r8770k03366k50128m12143n39414l17594
11562c85904J88831M54741J78185k39239k61587j0655K2542j40551m9614K57495
11552A4244K09555k54796l94295J84443P71995N21262l32775q41208o03656o0179
$$ plain form
11542 -785410 -502896 -156663 98559 176659 28866 -354286 -917138 -1419149 -1460167 -900900
11532 -900900 -196863 39285 -189923 -330180 -159712 -106132 -447714 -701764 -284750 522370
11522 522370 838485 342673 -346533 -524824 -176401 288042 647599 878569 830214 360073
11512 360073 -267738 -550377 -387074 -191021 -242825 -307235 -111507 168663 260175 329230
11502 329230 691942 1160311 1208745 768259 348423 303683 447936 508582 495510 437018
11492 437018 192153 -215117 -441651 -282299 12241 113582 30265 -65882 -118776 -67139
11482 -67139 231227 691198 923687 744538 465199 399196 399287 213280 -14081 2332 164391
11471 164391 144112 -72025 -159082 81647 478754 649913 300387 -449774 -976194 -723929
$$ packed form
11542g85410K82514L46233K55222P8100j47793l83152n62852n02011m1018N59267
11532i00900P04037K36148k29208j40257J70468N3580l41582k54050M17014Q07120
11522E22370L16115m95812o89206j78291L48423M64443L59557K30970m8355m70141
11512C60073o27811k82639J63303J96053n1804o4410J95728K80170R1512O9055
11502C29230L62712M68369M8434m40486m19836m4740J44253O0646j3072n8492
11492D37018k44865m07270k26534J59352K94540J01341q3317r6147n2894N1637
11482f7139K98366M59971K32489j79149k79339o6003R1j86007k27361J6413J62059
11471A64391k0279k16137q7057K40729L97107J71159l49526p50161n26420K52265
$$ plain form
11461 -723929 23683 392563 99336 -183489 52267 332886 66355 -374140 -219248 422903
11451 422903 728126 439608 157132 308781 571458 506242 204045 37911 136882 339252
11441 339252 486733 625541 920151 1290687 1207988 238056 -1122311 -1708342 -1092792 -162877
11431 -162877 136898 10413 130736 389623 246577 -81188 168211 1002051 1538961 1232041
11421 1232041 448221 -210397 -449626 -165358 469161 807101 396755 -149872 204651
11412 204651 1364078 2100562 1803154 1274103 1408869 1964481 2183366 1920803 1521931
11403 1521931 1109690 636321 301879 346533 603018 678745 468107 204121 121564 247977
11393 247977 392055 260930 -205993 -589537 -364469 416664 1103195 1178241 748427 278587
$$ packed form
11461g23929P47612L68880k93227k82825K35756K80619k66531m40495J54892O42151
11451D22903L05223k88518k82476J51649K62677o5216l02197j66134R8971K02370
11441C39252J47481J38808K94610L70536q2699r69932j360367n86031O15550R29915
11431a62877K99775j26485J20323K58887j43046l27765K49399Q33840N36910l06920
11421A232041p83820o58618k39229K84268O34519L37940m10346n46627L54523
11412B04651J159427P36484k97408n29051J34766N55612K18885k62563l98872
11403A521931m12241m73369l34442M4654K56485P5727k10638k63986q2557J26413
11393B47977J44078j31125m66923l83544K25068P81133O86531P5046m29814m69840
$$ plain form
11383 278587 115116 286494 525126 514906 309195 311040 586297 569633 -73004 -700505
11373 -700505 -530646 94009 161530 -443314 -819983 -528881 -153352 -149089 -127646 271423
11363 271423 644554 515890 105962 -139018 -254145 -469810 -644330 -473444 12205 500647
11353 500647 721099 564781 209030 170595 771700 1509330 1535540 851001 349532 512255
11343 512255 794854 601920 138903 -124939 -212214 -387620 -644091 -838225 -921995 -774556
11333 -774556 -273512 283591 413211 271240 528058 1187310 1377073 720436 35770 75125
11323 75125 366185 62995 -691563 -1079214 -845590 -452337 -261737 -207552 -97543 203342
11313 203342 681444 1000044 784101 271307 116222 320199 107699 -766689 -1457515 -1332815
$$ packed form
11383B78587j63471J71378K38632j0220k05711J845K75257j6664o42637o27501
11373g00505J69859O24655O7521o04844l76669K91102L75529M263K1443L99069
11363B71423L73131j28664m09928k44980j15127k15665j74520J70886M85649M88442
11353E00647K20452j56318l55751l8435O01105P37630K6210o84539n01469J62723
11343E12255K82599j92934m63017k63842q7275j75406k56471j94134q3770J47439
11333g74556N01044N57103J29620j41971K56818O59252J89763o56637o84666L9355
11323G5125K91060l03190p54558l87651K33624L93253J90600N4185J10009L00885
11313B03342M78102L18600k15943n12794j55085K03977k12500q74388o90826J24700
$$ plain form
11303 -1332815 -945908 -956050 -947541 -286236 587676 835468 628065 705709 937254 556161
11293 556161 -361532 -871179 -620300 -246845 -214934 -247323 -92625 61496 192631 638832
11283 638832 1380317 1824459 1622184 1103958 634570 125512 -494827 -874627 -711538 -250422
11273 -250422 62345 147172 207823 317445 400399 487202 694684 958206 981655 551249
11263 551249 -145482 -625899 -616863 -363837 -279501 -385805 -386495 -230795 -193862 -338722 -350634
11252 -350634 -79128 180887 175947 69810 99839 244921 456797 791067 1062856 857028
11242 857028 202288 -243270 -41970 455499 758042 926380 1162850 1237776 904043 467433
11232 467433 356019 456336 414822 264850 226576 217681 90177 28289 204187 378496
$$ packed form
11303a332815L86907j0142Q509O61305Q73912K47792k07403P7644K31545l81093
11293E56161r17693n09647K50879L73455L1911l2389J54698J54121J31135M46201
11283F38832P41485M44142k02275n18226m69388n09058o20339l79800J63089M61116
11273b50422L12767Q4827O0651J09622Q2954Q6803K07482K63522K3449m30406
11263E51249o96731m80417R036K53026Q4336j06304o90J55700L6933j44860j1912
11252c50634K71506K60015m940j06137L0029J45082K11876L34270K71789k05828
11242H57028o54740m45558K01300M97469L02543J68338K36470P4926l33733m36610
11232D67433j11414J00317m1514j49972l8274q895j27504o1888J75898J74309
$$ plain form
11222 378496 323799 245369 292480 145310 -335152 -594700 -233213 167946 -103201 -686381
11212 -686381 -730184 -279512 -54618 -129229 59917 502058 543720 109525 -52931 436795
11202 436795 1053090 1249467 1079989 718683 139316 -466120 -664648 -442506 -247008 -188236
11192 -188236 88810 541144 567608 80323 -89076 564009 1254229 944022 -103797 -640232
11182 -640232 -146628 540351 464891 -186630 -451035 72708 740001 789671 344929 109452
11172 109452 273053 306976 -51065 -233002 323850 1231193 1598168 1177201 518611 121277
11162 121277 -44560 -199594 -397588 -552290 -519547 -172533 370658 713895 632360 395681
11152 395681 382149 581167 769223 923238 1096859 1121834 830076 390982 77718 -107276
$$ packed form
11222C78496n4697p8430M7111j47170m80462k59548L61487M01159k71147n83180
11212f86381m3803M50672K24894p4611J89146M42141M1662m34195j62456M89726
11202D36795O16295J96377j69478l61306n79367o05436j98528K22142J95498N8772
11192a88236K77046M52334K6464m87285j69399O53085O90220l10207j047819n36435
11182f40232M93604O86979p5460o51521k64405N23743O67293M9670m44742k35477
11172A09452J63601L3923l58041j81937N56852R07343L66975m20967o58590l97334
11162A21277j65837j55034j97994j54702L2743L47014N43191L43237q1535k36679
11152C95681j3532J99018J88056J54015J73621K4975k91758m39094l13264j84994
$$ plain form
11142 -107276 -274545 -386341 -451025 -623962 -786548 -486344 269197 692137 284818 -285266
11132 -285266 -133911 460676 524990 -58169 -448575 -211274 174559 259538 225699 328018
11122 328018 428025 358846 260190 335737 613772 1002210 1281527 1147593 623227 239998
11112 239998 385059 719379 753819 688283 1000644 1448960 1287554 408518 -484548 -848573
11102 -848573 -771096 -484434 -108691 77555 -217749 -775030 -1040719 -881233 -639900 -472140
11092 -472140 -206924 135428 282870 210958 176738 243676 254138 215613 228038 148101 -163025
11081 -163025 -439886 -412592 -346902 -534360 -554580 128744 1080824 1366459 1004189 933636
11071 933636 1483585 1896817 1603659 1026044 751298 691268 490318 182459 49171 200781
$$ packed form
11142a07276j67269j11796o4684j72937j62586L00204P55541M22940m07319n70084
11132b85266J51355N94587O4314n83159l90406K37301L85833Q4979l3839J02319
11122C28018J00007o9179r8656P5547K78035L88438K79317j33934n24366l83229
11112B39998J45061L34320L4440o5536L12361M48316j61406q79036q93066l64025
11102h48573P7477K86662L75743J86246k95304n57281k65689J59486K41333J67760
11092d72140K65216L42352J47442p1912l4220O6938J0462l8525J2425p9937l11126
11081a63025k76861K7294O5690j87458k0220O83324R52080K85635l62270p0553
11071I33636N49949M13232k93158n77615k74746o0030k00950l07859j33288J51610
$$ plain form
11061 200781 510244 684658 446459 -10496 4021 717446 1262882 772633 -217044 -427923
11051 -427923 280221 793099 502474 47715 106711 496409 773223 801170 449616 -369094
11041 -369094 -1103779 -948026 -118286 216967 -351105 -826159 -366203 466540 661476 168755
11031 168755 -343424 -513022 -398488 -58260 382809 602803 469377 248702 164144 147541
11021 147541 207274 514248 922542 999196 761984 752423 1112555 1274247 910107 509268
11011 509268 572560 849433 847146 565834 270454 16378 -165320 -76195 224533 243299
11001 243299 -259210 -795443 -800589 -401164 -92099 51837 351243 853637 1147635 919709
10991 919709 443902 326829 746736 1131843 880461 304670 309395 1018923 1449781 947751
$$ packed form
11061B00781L09463J74414k38199m56955J4517P13425N45436m90249r89677k10879
11051d27923P08144N12878k90625m54759N8996L89698K76814K7947l51554q18710
11041c69094p34685J55753Q29740L35253n68072m75054M59956Q32743J94936m92721
11031A68755n12179j69598J14534L40228M41069K19994j33426k20675q4558j6603
11021A47541N9733L06974M08294P6654k37212r561L60132J61692l64140m00839
11011E09268O3292K76873k287k81312k95380k54076j81698Q9125L00728J8766
11001B43299n02509n36233n146L99425L09065J43936K99406N02394K93998k27926
10991I19709m75807j17073M19907L85107k51382n75791M725P09528M30858n02030
$$ plain form
10981 947751 179994 47739 354280 412783 294877 428113 535271 168107 -161957 329786
10971 329786 1232077 1480739 1076495 860232 844544 347727 -338665 -149335 770114 1016638
10961 1016638 184677 -519387 -353080 -41084 -112071 90734 920352 1479229 1123515 596631
10951 596631 702596 1040663 995785 857209 1008169 1069990 799439 824123 1521304 2101009
10941 2101009 1761426 911827 362475 127341 -125325 -262068 -154713 -168375 -425823 -405331
10931 -405331 45624 228577 -169833 -392625 44578 412483 82728 -303475 -18951 430094
10921 430094 304963 5864 237504 652207 567073 285932 446604 698164 293026 -522512
10911 -522512 -907304 -777280 -660514 -624031 -387747 -111754 -96718 -90950 218580 474607
$$ packed form
10981I47751p67757j32255L06541N8503j17906J33236J07158l67164l30064M91743
10971C29786R02291K48662m04244k16263j5688m96817o86392J89330R19449K46524
10961A016638q31961p04064J66307L11996p0987K02805Q29618N58877l55714n26884
10951E96631J05965L38067m4878j38576J50960O1821k70551K4684O97181N79705
10941B101009l39583q49599n49352k35134k52666j36743J07355j3662k57448K0492
10931d05331M50955J82953l98410k22792M37203L67905l29755l86203K84524M49045
10921D30094j25131k99099K31640M14703q5134k81141J60672K51560m05138q15538
10911e22512l84792J30024J16766L6483K36284K75993J5036N768L09530K56027
$$ plain form
10901 474607 259324 -73482 -19739 181504 126860 105891 487828 885185 843029 701083
10891 701083 845469 849873 374965 107358 627997 1146395 702982 -94546 -42086 534228
10881 534228 271035 -929311 -1741019 -1504638 -951630 -739585 -644752 -427893 -293462 -232534
10871 -232534 48859 344473 62495 -694449 -1080903 -723754 -145571 174288 342000 496114
10861 496114 506403 438074 620114 1024577 1161894 798053 310050 191501 563756 1182700
10851 1182700 1591287 1362667 551915 -229105 -502014 -442531 -393852 -258681 142817 488956
10841 488956 328705 -202337 -571755 -555990 -313623 -2213 251696 259576 45232 -40918
10831 -40918 206568 566868 808269 963578 993233 723281 348360 354661 673190 628750
$$ packed form
10901D74607k15283l32806N3743K01243n4644k0969L81937L97357m2156j41946
10891G01083J44386M404m74908k67607N20639N18398m43413p97528N2460N76314
10881E34228k63193j200346q11708K36381N53008K12045R4833K16859J34431O0928
10871b32534K81393K95614k81978p56944l86454L57149N78183L19859J67712J54114
10861D96114J0289o8329J82040M04463J37317l63841m88003j18549L72255O18944
10851A182700M08587k28620q10752p81020k72909N9483M8679J35171M01498L46139
10841D88956j60251n31042l69418J5765K42367L11410K53909P880k14344q6150
10831d0918K47486L60300K41401J55309K9655k69952l74921O301L18529m4440
$$ plain form
10821 628750 43725 -399034 -258834 50232 165223 371794 789171 906317 536721 330093
10811 330093 710477 1187652 1293224 1238956 1101392 481276 -387373 -452547 428348 894526
10801 894526 178316 -559811 -145596 713838 829884 560113 831702 1211513 710201 -275650
10791 -275650 -571231 -208387 -160726 -536091 -591600 -224707 -8648 2317 207228 458183
10781 458183 300860 -73053 -164643 -75852 -106871 21866 538991 831407 351626 -311461
10771 -311461 -328108 77074 254265 264988 325089 25749 -714322 -904789 14028 950390
10761 950390 837369 429543 852853 1491281 1150702 327817 315247 855237 738145 67035
10751 67035 -143281 -37940 -479256 -1025122 -515900 662342 1045656 572370 468842 857305
$$ packed form
10821F28750n85025m42759J40200L09066J14991K06571M17377J17146l69596k06628
10811C30093L80384M77175J05572n4268j37564o20116q68649o5174Q80895M66178
10801H94526p16210p38127M14215Q59434J16046k69771K71589L79811n01312r85851
10791b75650k95581L62844M7661l75365n5509L66893K16059J0965K04911K50955
10781D58183j57323l73913r1590Q8791l1019J28737N17125K92416m79781o63087
10771c11461j6647M05182J77191J0723O0101k99340p40071j90467R18817R36362
10761I50390j13021m07826M23310O38428l40579q22885j2570N39990j17092o71110
10751F7035k10316J05341m41316n45866N09222J178242L83314m73286j03528L88463
$$ plain form
10741 857305 681979 -4411 102782 1202320 1939952 1658460 1223998 1227500 1098177 456079
10731 456079 -170911 -391974 -435100 -376333 -84292 53142 -438303 -1073128 -1015858 -479332
10721 -479332 -240406 -174996 299312 802809 603573 174599 440901 929518 495443 -506098
10711 -506098 -704735 -80730 121312 -343410 -495979 -69916 215611 234258 496545 760395
10701 760395 377030 -206175 -74614 387955 242215 -3578 755369 1871585 1792059 857724
10691 857724 749374 1403842 1145214 -170029 -867919 -449842 -156295 -284491 296321
10682 296321 1498896 1636800 374534 -524496 -167538 216795 -201497 -514572 -177361
10673 -177361 -127497 -781650 -1040534 -317104 393717 400888 409479 894053 1204041 1056450
$$ packed form
10741H57305j75326o86390J07193J099538P37632k81492m34462L502j29323o42098
10731D56079o26990k21063m3126N8767K92041J37434m91445o34825N7270N36526
10721d79332K38926O5410M74308N03497j99236m28974K66302M88617m34075j001541
10711e06098j98637O24005K02042m64722j52569M26063K85527J8647K62287K63850
10701G60395l83365n83205J31561M62569j45740k45793P58947J116216p9526r34335
10691H57724j08350O54468k58628j315243o97890M18077K93547j28196N80812
10682B96321J202575J37904j262266q99030L56958L84333m18292l13075L37211
10673a77361M9864o54153k58884P23430P10821P171Q591M84574L09988j47591
$$ plain form
10663 1056450 1130260 1493621 1240398 313890 -127999 261911 469460 99716 4129 424278
10653 424278 447376 -161781 -492140 -301536 -368730 -668319 -239277 757820 975498 253636
10643 253636 -101640 242882 202793 -367990 -281162 551933 727611 -49375 -392833 164212
10633 164212 440161 55668 106035 749515 665650 -378708 -946175 -590518 -532408 -1019993
10623 -1019993 -724517 467206 841534 -58737 -504202 287053 839994 308914 -57675
10614 -57675 504562 861542 314549 -164870 -96416 -380750 -1079540 -901825 182333 491370
10604 491370 -335928 -639905 94372 317382 -465226 -757021 -217069 -496494 -1825474
10595 -1825474 -2103867 -684697 273802 -372327 -926277 -302650 94576 -466374 -430532
$$ packed form
10663A056450P3810L63361k53223r26508m41889L89910K07549l69744r5587M20149
10653D24278K3098o09157l30359J90604o7194k99589M29042R97097K17678p21862
10643B53636l55276L44522m0089n70783Q6828Q33095J75678p76986l43458N57045
10633A64212K75949l84493N0367O43480q3865j044358n67467L55657N8110m87585
10623a019993K95476J191723L74328r00271m45465P91255N52941n31080l66589
10614e7675N62237L56980n46993m79419O8454k84334o98790J77715J084158L09037
10604D91370q27298l03977P34277K23010p82608k91795N39952k79425j328980
10595a825474k78393J419170R58499o46129n53950O23627L97226n60950L5842
$$ plain form
10586 -430532 741551 1012736 -609884 -2092560 -1859261 -1140259 -1109265 -875365 -61923
10577 -61923 -121850 -1304384 -1563428 -210729 654061 -6276 -373629 529187 1013778 314614
10567 314614 199260 1187574 1100107 -692765 -1611937 -488398 295199 -597292 -993058
10558 -993058 353584 1199935 171332 -611351 214117 666213 -404400 -939247 45715
10549 45715 348108 -785885 -727725 1271437 1962147 -21470 -1436635 -471722 19377
10540 19377 -1572646 -2242366 -340375 935520 -353971 -1229454 68669 492830 -1402484
10531 -1402484 -2005546 271217 1298800 -965943 -2179624 102953 1402472 -1141513
10523 -1141513 -3012384 -894381 967641 -810551 -2177281 -91466 977206 -1947501
$$ packed form
10586d30532J172083K71185j622620j482676K33299P19002L0994K33900Q13442
10577f1923n9927j182534k59044J352699Q64790o60337l67353R02816M84591o99164
10567C14614j15354R88314q7467j792872r19172J123539P83597q92491l95766
10558i93058J346642Q46351j028603p82683Q25468M52096j070613n34847R84962
10549D5715L02393j133993N8160J999162O90710j983617j415165R64913M91099
10540A9377j592023o69720J901991J275895j289491q75483J298123M24161j895314
10531a402484o03062K276763J027583k264743j213681K282577J299519k543985
10523a141513j870871K118003J862022j778192j366730K085815J068672k924707
$$ plain form
10515 -1947501 -3707756 -895964 915635 -2161915 -4340430 -1469530 292669 -3370187
10507 -3370187 -5555050 -1502557 956106 -3797920 -7169024 -2608606 492871 -5346917
10499 -5346917 -9628521 -3778566 -21333 -8632727 -15008943 -6237454 -427927 -15268427
10491 -15268427 -28248686 -14973406 -11149613 -73576846 -176764638 -216865563 -144495546
10484 -144495546 -34689177 13862464 -908721 -13492936 1276791 11907281 1899655
10477 1899655 -5774570 2649345 9619850 3305444 -2436000 2559155 6943677 2018388
10469 2018388 -2409229 1422709 4928702 1090852 -2410432 962145 4320580 1374071
10461 1374071 -1973650 118876 2677909 637427 -1476002 753513 2909578 841346
$$ packed form
10515a947501j760255K811792J811599l077550k178515K870900J762199l662856
10507c370187k184863M052493K458663m754026l371104M560418L101477n839788
10499e346917m281604N849955L757233q611394o376216Q771489N809527j4840500
10491a5268427j2980259J3275280L823793o2427233j03187792m0100925P2370017
10484a44495546J09806369M8551641j4771185j2584215J4769727J0630490j0007626
10477A899655p674225Q423915O970505o314406n741444M995155M384522m925289
10469B018388m427617L831938L505993l837850l501284L372577L358435k946509
10461A374071l347721K092526K559033k040482k113429K229515K156065k068232
$$ plain form
10453 841346 -1234995 712170 2854920 1427748 -92915 1619671 3109757 1237292
10445 1237292 -571455 799746 2145877 574084 -697071 1177631 2901837 1322169
10437 1322169 -630128 308544 1786156 869368 -394099 498793 1518607 475122 -463482
10428 -463482 779322 1883383 676129 -562021 402411 1402390 228466 -965356 191304
10419 191304 1798311 1429449 504029 987979 1468744 375885 -466580 715907 2028509
10410 2028509 1327238 25855 104117 522953 -117161 -536697 415862 1063728 109136
10401 109136 -575403 604314 1829156 1191664 97233 352901 863139 213812 -367601
10392 -367601 411031 1181710 616696 84569 865544 1522167 784986 243692 1377329
$$ packed form
10453H41346k076341J947165K142750j427172j520663J712586J490086j872465
10445A237292j808747J371201J346131j571793j271155J874702J724206j579668
10437A322169j952297R38672J477612r16788j263467Q92892J019814j043485r38604
10428d63482J242804J104061j207254j238150R64432R99979j173924j193822J156660
10419A91304J607007l68862r25420M83950M80765j092859q42465J182487J312602
10410B028509p01271j301383P8262M18836o40114m19536R52559O47866r54592
10401A09136o84539J179717J224842o37492j094431K55668N10238o49327n81413
10392c67601P78632P70679n65014n32127P80975O56623p37181n41294J133637
$$ plain form
10383 1377329 2638573 2263445 1329536 1333024 1389624 513329 7887 905929 1644967 914071
10373 914071 175230 780483 1330956 551937 -31581 911346 1670223 600915 -639541
10364 -639541 -46412 1135098 917015 190186 600991 1163550 339363 -651553 8931
10355 8931 1193955 814620 -380771 -297812 752317 1003332 560256 698107 1099879 736031
10345 736031 303780 961078 1781412 1211467 -40774 -224390 432143 500354 109773 383561
10335 383561 1044653 993432 436829 268167 237907 -240865 -522946 59934 592654 144909
10325 144909 -324943 351112 1283770 1021050 26904 -410141 -456751 -845975 -1022269 -302624
10315 -302624 367251 -79232 -795410 -517404 208513 300018 229240 758100 1054540 269702
$$ packed form
10383A377329J261244l75128r33909L488N6600q76295n05442Q98042P39038p30896
10373I14071p38841O05253N50473p79019n83518R42927P58877j069308j240456
10364f39541N93129J181510k18083p26829M10805N62559q24187r90916O60484
10355H931J185024l79335j195391Q2959J050129K51015m43076J37851M01772l63848
10345G36031m32251O57298Q20334n69945j252241j83616O56533O8211l90581K73788
10335C83561O61092n1221n56603j68662l0260m78772k82081N82880N32720m47745
10325A44909m69852O76055R32658k62720r94146m37045m6610l89224j76294P19645
10315c02624O69875m46483p16178K78006P25917R1505p0778N28860K96440p84838
$$ plain form
10305 269702 -465111 100215 934904 559852 -193054 202405 991996 524198 -579544
10296 -579544 -466495 670653 1146091 848536 1013473 1526714 1156382 105937 -192627
10287 -192627 397880 702550 503000 651973 1129555 1034151 379352 89484 387993 756202
10277 756202 1108226 1543567 1535820 834719 404750 973443 1589935 1212377 626859 1004952
10267 1004952 1685113 1365181 462718 238268 531185 428633 241860 725012 1262910
10258 1262910 954066 539833 1080997 1717955 1071896 -84022 -13979 979108 1281489
10249 1281489 931055 1208239 1882616 1585638 529327 183224 515037 185083 -692276
10240 -692276 -632737 384693 748349 28271 -466367 -151544 122172 59752 383458 1017383
$$ packed form
10305B69702p34813N65326Q34689l75052p52906L95459P89591m67798j103742
10296e79544J13049J137148M75438k97555J64937N13241l70332j050445k98564
10287a92627N90507L04670j99550J48973M77582r5404o54799k89868K98509L68209
10277G56202L52024M35341p747p01101m29969N68693O16492l77558n85518L78093
10267A004952O80161l19932r02463k24450K92917j02552j86773M83152N37898
10258A262910l08844m14233N41164O36958o46059j155918P0043R93087L02381
10249A281489l50434K77184O74377k96978j056311l46103L31813l29954q77359
10240f92276N9539J017430L63656p20078m94638L14823K73716o2420L23706O33925
$$ plain form
10230 1017383 948915 222278 43645 599944 738593 106374 -320752 -132998 -24874 -141226
10220 -141226 260474 1150096 1492216 1026415 630603 634334 408214 -117037 -166508 352031
10210 352031 587450 273065 50211 96871 -99562 -470707 -329900 284663 636878 676622
10200 676622 973931 1342755 1035067 243790 -103145 45932 -14753 -194877 208049 948903
10190 948903 1132260 875984 958648 1084433 405434 -478907 -163680 1021324 1352143 648767
10180 648767 517033 1378147 1708923 866975 290931 924016 1585952 1086186 116001 -216474
10170 -216474 -160876 -362400 -451851 119146 827589 802673 90032 -650484 -1082637 -1213524
10160 -1213524 -1078125 -851817 -747678 -623881 -273286 -12457 -205633 -427904 -81778
$$ packed form
10230A017383o8468p26637j78633N56299J38649o32219m27126J87754J08124j16352
10220a41226M01700Q89622L42120m65801l95812L731k26120n25251m9471N18539
10210C52031K35419l14385k22854M6660j96433l71145J40807O14563L52215L9744
10200F76622K97309L68824l07688p91277l46935J49077o0685j80124M02926P40854
10190I48903J83357k56276Q2664J25785o78999q84341L15227J185004L30819p03376
10180F48767j31734Q61114L30776q41948n76044O33085O61936m99766r70185l32475
10170b16474N5598k01524q9451N70997P08443k4916p12641p40516m32153j30887
10160a213524J35399K26308J04139J23797L50595K60829j93176k22271L46126
$$ plain form
10151 -81778 429392 295890 -231322 -288114 -13837 -210470 -619774 -242420 697670 918528
10141 918528 301611 78671 542685 507173 -441067 -1043325 -505242 156989 -140915 -863339
10131 -863339 -889008 -133264 706728 1127188 912286 95107 -733314 -892108 -603625 -608466
10121 -608466 -783290 -336268 578877 853279 247191 -210878 12069 208426 -123945 -466918
10111 -466918 -420184 -379468 -570680 -588372 -334508 -265114 -358450 -47829 514296 429118 -363936
10100 -363936 -806852 -414475 87134 208800 409873 906212 1135707 924209 863070 1023779
10090 1023779 627163 -480873 -1337730 -1369262 -1085654 -809704 -134645 777473 828208 -313580
10080 -313580 -1428537 -1433166 -701866 -72714 281858 389628 96825 -249423 64705 782743
$$ packed form
10151h1778N11170j33502n27212n6792K74277j96633m09304L77354R40090K20858
10141I18528o16917k22940M64014l5512r48240o02258N38083O62231k97904p22424
10131h63339k5669P55744Q39992M20460k14902q17179q28421j58794K88483m841
10121f08466j74824M47022R15145K74402o06088m58069K22947J96357l32371l42973
10111d66918M6734M0716j91212j7692K53864O9394r3336L10621N62125q5178p93054
10100c63936m42916L92377N01609J21666K01073M96339K29495k11498o1139J60709
10090A023779l96616j108036q56857l1532K83608K75950O75059R12118N0735j141788
10080c13580j114957m629P31300O29152L54572J07770k92803l46248L14128P18038
$$ plain form
10070 782743 763396 -108013 -552172 -37644 298309 -310457 -894088 -490628 204505 183152
10060 183152 -121226 240397 1031465 1357829 1156777 994818 966551 790674 506180 273967
10050 273967 -17138 -317475 -160891 610774 1458996 1912882 2071622 2042583 1676484 1152964
10040 1152964 957382 1023184 839388 550995 784273 1213771 726591 -617127 -1315472
10031 -1315472 -700548 49879 -47440 -233010 490820 1623020 2072637 1764358 1273227
10022 1273227 743768 137415 -224498 -204302 -224546 -455683 -395662 216543 922897 1413327
10012 1413327 1899486 2249143 1883394 960948 445150 545075 406340 -181864 -259086 511723
10002 511723 1075440 797494 517406 889725 1172044 691947 114592 166746 401441 283758
$$ packed form
10070G82743j9347q71409m44159N14528L35953o08766n83631M03460O95133k1353
10060A83152l04378L61623P91068L26364k01052j61959k8267j75877k84494k32213
10050B73967k91105l00337J56584P71665Q48222M53886J58740k9039l66099n23520
10040A152964j95582O5802j83796k88393K33278M29498m87180j343718o98345
10031a315472O14924P50427r7319j85570P23830J132200M49617l08279m91131
10022A273227n29459o06353l61913K0196k0244k31137O0021O12205P06354M90430
10012A413327M86159L49657l65749r22446n15798R9925j38735n88204p7222P70809
10002E11723N63717k77946k80088L72319K82319m80097n77355N2154K34695j17683
$$ plain form
9992 283758 226456 517235 517203 -38707 -286073 165802 300048 -455638 -899437 25537 1301916
9981 1301916 1363278 473047 68987 592492 1335800 1711262 1514064 672066 -286783 -360191
9971 -360191 499579 1083533 790199 528445 943332 1226772 744285 325572 700405 1113107
9961 1113107 817824 526290 973490 1429550 1086091 591212 756596 1050165 804653 586291
9951 586291 941617 1182272 834487 780916 1485743 1748896 856103 195356 879904 1573391
9941 1573391 803287 -305811 10308 1028414 914425 -79370 -358941 163853 445522
9932 445522 538041 1068854 1483257 1095953 828803 1624245 2337884 1611615 555280 974984
9922 974984 2193614 2367265 1770815 1950559 2726493 2868342 2652023 2988591 3276585 2850245
$$ packed form
9992B83758n7302K90779l2n55910k47366M51875J34246p55686m43799R24974J276379
9981A301916O1362q90231m04060N23505P43308L75462j97198q41998r58849p3408
9971c60191Q59770N83954k93334k61754M14887K83440m82487m18713L74833M12702
9961A113107k95283k91534M47200M56060l43459m94879J65384K93569k45512k18362
9951E86291L55326K40655l47785n3571P04827K63153q92793o60747O84548O93487
9941A573391p70104j109098L16119J018106j13989r93795k79571N22794K81669
9932D45522R2519N30813M14403l87304k67150P95442P13639p26269j056335M19704
9922I74984J218630J73651n96450J79744P75934J41849k16319L36568K87994m26340
$$ plain form
9912 2850245 2931049 4214044 4589402 2674537 1195399 2783335 5072438 4849429 4152074
9903 4152074 6207920 8392039 6998195 6155267 11408739 15201103 2044332 -27627395
9895 -27627395 -51139413 -49331602 -29524326 -13494285 -10053611 -10809271 -8276335 -5053271
9887 -5053271 -4806352 -5356921 -4162171 -3037672 -3779326 -4502027 -3459750 -2245459 -2480716
9878 -2480716 -2860035 -1908559 -691089 -599845 -992800 -955108 -1145450 -2111122 -2750457 -2109139
9868 -2109139 -1039418 -658156 -663001 -408507 -224598 -505624 -755553 -573105 -472631 -882329
9858 -882329 -1377276 -1570995 -1703340 -1808497 -1431237 -670818 -355210 -699537 -936678 -703154
9848 -703154 -592744 -902967 -1071397 -844009 -785024 -1107862 -1184207 -749297 -457365 -721874
$$ packed form
9912B850245Q0804J282995L75358j914865j479138J587936K289103k23009o97355
9903D152074K055846K184119j393844q42928N253472L792364j3156771k9671727
9895b7627395k3512018J807811J9807276J6030041L440674p55660K532936L223064
9887e053271K46919n50569J194750J124499p41654p22701J042277J214291k35257
9878b480716l79319R51476J217470R1244l92955L7692j90342r65672o39335O41318
9868b109139J069721L81262m845K54494J83909k81026k49929J82448J00474m09698
9858h82329m94947j93719j32345j05157L77260P60419L15608l44327k37141K33524
9848g03154J10410l10223j68430K27388N8985l22838p6345M34910K91932k64509
$$ plain form
9838 -721874 -1104568 -1302350 -1580851 -1806812 -1337606 -401162 -244908 -1233964 -2097333 -1830094
9828 -1830094 -1078093 -782858 -713975 -356044 -85794 -328083 -543525 -216192 56805 -355169
9818 -355169 -810633 -463010 108448 -247664 -1279072 -1643282 -933933 -49560 359760 547232
9808 547232 709877 536109 -28255 -463163 -414001 -108923 101244 67821 -277729 -783366
9798 -783366 -909528 -374597 148765 -224485 -1198622 -1540280 -820723 12926 92316 -256721
9788 -256721 -353230 -312622 -621164 -1075331 -968603 -174879 628351 848219 598685 336900
9778 336900 245048 158276 -81306 -393724 -583821 -600250 -567676 -534446 -345214 62603 368926
9767 368926 191692 -305948 -478226 2103 695844 946904 652716 252207 104102 140784
$$ packed form
9838g21874l82694j97782k78501k25961M69206R36444J56254r89056q63369K67239
9828a830094P52001K95235O8883L57931K70250k42289k15442L27333K72997m11974
9818c55169m55464L47623N71458l56112j031408l64210P09349Q84373M09320J87472
9808E47232J62645j73768n64364m34908M9162L05078K10167l3423l45550n05637
9798g83366j26162N34931N23362l73250r74137l41658P19557Q33649P9390l49037
9788b56721r6509M0608l08542m54167J06728P93724Q03230K19868k49534k61785
9778C36900r1852q6772k39582l12418j90097j6429L2574L3230J89232M07817L06323
9767C68926j77234m97640j72278M80329O93741K51060k94188m00509j48105L6682
$$ plain form
9757 140784 95393 -143838 -458451 -691365 -853790 -1077747 -1311918 -1203950 -515087 414412
9747 414412 932989 838516 531358 344206 150556 -164699 -314367 -77155 200414 38728
9737 38728 -482044 -925265 -1158519 -1276382 -1069683 -257357 776130 1189143 789887 297727
9727 297727 255933 310310 -44638 -571679 -704034 -468853 -366694 -501100 -436586 56051
9717 56051 619638 827264 712180 558957 402251 36126 -500429 -740518 -331939 335364
9707 335364 418493 -314570 -1085000 -1106945 -641959 -504851 -781078 -808222 -395025 -171832
9697 -171832 -488674 -814122 -673649 -422279 -499027 -594195 -277420 113748 38972 -216575
9687 -216575 30620 667506 909717 510278 3720 -236930 -393739 -597860 -661068 -525980
$$ packed form
9757A40784m5391k39231l14613k32914j62425k23957k34171J07968O88863R29499
9747D14412N18577r4473l07158j87152j93650l15255j49668K37212K77569j61686
9737C8728n20772m43221k33254j17863K06699Q12326J033487M13013l99256m92160
9727B97727m1794N4377l54948n27041j32355K35181J02159j34406O4514M92637
9717E6051N63587K07626j15084j53223j56706l66125n36555k40089M08579O67303
9707C35364Q3129p33063p70430k1945M64986J37108k76227k7144M13197K23193
9697a71832l16842l25448J40473K51370p6748r5168L16775L91168p4776k55547
9687b16575K47195O36886K42211l99439n06558k40650j56809k04121o3208J35088
$$ plain form
9677 -525980 -355519 -114676 305510 544789 113425 -624426 -636010 324444 1202340 995473
9667 995473 -9289 -791366 -836966 -354097 270844 703355 684455 314196 88815 275870
9657 275870 481429 187861 -506631 -1040746 -1098487 -832729 -518742 -284164 -116193 55717
9647 55717 225245 214081 -92335 -398796 -243316 289438 496775 -50991 -891236 -1236787
9637 -1236787 -876259 -211569 320981 519023 331019 -111688 -492567 -637356 -731124 -955870
9627 -955870 -1077003 -715587 56753 704066 783084 289804 -474918 -1123067 -1308416 -940135
9617 -940135 -341891 15840 47139 168493 760701 1598381 1986838 1518865 576747 -56072
9607 -56072 -31217 304780 477499 426591 351543 301695 177330 -48570 -351459 -708655 -905322
$$ packed form
9677e25980J70461K40843M20186K39279m31364p37851j1584R60454Q77896k06867
9667I95473j004762p82077m5600M82869O24941M32511j8900l70259k25381J87055
9657B75870K05559k93568o94492n34115n7741K65758L13987K34578J67971J71910
9647E5717J69528j1164l06416l06461J55480N32754K07337n47766q40245l45551
9637a236787L60528O64690N32550J98042j88004m42707l80879j44789r3768k24746
9627i55870j21133L61416P72340O47313P9018m93280p64722o48149j85349L68281
9617i40135N98244L57731L1299J21354N92208Q37680L88457m67973r42118o32819
9607e6072K4855L35997J72719n0908p5048m9848j24365k25900l02889l57196j96667
$$ plain form
9596 -905322 -568647 264506 898930 746154 105632 -300480 -320734 -311157 -312565 -46657 341891
9585 341891 336127 -95931 -445309 -549323 -740205 -972804 -701388 66508 489031 130341
9575 130341 -338920 -238048 106333 103963 -59143 82840 338023 286803 183042 507326
9565 507326 952082 808334 203805 19010 551185 1098290 1016984 489689 18190 -285321
9555 -285321 -625435 -1082312 -1438410 -1312804 -542101 413362 733391 234200 -264745 -52761
9545 -52761 409188 248714 -350203 -410016 213953 558275 118890 -346325 -82020 472782
9535 472782 457148 -95239 -512344 -625910 -789655 -942327 -551321 366565 928459 496047
9525 496047 -393342 -724204 -372436 -186688 -681668 -1234516 -940781 91829 836187 649409
$$ packed form
9596i05322L36675Q33153O34424j52776o40522m06112k0254R577j408K65908L88548
9585C41891n764m32058l49378j04014j90882k32599K71416P67896M22523l58690
9575A30341m69261J00872L44381k370j63106J41983K55183n1220j03761L24284
9565E07326M44756j43748o04529j84795N32175N47105q1306n27295m71499l03511
9555b85321l40114m56877l56098J25606P70703R55463L20029m99191m98945K11984
9545e2761M61949j60474n98917n9813O23969L44322m39385m65215K64305N54802
9535D72782j5634n52387m17105j13566j63745j52672L91006R17886N61894m32412
9525D96047q89389l30862L51768J85748m94980n52848K93735J032610P44358j86778
$$ plain form
9515 649409 -35503 -421165 -279762 55911 246471 179177 -66936 -189344 143736 771117
9505 771117 991630 385597 -581704 -1148303 -1162440 -964775 -664022 -112586 562297 1002235
9495 1002235 1130987 1107608 889317 421878 126975 479806 1131824 1232684 688680 266065
9485 266065 288820 183845 -310593 -477516 169791 868284 685727 -17530 -213791 144339
9475 144339 208966 -226539 -436045 -111568 80139 -334460 -822382 -744239 -348458 -213144
9465 -213144 -233483 82790 622719 763808 410827 204705 507546 767193 277891 -774151
9455 -774151 -1478213 -1311160 -686188 -330386 -449282 -725880 -914506 -1058381 -1139115 -932205
9445 -932205 -428324 -70324 -204189 -499140 -376830 62945 101212 -505096 -1055486 -855643
$$ packed form
9515F49409o84912l85662J41403L35673J90560o7294k46113j22408L33080O27381
9505G71117K20513o06033r67301n66599j4137J97665L00753N51436O74883M39938
9495A002235J28752k3379k18291m67439k94903L52831O52018J00860n44004m22615
9485B66065K2755j04975m94438j66923O47307O98493j82557p03257j96261L58130
9475A44339O4627m35505k09506L24477J91707m14599m87922P8143L95781J35314
9465b13144k0339L16273N39929J41089l52981k06122L02841K59647m89302j052042
9455g74151p04062J67053O24972L55802j18896k76598j88626j43875q0734K06910
9445i32205N03881L58000j33865k94951J22310M39775L8267o06308n50390J99843
$$ plain form
9435 -855643 -157936 316478 431378 611605 958686 1066522 760173 409811 319362 304704
9425 304704 133918 -47301 -49221 -50225 -326120 -819596 -1290714 -1648502 -1813351 -1528724
9415 -1528724 -741784 28524 200394 -82557 -175077 75830 123537 -344617 -815754 -660361
9405 -660361 -60345 248834 21314 -185279 178118 881020 1207633 878928 382373 308293
9395 308293 599302 717404 459365 230516 383288 633866 458240 -123545 -530327 -340594
9385 -340594 276846 833792 939812 475794 -317704 -888121 -834607 -411731 -267938 -591823
9375 -591823 -866283 -639645 -177931 -49156 -333133 -618773 -627181 -440655 -164466 237269
9365 237269 689415 931084 869943 770478 881284 1056021 994157 733307 585016 602448
$$ packed form
9435h55643O97707M74414J14900J80227L47081J07836l06349l50362r0449j4658
9425C04704j70786j81219j920j004k75895m93476m71118l57788j64849K84627
9415a528724P86940P70308J71870k82951r2520K50907M7707m68154m71137J55393
9405f60361O00016L09179k27520k06593L63397P02902L26613l28705m96555p4080
9395C08293K91009J18102k58039k28849J52772K50578j75626n81785m06782J89733
9385c40594O17440N56946J06020m64018p93498n70417N3514M22876J43793l23885
9375e91823k74460K26638M61714J28775k83977k85640q408J86526K76189M01735
9365B37269M52146K41669o1141r9465J10806J74737o1864k60850j48291J7432
$$ plain form
9355 602448 479562 111693 -101891 179127 627961 637585 217705 22669 407866 912456
9345 912456 919148 497166 276053 642161 1307074 1611063 1153371 222444 -393871 -213781
9335 -213781 378595 686660 701045 986099 1547756 1579429 668491 -461263 -929258 -792718
9325 -792718 -565723 -279783 196403 450163 87624 -369584 -150887 451806 489488 -72793
9315 -72793 -321769 42768 278421 -36633 -321931 -87455 272448 285024 156829 194973
9305 194973 210073 21236 -107637 -26595 -60513 -362468 -563709 -507664 -618059 -1054452
9295 -1054452 -1276325 -1021849 -902256 -1301338 -1494432 -776581 222420 399815 -155230 -458719
9285 -458719 -244634 -145661 -413560 -563745 -356964 -177597 -264351 -358626 -302952 -296233 -353342
$$ packed form
9355F02448j22886l67869k13584K81018M48834R624m19880j95036L85197N04590
9345I12456O692m21982k21113L66108O64913L03989m57692r30927o16315J80090
9335b13781N92376L08065J4385K85054N61657L1673r10938j129754m67995J36540
9325g92718K26995K85940M76186K53760l62539m57208K18697O02693L7682n62281
9315g2793k48976L64537K35653l15054k85298K34476L59903J2576j28195L8144
9305A94973J5100j88837j28873Q1042l3918l01955k01241N6045j10395m36393
9295a054452k21873K54476J19593l99082j93094P17851R99001J77395n55045l03489
9285d58719K14085R8973k67899j50185K06781J79367q6754r4275N5674O719n7109
$$ plain form
9274 -353342 -115628 567214 1324909 1719663 1678194 1404971 1155097 1068484 986530 598910
9264 598910 15678 -175122 182229 330046 -334627 -1164812 -1085962 -193387 448052 433715
9254 433715 387060 681599 892501 766680 719093 947526 943572 405405 -111172 -28010 372241
9243 372241 471550 237517 64148 83038 159928 275925 431490 405151 44059 -368096
9233 -368096 -405503 -74325 165059 -99885 -802968 -1358704 -1097513 -11300 1002846 1050460
9223 1050460 355736 -41648 292314 720789 630789 258998 79739 49724 -42978 -43745 195378
9212 195378 366925 199132 -3479 119754 310899 170576 -28344 279018 976147 1413579
9202 1413579 1416017 1386567 1419815 1109903 419049 -16113 173700 431836 54431 -768725
$$ packed form
9274c53342K37714O82842P57695L94754m1469k73223k49874q6613q1954l87620
9264E98910n83232j90800L57351J47817o64673q30185P8850Q92575O41439j4337
9254D33715m6655K94539K10902j25821m7587K28433l954n38167n16577Q3162M00251
9243C72241R9309k34033j73369J8890P6890J15997J55565k6339l61092m12155
9233c68096l7407L31178K39384k64944p03083n55736K61191J086213J014146M7614
9223A050460o94724l97384L33962M28475r0000l71791j79259l0015r2702p67K39123
9212A95378J71547j67793k02611J23233J91145j40323j98920L07362O97129M37432
9202A413579K438k9450L3248l09912o90854m35162J89813K58136l77405q23156
$$ plain form
9192 -768725 -1228210 -996051 -519376 -253327 -108524 165420 429696 340129 -59675 -296652
9182 -296652 -84378 307048 468331 410907 439051 597966 589139 237338 -261356 -623859
9172 -623859 -768331 -765003 -732649 -810383 -971042 -868386 -223971 611922 944829 699959
9162 699959 575666 990617 1450232 1383150 1052199 1002870 1040729 564093 -295306 -722601
9152 -722601 -426896 -2614 63483 -8309 46564 173 -302866 -452095 -101144 359218
9142 359218 353545 20096 -52962 245830 524644 643869 817903 976729 730736 133332
9132 133332 -168833 153798 603724 633140 444438 537087 848095 928328 745435 698915
9122 698915 904684 1031213 878093 608478 337083 -8341 -296082 -195267 201832 292446
$$ packed form
9192g68725m59485K32159M76675K66049J44803K73944K64276q9567l99804k36977
9182b96652K12274L91426J61283n7424K8144J58915q827l51801m98694l62503
9172f23859j44472L328L2354p7734j60659J02656O44415Q35893L32907k44870
9162F99959j24293M14951M59615o7082l30951m9329L7859m76636q59399m27295
9152g22601K95705M24282O6097p1792N4873m6391l03039j49229L50951M60362
9142C59218n673l33449p3058K98792K78814J19225J74034J58826k45993n97404
9132A33332l02165L22631M49926K9416j88702R2649L11008Q0233j82893m6520
9122F98915K05769J26529j53120k69615k71395l45424k87741J00815L97099R0614
$$ plain form
9112 292446 -138557 -417625 89791 896682 913254 -36720 -879025 -636152 391910 1098146
9102 1098146 906413 286208 47469 442985 1049809 1367510 1350046 1293733 1309805 1109636
9092 1109636 407145 -581078 -1192714 -904536 149864 1208591 1473371 835582 38684
9083 38684 -64460 529772 968453 568889 -416957 -1220093 -1439096 -1234941 -893898 -574100
9073 -574100 -376339 -311521 -213894 52508 333803 350705 56203 -366220 -733816 -882063
9063 -882063 -656432 -189524 36442 -199280 -399112 -5856 665435 802490 339304 62903
9053 62903 341697 540616 81694 -610590 -784711 -457897 -196343 -163495 -56415 227405
9043 227405 512260 802307 1165621 1237961 589673 -313373 -315177 876447 2006739 1747738
$$ packed form
9112B92446m31003k79068N07416Q06891J6572r49974q42305K42873J028062P06236
9102A098146j91733o20205k38739L95516O06824L17701j7464n6313J6072k00169
9092A109636p02491r88223o11636K88178J054400J058727K64780o37789p96898
9083C8684j03144N94232M38681l99564r85846q03136k19003K04155L41043L19798
9073e74100J97761O4818R7627K66402K81295J6902k94502m22423l67596j48247
9063h82063K25631M66908K25966k35722j99832L93256O71291J37055m63186k76401
9053F2903K78794J98919m58922o92284j74121L26814K61554L2848J07080K83820
9043B27405K84855K90047L63314P2340o48288r03046j804J191624J130292k59001
$$ plain form
9033 1747738 415721 -484728 -204415 522975 696492 214222 -446908 -1031867 -1463963
9024 -1463963 -1470980 -912363 -261567 -119977 -324826 -173545 442286 810066 497280 13215
9014 13215 -12493 253209 266820 12008 -111565 -14845 80528 200494 565568 1037039 1183281
9003 1183281 909253 513567 129635 -324275 -592989 -146875 930656 1678303 1315463
8994 1315463 234643 -472634 -287925 288925 464521 15340 -593717 -779056 -440245
8985 -440245 27993 295039 468242 748163 943745 701732 123849 -258692 -135960 316874
8975 316874 806584 1150130 1163776 807503 454559 477192 537839 -20100 -932469 -1016165
8965 -1016165 140101 1294501 1103485 -40698 -619169 -74941 674041 710693 165012
$$ packed form
9033A747738j332017r00449K80313P27390J73517m82270o61130n84959m32096
9024a463963p017N58617O50796J41590k04849J51281O15831L67780l12786m84065
9014A3215k5708K65702J3611k54812j23573R6720R5373J19966L65074M71471J46242
9003A183281k74028l95686l83932m53910k68714M46114J077531P47647l62840
8994A315463j080820p07277J84709N76850J75596m49181o09057j85339L38811
8985d40245M68238K67046J73203K79921J95582k42013n77883l82541J22732M52834
8975C16874M89710L43546J3646l56273l52944K2633O0647n57939r12369q3696
8965a016165J156266J154400j91016j144183n78471N44228P48982L6652n45681
$$ plain form
8956 165012 -362648 -607225 -544810 -131526 445774 689436 360744 -144469 -287483 -10520
8946 -10520 372581 635033 699580 486068 39550 -336238 -396827 -312386 -398986 -576394 -453643
8935 -453643 32943 447206 467055 343116 469378 720678 609736 77775 -271710 78360
8925 78360 835086 1216965 908413 385299 228796 386077 338762 -103982 -476784 -251769
8915 -251769 406717 742615 307029 -476855 -836362 -575698 -188576 -120967 -318268 -585054
8905 -585054 -946530 -1359333 -1432731 -895107 -142099 167782 -4872 -80935 237959 556756
8895 556756 418261 -69543 -464030 -535661 -354363 -72098 148459 154892 -53099 -308628
8885 -308628 -499074 -668722 -859921 -1029585 -1127274 -1031677 -480122 545969 1384490 1204857
$$ packed form
8956A65012n27660k44577O2415M13284N77300K43662l28692n05213j43014K76963
8946a0520L83101K62452O4547k13512m46518l75788o0589Q4441q6600j77408J22751
8935d53643M86586M14263J9849j23939J26262K51300j10942n31961l49485L50070
8925G8360P56726L81879l08552n23114j56503J57281m7315m42744l72802K25015
8915b51769O58486L35898m35586p83884l59507K60664L87122O7609j97301k66786
8905e85054l61476m12803p3398N37624P53008L09881j72654p6063L18894L18797
8895E56756j38495m87804l94487p1631J81298K82265K20557O433k07991k55529
8885c08628j90446j69648j91199j69664r7689R5597N51555J026091Q38521j79633
$$ plain form
8875 1204857 141643 -648862 -392309 379643 730823 579930 435199 372647 145433 42154
8865 42154 637845 1650927 2012163 1359401 612099 608856 939965 778475 252188 142140
8855 142140 549546 768960 454491 81573 61755 121846 -54525 -131769 381164 1232792
8845 1232792 1589226 1053749 109400 -502196 -517795 -177006 206485 495654 671828 714619
8835 714619 575364 236598 -206622 -545183 -577799 -243560 348915 953793 1255129 1065792
8825 1065792 567690 219715 276823 505750 521239 258729 -79163 -363562 -532669 -412282
8815 -412282 48051 445388 310927 -159139 -274753 153160 559021 575554 614262 1063802
8805 1063802 1457461 1068123 1494 -949679 -1347012 -1370858 -1172751 -666944 -34355 213330
$$ packed form
8875A204857j063214p90505K56553P71952L51180j50893j44731o2552k27214j03279
8865D2154N95691J013082L61236o52762p47302l243L31109j61490n26287j10048
8855A42140M07406K19414l14469l72918j9818O0091j76371p7244N12933Q51628
8845A232792L56434n35477r44349o11596j5599L40789L83491K89169J76174M2791
8835G14619j39255l38766m43220l38561l2616L34239N92475O04878L01336j89337
8825A065792m98102l47975N7108K28927J5489k62510l37892k84399j69107J20387
8815d12282M60333L97337j34461m70066j15614M27913M05861J6533L8708M49540
8805A063802L93659l89338j066629r51173l97333k3846J98107N05807O32589K47685
$$ plain form
8795 213330 -89151 -490423 -568086 -448006 -425512 -422649 -151053 403260 968116 1341746
8785 1341746 1503490 1430538 1051448 438770 -99317 -248643 -22574 209728 107738 -262757
8775 -262757 -546434 -556941 -439316 -377450 -377044 -392537 -416415 -374962 -226010 -220205 -664029
8764 -664029 -1292869 -1382514 -754217 -132296 -96657 -235566 81016 603736 656339 322706
8754 322706 288775 654064 800509 471243 147059 202543 416231 507299 510433 433976 163768
8743 163768 -106356 43469 541045 774786 482615 107623 28165 17234 -228899 -546246
8733 -546246 -612842 -382586 27704 470412 638409 300622 -191165 -188232 315117 654750
8723 654750 565710 514814 686646 503376 -315646 -997898 -734746 127307 646822 591279
$$ packed form
8795B13330l02481m01272p7663J20080K2494K863K71596N54313N64856L73630
8785A341746J61744p2952l79090o12678n38087j49326K26069K32302j01990l70495
8775b62757k83677j0507J17625O1866M06j5493k3878M1453J48952N805m43824
8764f64029o28840q9645O28297O21921L5639j38909L16582N22720N2603l33633
8754C22706l3931L65289J46445l29266l24184N5484K13688R1068L134p6457k70208
8743A63768k70124J49825M97576K33741k92171l74992p9458j0931k46133l17347
8733e46246o6596K30256M10290M42708J67997l37787m91787K933N03349L39633
8723F54750q9040n0896J71832j83270q19022o82252K63152Q62053N19515n5543
$$ plain form
8713 591279 456291 528990 652542 709379 704723 524696 155011 -20192 351157 998291
8703 998291 1322316 1139135 727557 337183 88331 175025 680995 1268272 1448799 1132633
8693 1132633 638739 273113 129523 142657 113087 -138156 -463123 -472549 -65043 447147
8683 447147 852064 1236039 1522934 1389029 910492 686871 946034 1142012 876807 546340
8673 546340 506345 300442 -517203 -1389939 -1482658 -958715 -615301 -576789 -308860 260498
8663 260498 589759 458580 217056 90569 -17369 -27519 283914 724360 829531 608407
8653 608407 521584 704525 827063 734447 626216 592757 547045 575102 770315 821772 425168
8642 425168 -23265 86480 492390 365713 -270933 -443241 210312 785366 513162 -78809
$$ packed form
8713E91279j34988P2699J23552N6837m656j80027l69685j75203L71349O47134
8703I98291L24025j83181m11578l90374k48852Q6694N05970N87277J80527l16166
8693A132633m93894l65626j43590J3134k9570k51243l24967r426M07506N12190
8683D47147M04917L83975K86895j33905m78537k23621K59163J95978k65205l30467
8673E46340l9995k05903q17645q72736r2719N23943L43414L8512K67929N69358
8663B60498L29261j31179k41524j26487j07938j0150L11433M40446J05171k21124
8653F08407q6823J82941J22538r2616j08231l3459m5712K8057J95213N1457l96604
8642D25168m48433J09745M05910j26677o36646j72308O53553N75054k72204n91971
$$ plain form
8632 -78809 -102895 283254 259121 -256775 -475664 8473 561471 380914 -388409 -811456
8622 -811456 -363876 397956 603858 271503 248900 923878 1587898 1413674 536914 -332225
8612 -332225 -905743 -1269385 -1208813 -413936 741577 1380056 1138466 454840 -113834 -298383
8602 -298383 40731 803528 1408893 1317533 791771 512245 522172 298796 -172999 -285370
8592 -285370 110731 398923 249119 145465 468798 792397 594476 94599 -135559 25746
8582 25746 283869 432566 447287 317554 60512 -266983 -652123 -995630 -977064 -448869
8572 -448869 138144 234489 27486 130576 506167 511680 91096 7140 598855 1175133
8562 1175133 1082984 609911 305681 98890 -293212 -616501 -402316 271706 848940 912532
$$ packed form
8632g8809k4086L86149k4133n15896k18889M84137N52998j80557p69323m23047
8622h11456M47580P61832K05902l32355k2603O74978O64020j74224q76760q69139
8612c32225n73518l63642O0572P94877J155513O38479k41590o83626n68674j84549
8602b98383L39114P62797O05365r1360n25762k79526R927k23376m71795j12371
8592b85370L96101K88192j49804j03654L23333L23599j97921m99877k30158J61305
8582B5746K58123J48697J4721j29733k57042l27495l85140l43507J8566N28195
8572d48869N87013R6345k07003J03090L75591N513m20584q3956N91715N76278
8562A175133r2149m73073l04230k06791l92102l23289K14185O74022N77234O3592
$$ plain form
8552 912532 453476 -174541 -369422 242623 1253213 1838174 1793026 1626531 1533510 1091266
8542 1091266 262988 -208745 50009 330273 -39693 -581482 -469077 142228 449380 244691
8532 244691 -10140 -56106 -4145 153543 483780 718963 552416 184358 25833 50556
8522 50556 -20825 -121302 -1228 214836 226415 144584 306776 655563 865755 946076 1135789
8511 1135789 1314869 1112651 574396 183111 201607 433995 629164 729315 755407 784850
8501 784850 953238 1189291 1154019 766246 475282 577183 624833 113303 -570741 -634153
8491 -634153 -130795 91899 -307257 -731718 -670034 -394764 -335175 -388046 -270095 -90783
8481 -90783 -109888 -192797 71192 793905 1604142 2011152 1808161 1159444 406372 -184444
$$ packed form
8552I12532m59056o28017j94881O12045J010590N84961m5148j66495r3021m42244
8542A091266q28278m71733K58754K80264l69966n41789J12405O11305L07152k04689
8532B44691k54831m5966N1961J57688L30237K35183j66547l68058j58525K4723
8522E0556p1381j00477J20074K16064J1579q1831J62192L48787K10192Q0321J89713
8511A135789J79080k02218n38255l91285J8496K32388J95169J00151K6092K9443
8501G84850J68388K36053l5272l87773k90964J01901M7650n11530o84044o3412
8491f34153N03358K22694l99156m24461O1684K75270N9589n2871J17951J79312
8481i0783j9105q2909K63989P22713Q10237M07010k02991o48717p53072n90816
$$ plain form
8471 -184444 -500772 -498070 -207862 127996 158063 -189748 -594795 -762837 -756444 -752486 -728005
8460 -728005 -616483 -527517 -534582 -465368 -189403 104813 221435 321853 644670 1070705
8450 1070705 1322903 1410059 1500043 1521984 1287298 885050 590156 476918 441382 473036
8440 473036 581384 600719 402259 162571 109973 162404 108055 -61822 -290461 -637013
8430 -637013 -971008 -836856 -95204 625052 666975 252344 46218 100337 -32316 -310078
8420 -310078 -178969 426121 851240 688702 311481 202309 313251 358768 273396 113184
8410 113184 -110304 -265692 -103522 375838 817915 899983 589166 13627 -602790 -892806
8400 -892806 -638220 -163080 -43590 -354107 -580197 -358353 74549 266342 45412 -439035
$$ packed form
8471a84444l16328K702K90208L35858L0067l47811m05047j68042O393L958K4481
8460g28005J11522Q8966p065O9214K75965K94216J16622J00418L22817M26035
8450A070705K52198Q7156Q9984K1941k34686m02248k94894j13238l5536L1654
8440D73036J08348J9335j98460k39688n2598N2431n4349j69877k28639l46552
8430f37013l33995J34152P41652P20256M1923m14631k06126N4119j32653k77762
8420c10078J31109O05090M25119j62538l77221j09172J10942M5517q5372j60212
8410A13184k23488j55388J62170M79360M42077Q2068l10817n75539o16417k90016
8400h92806K54586M75140J19490l10517k26090K21844M32902J91793k20930m84447
$$ plain form
8390 -439035 -847800 -792519 -200427 427979 479221 -41170 -593312 -867614 -997219 -1012620
8380 -1012620 -646039 158392 1004885 1514931 1675438 1592869 1275563 791326 300566 -157961
8370 -157961 -597602 -821329 -652287 -390628 -502033 -830293 -739932 -148952 262729 111222
8360 111222 -111210 107002 478998 458016 107278 -115205 -101746 -106998 -241413 -395456
8350 -395456 -505602 -544368 -407220 -101964 124788 104939 7271 71657 307676 629405
8340 629405 990454 1186555 888885 166166 -359560 -212512 354762 772116 840955 704472
8330 704472 468314 234635 213700 383813 304918 -286995 -932257 -968904 -430820 54330
8320 54330 154977 157098 438393 1027331 1663595 1956181 1556176 549756 -368070 -492703
$$ packed form
8390d39035m08765N5281N92092O28406N1242n20391n52142k74302j29605j5401
8380a012620L66581Q04431Q46493N10046J60507q2569l17306m84237m90760m58527
8370a57961m39641k23727J69042K61659j11405l28260R0361N90980M11681j51507
8360A11222k22432K18212L71996k0982l50738k22483J3459n252j34415j54043
8350c95456j10146l8766J37148L05256K26752j9849r7668O4386K36019L21729
8340F29405L61049J96101k97670p22719n25726J47048N67274M17354O8839j36483
8330G04472k36158k33679k0935J70113p8895n91913o45262l6647N38084M85150
8320E4330J00647K121K81295N88938O36264K92586m00005j006420r17826j24633
$$ plain form
8310 -492703 115193 763299 976103 865547 735781 755383 1035906 1585101 2056704 1932121
8300 1932121 1144009 247515 -187493 -122110 135857 399799 691243 1033214 1352521 1519995
8290 1519995 1409511 1025235 609770 448696 487366 348660 -119706 -523875 -407500 69033
8280 69033 277797 -22073 -343100 -187158 212459 267468 -16476 -31245 411187 668994
8270 668994 266042 -242163 -51320 582867 658497 -18511 -512380 -215988 255569 134763
8260 134763 -293583 -295837 41464 34216 -360459 -429596 147197 812659 989678 811185 728983
8249 728983 866645 1055179 1179491 1224884 1195512 1155110 1165814 1110138 787937 222628 -372789
8238 -372789 -912938 -1399974 -1613321 -1303284 -735028 -482251 -506898 -68392 1073700 1967634
$$ packed form
8310d92703O07896O48106K12804j10556j29766J9602K80523N49195M71603j24583
8300A932121p88112q96494m35008O5383K57967K63942K91444L41971L19307J67474
8290A519995j10484l84276m15465j61074L8670j38706m68366m04169J16375M76533
8280F9033K08764k99870l21027J55942L99617N5009k83944j4769M42432K57807
8270F68994m02952n08205J90843O34187P5630o77008m93869K96392M71557j20806
8260A34763m28346k254L37301p248l94675o9137N76793O65462J77019j78493q2202
8249G28983J37662J88534J24312M5393k9372m0402J0704n5676l22201n65309n95417
8238c72789n40149m87036k13347L10037N68256K52777k4647M38506J142092Q93934
$$ plain form
8228 1967634 1605557 358002 -457597 -270877 217764 223293 -140056 -310268 -130508 159990
8218 159990 437765 774477 1151791 1418445 1479712 1333591 994121 544575 184595 62351
8208 62351 116751 204234 292684 403168 471717 444414 431847 577256 810973 927804 901291
8197 901291 929848 1132568 1366380 1421953 1281869 1099196 996232 961672 907120 772588
8187 772588 600202 531443 695214 1046852 1316101 1176742 564679 -143130 -392852 -41378
8177 -41378 405752 367252 -46655 -164438 288849 766251 669720 176111 -87782 86312
8167 86312 401991 629100 733044 571585 70015 -329090 -52038 668738 918671 380975
8157 380975 -197771 -181395 11899 -292516 -872059 -999989 -616408 -302974 -268437 -153706
$$ packed form
8228A967634l62077j247555q15599J86720M88641N529l63349j70212J79760K90498
8218A59990K77775L36712L77314K66654O1267j46121l39470m49546l59980j22244
8208F2351N4400Q7483Q8450J10484O8549k7303j2567J45409K33717J16831k6513
8197I01291K8557K02720K33812N5573j40084j82673j02964l4560n4552j34532
8187G72588j72386o8759J63771L51638K69249j39359o12063p07809k49722L51474
8177d1378M47130l8500m13907j17783M53287M77402r6531m93609k63893J74094
8167H6312L15679K27109J03944j61459n01570l99105K77052P20776K49933n37696
8157C80975n78746J6376J93294l04415n79543j27930L83581L13434L4537J14731
$$ plain form
8147 -153706 163980 321300 163388 45653 212182 404988 365324 278065 401835 601499
8137 601499 584745 380874 278281 397234 551249 501649 253350 126222 495768 1340702
8127 1340702 2124128 2321339 1980805 1518899 1099139 607524 164253 138567 552502 942061
8117 942061 982589 821391 610254 192046 -451379 -887135 -761487 -302239 83386 373006
8107 373006 677617 781825 479879 119133 200356 567171 610916 237787 -9046 152383
8097 152383 383009 442679 608708 1022693 1209400 764771 90506 -149519 -10931 -69055
8087 -69055 -411241 -536935 -281578 -125983 -349034 -496398 -105441 508785 703122 446689
8077 446689 275211 449232 680822 689826 561079 451583 324962 129539 -35500 -66578
$$ packed form
8147a53706L17686J57320j57912j17735J66529J92806l9664q7259J23770J99664
8137F01499j6754k03871j02593J18953J54015m9600k48299j27128L69546Q44934
8127A340702P83426J97211l40534m61906m19760m91615m43271k5686M13935L89559
8117I42061M0528j61198k11137m18208o43425m35756J25648M59248L85625K89620
8107C73006L04611J04208l01946l60746Q1223L66815M3745l73129k46833J61429
8097A52383K30626N9670J66029M13985J86707m44629o74265k40025J38588n8124
8087f9055l42186j25694K55357J55595k23051j47364L90957O14226J94337k56433
8077D46689j71478J74021K31590R004j28747j09496j26621j95423j65039l1078
$$ plain form
8067 -66578 34440 257611 573352 800796 758413 582434 590335 771717 761795 419736 53636
8056 53636 -90247 -168732 -342659 -421148 -208212 130422 375924 614865 924585 1007017
8046 1007017 578373 -92291 -462522 -361935 17325 529734 1013958 1063013 441508 -376114
8036 -376114 -652422 -319404 77584 290077 581216 1022232 1279957 1269492 1350953 1621266
8026 1621266 1655046 1299529 1092247 1381965 1578378 934289 -281113 -1095203 -1133675 -897174
8016 -897174 -768623 -493580 117419 613019 500381 25323 -195924 -127941 -289152 -753768
8006 -753768 -834901 -97221 840678 1079606 687969 481412 702275 753283 364949 140424
7996 140424 510286 936083 807226 482278 623911 989837 827562 173429 -236492 -220584
$$ packed form
8067f6578J01018K23171L15741K27444m2383j75979P901J81382r922l42059l66100
8056E3636j43883p8485j73927p8489K12936L38634K45502K38941L09720Q2432
8046A007017m28644o70664l70231J00587L79260N12409M84224M9055o21505q17622
8036c76114k76308L33018L96988K12493K91139M41016K57725j0465Q1461K70313
8026A621266L3780l55517k07282K89718J96413o44089j215402q14090l8472K36501
8016h97174J28551K75043O10999M95600j12638m75058k21247O7983j61211m64616
8006g53768q1133P37680R37899K38928l91637k06557K20863N1008l88334k24525
7996A40424L69862M25797j28857l24948J41633L65926j62275o54133m09921J5908
$$ plain form
7986 -220584 -301356 -586319 -542501 -95094 51111 -428159 -879741 -704030 -194692 152924
7976 152924 406495 681222 593170 -42089 -569146 -353655 187710 243970 -88224 -54389
7966 -54389 447985 752655 581556 426391 631326 870631 804191 613935 557872 503899
7956 503899 282623 122362 335812 802576 1117100 1135938 1085954 1158503 1227005 1034071
7946 1034071 548394 37578 -221002 -221971 -136463 -6922 251200 522176 457229 -38803
7936 -38803 -512081 -428802 171886 745732 881468 621355 217442 -122719 -207231 140375
7926 140375 875045 1621173 1903392 1516528 682120 -137874 -602830 -687939 -516965 -98857
7916 -98857 601520 1358530 1709741 1411248 708297 48979 -307150 -307394 18511 480689
$$ packed form
7986b20584q0772k84963M3818M47407J46205m79270m51582J75711N09338L47616
7976A52924K53571K74727q8052o35259n27057K15491N41365N6260l32194L3835
7966e4389N02374L04670j71099j55165K04935K39305o6440j90256n6063n3973
7956E03899k21276j60261K13450M66764L14524J8838m9984P2549O8502j92934
7946A034071m85677n10816k58580r69Q5508J29541K58122K70976o4947m96032
7936c8803m73278Q3279O00688N73846J35736k60113m03913l40161q4512L47606
7926A40375P34670P46128K82219l86864q34408q19994m64956q5109J70974M18108
7916i8857P00377P57010L51211k98493p02951o59318l56129k44L25905M62178
$$ plain form
7906 480689 703966 470303 47050 -58047 311412 780536 896378 647454 460395 695945
7896 695945 1184821 1333437 763298 -205142 -841060 -780440 -381379 -263591 -603182 -954477
7886 -954477 -746286 55747 812089 850783 251114 -235984 -130420 229141 286401 53957
7876 53957 -76275 1473 113886 242753 420404 403599 51742 -170303 214807 746393
7866 746393 522733 -365802 -848973 -472984 10772 -16712 -127684 172945 477296 237490
7856 237490 -226576 -293131 -54326 17125 -58869 4059 91438 14904 95784 615443 1066958
7845 1066958 841837 352023 493014 1172384 1418206 962758 662779 1079893 1571841 1278813
7835 1278813 348749 -366875 -440072 -194527 -88814 -164414 -152548 22886 9640 -518882
$$ packed form
7906D80689K23277k33663m23253j05097L69459M69124J15842k48924j87059K35550
7896F95945M88876J48616n70139r68440o35918O0620L99061J17788l39591l51295
7886i54477K08191Q02033P56342L8694n99669m87098J05564L59561N7260k32444
7876E3957j30232P7748J12413J28867J77651j6805l51857k22045L85110N31586
7866G46393k23660q88535m83171L75989M83756k7484j10972L00629L04351k39806
7856B37490m64066o6555K38805P1451p5994O2928Q7379p6534Q0880N19659M51515
7845A066958k25121m89814J40991O79370K45822m55448k99979M17114M91948k93028
7835A278813r30064p15624p3197K45545J05713p5600J1866J75434j3246n28522
$$ plain form
7825 -518882 -1215712 -1285937 -555318 163664 162260 -188086 -126356 254724 232610 -310445 -725744
7814 -725744 -649304 -419974 -342634 -265849 -108256 -167013 -592628 -1024513 -1034342 -602535 12864
7803 12864 558867 825863 730619 468024 317840 290327 234129 195016 289129 338225 112902
7792 112902 -133110 86879 713979 1172427 1219196 1186172 1262634 1129014 548044 -167027
7782 -167027 -566712 -598510 -488178 -371575 -251756 -138668 -114658 -339832 -881351 -1393793
7772 -1393793 -1278725 -506710 88694 -126137 -591296 -347761 471600 855931 479543 30909
7762 30909 -56268 -124517 -323274 -203673 292074 446359 -55384 -471220 -193323 251591
7752 251591 176292 -54863 265760 848625 838827 280380 89047 584987 977804 526221
$$ packed form
7825e18882o96830p0225P30619P18982j404l50346O1730L81080k2114n43055m15299
7814g25744P6440K29330P7340P6785J57593n8757m25615m31885r829M31807O15399
7803A2864N46003K66996r5244k62595j50184k7513n6198l9113R4113M9096k25323
7792A12902k46012K19989O27100M58448M6769l3024P6462j33620n80970p15071
7782a67027l99685l1798J10332J16603J19819J13088K4010k25174n41519n12442
7772a393793J15068P72015N95404k14831m65159K43535Q19361L84331l76388m48634
7762C0909q7177o8249j98757J19601M95747J54285n01743m15836K77897M44914
7752B51591p5299k31155L20623N82865r798n58447j91333M95940L92817m51583
$$ plain form
7742 526221 -456328 -1051373 -803522 -109581 274561 16239 -455915 -481197 -32752 254957
7732 254957 22071 -306482 -224848 102904 223475 126390 77545 40034 -164720 -343551
7722 -343551 -173684 176005 246036 44103 40933 404862 766477 813011 649785 474384
7712 474384 316021 227610 364878 713880 1020273 1109892 1040874 875195 573326 201948
7702 201948 -21366 -9171 87504 144630 216562 318255 286333 18630 -323074 -529521 -639599
7691 -639599 -823964 -1029664 -949729 -413933 313736 759559 759468 636978 776029 1094295 1114443
7680 1114443 590135 -114821 -408852 -136286 311415 520271 489602 452373 429000 206451
7670 206451 -229261 -513472 -352472 32679 210239 181264 328664 725407 973964 899967
$$ packed form
7742E26221r82549n95045K47851O93941L84142k58322m72154k5282M48445K87709
7732B54957k32886l28553Q1634L27752J20571r7085m8845l7511k04754j78831
7722c43551J69867L49689P0031k01933l170L63929L61615M6534j63226j75401
7712D74384j58363q8411J37268L49002L06393Q9619o9018j65679l01869l71378
7702B01948k23314J2195R6675N7126P1932J01693l1922k67703l41704k06447j10078
7691f39599j84365k05700P9935N35796P27669M45823r1j22490J39051L18266K0148
7680A114443n24308p04956k94031K72566M47701K08856l0669l7229k3373k22549
7670B06451m35712k84211J61000L85151J77560k8975J47400L96743K48557p3997
$$ plain form
7660 899967 906389 1292071 1654158 1456680 875893 516115 477037 298507 -221240 -703389
7650 -703389 -732288 -297055 326926 774244 731261 278451 -1240 319991 872790 965670
7640 965670 525029 17003 -347095 -627912 -575004 87976 830285 734348 -115469 -629785
7630 -629785 -329773 50133 -57250 -144813 282499 713405 548885 192401 290761 553442
7620 553442 344776 -49485 161369 871043 1171923 794708 458053 649888 919210 680133
7610 680133 82101 -286897 -170202 199857 501565 644873 735047 816132 755743 514309
7600 514309 392093 638424 871841 455789 -439585 -828915 -276376 413309 346123 -261177
7590 -261177 -645373 -681931 -754487 -872547 -722450 -343010 -48310 97482 118273 -224587
$$ packed form
7660H99967O422L85682L62087j97478n80787l59778l9078j78530n19747m82149
7650g03389k8899M35233O23981M47318m2983m52810k79691L21231N52799R2880
7640I65670m40641n08026l64098k80817N2908O62980P42309r5937q49817n14316
7630f29785L00012L79906j07383q7563M27312M30906j64520l56484R8360K62681
7620E53442k08666l94261K10854P09674L00880l77215l36655J91835K69322k39077
7610F80133n98032l68998J16695L70059L01708J43308R0174Q1085o0389k41434
7600E14309j22216K46331K33417m16052q95374l89330N52539O89685o7186o07300
7590b61177l84196l6558p2556j18060J50097L79440K94700J45792K0791l42860
$$ plain form
7580 -224587 -930636 -1280204 -695810 198117 299827 -356459 -688254 -223065 345820 404515
7570 404515 256252 393952 747842 1061657 1359581 1608996 1442864 663883 -311364 -849071
7560 -849071 -712769 -118153 547832 931055 911151 725095 697959 846931 957540 951479
7550 951479 904746 836925 779195 847481 912978 515690 -411932 -1071667 -696324 318891
7540 318891 878755 603291 63282 -226267 -246834 -12611 488753 898082 819502 519485
7530 519485 492577 469101 -148660 -960771 -911036 -74728 231183 -492660 -1096862 -650054
7520 -650054 120262 127521 -416265 -665139 -576505 -587622 -551044 -111049 377961 384599 226043
7509 226043 510092 934143 757053 208118 249478 995544 1506873 1266177 798728 584731
$$ packed form
7580b24587p06049l49568N84394Q93927J01710o56286l31795M65189N68885N8695
7570D04515j48263J37700L53890L13815K97924K49415j66132p78981r75247n37707
7560h49071J36302N94616O65985L83223j9904j86056k7136J48972J10609o061
7550I51479m6733o7821n7730O8286O5497l97288r27622o59735L75343J015215
7540C18891N59864k75464n40009k89549k0567K34223N01364M09329p8580l00017
7530E19485k6908k3476o17761q12111M9735Q36308L05911p23843o04202M46808
7520f50054P70316P259n43786k48874Q8634j1117L6578M39995M89010O638j58556
7509B26043K84049M24051j77090n48935M1360P46066N11329k40696m67449k13997
$$ plain form
7499 584731 355007 -117295 -390893 -92438 360337 380531 116007 127773 439164 513581
$$ packed form
7499E84731k29724m72302k73598K98455M52775K0194k64524J1766L11391P4417
$$ [...]
##END NTUPLES=NMR SPECTRUM
##END=
