##TITLE=31Pdec_BAU-P2
 CDCl3, 24 sc
 7.6.2019
##JCAMPDX= 6.0         $$ Bruker NMR JCAMP-DX V2.0
##DATA TYPE= NMR SPECTRUM
##DATA CLASS= NTUPLES
##ORIGIN= UXNMR, Bruker Analytische Messtechnik GmbH
##OWNER= root
$$ XWIN-NMR		Version 3.5
$$ Fri Jun  7 14:35:53 2019 Russian Standard Time (UT+4h)  she@DPX200
##.OBSERVE FREQUENCY= 81.013821
##.OBSERVE NUCLEUS= ^31P
##.ACQUISITION MODE= SIMULTANEOUS
##.ACQUISITION SCHEME= undefined
##.AVERAGES= 24
##.DIGITISER RES= 17
##SPECTROMETER/DATA SYSTEM= spect
##.PULSE SEQUENCE= zgpg30
##.SOLVENT NAME= CDCl3
##.SHIFT REFERENCE= (INTERNAL, CDCl3, 0, 182.463)
##AUDIT TRAIL= $$ (NUMBER, WHEN, WHO, WHERE, WHAT)
$$ ##TITLE= Audit trail, XWIN-NMR		Version 3.5
$$ ##JCAMPDX= 5.01
$$ ##ORIGIN= Bruker BioSpin GmbH
$$ ##OWNER= she
$$ F:/spectra/data/she/nmr/P31/1/pdata/1/auditp.txt
$$ ##AUDIT TRAIL=  $$ (NUMBER, WHEN, WHO, WHERE, WHAT)
(   1,<2019-06-07 14:34:45.84 +0400>,<she>,<DPX200>,
      <created by zg, POWCHK disabled, PULCHK disabled
       configuration hash MD5:
       00 E9 B6 7A A2 85 ED C7 34 08 36 98 17 FE 4E 26
       data hash MD5: 32K
       10 13 C6 E0 B9 F4 D0 77 D0 26 48 21 A5 82 75 A5>)
(   2,<2019-06-07 14:34:52.43 +0400>,<she>,<DPX200>,
      <Start of raw data processing
       efp BC_mod = 2 LB = 1 FT_mod = 6 PKNL = 1 PHC0 = -2565.935 PHC1 = 78.19916 SI = 64K 
       data hash MD5: 64K
       BE 1D 52 EC 05 1F 6E E0 27 FE B4 85 32 60 15 0F>)
(   3,<2019-06-07 14:35:11.65 +0400>,<she>,<DPX200>,
      <pk PHC0 = 31.7071 PHC1 = 0 
       data hash MD5: 64K
       6C B4 12 F3 AC 14 32 66 C5 5E 21 E4 17 D1 5B 41>)
$$ ##END=
$$ 
$$ hash MD5
$$ 35 25 41 12 47 15 98 24 29 C5 F1 7F 83 F6 13 04
##$RELAX= 
##$RELAX= 
##$RELAX= 
##$RELAX= 
##$RELAX= 
##$RELAX= 
##$RELAX= 
##$RELAX= 
$$ Bruker specific parameters
$$ --------------------------
##$DU= <F:/spectra>
##$EXPNO= 1
##$NAME= <P31>
##$PROCNO= 1
##$TYPE= <nmr>
##$USER= <she>
##$AMP= (0..31)
100 100 100 100 100 100 100 100 100 100 100 100 100 100 100 100 100 100 
100 100 100 100 100 100 100 100 100 100 100 100 100 100 
##$AQSEQ= 0
##$AQ_mod= 1
##$AUNM= <au_zg>
##$AUTOPOS= <>
##$BF1= 81.014009
##$BF2= 200.13
##$BF3= 200.13
##$BF4= 200.13
##$BF5= 200.13
##$BF6= 200.13
##$BF7= 200.13
##$BF8= 200.13
##$BYTORDA= 1
##$CFDGTYP= 0
##$CFRGTYP= 5
##$CHEMSTR= <none>
##$CNST= (0..31)
1 1 145 1 1 1 1 1 1 1 1 1 1 1 1 1 1 1 1 1 1 1 1 1 1 1 1 1 1 1 1 1 
##$CPDPRG= <waltz16>
##$CPDPRG1= <>
##$CPDPRG2= <waltz16>
##$CPDPRG3= <>
##$CPDPRG4= <mlev>
##$CPDPRG5= <mlev>
##$CPDPRG6= <mlev>
##$CPDPRG7= <mlev>
##$CPDPRG8= <mlev>
##$CPDPRGB= <>
##$CPDPRGT= <>
##$D= (0..31)
0 1 0 0 0 0 0 0 0 0 0 0.03 2e-05 3e-06 0 0 0 0 0 0 0 0 0 0 0 0 0 0 0 0 
0 0 
##$DATE= 1559903685
##$DBL= (0..7)
120 120 120 11 120 120 24 19 
##$DBP= (0..7)
150 150 150 150 150 150 150 150 
##$DBP07= 0
##$DBPNAM0= <>
##$DBPNAM1= <>
##$DBPNAM2= <>
##$DBPNAM3= <>
##$DBPNAM4= <>
##$DBPNAM5= <>
##$DBPNAM6= <>
##$DBPNAM7= <>
##$DBPOAL= (0..7)
0.5 0.5 0.5 0.5 0.5 0.5 0.5 0.5 
##$DBPOFFS= (0..7)
0 0 0 0 0 0 0 0 
$$ [...]
##$SUBNAM2= <"">
##$SUBNAM3= <"">
##$SUBNAM4= <"">
##$SUBNAM5= <"">
##$SUBNAM6= <"">
##$SUBNAM7= <"">
##$SUBNAM8= <"">
##$SUBNAM9= <"">
##$SW= 369.568048894756
##$SWIBOX= (0..15)
0 1 3 0 0 0 0 0 0 0 0 0 0 0 0 0 
##$SW_h= 29940.119760479
##$TD= 32768
##$TD0= 1
##$TE= 0
##$TE2= 300
##$TE3= 300
##$TEG= 300
##$TL= (0..7)
0 120 53 12 22 120 120 120 
##$TP= (0..7)
150 150 150 150 150 150 150 150 
##$TP07= 0
##$TPNAME0= <>
##$TPNAME1= <>
##$TPNAME2= <>
##$TPNAME3= <>
##$TPNAME4= <>
##$TPNAME5= <>
##$TPNAME6= <>
##$TPNAME7= <>
##$TPOAL= (0..7)
0.5 0.5 0.5 0.5 0.5 0.5 0.5 0.5 
##$TPOFFS= (0..7)
0 0 0 0 0 0 0 0 
##$TUNHIN= 0
##$TUNHOUT= 0
##$TUNXOUT= 0
##$USERA1= <user>
##$USERA2= <user>
##$USERA3= <user>
##$USERA4= <user>
##$USERA5= <user>
##$V9= 5
##$VALIST= <valist>
##$VCLIST= <CCCCCCCCCCCCCCC>
##$VD= 0
##$VDLIST= <DDDDDDDDDDDDDDD>
##$VPLIST= <PPPPPPPPPPPPPPP>
##$VTLIST= <TTTTTTTTTTTTTTT>
##$WBST= 1024
##$WBSW= 4
##$XGAIN= (0..3)
0 0 0 0 
##$XL= 0
##$YL= 0
##$YMAX_a= 82703
##$YMIN_a= -88474
##$ZGOPTNS= <>
##$ZL1= 120
##$ZL2= 120
##$ZL3= 120
##$ZL4= 120
##$ABSF1= 0
##$ABSF2= 0
##$ABSG= 0
##$ABSL= 0
##$ALPHA= 0
##$AQORDER= 0
##$ASSFAC= 0
##$ASSFACI= 0
##$ASSFACX= 0
##$ASSWID= 0
##$AUNMP= <proc_1d>
##$AZFE= 0.1
##$AZFW= 0.5
##$BCFW= 0
##$BC_mod= 2
##$BYTORDP= 0
##$COROFFS= 0
##$CY= -3
##$DATMOD= 1
##$DC= 0
##$DFILT= <>
##$DTYPP= 0
##$F1P= 0
##$F2P= 0
##$FCOR= 1
##$FTSIZE= 65536
##$FT_mod= 6
##$GAMMA= 0
##$GB= 0
##$INTBC= 1
##$INTSCL= 5.30512e-09
##$ISEN= 30
##$LB= 1
##$LEV0= 0
##$LPBIN= 0
##$MAXI= 10000
##$MC2= 0
##$MEAN= 0
##$ME_mod= 0
##$MI= 50
##$NCOEF= 0
##$NC_proc= -4
##$NLEV= 6
##$NOISF1= 182.463
##$NOISF2= 159.3651
##$NSP= 0
##$NTH_PI= 0
##$NZP= 0
##$OFFSET= 182.463
##$PC= 4
##$PHC0= -2534.228
##$PHC1= 78.19916
##$PH_mod= 1
##$PKNL= yes
##$PPARMOD= 0
##$PSCAL= 0
##$PSIGN= 0
##$REVERSE= no
##$SF= 81.0140089999434
##$SI= 65536
##$SIGF1= 159.3651
##$SIGF2= -187.1042
##$SINO= 113.3802
##$SIOLD= 16384
##$SREGLST= <1H.CDCl3>
##$SSB= 0
##$STSI= 65536
##$STSR= 0
##$SW_p= 29940.119760479
##$SYMM= 0
##$S_DEV= 0
##$TDeff= 32768
##$TDoff= 0
##$TI= <>
##$TILT= no
##$TM1= 0
##$TM2= 0
##$TOPLEV= 0
##$USERP1= <user>
##$USERP2= <user>
##$USERP3= <user>
##$USERP4= <user>
##$USERP5= <user>
##$WDW= 1
##$XDIM= 65536
##$YMAX_p= 361340175
##$YMIN_p= -2329242
$$ End of Bruker specific parameters
$$ ---------------------------------
##NTUPLES= NMR SPECTRUM
##VAR_NAME=  FREQUENCY,     SPECTRUM/REAL,   SPECTRUM/IMAG
##SYMBOL=    X,             R,               I
##VAR_TYPE=  INDEPENDENT,   DEPENDENT,       DEPENDENT
##VAR_FORM=  AFFN,          ASDF,            ASDF
##VAR_DIM=   65536,         65536,           65536
##UNITS=     HZ,            ARBITRARY UNITS, ARBITRARY UNITS
##FACTOR=    0.456856943014862, 1,           1
##FIRST=     14782.0589164792, 0,            0
##LAST=      -15158.0608439998, 0,           0
##MIN=       -15158.0608439998, -2329242,    0
##MAX=       14782.0589164792, 361340175,    0
$$ Real data points
##PAGE= N=1
##DATA TABLE= (X++(R..R)), XYDATA
$$ [...]
36540c59588k19116J18196K93156P1544p3736J49019K54339j42151n29747l08845
$$ -359588 -578704 -460508 -167352 -95808 -169544 -20525 233814 91663 -438084 -746929
36530g46929J81764K45220l3661q2129J02014R1601l9438J23221L89143J58279
$$ -746929 -565165 -319945 -353606 -435735 -333721 -242120 -281558 -158337 230806 389085
36520C89085m32734n27820J07498O45607M09880k21578n10004l40126r0514J2268
$$ 389085 -43649 -571469 -463971 181636 591516 369938 -140066 -480192 -570706 -558438
36510e58438L366m0754k7898J07297K21342R3970j64835j79814J17737L49112
$$ -558438 -555072 -595826 -623724 -516427 -295085 -201115 -365950 -545764 -428027 -78915
36500g8915K38447n5388k73453l61773l24424j32044J01573J88268J87317K95662
$$ -78915 159532 104144 -169309 -531082 -855506 -987550 -885977 -697709 -510392 -214730
36490b14730L85457J16264m01190n76499j76405K95506L20112L3780j16865j7964
$$ -214730 170727 286991 -114199 -690698 -867103 -571597 -251485 -217705 -334570 -352534
36480c52534J28280J73189R2562r2363k64881k78709j67631o0050R8220L84485
$$ -352534 -224254 -51065 41497 -50866 -315747 -594456 -762087 -822137 -723917 -339432
36470c39432N24049J89975l22772l54222R2070K83759p0465l53400r6930K68734
$$ -339432 184617 374592 51820 -302402 -210332 73427 2962 -350438 -447368 -178634
36460a78634K36927P1359J84488L08201M0212l03087k00948J03619K174l93020
$$ -178634 58293 129652 314140 622341 662553 359466 158518 262137 264311 -128709
36450a28709m25226l546K94619J88641O7k5474o699J1130J40431K42279M7987
$$ -128709 -553935 -557481 -262862 -74221 -74154 -99628 -106327 -95197 45234 287513 335500
36439C35500k51486j59334K86517M48115K8831m97120o10952l85985j55948j1657
$$ 335500 84014 -75320 211197 659312 688143 191023 -419929 -805914 -961862 -973519
36429i73519R4865J17373M9622J0230J0053r7660l08221l92305k42290j0105J78460
$$ -973519 -878654 -761281 -711659 -701429 -691376 -789036 -1097257 -1489562 -1731852 -1741957 -1563497
36418a563497L42443M16287K48729o5075j81553L3265L20370L87433J91302j56468
$$ -1563497 -1221054 -804767 -556038 -621113 -802666 -769401 -449031 -61598 129704 -26764
36408b6764m60610m36087p343L95487K76041j76666k75236J57848N23722L56694
$$ -26764 -487374 -923461 -930804 -535317 -259276 -435942 -711178 -553330 -29608 327086
36398C27086n5861k26210j27884J7071J56909K65731J83037n3644r5416J58883
$$ 327086 271225 45015 -82869 -65798 91111 356842 539879 486235 390819 549702
36388E49702K89532J3072l13427k98573k03925m41909p24232m18145L89668Q90840
$$ 549702 839234 852306 538879 240306 36381 -405528 -1129760 -1547905 -1158237 -267397
36378b67397O54254J17820j43509j00883j1534O1477J55734J46471q1467l48779
$$ -267397 386857 504677 361168 260285 248751 310228 465962 612433 530966 182187
36368A82187l58122j11467O8779l9053k66893k73512J6139L01357K67910k8877
$$ 182187 -175935 -287402 -218623 -257676 -524569 -798081 -781942 -480585 -212675 -241552
36358b41552k39822j34633J80048M33747M49716K33470n4704k03582j52587p6507
$$ -241552 -481374 -616007 -435959 -2212 447504 680974 626270 422688 270101 193594
36348A93594j38203k22984j19119J10351K10273J42795Q9204O4426p9494k41217
$$ 193594 55391 -167593 -286712 -176361 33912 176707 265911 330337 250843 9626
36338I626j26091J74841J77061j98084l51876Q2993N53315L47641l02043n20755
$$ 9626 -116465 58376 235437 37353 -314523 -231530 321785 669426 367383 -153372
36328a53372m3776M61417L70321j29525m29559l00357m7745j1066j15612q714
$$ -153372 -197148 264269 634590 505065 75506 -224851 -272596 -283662 -399274 -407988
36318d07988L66990N23504K3477p63579r60728l35284L58329M24021P8383j12755
$$ -407988 -40998 482506 505983 -257596 -1218324 -1553608 -1195279 -771258 -692875 -805630
36308h05630j04958j33551p8698K31731M30785R5299m00163l20773K47646M93123
$$ -805630 -910588 -1044139 -1122837 -891106 -460321 -365022 -765185 -1085958 -838312 -345189
36298c45189J57617j35356K4241K49528J57224q628M7590J16070n4378k65474
$$ -345189 -187572 -322928 -298687 -49159 108065 99437 147027 263097 208719 -56755
36288e6755k77820k42699l08316k46282Q7016L42340K15257J7538J89552N41471
$$ -56755 -334575 -577274 -885590 -1131872 -1044856 -702516 -487259 -469721 -280169 261302
36278B61302N23925N9607l97373n07856l27844o0168R8513q190k75030l10384
$$ 261302 785227 844834 447461 -60395 -388239 -448407 -349894 -358084 -633114 -943498
36268i43498L7590L46572J84779k29918l71218j71198M8964J92736L54041L47061
$$ -943498 -905908 -559336 -374557 -604475 -975693 -1146891 -1097927 -905191 -551150 -204089
36258b04089n4627m81817l07257L23494N52943R1318l25777j09030K83534J65626
$$ -204089 -258716 -740533 -1047790 -724296 -171353 -80035 -405812 -514842 -231308 -65682
36248f5682k52923k75524J15308K76267k8204k95985j21166K24329K69474m258
$$ -65682 -318605 -594129 -478821 -202554 -230758 -526743 -647909 -423580 -154106 -158364
36238a58364k57246k82476j50350J107J10800J64470J50178O7771m3963j07252
$$ -158364 -415610 -698086 -848436 -847329 -736529 -572059 -421881 -354110 -398073 -505325
36228e05325p8003l0054p4453j53332n6500K52059M83682L78150P2928j02111
$$ -505325 -583328 -613382 -687835 -841167 -897667 -645608 -161926 216224 289152 187041
36218A87041q7131p9990j35270r6187O5680J60054R8811K3399K0671j1607j00358
$$ 187041 99910 19920 -115350 -211537 -145857 14197 113008 136407 157078 145471 45113
36207D5113p8715J10499K53791J91200N2923k4579j51142l96126n10652k73579
$$ 45113 -33602 76897 330688 521888 574811 550232 399090 2964 -507688 -781267
36197g81267Q2772J68531K1299k790J58086J95472k3086k43117k50324j57577
$$ -781267 -698495 -529964 -508665 -511455 -353369 -157897 -180983 -424100 -674424 -832001
36187h32001j37311j57801j17919o562J68074L75189M26891J29161l39485m97734
$$ -832001 -969312 -1127113 -1245032 -1251594 -1083520 -708331 -281440 -152279 -491764 -989498
36177i89498j54412L27629N02439L28685N8545r3820l0824K05728L40375Q6137
$$ -989498 -1143910 -816281 -313842 14843 73388 -20432 -51256 154472 494847 580984
36167E80984l80484n03343j08925K87200K15541q5669j15563J32128L13533L46941
$$ 580984 200500 -302843 -411768 -124568 90973 5304 -110259 21869 335402 682343
36157F82343L56051K12345k79546q24724q50537l15963J95077K67269Q7622m414
$$ 682343 1038394 1250739 971193 146469 -704068 -1020031 -824954 -557685 -470063 -474477
36147d74477M2602J41000K55920K84275Q5596k17047k95439j11840r623j54880
$$ -474477 -431875 -290875 -34955 249320 334916 117869 -177570 -289410 -299033 -453913
36137d53913k66182j24910K4518q9811k50755q9524K64559L46360J10172K8634
$$ -453913 -720095 -845005 -820487 -910298 -1161053 -1250577 -986018 -639658 -529486 -500852
36127e00852L07315M55934O934o21316n37624L15997Q72111L33468o18513o96278
$$ -500852 -193537 262397 269331 -351985 -889609 -573612 298499 631967 13454 -682824
36117f82824J46454O44271J11418n84733m54430J10273J35643k87259k74513K57078
$$ -682824 -536370 107901 219319 -365414 -819844 -709571 -573928 -861187 -1135700 -878622
36107h78622M71985R6062j40697J88906M89347J92875l20429m17466j64969j5748
$$ -878622 -406637 -310575 -451272 -262366 226981 419856 99427 -318039 -483008 -498756
36097d98756o0014j20868j77051k31895j39967O2360O9615j21894o1453L70415
$$ -498756 -558770 -679638 -856689 -1088584 -1228551 -1166191 -1096576 -1218470 -1279923 -909508
36087i09508O02101K67419j30779m1384K09381J8735m32543n05563j56158J21168
$$ -909508 -307407 -39988 -170767 -212151 -2770 15965 -416578 -922141 -1078299 -957131
36077i57131J64304K01879K26349N7145j02890Q9605M09796L25626q9305k40083
$$ -957131 -792827 -590948 -364599 -307454 -410344 -320739 89057 414683 325378 85295
36067H5295m146J05308j48186l64265k28893L2194J29524J03990N7211l8283j07346
$$ 85295 81149 186457 38271 -325994 -554887 -522693 -393169 -289179 -231968 -270251 -377597
36056c77597J2596K18617K28711P1513L4912J05571k5742l53546m94253l17514
$$ -377597 -365001 -146384 82327 153840 188752 294323 268581 -84965 -579218 -896732
36046h96732j13740m7982K0171R6056o256j85765r7049K25827L72690K64954K18868
$$ -896732 -1010472 -1058454 -1038283 -942227 -948483 -1134248 -1231297 -1005470 -632780 -367826 -148958
36035a48958K29229n7193n06441m76704R2188M33044J84392j3968L12133N87821
$$ -148958 80271 23078 -483363 -960067 -867879 -434835 -250443 -264411 47722 635543
36025F35543J94627m06844m23488r004J15740j09439j54103Q4932K11626J21170
$$ 635543 830170 423326 -162 -9166 106574 -2865 -156968 -72036 139590 260760
36015B60760P5379Q5438p0922k91448k63344o5898m9422j97490k04556q3715q4004
$$ 260760 336139 421577 350655 59207 -204137 -270035 -319457 -516947 -721503 -805218 -889222
36004h89222j12853J03394L64428J98783k90219m73624j36815K89170M83095N37487
$$ -889222 -1002075 -898681 -534253 -335470 -625689 -1099313 -1236128 -946958 -463863 73624
35994G3624M36220k4225o05249o55738p2494M29645L47802N6082M1037J03762
$$ 73624 509844 485619 -119630 -775368 -847862 -418217 -70415 -14333 26704 130466
35984A30466j27721m07237k52242J98983L63429J00880j53630j08458M0248M2325
$$ 130466 2745 -404492 -656734 -457751 -94322 6558 -147072 -255530 -215282 -172957
35974a72957m0957l9814M3568J09056J34906J46850J11180k7410k26605l40533
$$ -172957 -213914 -253728 -210160 -101104 33802 180652 291832 264422 37817 -302716
35964c02716k64905o4914R5412J50614J68883J67669N0259j74743k87675j49926
$$ -302716 -567621 -632535 -537123 -386509 -217626 -49957 302 -174441 -462116 -612042
35954f12042N5237R5369N1687J42236L24743L93428L47377K99173J33745k98561
$$ -612042 -556805 -461436 -409749 -267513 57230 450658 798035 1097208 1230953 932392
35944I32392p17532o61430k24451O745j34064j34747K93705O45178L75637k24213
$$ 932392 214860 -446570 -671021 -664276 -798340 -933087 -639382 5796 381433 157220
35934A57220m39945j34565J86460J66687l2272j32057j02968n3798k4893J5947
$$ 157220 -282725 -417290 -230830 -64143 -96415 -228472 -331440 -385238 -410131 -394184
35924c94184R9332K04807K41551J47561L1222N6212J46260M1571k57627l94699
$$ -394184 -294852 -90045 151506 299067 330289 386501 532761 574332 316705 -77994
35914g7994j82303O5597j7653l20992m68891l54719j43203Q1313L20526M41503
$$ -77994 -260297 -194700 -212353 -533345 -1002236 -1356955 -1500158 -1418845 -1098319 -656816
35904f56816L08428P6632L2837J71124K14732L6323k09403l47923l28361j40065
$$ -656816 -348388 -271756 -238919 -67795 146937 183260 -26143 -374066 -702427 -842492
35894h42492J54620L29726K01942p3928j58172K6661K30288K44219J06925m4424
$$ -842492 -687872 -358146 -156204 -230132 -388304 -361643 -131355 112864 219789 175365
35884A75365r8203K4511K44051K56995j08037n12242m45662L8281L31587J22312
$$ 175365 77162 101673 345724 602719 494682 -17560 -463222 -424941 -93354 28958
35874B8958j79348q8190K54017L58197J11794j61911k40503k21096k16078j65342
$$ 28958 -150390 -238580 15437 373634 485428 323517 83014 -138082 -354160 -519502
35864e19502l8969K6178n9553j44447k4530K37065L44089J45545j51056k45015
$$ -519502 -558471 -532293 -591846 -736293 -760823 -523758 -179669 -34124 -185180 -430195
35854d30195j40607j05078k18674j98129J61254N52300M79659j7045l22991o2984
$$ -430195 -570802 -675880 -894554 -1092683 -931429 -379129 100530 83485 -239506 -302490
35844c02490L63013L33418j25668m09085k12202Q3619M0816j92368j84164O8119
$$ -302490 60523 393941 268273 -140812 -353014 -269395 -228579 -420947 -605111 -536992
35834e36992J54086o0646k07699k5723J98067R8969j50426j21649J36699J55594
$$ -536992 -382906 -443552 -651251 -676974 -478907 -379938 -530364 -652013 -515314 -359720
35824c59720j58441l17199l4997K65132R9433k80764k38030K74772O17479L74391
$$ -359720 -518161 -835360 -870357 -605225 -505792 -786556 -1024586 -749814 -132335 242056
35814B42056j01599k42226k0963J22389o0166l32297l36477n3182J97952J58129
$$ 242056 140457 -101769 -122732 -343 -60509 -392806 -729283 -782465 -584513 -426384
35804d26384o3667j35157Q0214L48318L49416M9054k95254m31262l20839r7282
$$ -426384 -490051 -625208 -544994 -196676 152740 201794 -93460 -524722 -845561 -942843
35794i42843Q3044J53129J65962K10772K81291K75974J45628l9872j96991l00015
$$ -942843 -859799 -706670 -540708 -329936 -48645 227329 372957 333085 136094 -163921
35784a63921l20562k26122q0317N336O3071K20137L98173L19824m4863l14885
$$ -163921 -484483 -710605 -790922 -785586 -722515 -502378 -104205 215619 170756 -144129
35774a44129k07368L8671L3291j84444k76919j56857l1033J2996Q9705K12888
$$ -144129 -351497 -312826 -279535 -463979 -740898 -897755 -928788 -915792 -826087 -613199
35764f13199K43830J40131j6905j93392l31306k26730J68727M54333K37357j98258
$$ -613199 -369369 -229238 -246143 -439535 -770841 -997571 -828844 -374511 -137154 -335412
35754c35412k10004K19516M15947N5789l40819k39887J34039K47681M1711j73902
$$ -335412 -545416 -325900 90047 145836 -194983 -434870 -300831 -53150 -11439 -185341
35744a85341k66437k75113j26177J92444L63946R7323l66621n10848k29201J11403
$$ -185341 -451778 -726891 -853068 -660624 -296678 -199355 -565976 -1076824 -1306025 -1194622
35734a194622K32751J97407J20414J767r2031O335K93935M98450L68373m2565
$$ -1194622 -961871 -764464 -644050 -642283 -734314 -727979 -434044 64406 432779 390214
35724C90214m29742n08915k50622Q4425J88196L5480j21969j30055j16455j94087
$$ 390214 -39528 -548443 -799065 -714640 -526444 -490964 -612933 -742988 -859443 -1053530
35714a053530k07004J7334L33637M37463K49727n2405k61574k21072J29821N58681
$$ -1053530 -1260534 -1243200 -909563 -472100 -222373 -274778 -536352 -757424 -627603 -68922
35704f8922N99174J13207l97563m03684r6094p6109m12048n47439j91289K43469
$$ -68922 530252 643459 245896 -157788 -253882 -329991 -742039 -1289478 -1480767 -1237298
35694a237298K92119P7782L3J09370J34341m7277k68345l28340j74827J20571
$$ -1237298 -945179 -867397 -867364 -757994 -623653 -670930 -939275 -1267615 -1442442 -1321871
35684a321871M06208N07253L63458J00796q8890j08214J1843J53520J73727K6882
$$ -1321871 -915663 -408410 -44952 55844 -33046 -141260 -129417 24103 197830 224712
35674B24712j49214j70732m7235K6262o7913k33685l10754k45566q7611P9948
$$ 224712 75498 -95234 -142469 -116207 -184120 -417805 -728559 -974125 -1061736 -981788
35664i81788J84786K24546K67780L14129K30403k6871k17119p7663K56158L63064
$$ -981788 -797002 -572456 -304676 9453 239856 212985 -4134 -81797 174361 537425
35654E37425R7253k32593l24137k52174k31851k42254j02703J97697M44193M34733
$$ 537425 634678 402085 77948 -174226 -406077 -648331 -751034 -553337 -109144 325589
35644C25589J62464k01572m35412m21520k32655m0226N9920Q2793O4311M3040
$$ 325589 488053 286481 -148931 -570451 -803106 -843332 -783412 -700619 -636308 -593268
35634e93268R2456K34831L43032K66761M0575j63912k55735k56974j85753p6057
$$ -593268 -500812 -265981 77051 343812 384387 220475 -35260 -292234 -477987 -554044
35624e54044l4670q6553o8044R7977J64756q7352m04017l64755l3755J74477K11010
$$ -554044 -588714 -675267 -743311 -645334 -480578 -567930 -971947 -1336702 -1370457 -1195980 -984970
35613i84970L90167O48690M91856j21018n19459k99994O4103L4281j66509r6378
$$ -984970 -594803 53887 545743 424725 -94734 -394728 -330625 -296344 -462853 -559231
35603e59231P2871n1925k79342j70067J23716J37414j0762J53582M61726K57338
$$ -559231 -486360 -538285 -817627 -987694 -863978 -726564 -737326 -583744 -122018 135320
35593A35320l91134n87088J1463N94568M43676j1229n837L10200K14272l66711
$$ 135320 -255814 -842902 -831439 -236871 206805 195576 189739 499939 714211 347500
35583C47500p66516n93115j50116J63537K91963K78468J01675q5920K746L04619
$$ 347500 -419016 -1012131 -1162247 -998710 -706747 -428279 -326604 -412524 -409778 -105159
35573a05159L51211l8974l69548j43209L33924L21229k63152o64439l52446K37223
$$ -105159 246052 207078 -162470 -305679 28245 349474 86322 -578117 -930563 -693340
35563f93340L75000P3795o8054J27923K01251j01051l74940k39793M0544M3110
$$ -693340 -318340 -244545 -312599 -184676 16575 -84476 -459416 -699209 -658665 -615555
35553f15555r3826M0333L68055M34240J81103L0579J55508K16682j9765k86154
$$ -615555 -709381 -669048 -300993 133247 314350 344929 500437 717119 697354 411200
35543D11200k79233j37522j60050l18080l30772o2268L58555O71955O22612J68696
$$ 411200 131967 -5555 -165605 -483685 -814457 -876725 -518170 153785 776397 945093
35533I45093l21196l37544J24207M44078J36507n03532p97647n45185j56436j2853
$$ 945093 623897 286353 410560 854638 991145 487613 -310034 -855219 -1011655 -1024508
35523a024508l2087P9651L75201N87156M39071j4532l94018m00349j55581J7947
$$ -1024508 -1056595 -976944 -601743 -14587 424484 409952 15934 -384415 -539996 -522049
35513e22049Q5237K65305N04079M04960j14480n00273k60060K99763M61882N6129
$$ -522049 -436812 -171507 332572 737532 623052 122779 -137281 162482 624364 680493
35503F80493m07568m93379k98166j25416p2427n3345K1224J83369L57083L53075
$$ 680493 272925 -220454 -518620 -644036 -716463 -769808 -748584 -565215 -208132 144943
35493A44943Q8020k24275l08492k01095j37057j25904K5160K62314K48428r6923
$$ 144943 232963 8688 -299804 -500899 -637956 -763860 -738700 -476386 -227958 -324881
35483c24881l73135k41143P3941J02835k01478m09050j95257K56459N02274L62410
$$ -324881 -698016 -939159 -865218 -762383 -963861 -1372911 -1568168 -1311709 -809435 -447025
35473d47025Q8623Q811J02375O7153j86801l28782n9989L99158N47386K52878
$$ -447025 -358402 -349591 -247216 -180063 -366864 -695646 -755635 -356477 190909 443787
35463D43787j24860k48395j46805j9096K1509n2809j74128j19593K42222N95702
$$ 443787 318927 70532 -76273 -95369 -73860 -126669 -300797 -420390 -178168 417534
35453D17534M40166j66693n42500k95518J09209O5266k64595k66771J25253L48294
$$ 417534 857700 691007 148507 -147011 -37802 27464 -237131 -503902 -378649 -30355
35443c0355R0931l02356m16585k79475j04309P2562K43874K42906j631k39919
$$ -30355 60576 -241780 -658365 -937840 -1042149 -969587 -725713 -482807 -484438 -724357
35433g24357k05915J3388J59365J93764K39984K66791J42221o1241j23777k5031
$$ -724357 -930272 -916884 -757519 -563755 -323771 -56980 85241 24000 -99777 -124808
35423a24808N7598Q6100J62788J67738j85274p61420r05133k81241N14252O59727
$$ -124808 -67210 18890 181678 349416 164142 -597278 -1502411 -1783652 -1269400 -609673
35413f09673K23597O578L06901M87846Q747o72287o94298J6741O63289N95116
$$ -609673 -386076 -379498 -72597 415249 423996 -248291 -942589 -925848 -262559 332557
35403C32557p114m85894m18839Q2004N31544M66027j31148p47781q37100l96780
$$ 332557 325443 -160451 -579290 -497286 34258 500285 369137 -378644 -1215744 -1612524
35393a612524R5656K71543J72260L775j10481q2735J38389L98960M14170J45644
$$ -1612524 -1516868 -1245325 -1073065 -1069290 -1179771 -1262506 -1124117 -725157 -310987 -165343
35383a65343j10070j35173n9728o4082o6863O0676J91209J44698L3209P2177J49439
$$ -165343 -275413 -410586 -470314 -534396 -601259 -540583 -349374 -204676 -171467 -99290 50149
35372E0149l7477m12592m88607m8289M74520N47616K40063M3406J15832J03920
$$ 50149 12672 -399920 -888527 -936816 -462296 85320 325383 368789 484621 588541
35362E88541k18091n21277m07221o3593k8955l72422n55058k23610K75645M39809
$$ 588541 370450 -150827 -558048 -621641 -650596 -1023018 -1578076 -1801686 -1526041 -1086232
35352a086232L11234K45273K40051J0257l73873m74712j77008J16729J36500J17612
$$ -1086232 -774998 -529725 -289674 -279417 -653290 -1128002 -1305010 -1188281 -1051781 -934169
35342i34169K84039M04624K17805n5971n0014J41596J36987q8831j71085N5872
$$ -934169 -650130 -245506 -27701 -83672 -133686 7910 144897 56066 -115019 -59147
35332e9147L16854K98879J0869l26138n25086m99235k58223O8417K80543K38287
$$ -59147 257707 556586 567455 241317 -283769 -783004 -1041227 -972810 -692267 -453980
35322d53980l0913k98878k61805J24667M59422L17188j26670k69739K3586J94285
$$ -453980 -484893 -783771 -1045576 -920909 -461487 -144299 -270969 -540708 -517122 -322837
35312c22837q9336l35102l3882M31664L66166j00363k64087n7684j02829n07034
$$ -322837 -412173 -747275 -781157 -349493 16673 -83690 -347777 -405461 -508290 -1015324
35302a015324n37911J78006R24906Q76448K32108j80630m7824K32814K59977M3805
$$ -1015324 -1553235 -1375229 -450323 426125 658233 477603 429779 662593 922570 966375
35292I66375j96336k92024k10990p5733l2198l8802K9131N9858j62803m50777
$$ 966375 770039 478015 267025 191292 159094 120292 149423 209281 46478 -404299
35282d04299l13173K39023N14826J21582l73108k50279K91096M67307N4735m17216
$$ -404299 -717472 -478449 36377 157959 -215149 -465428 -174332 292975 347710 -69506
35272f9506n03730l01562q1503M2272L5390o6564o2939J88111M78688N01068L02897
$$ -69506 -573236 -874798 -956301 -914029 -878639 -945203 -1008142 -820031 -341343 159725 462622
35261D62622J41229J2750k28384l98555j79793K27207K42284j89928m24508p7595
$$ 462622 603851 616601 388217 -10338 -190131 37076 279360 89432 -335076 -412671
35251d12671L83431L63345k696j66085k7993J4369k41333n12403m59213r5939
$$ -412671 -29240 334105 331409 165324 137331 151700 -89633 -602036 -1061249 -1157188
35241a157188K95040M61346L32949K0184k57441l02434q2955K16117L10085P6954
$$ -1157188 -862148 -400802 -67853 -47669 -305110 -607544 -690499 -474382 -164297 -87343
35231h7343k53238k87524N2835L72704K72211j54126m83057m91368k70118M7682
$$ -87343 -340581 -628105 -575270 -202566 69645 -84481 -567538 -1058906 -1329024 -1281342
35221a281342L40739L85438R2672j80137j320M30331M56330n1465m20071j59175
$$ -1281342 -940603 -555165 -462493 -642630 -643950 -213619 242711 191246 -228825 -388000
35211c88000L04388K90648j51795m40337l49491j47845M280K13565M07498K76207
$$ -388000 -83612 207036 55241 -385096 -734587 -882432 -878152 -664587 -257089 19118
35201A9118j83952n04924l58718m659J40711J07662J98328L75544K70554j57738
$$ 19118 -164834 -669758 -1028476 -1033135 -892424 -784762 -586434 -210890 59664 -98074
35191i8074m04699j21563K78266J33739m81118p94447m13054J60052L20734J77397
$$ -98074 -502773 -624336 -346070 -212331 -693449 -1487896 -1900950 -1740898 -1420164 -1242767
35181a242767J55805K18754O6895j58588n5408K68978L02744J3921p5215J92938
$$ -1242767 -1086962 -868208 -801313 -959901 -1015309 -746331 -443587 -429666 -504881 -311943
35171c11943L38609J19684l6283J62546L05408R123l56416k48010J88610M15344
$$ -311943 26666 146350 110067 272613 578021 587144 230728 -17282 171328 586672
35161E86672L01270P1731k02444m90297m87711l3805M10405L18734q0150j70105
$$ 586672 887942 959673 757229 266932 -220779 -254584 155821 474555 394405 224300
35151B24300O3633J01954j76647l54652k49297j36907j44155n0430J99062L49722
$$ 224300 287933 389887 213240 -141412 -390709 -527616 -671771 -722201 -523139 -173417
35141a73417L03648K15517Q6186k01566m41566l04091J4099J2561k09412m6898
$$ -173417 130231 345748 431934 230368 -211198 -515289 -501190 -488629 -698041 -744939
35131g44939M96026O51373J21518m10863m26434l45077n69795o04584M2495P46865
$$ -744939 -248913 402460 523978 113115 -313319 -658396 -1228191 -1832775 -1790280 -1043415
35121a043415N63263k50165n24982J21529Q21256P70315K07534j67837j49869
$$ -1043415 -480152 -730317 -1255299 -1133770 -312514 457801 665335 497498 347629
35112C47629n4985j43028l08190k49229J39685N28396M44199r4531n09774m37958
$$ 347629 292644 149616 -158574 -407803 -268118 260278 704477 609946 100172 -337786
35102c37786k22381k86100m01851j32149L01643K87534j54394l49426l0277K73179
$$ -337786 -560167 -846267 -1248118 -1380267 -1078624 -791090 -945484 -1294910 -1325187 -1052008
35092a052008J16197k01217j87002J12143L24628L60113L95020M39913K89557
$$ -1052008 -935811 -1137028 -1324030 -1211887 -887259 -527146 -132126 307787 597344
35083E97344j23990n51585o35317k58941K68564M34782P5874l64474l52892L4648
$$ 597344 473354 -78231 -713548 -972489 -703925 -269143 -193269 -557743 -910635 -875987
35073h75987K58453J27283K6741K24030M10229K34233p7499o6944J92429J66476
$$ -875987 -617534 -490251 -463510 -239480 170749 404982 327483 260539 452968 619444
35063F19444l01948o74779m46769J09389K70294j55559n57849l74062J28079K72310
$$ 619444 317496 -357283 -804052 -694663 -424369 -579928 -1137777 -1511839 -1383760 -1111450
35053a111450j0500j00948L26805P78002O64500J18361l09819m16813l58707j84344
$$ -1111450 -1121950 -1222898 -896093 -118091 546409 664770 354951 -61862 -420569 -604913
35043f04913J15676K87457R7554j79776j14649J40226P9778k41164k41574J65938
$$ -604913 -489237 -201780 -104226 -284002 -398651 -258425 -178647 -419811 -661385 -495447
35033d95447L54460K6918k62376m1741K82998J24816l08126l78338l2685J96063
$$ -495447 -140987 -114069 -376445 -418186 -135188 -10372 -318498 -696836 -729521 -533458
35023e33458M3925k01922k37146r1309P5700J76133J63744N0779m8720o4289p7704
$$ -533458 -489533 -691455 -928601 -1019910 -944210 -768077 -604333 -553554 -602274 -666563 -744267
35012g44267j35075j05255Q4766K47863J91738J6994n4805M402P6109Q0373m1789
$$ -744267 -879342 -984597 -899831 -651968 -460230 -443236 -498041 -493639 -417530 -337157 -378946
35001c78946k92411m21654j20406L89132M15590j98588o37621k15917N28356N65596
$$ -378946 -671357 -1093011 -1213417 -824285 -408695 -607283 -1244904 -1460821 -932465 -366869
34991c66869j04044n06725j74180L04112L22489N0456r7682j11529j28841n7301
$$ -366869 -470913 -977638 -1151818 -847706 -525217 -474761 -572443 -683972 -812813 -870114
34981h70114J50738K42620M9378j92288k16724j31954j42768j51945K9901K87524
$$ -870114 -719376 -476756 -427378 -619666 -836390 -968344 -1111112 -1263057 -1233156 -945632
34971i45632L41908J65541o351r439P8797M2341k65145o94145p88259k48858N54526
$$ -945632 -603724 -438183 -444534 -453973 -375176 -332835 -597980 -1292125 -2080384 -2329242 -1774716
34960a774716Q59514M13042k16654l79949p6073K50923L31910K30995J20447J33797
$$ -1774716 -915202 -502160 -718814 -1098763 -1174836 -923913 -592003 -361008 -240561 -106764
34950a06764K66883K91750R191l32190k43898K36715M67621J52431j61054L9598
$$ -106764 160119 451869 461060 128870 -115028 121687 589308 741739 580685 620283
34940F20283L68364J70526l81443n63777k49117Q733k5706J5381K80331L51908
$$ 620283 988647 1159173 777730 213953 -35164 -26431 -52137 -36756 243575 595483
34930E95483P658l15567k09313N6407J3011k50901k84304O700K80362K97429J65800
$$ 595483 603141 287574 78261 134668 147679 -103222 -387526 -380826 -100464 196965 362765
34919C62765P0496M5123L2219k4822j68267l70517m90462l87891r0699K03882
$$ 362765 433261 478384 510603 485781 317514 -53003 -543465 -931356 -1022055 -818173
34909h18173K98812J76934L8129R7051K79686K52043r1464l43052r7013L69776
$$ -818173 -519361 -342427 -304298 -207247 72439 324482 233018 -110034 -207047 162729
34899A62729L79682j67621o04192m48708m8893M7833q4687k2171K36514L04976
$$ 162729 542411 374790 -229402 -678110 -727003 -679170 -763857 -786028 -549514 -244538
34889b44538P2294j70315k23387j69727q4441M9831J34695M1480q3942J9031K46491
$$ -244538 -172244 -342559 -565946 -735673 -820114 -770283 -635588 -594108 -678050 -659019 -412528
34878d12528K24941o3815k08697m7524N5928j54273l65633k14268J05708J66161
$$ -412528 -187587 -251402 -460099 -507623 -451695 -605968 -971601 -1185869 -1080161 -914000
34868i14000k2542j01424L7956J74262J91872J89723J79223N2987j16280r1390
$$ -914000 -936542 -1037966 -1000010 -825748 -633876 -444153 -264930 -211943 -328223 -419613
34858d19613J40812K93520J86720k5370j32527j41036j50030j53118r6605K887
$$ -419613 -278801 14719 201439 176069 43542 -97494 -247524 -400642 -497247 -494360
34848d94360J00751J73649J69299L2764j67591k67025k00588n8909O0565J25540
$$ -494360 -393609 -219960 -50661 -17897 -185488 -452513 -653101 -712010 -651445 -525905
34838e25905J08091J9885j0296J11012K37014J57813n0144j36712j13307k10128
$$ -525905 -417814 -397929 -408225 -297213 -60199 97614 47470 -89242 -202549 -412677
34828d12677l77469k76242J10106L33012J77625K2001J65155K78218N36l36308
$$ -412677 -790146 -1066388 -956282 -623270 -445645 -423644 -258489 19729 20265 -316043
34818c16043j90721K67889L97119R8308j00052L4753J24169q0255k70184j49892
$$ -316043 -506764 -238875 158244 256552 156500 191253 315422 235167 -35017 -184909
34808a84909Q2364J27275N5059P7447J66459J80594J18527J9957j51644l43823
$$ -184909 -102545 24730 79789 157236 323695 504289 622816 642773 491129 147306
34798A47306l76515k26910r6754o7338J0397J57188J64386J6400r46J61731J29594
$$ 147306 -229209 -456119 -552873 -620211 -609814 -452626 -288240 -271840 -272786 -111055 18539
34787A8539k30384m36214j30769K46683J05890l20168l22675J56035M58077K44793
$$ 18539 -211845 -648059 -778828 -532145 -426255 -746423 -1069098 -913063 -454986 -210193
34777b10193q3648j12543M1693J10702R6784N9526j18016m59420o72142m67702
$$ -210193 -293841 -406384 -364691 -253989 -157205 -97679 -215695 -675115 -1347257 -1814959
34767a814959N2644N03636N90624L16462l2753j00127J55172L28926Q7149k77433
$$ -1814959 -1762315 -1258679 -668055 -351593 -384346 -484473 -329301 -375 86774 -190659
34757a90659k02710K52126L92912q6071n90943m59474J25267M72170L28548K4715
$$ -190659 -393369 -141243 251669 165598 -425345 -884819 -759552 -287382 41166 65881
34747F5881j46774k13990k21184p6911J87839L14113J28163j99012l32959j48535
$$ 65881 -80893 -294883 -516067 -592978 -405139 -91026 37137 -161875 -494834 -643369
34737f43369J49654K57031R1360j31091j62300j2430J20371J46580J28457N6302
$$ -643369 -493715 -236684 -145324 -276415 -438715 -451145 -330774 -184194 -55737 565
34727E65j49737l56110k45102J94286M85744K49566k39796m03768j36673J22922
$$ 565 -149172 -505282 -750384 -556098 -70354 179212 -60584 -464352 -601025 -478103
34717d78103N8548j48928j83939k4337J46349K30815K33335J25005j03476l08592
$$ -478103 -419555 -568483 -752422 -776759 -630410 -399595 -166260 -41255 -144731 -453323
34707d53323k95861p0772J48880K13316K05570K38096K13756j6699l08205l03099
$$ -453323 -749184 -819956 -671076 -457760 -252190 -14094 199662 182963 -125242 -428341
34697d28341N0639L23262J49376k58495m18804k43140m7211j507K1584O2698k5244
$$ -428341 -377702 -54440 94936 -163559 -582363 -825503 -872714 -874221 -852637 -789939 -815183
34686h15183k06638k14743j8773P4809l0669k2703K13841K76755p0499l61544
$$ -815183 -1021821 -1236564 -1255337 -1180528 -1211197 -1233900 -1020059 -743304 -813803 -1175347
34676a175347j21687K86313K00877k11633j88360L30033N28618N4376l51070m0299
$$ -1175347 -1297034 -1010721 -809844 -1021477 -1209837 -879804 -351186 -296810 -647880 -688179
34666f88179M59163K86187l37997m47964R7315L67323j30275o02871j97671N94585
$$ -688179 -229016 57171 -280826 -728790 -631475 -264152 -394427 -997298 -1194969 -600384
34656f00384O03630k47554p88615l26784L81448L54421j55687k02928K96582N00536
$$ -600384 3246 -244308 -1032923 -1359707 -978259 -623838 -779525 -982453 -685871 -185335
34646a85335M9079m13243l45427r7399j56579l07296j25043K16017K71542Q5823
$$ -185335 -136256 -549499 -894926 -992325 -1148904 -1456200 -1581243 -1365226 -1093684 -1007861
34636a007861p745l0000j52614j39815K75655O70598M06733k54852l90716J65324
$$ -1007861 -1015606 -1045606 -1198220 -1338035 -1062380 -391782 14951 -239901 -630617 -465293
34626d65293N41248K10022k26897q3259L52758M00559M1804k54357l36900l71509
$$ -465293 75955 285977 59080 -24179 328579 729138 770942 516585 179685 -191824
34616a91824l41849j48355J8381o0606j94183r7396P2608J1858j25730L85K28562
$$ -191824 -533673 -682028 -663647 -724253 -918436 -1015832 -943224 -931366 -1057096 -1056711 -828149
34605h28149J27075j93339j98980J43144K94564J05106P9498M12438N06739n3893
$$ -828149 -701074 -894413 -1093393 -950249 -655685 -550579 -471081 -58643 448096 394203
34595C94203o65657n05224K10323M96117J0544m97463k77340M21329P35476K97072
$$ 394203 -271454 -776678 -566355 -70238 -59694 -557157 -834497 -413168 322308 619380
34585F19380l63051m81938N9396O22271N54245o2143n36456m04977Q5023L86790
$$ 619380 256329 -225609 -166213 456058 1010303 948160 411704 6727 91750 478540
34575D78540K92952j1914l05220m56334l50112R97L17373L11478O9346r1139j03462
$$ 478540 771492 759578 454358 -1976 -352088 -351091 -33718 277760 347106 255967 152505
34564A52505j63065k51484o9123M00800O64958L64831j45841k54130N5912K16833
$$ 152505 -10560 -262044 -331167 69633 734591 1099422 953581 699451 755363 972196
34554I72196j02659n90224p58360m87647j635M11912N23472K63621j27374k51490
$$ 972196 869537 279313 -479047 -966694 -968329 -556417 -32945 230676 103302 -148188
34544a48188j2725K55991K61426J17364N3629J1217j70031l50413k59130J5469
$$ -148188 -160913 95078 356504 473868 527497 538714 368683 18270 -240860 -225391
34534b25391R6874j06481k74007j94384m7490j8931J1937J58214K08780l3296
$$ -225391 -128517 -234998 -509005 -703389 -750879 -769810 -757873 -599659 -390879 -424175
34524d24175l03223j74487K59476M21604N2320l92765l57793P3072L60637K87881
$$ -424175 -727398 -901885 -642409 -220805 -168485 -561250 -919043 -845971 -485334 -197453
34514a97453J61742K04032J52383k51971o60103m65525K68321P15163L25114m29288
$$ -197453 -35711 168321 320704 68733 -591370 -1056895 -788574 -73411 251703 -177585
34504a77585o87188l02287J29766J97228J03148J28508J68292L5143j39164j15976
$$ -177585 -864773 -1167060 -1037294 -840066 -736918 -608410 -440118 -404975 -544139 -660115
34494f60115M7660R6614l4163j62342j29339M1505K12589K44730J03789p0012
$$ -660115 -612455 -515841 -550004 -712346 -841685 -800180 -587591 -342861 -239072 -309084
34484c09084q8961L7145J15450O7288J7550K5411k1582j20523m6023K57302M44992
$$ -309084 -398045 -360900 -245450 -178162 -160612 -135201 -156783 -277306 -323329 -66027 378965
34473C78965K26297j70677l19583k05809j40972j93534j34171P7005J85397J02236
$$ 378965 605262 434585 115002 -90807 -231779 -425313 -559484 -482479 -297082 -194846
34463a94846P1469K15639K61574l2610m24984m69254j40430J10539m0568l52677
$$ -194846 -123377 92262 353836 321226 -103758 -573012 -713442 -602903 -643471 -996148
34453i96148l29315J19186N24443M50343O4667r9328J28803L80289L31761J03775
$$ -996148 -1325463 -1206277 -681834 -231491 -166824 -266152 -137349 242940 574701 678476
34443F78476p9526k52415m46273m15287k9605L24977K19545j31016j76288R5585
$$ 678476 598950 346535 -99738 -515025 -544630 -219653 -108 -131124 -307412 -211827
34433b11827J75913r4963k99414j88710m8074j00209j12100R4726K51449J39383
$$ -211827 -35914 -130877 -430291 -619001 -667075 -767284 -879384 -784658 -533209 -393826
34423c93826L5874K25515M40364K79191r9995k27864p4509k5613k01664l09112
$$ -393826 -357952 -132437 307927 587118 487123 259259 184750 159137 -42527 -351639
34413c51639j71800M0284J65546K35903K33097L8072k55575l24574q5243J16913
$$ -351639 -523439 -483155 -317609 -81706 151391 189463 -66112 -390686 -475929 -359016
34403c59016p67k28417j97458L4407P8124j35842j69884K71638P65387O11374
$$ -359016 -359783 -588200 -785658 -751251 -673127 -808969 -978853 -707215 58172 669546
34393F69546j72037p15834l95429K89279L78031j94806n28630j06941M54428L80868
$$ 669546 497509 -218325 -613754 -324475 53556 -141250 -669880 -776821 -322393 58475
34383E8475j01812j95901K10601M45062J56459j84436q5858K24761K10577j78762
$$ 58475 -43337 -239238 -28637 416425 572884 388448 302590 527351 737928 559166
34373E59166m98463m26628q1798K12384K57407R2502q2755j06407l3169n3546
$$ 559166 60703 -365925 -447723 -235339 22068 114570 31815 -74592 -107761 -161307
34363a61307j94526k30371o1L02401L30524M6410k03784j39412P4312N8201k15471
$$ -161307 -355833 -586204 -586265 -283864 46660 93070 -110714 -250126 -175814 -117613 -333084
34352c33084l28030j1548L78445K99856j55163l12098J01616M86020K14866m22211
$$ -333084 -661114 -672662 -294217 5639 -149524 -461622 -360006 126014 340880 -81331
34342h1331o27791k35205J51783J25839k8176M5885K19490K46509K28478L16460
$$ -81331 -709122 -944327 -792544 -666705 -694881 -648996 -429506 -182997 45481 361941
34332C61941L01686k4323l35489j29438M50163O71790J86198n02752p27398m60359
$$ 361941 663627 639304 303815 174377 624540 1296330 1482528 979776 252378 -207981
34322b07981j59575o9404k6369J30993K91082K67142N5962j86596l03508k18646
$$ -207981 -367556 -436960 -463329 -332336 -41254 225888 281850 95254 -208254 -426900
34312d26900K1178K36101K60340J47967J00019J33075J1133l56165o49493n22734
$$ -426900 -405722 -169621 90719 238686 338705 471780 482913 126748 -522745 -1045479
34302a045479j18819J02599k499j35496p0633O2500J10153J57100K77663L27012
$$ -1045479 -1164298 -1061699 -1064198 -1199694 -1270327 -1207827 -1097674 -940574 -662911 -335899
34292c35899K01819N5665L5148M4221j2995k4412N3257J5644j90841k26745R0343
$$ -335899 -134080 -78415 -43267 954 -12041 -36453 16804 32448 -158393 -385138 -294795
34281b94795L31823P1115l38616k39364K61665M23849L6609l06509k05159J6655
$$ -294795 37028 108143 -230473 -469837 -208172 215677 252286 -54223 -259382 -242727
34271b42727J1464n1524J8098K4657j20107o9430L21529N47896J88468l43998
$$ -242727 -231263 -282787 -264689 -240032 -360139 -429569 -108040 439856 628324 284326
34261B84326l76594L4822K94930J89825M889r6914j94691j99277P6376M38199
$$ 284326 -92268 -57446 237484 427309 432198 335284 140593 -58684 17692 455891
34251D55891M43957P0404k18815j37582J04620K07768J18858r2307l34701m23183
$$ 455891 899848 970252 751437 613855 718475 926243 1045101 952794 618093 194910
34241A94910k40614j134j9373k17761k27889J4337J74252O0923j28878j76166
$$ 194910 -45704 -46838 -66211 -283972 -511861 -497524 -323272 -262349 -391227 -567393
34231e67393q4792Q5923K67444K49920p8815l59384j23150M28175N74774J31689
$$ -567393 -652185 -566262 -298818 -48898 -127713 -487097 -610247 -182072 392702 524391
34221E24391k72837j96911p274j32956l26853j97920L7155m8181l14281l03518
$$ 524391 251554 54643 47369 -85587 -412440 -610360 -573205 -621386 -935667 -1239185
34211a239185j967K39772L35281M33390M43299J82068j36748j54286l119r1428
$$ -1239185 -1241152 -1001380 -666099 -232709 210590 392658 255910 101624 98505 7077
34201G077l41856l05444J517R6902q0004n8368K16362J56918l83031o24519n6413
$$ 7077 -334779 -640223 -638706 -541804 -621808 -680176 -463814 -306896 -689927 -1314446 -1370859
34190a370859N91413L65780m14365o07411M2129O11466M54739L4951K339K14747
$$ -1370859 -779446 -413666 -828031 -1435442 -1393313 -781847 -327108 -292157 -289818 -75071
34180g5071J90974n943L1427K63828K52540o5526k25783K1645K92358J58061j81574
$$ -75071 115903 109960 141387 405215 657755 592229 366446 388091 680449 838510 656936
34169F56936j98973J43257L05765l2024m67278m17009O7698L86595K25889p4321
$$ 656936 457963 601220 906985 874961 407683 -9326 58372 444967 670856 596535
34159E96535r1557Q7949J03690r7876k58901k66805k46274k15013k9531K48546
$$ 596535 504978 592927 696617 598741 339840 73035 -173239 -388252 -417783 -169237
34149a69237L13247J15152L1515K55530L67414m9938o22006n90626M9242M52343
$$ -169237 144010 259162 290677 546207 913621 863683 241677 -348949 -299707 152636
34139A52636J12629m51077n34673k44964j33651k18052m7218L90904N38744J58477
$$ 152636 265265 -185812 -720485 -965449 -1099100 -1317152 -1364370 -973466 -434722 -276245
34129b76245k56389k21651P2229J80458R9555J13885K05749R7940k02436l40325
$$ -276245 -532634 -754285 -682056 -501598 -402043 -288158 -82409 15531 -186905 -527230
34119e27230j37090J58683K45798J47478Q6562J47387J95842P5378j94381m17742
$$ -527230 -664320 -505637 -259839 -112361 -25799 121588 317430 392808 198427 -219315
34109b19315m34550l19003k65969k65142q3896L15159N73766L93629P723j22376
$$ -219315 -653865 -972868 -1238837 -1503979 -1587875 -1272716 -698950 -305321 -297598 -419974
34099d19974L6047J03968p0233j97440n2989J84868K68999K38728K30318J94858
$$ -419974 -383927 -279959 -350192 -547632 -600621 -415753 -146754 91974 322292 517150
34089E17150M9225r0913q2826j9966p9097k05250j91858k7965O0044o6487k49455
$$ 517150 566375 475462 392636 372670 293573 88323 -103535 -131500 -71456 -137943 -387398
34078c87398k03869J57256N78119O56331K64504k40671l82182j41728M0403j02120
$$ -387398 -591267 -434011 144108 800439 1064943 824272 442090 300362 340765 238645
34068B38645l07970k27091N5755J94651Q6354q4048j68548j52995l7908J09739
$$ 238645 -69325 -296416 -240661 -46010 40344 -43704 -212252 -365247 -403155 -293416
34058b93416R5215j32115k66387l7072K93475K31434j89334m11410j79759J15814
$$ -293416 -198201 -330316 -596703 -633775 -340300 -108866 -298200 -709610 -889369 -773555
34048g73555J05877r457J06678L14722K40356q7010k77111j79468l3570k658O3281
$$ -773555 -667678 -677135 -570457 -255735 -15379 -102389 -379500 -558968 -592538 -595196 -531915
34037e31915K70031L93974J90661j79888k99894l6152K87667L17733Q7153j20064
$$ -531915 -261884 132090 322751 142863 -157031 -193183 94484 412217 499370 379306
34027C79306j77312j74853j39199K3124K47616K71403L8180j19023M6642K63177
$$ 379306 201994 27141 -112058 -88934 158682 430085 468265 349242 395884 659061
34017F59061J25210k43961l34174j2021K84958J81177j92638m93935n51566l27812
$$ 659061 784271 540310 206136 194115 479073 660250 467612 -26323 -577889 -905701
34007i05701J41229N87273O30051K74294j5887M3186J60300k2852l52657m34638
$$ -905701 -764472 -177199 452852 727146 711259 754445 914745 891893 539236 104598
33997A04598k22362L4088K19898L60277L69432J81805n810m695o269k66101n41924
$$ 104598 -117764 -83676 136222 496499 865931 1047736 1041926 1037231 1030962 764861 222937
33986B22937l46591K55087O09865L38191j98433m38314k61823O3048K51187J49834
$$ 222937 -123654 131433 741298 1079489 881056 442742 180919 243967 495154 644988
33976F44988j96229m66626l12756J65256M47423K59395n6065l7260K63758M05104
$$ 644988 448759 -17867 -330623 -165367 282056 541451 485386 448126 711884 1116988
33966A116988J63640k32601m24305k90966k0362Q8196q0454l10472k70354R2225
$$ 1116988 1280628 1048027 623722 332756 312394 400590 320136 9664 -260690 -168465
33956a68465M60963M96269J93159j31948j61222R6688K66650P901m82391n93047
$$ -168465 292498 788767 981926 849978 688756 785444 1052094 1059995 577604 -15443
33946a5443j10303L77302K39239k76908l92006P1328N02896M64956K11406R3555
$$ -15443 -125746 251556 490795 213887 -178119 -106791 396105 861061 1072467 1166022
33936A166022M4539p1512j14713l215M0576j03974k01996j08543m2503j06541
$$ 1166022 1210561 1139049 1024336 1021121 1061697 957723 755727 647184 604681 498140
33926D98140p506L55431N08146J04259m15697m35154q2779N8908j12380k01176
$$ 498140 490634 846065 1354211 1458470 1042773 607619 524840 583748 471368 270192
33916B70192l8161J79280L31892M16234K91417p2010k79269l1786K49501m994
$$ 270192 232031 411311 743203 1159437 1450854 1378844 1099575 1067789 1317290 1312296
33906A312296n07479m73030R4254L55372l0029l98828j79963K85561M02315J62197
$$ 1312296 804817 331787 426041 781413 751384 352556 172593 458154 860469 1022666
33896A022666p6753j46581n1154J69095K84470L8639l31199k67640K03774L73627
$$ 1022666 945913 799332 748178 917273 1201743 1240382 909183 641543 845317 1218944
33886A218944n2544m38490k28194K01604K57201Q0632J16004K40556Q4498j64745
$$ 1218944 1166400 727910 499716 701320 958521 1039153 1155157 1395713 1480211 1315466
33876A315466o4206K31794J94806j43448k24076J07031L79057K54882o8974k90352
$$ 1315466 1251260 1483054 1677860 1534412 1310336 1417367 1796424 2051306 1982332 1691980
33866A691980l37605k26021j2912Q4916p2344k29924o4250K61288L27028J38527
$$ 1691980 1354375 1128354 1115442 1200358 1128014 898090 833840 1095128 1422156 1560683
33856A560683L9247K6048k08158n29738l67186L42791Q51526N74594j17462m35391
$$ 1560683 1599930 1625978 1417820 888082 520896 863687 1715213 2289807 2172345 1736954
33846A736954j23777M35746P52473N69793l3078o05188o30890j18927L31085K60205
$$ 1736954 1613177 2048923 2801396 3371189 3338111 2732923 2102033 1983106 2314191 2574396
33836B574396q2406j34773K14643N21961L64982j53549m78443j74358N16724Q21692
$$ 2574396 2491990 2357217 2571860 3093821 3458803 3305254 2826811 2652453 3169177 3990869
33826C990869L35361m05449n81279j42056K78901L56744L31882K88991m6891n90250
$$ 3990869 4326230 3920781 3339502 3197446 3476347 3833091 4164973 4453964 4407073 3816823
33816C816823p36519k99804Q3991m2177k19902P6105M79386L63157o3742j26086
$$ 3816823 3080304 2780500 2864491 2822314 2602412 2678517 3157903 3521060 3457318 3331232
33806C331232J89476L27097J62065N2931K8825j93816m22111j36720M67576N19346
$$ 3331232 3520708 3847805 4009870 4062801 4091626 3897810 3475699 3338979 3806555 4325901
33796D325901j82100p26038m09570K75560M92933K25801k0272j27554k85321l81872
$$ 4325901 4143801 3417763 3008193 3283753 3776686 4002487 3982215 3854661 3569340 3187468
33786C187468j83224R7024M7808k39526k93740j4034K32970K37126J68780J68003
$$ 3187468 3004244 3101268 3149076 2909550 2615810 2601776 2834746 3071872 3240652 3408655
33776C408655J68914J71267K60381L07927P1788l33959m82438k50844N708K1829
$$ 3408655 3577569 3748836 4009217 4317144 4388932 4054973 3572535 3321691 3327399 3349228
33766C349228m3496q830N915r6245j14936R1164K84891K18583N2476M9769R5027
$$ 3349228 3305732 3296902 3302817 3206572 3091636 3182800 3467691 3686274 3738750 3788519 3883546
33755C883546p0050l04410k24077J58261L93977K34474p4303k05465j24806L4230
$$ 3883546 3813496 3509086 3285009 3443270 3837247 4071721 3997418 3791953 3667147 3701377
33745C701377J56599J08278j80680m71900l62636J56313N69664M74997R6773q7392
$$ 3701377 3857976 3966254 3785574 3313674 2951038 3107351 3677015 4152012 4248785 4161393
33735D161393j0006J5247j47298k74166j65866O6673J87196J42546Q7143J56387
$$ 4161393 4151387 4166634 4019336 3745170 3579304 3645977 3833173 3975719 4062862 4219249
33725D219249K76700K37943r791k07082r1884J84671K11985o0006j79435J46880
$$ 4219249 4495949 4733892 4724101 4517019 4425135 4609806 4821791 4761785 4582350 4729230
33715D729230N62560N35680R7307k53580k45653o1853O6624J20871J27057M9737
$$ 4729230 5291790 5827470 5924777 5671197 5425544 5363691 5430315 5551186 5678243 5727980
33705E727980o9615r3316L7563K58711M74979N39337K71887k47089n50850l03138
$$ 5727980 5658365 5565049 5602612 5861323 6336302 6875639 7147526 6900437 6349587 6046449
33695F046449J64919K44772q7763k75985n2906K24768K38270J72585K75716M16970
$$ 6046449 6211368 6456140 6368377 6092392 6039486 6264254 6502524 6675109 6950825 7367795
33685G367795M04665L64604M54637N11536L39573J07224J06020K93429L89364
$$ 7367795 7772460 8137064 8591701 9103237 9442810 9550034 9656054 9949483 10338847
33676A0338847K89748J21431R365j672P8219J43219R7959Q6260L36074O97097
$$ 10338847 10628595 10750026 10759391 10757719 10835938 10979157 11077116 11163376 11499450 12196547
33666A2196547P35539M36563L09886N43058O36847K97632O3638M10720Q10699
$$ 12196547 12932086 13368649 13678535 14221593 14858440 15156072 15219710 15630430 16441129
33657A6441129N33385l4186J08243R39715J384655R87110N44006P47833J173786
$$ 16441129 16974514 16940328 17048571 17988286 19372941 20360051 20904057 21651890 22825676
33648B2825676J157624Q91171R64635J368127J641040J668173J701750J815810
$$ 22825676 23983300 24874471 25839106 27207233 28848273 30516446 32218196 34034006
33640C4034006J893678K012478K342073K737724K870209K751523K785762L276881
$$ 34034006 35927684 37940162 40282235 43019959 45890168 48641691 51427453 54704334
33632E4704334M122952M981029N556679N803540O008303O581980P607056Q714194
$$ 54704334 58827286 63808315 69364994 75168534 81176837 87758817 95365873 104080067
33624A04080067R556207J0225024J1000204J1874754J2595986J3039733J3265428
$$ 104080067 113636274 123861298 134861502 146736256 159332242 172371975 185637403
33617A85637403J3287450J3058646J2635093J2129260J1541885J0849494J0209924
$$ 185637403 198924853 211983499 224618592 236747852 248289737 259139231 269349155
33610B69349155R849874R735803R535932Q948714P976470O888164N985564N357458
$$ 269349155 279199029 288934832 298470764 307419478 315395948 322284112 328269676 333627134
33602C33627134M793160L997202K934667J880040J117837P47008P75293J142721
$$ 333627134 338420294 342417496 345352163 347232203 348350040 349097048 349872341 351015062
33594C51015062J570198J685691J475364J334891J464405J501914J042019K50631
$$ 351015062 352585260 354270951 355746315 357081206 358545611 360047525 361089544 361340175
33586C61340175m05918q55798j445249k375104l514845m750554o146445p718214
$$ 361340175 360934257 360078459 358633210 356258106 352743261 347992707 341846262 334128048
33578C34128048r343172j0944332j2517249j3942887j5005326j5631308j5915836
$$ 334128048 324784876 313840544 301323295 287380408 272375082 256743774 240827938
33571B40827938j5902265j5540593j4879552j4108341j3378018j2722650j2137650
$$ 240827938 224925673 209385080 194505528 180397187 167019169 154296519 142158869
33564A42158869j1582414j0935381j0102718r145632q181662p240141o344138
$$ 142158869 130576455 119641074 109538356 100392724 92211062 84970921 78626783
33557G8626783n608403n086669m657448m240574l953463l837374l644769l193925
$$ 78626783 73018380 67931711 63274263 59033689 55080226 51242852 47598083 44404158
33549D4404158k723429k527390k425168k032361j430562j085207j153292j353963
$$ 44404158 41680729 39153339 36728171 34695810 33265248 32180041 31026749 29672786
33541B9672786j499527j642562j677222j354288q16001n78433p80611r42404p11244
$$ 29672786 28173259 26530697 24853475 23499187 22683186 22104753 21324142 20381738 19670494
33532A9670494l79473l51028n15028n27064l92796l76786n35753o84500o95905
$$ 19670494 19291021 18939993 18424965 17897901 17505105 17128319 16592566 15908066 15212161
33523A5212161n84612m18846l30376m53239o98631p73063n56612k66739j44244
$$ 15212161 14627549 14208703 13878327 13425088 12726457 11953394 11396782 11130043 10985799
33514A0985799k09841l97796o16138o06358j64179L63762L06204l56553p76672
$$ 10985799 10775958 10378162 9762024 9155666 8991487 9355249 9661453 9304900 8528228
33505H528228l89554K36014K36249k94860n60029k85807K9684o77k05007l25287
$$ 8528228 8138674 8374688 8610937 8316077 7756048 7470241 7499925 7499248 7294241 6968954
33495F968954l48433k65407j4839K04098L7084m31047o12819j85866M14366N44379
$$ 6968954 6620521 6355114 6340275 6544373 6581457 6150410 5537591 5351725 5766091 6310470
33485F310470J65810j75052q5360K02523J63341l11031o92974m54252J72002L93735
$$ 6310470 6476280 6301228 6215868 6418391 6581732 6270701 5577727 5123475 5295477 5689212
33475E689212r5565o72721o41961j52050J50991P1206o3359p2738q5453r4593
$$ 5689212 5593647 4920926 4278965 4126915 4277906 4349112 4285753 4213015 4127562 4032969
33465D032969P4358L19765L07289L3194j31610m9415j542j50825k74413j91139
$$ 4032969 4107327 4427092 4734381 4767575 4635965 4586550 4585008 4434183 4159770 3968631
33455C968631m1204K6343O2601O5857r3302l37747l61880j10710R9484R7646Q6171
$$ 3968631 3927427 3953770 4016371 4082228 3988926 3651179 3289299 3178589 3278073 3375719 3461890
33444C461890J73831J25054j74526m25427l84903k48454k52865k68434j24667
$$ 3461890 3635721 3760775 3586249 3160822 2775919 2527465 2274600 2006166 1881499
33435A881499J0143m7908j09062N2754K42306J53148o6377O76L83524O33948L83134
$$ 1881499 1891642 1843734 1734672 1787426 2029732 2182880 2116503 2117179 2500703 3134651 3517785
33424C517785k47491p57505o82738n2854M99402L67328k10565l76512J41378N94396
$$ 3517785 3270294 2512789 1830051 1777197 2276599 2643927 2433362 2056850 2198228 2792624
33414B792624L23721k67794m00021q2882R8671J9928M5460J91204O7795l17467
$$ 2792624 3116345 2848551 2448530 2365648 2464319 2484247 2529707 2720911 2788706 2471239
33404B471239m38158q4969K86008K55820O77q4746N9416K01188J52686p6943k89122
$$ 2471239 2033081 1948112 2234120 2489940 2490617 2405871 2465287 2666475 2819161 2742218 2453096
33393B453096k52979k5127K9324k16481l37991P004M17408K96171j66871k72254
$$ 2453096 2200117 2174990 2204314 1987833 1649842 1656846 2074254 2370425 2203554 1931300
33383A931300M2675J41559j95869m44011l00328j47253k25156j43526L23098O62038
$$ 1931300 1973975 2115534 1919665 1475654 1175326 1028073 802917 659391 982489 1644527
33373A644527M07149q4188k24921q0212o0844j59148j09993K2010K3143K3714
$$ 1644527 2051676 1967488 1742567 1662355 1601511 1442363 1332370 1354380 1377523 1401237
33363A401237K25217L77912J28457k97366l59675l7883J71017K7166k11463l03911
$$ 1401237 1626454 2004366 2132823 1835457 1475782 1437899 1608916 1636082 1424619 1120708
33353A120708k90912k28094q7738M2829L0497l7370J6255J18186Q0724r648P3240
$$ 1120708 829796 601702 513964 556793 587290 549920 566175 684361 765085 755437 828677
33342H28677K45342K13864o892r6864N3926K22333K55097K28466J99969J48308
$$ 828677 1074019 1287883 1280991 1184127 1238053 1460386 1715483 1943949 2143918 2292226
33332B292226J46704K56299K98103R8872j12381K1128L72961M65518J90343q8862
$$ 2292226 2438930 2695229 2993332 3092204 2979823 3000951 3373912 3839430 4029773 3940911
33322C940911j53499j38239q4305J83516O34661R83384J169953J436834J878286
$$ 3940911 3787412 3649173 3564868 3748384 4383045 5366429 6536382 7973216 9851502
33313I851502K401947L116617M160572N207578N929172O890963Q853744J0937514
$$ 9851502 12253449 15370066 19530638 24738216 30667388 37558351 46412095 57349609
33305E7349609J0859757P812998L874681J324421m48769l700412q484944j1971381
$$ 57349609 68209366 76022364 79897045 81221466 80772697 77072285 68587341 56615960
33297E6615960j1904447r187836o354397m708310l895398l359640l000096k678019
$$ 56615960 44711513 35523677 29169280 24460970 20565572 17205932 14205836 11527817
33289A1527817k099248j313635p45874o11445o73282o34979m84920l95448m76553
$$ 11527817 9428569 8114934 7369060 6757615 6084333 5449354 4964434 4568986 4092433
33280D092433o59553p24735n04908j43947n599j90700l27155n4877M29072N83487
$$ 4092433 3432880 2708145 2203237 2059290 2053691 1862991 1535836 1480959 1910031 2493518
33270B493518K21284k67205m05651j43112J76106K16753l0217k77577k77224j20345
$$ 2493518 2714802 2447597 2041946 1898834 2074940 2291693 2261476 1983899 1706675 1586330
33260A586330j05890k91278l70024j22811K17941K80651O5344j43071k39706l21268
$$ 1586330 1480440 1189162 819138 696327 914268 1194919 1260263 1117192 877486 556218
33250E56218l17009l6296L67906M45168J29131p4595J34880L20373j7655n81048
$$ 556218 239209 202913 570819 1015987 1145118 1070523 1205403 1525776 1508121 927073
33240I27073o61181j94902J98793J99624J45471K92031L66239J55667k4176J29345
$$ 927073 265892 70990 269783 469407 614878 906909 1273148 1428815 1404639 1533984
33230A533984L51648K66746J7448p3609j33420m24208o57676l31200L46800N92302
$$ 1533984 1885632 2152378 2169826 2096217 1962797 1538589 880913 549713 896513 1488815
33220A488815J63109l31266l72034j35837M7907J97299L21312J65745k71284m92114
$$ 1488815 1651924 1320658 948624 812787 860694 1057993 1379305 1545050 1273766 781652
33210G81652k28820M7779j42410m77361l42948J79833M80849L56326J37921J7094
$$ 781652 552832 600611 458201 -19160 -362108 -182275 298574 654900 792821 809915
33200H09915j26640k63151j76662O7229J38621j9719j28636n9814O6342K44321
$$ 809915 683275 420124 243462 310691 449312 429593 300957 241143 307485 551806
33190E51806N38250O95787L86570j41893k75263M162M2544m06869p48944n24167
$$ 551806 1090056 1785843 2172413 2030520 1755257 1759419 1801963 1395094 646150 121983
33180A21983j24290n7918j30538M3909K36786J5611l94294l87348P0960M33832
$$ 121983 -2307 -60225 -190763 -146854 89932 105543 -288751 -676099 -605139 -171307
33170a71307M14338K38836J21204M8356O5349K39113L37854O4640l69973m28294
$$ -171307 243031 481867 603071 651427 716776 955889 1293743 1358383 988410 560116
33160E60116n3330K22866Q2154j75285j86907j2305J40476K43640K81536J40123
$$ 560116 506786 729652 811806 636521 449614 437309 577785 821425 1102961 1243084
33150A243084j12877j97858p9935q1037l22620m69989l03659j15716j81153k46744
$$ 1243084 1130207 932349 852414 771377 448757 -21232 -324891 -440607 -621760 -868504
33140h68504L133L26008K97874M6840K6647K15404J61006j95790l55160m7147
$$ -868504 -865371 -539363 -241489 -194649 -168002 47402 208408 12618 -342542 -389689
33130c89689L28882K88383q3627l09924j18997L20470O07381M58796n126l22072
$$ -389689 -60807 227576 143949 -165975 -284972 35498 642879 1101675 1096549 774477
33120G74477k03746Q6247J21393n4734q0317M2294l9628l09023k99272P7045K53779
$$ 774477 570731 656978 778371 723637 643320 685614 645986 336963 37691 114736 368515
33109C68515r0802m52257k89032J28293K37200J12556J90291L84194K44432j65824
$$ 368515 277713 -174544 -463576 -335283 -98083 14473 204764 588958 833390 667566
33099F67566l25976j53194q5959k16935j08142L38458N59505K12371k46621k72338
$$ 667566 341590 188396 102437 -114498 -222640 115818 675323 887694 641073 368735
33089C68735j8J32539R3487J16759J88331J37774J1848m0268o1975j41734j79773
$$ 368735 368717 501256 594743 711502 899833 1037607 1049455 1009187 947212 805478 625705
33078F25705r8222m7194j13979j01416R5861K01251j467k44445j91812K1325R2002
$$ 625705 527483 480289 366310 264894 360755 562006 560539 316094 124282 145607 237609
33067B37609Q1995J71781J93049m9452k74038j36672J13850M5649j50382j4368
$$ 237609 319604 491385 684434 634982 360944 224272 338122 383771 233389 219021
33057B19021K47836P1019l42928k13510M34740O40527L9024n14698l33791O3434
$$ 219021 466857 537876 194948 -18562 416178 1056705 1095729 581031 247240 310674
33047C10674k7889k99748r5914L74644M23958O6949r7350N8841J18120j7802j436
$$ 310674 282785 -16963 -112877 261767 685725 752674 655324 714165 832285 814483 813047
33036H13047K13504K26551r5086l63188k85977m7011Q2503R0467M2941p5803k00103
$$ 813047 1026551 1253102 1158016 794828 508851 461840 544343 634810 677751 601948 401845
33025D01845j65036K1775J38200O7894n2997p0478l294M0472j4458j65315k83676
$$ 401845 236809 258584 396784 464678 411681 341203 337909 378381 363923 198608 -85068
33014h5068j90765P9572K25848O6311j74976j77883M9309K80619M07564M09175
$$ -85068 -275833 -196261 29587 95898 -79078 -256961 -207652 72967 480531 889706
33004H89706K16265r4851k14122l5236Q9648q7174k15938P7922M42007K62590
$$ 889706 1105971 1011120 796998 761762 851410 764236 548298 626220 1068227 1330817
32994A330817l32064o53093n25797m19950n11280m12346J9063L61415L64891L22031
$$ 1330817 998753 345660 -180137 -600087 -1111367 -1523713 -1504650 -1143235 -778344 -456313
32984d56313M15525L45268m1820l44362k34106K0537O3282J3939J10179K16252
$$ -456313 -40788 304480 262660 -81702 -315808 -295271 -231989 -218050 -107871 108381
32974A08381J21122m3057q8992j33342k75807k70469O1155L99865L41345r281
$$ 108381 229503 186446 97454 -35888 -311695 -582164 -521009 -121144 220201 210920
32964B10920k36343j75604M8092K86081L70156J46985k10211k73826j9879L5326
$$ 210920 -25423 -201027 -152935 133146 503302 650287 440076 166250 146371 181697
32954A81697l07860m87311p9984M11727L30360o7121r1017K09626K31046o8330
$$ 181697 -126163 -613474 -693458 -281731 48629 -18492 -109509 100117 331163 262833
32944B62833j52419P4364J30157j20314k43313o2489O5508l3173q4012M617m2108
$$ 262833 110414 184778 314935 194621 -48692 -111181 -45673 -78846 -162858 -158241 -200349
32933b00349k15603j17522K48568L28403j6749j64041K13810N08938J86001k65125
$$ -200349 -415952 -533474 -284906 43497 26748 -137293 76517 585455 771456 506331
32923E06331j31756L17746K96704j85515l83149n5617K29997J06214p5308K8396
$$ 506331 374575 692321 989025 803510 420361 364744 594741 700955 625647 654043
32913F54043J55454n4793m14006m65584j62114J15337J07960n4106j24973n5051
$$ 654043 809497 754704 340698 -124886 -287000 -171663 -63703 -117809 -242782 -297833
32903b97833M0708J01148J91643L57453M81758L74805J7082l56035m66997k75771
$$ -297833 -257125 -155977 35666 393119 874877 1249682 1266764 910729 443732 167961
32893A67961j6576M9399q0859j46009L2928K48659J49930j88398k64415Q8779
$$ 167961 151385 200784 119925 -26084 6844 255503 405433 217035 -47380 41399
32883D1399L23791j9290m69138k39227M73319O33982o8698o72656l53995L77511
$$ 41399 365190 345900 -123238 -362465 110854 744836 676138 3482 -350513 26998
32873B6998N19183K2992l51387k45465K4944J93191K71486J50696k85919o46881
$$ 26998 546181 569173 217786 -27679 -2735 190456 461942 612638 326719 -320162
32863c20162l59596L81833O93314K26028l39546l16186P9934K42533Q9929k5087
$$ -320162 -679758 -297925 395389 621417 281871 -34315 45619 288152 378081 352994
32853C52994K9933R6444J02739R0598N59k20922m10717l72472j55376Q0866L01139
$$ 352994 382927 479371 582110 672708 673267 452345 41628 -330844 -486220 -405354 -104215
32842a04215M48657L04428j59567m94478k68796K73574M93552K31857o5081r6905
$$ -104215 344442 648870 489303 -5175 -273971 -397 493155 725012 659931 563026
32832E63026p7802k22135l44314k32926m3316k323j5370R3508J87926N0427j54058
$$ 563026 485224 263089 -81225 -314151 -357467 -359790 -375160 -281652 -93726 -43299 -197357
32821a97357p8094J96138K00760j72090m07032j06267L46169K72868k87814n38641
$$ -197357 -275451 -79313 121447 -50643 -457675 -563942 -217773 55095 -232719 -771360
32811g71360L226P93474R36626L47310j92715j24936J96653J35118k78851m66049
$$ -771360 -768134 25340 961966 1309276 1116561 991625 1188278 1323396 1044545 578496
32801E78496k17070K6709j01811l57729l38339j15822l1189q1305L3801L22017
$$ 578496 361426 388135 286324 -71405 -409744 -525566 -556755 -638060 -604259 -282242
32791b82242M20097J82724n4400J8196K38147K69486R1846q1782j84348k84183
$$ -282242 137855 320579 266179 284375 522522 792008 883854 802072 617724 333541
32781C33541l13455j36673J32842J92370j9169k02797j09968J26166J87701m1012
$$ 333541 20086 -116587 16255 208625 189456 -13341 -123309 2857 190558 149546
32771A49546l90199n96546m83992o1007M43913P04681N65682J81790j48712k55385
$$ 149546 -240653 -837199 -1321191 -1382198 -938285 -233604 332078 513868 365156 109771
32761A09771j77379m7901L5750O0132P1394J09261J65266K15964K56541K53472
$$ 109771 -67608 -115509 -79759 -19627 51767 161028 326294 542258 798799 1052271
32751A052271J25558j27969l31564l06281j16762Q656q419m3390k5590j8803q849
$$ 1052271 1177829 1049860 718296 412015 295253 303909 295490 252100 226510 207707 198858
32740A98858J13645K52172R3444l87450o94191m02929K10267N06094L20539N9262
$$ 198858 312503 564675 658119 270669 -423522 -826451 -616184 -110090 210449 269711
32730B69711O972L43j32424k45302j87104q4442o2663K0699K75717M59654K94162
$$ 269711 276683 277026 144602 -100700 -287804 -372246 -434909 -414210 -138493 321161 615323
32719F15323o5185k28974j39946p7164j40931j20596P0326J92502O6726j24095
$$ 615323 550138 321164 181218 104054 -36877 -157473 -87147 105355 172081 47986
32709D7986j14710O5156J89792J64768O8677k4055r0368j00114m9162L689K1253
$$ 47986 -66724 -1568 188224 352992 421669 397614 307246 207132 157970 161659 182912
32698A82912K5131r769j45101k80132j81012J29522K54974m1783m11845l79824
$$ 182912 208043 198274 53173 -226959 -407971 -278449 -23475 -65258 -477103 -856927
32688h56927n1741Q1610n4494n5144J95718K86772K0553j69204Q3149M25029L26013
$$ -856927 -908668 -827058 -881552 -936696 -740978 -454206 -433653 -602857 -519708 -94679 231334
32677B31334p5464k27340m9296M0434r4661j13165J46569L64879K84768J03028
$$ 231334 155870 -71470 -120766 -80332 -174993 -288158 -141589 223290 508058 611086
32667F11086Q0412J36091R3315J7659L0917L7286r0634k56381l20081l34445l52850
$$ 611086 691498 827589 920904 938563 969480 1006766 916132 659751 339670 5225 -347625
32656c47625k23523J22465L86259K78466K9275Q8272L83937L67941j40348o32719
$$ -347625 -571148 -448683 -62424 216042 245317 333589 717526 1085467 945119 312400
32646C12400o27772k90414n3534J8065J01499J28338q6555l46075k27641K10626
$$ 312400 -315372 -605786 -659320 -641255 -539756 -411418 -497973 -844048 -1071689 -861063
32636h61063L79118K358m24890l33300J29887M02354L25307J85799J16340l197
$$ -861063 -481945 -479587 -904477 -1237777 -1107890 -705536 -380229 -194430 -78090 -81287
32626h1287r3633R2151M02887L38340j28626l54329J7086M43699L05600j48839
$$ -81287 -174920 -82769 320118 658458 529832 175503 192589 636288 941888 793049
32616G93049k80221r3741o5745j77987L6396N08002N45671n6548n75535l87730
$$ 793049 512828 419087 353342 175355 211751 719753 1265424 1208876 633341 245611
32606B45611J52360K98687o3548m26203l87976K290M10117M53550J9549m59131
$$ 245611 397971 696658 633110 206907 -181069 -178779 231338 684888 704437 245306
32596B45306l73740K05205M70687j2224o08439m89543J94309O09587M41870J59143
$$ 245306 -128434 76771 547458 535234 -73205 -562748 -368439 241148 683018 842161
32586H42161J65751K95301K09190j47120n64800p38742m36070K02306O20406M50089
$$ 842161 1007912 1303213 1512403 1365283 800483 61741 -374329 -172023 448383 898472
32576H98472L5284m3555J69663J32781k64789m91813k11699K07691K60255l2492
$$ 898472 933756 890201 1059864 1192645 927856 436043 224344 432035 692290 659798
32566F59798k89090k99020j33256O0079J60076J18839L2703L8213Q8425N585k17744
$$ 659798 370708 71688 -61568 -1489 158587 277426 310129 348342 436767 442352 224608
32555B24608l75539l34798j59753N5482K48569K86952O9977k38975l32780j39943
$$ 224608 -150931 -485729 -645482 -590000 -341431 -54479 15498 -223477 -556257 -696200
32545f96200J39912L52054M78216M67991K94819J35017J47338J35596j63411n18674
$$ -696200 -556288 -204234 273982 741973 1036792 1171809 1319147 1454743 1291332 772658
32535G72658m40380J1208K21238n9349l66940l04461r5472n5601m0753J80162
$$ 772658 332278 343486 564724 505375 138435 -166026 -261498 -317099 -357852 -177690
32525a77690M32245M32327K40856M5594j76367m20913m25566p6655K59033K18451
$$ -177690 254555 686882 927738 973332 796965 376052 -49514 -126169 132864 351315
32515C51315k0575q7025j4663n5580j58507j04989L8712O3786K9661Q8217R0246
$$ 351315 330740 243715 229052 173472 14965 -90024 -51312 12474 42135 130352 220598
32504B20598j56868m12869k96366P8049K73921K37756K76747L92021K37740j94536
$$ 220598 63730 -349139 -645505 -567456 -293535 -55779 220968 612989 850729 656193
32494F56193m27782k06621J26754J74363P258p6137n993O9393M2879o7537j60816
$$ 656193 228411 21790 148544 322907 330165 254028 248035 317428 360307 292770 131954
32483A31954j19270M2846J38643P9410N9657K25745L36135J15895k14244k34431
$$ 131954 12684 55530 194173 273583 333240 558985 895120 1011015 796771 562340
32473E62340l6072o8937l13965k71490J18511K57679j14123l82789q500N46167
$$ 562340 526268 457331 143366 -128124 -9613 248066 133943 -248846 -257346 288821
32463B88821M77564j24070m06312j960N13343M92846K1173l62368l79041j87898
$$ 288821 766385 642315 236003 234043 747386 1240232 1261405 899037 519996 332098
32453C32098m3077j9229l4785L227J02737J83894J59544L0805j02464j48005j45659
$$ 332098 289021 269792 235007 238234 340971 524865 684409 715214 612750 464745 319086
32442C19086k35561m32495m91708j82178K93701M23691P2709k45184o2305L42096
$$ 319086 83525 -348970 -840678 -1022856 -729155 -305464 -232755 -477939 -540244 -198148
32432a98148L58428j9890k24212l9650R4677j30701l72598k12266J80553L50504
$$ -198148 160280 140390 -83822 -123472 -28795 -159496 -532094 -744360 -563807 -213303
32422b13303K23053Q2753Q8989J61998K08618J69209k3915k78057k97551J4609
$$ -213303 9750 92503 181492 343490 552108 721317 697402 419345 121794 136403
32412A36403K92095J64627j77916k55515j9399J25974M85j09812J348R4155r3636
$$ 136403 428498 593125 415209 159694 140295 266269 266754 156942 158290 252445 158809
32401A58809l66336l36928j3134K10684J17310o4480k3368K27365M42746M84920
$$ 158809 -207527 -544455 -557589 -346905 -229595 -294075 -317443 -90078 352668 837588
32391H37588L83951J65502j41024l48455k46886L4263Q1194k31915n02415l67353
$$ 837588 1221539 1387041 1246017 897562 650676 684939 766133 534218 31803 -335550
32381c35550m1965M7569o5137l1708J46999J42316m1393r335L04243M31082J29357
$$ -335550 -377515 -329946 -395083 -426791 -279792 -137476 -178869 -188204 116039 547121 676478
32370F76478j70136k8201L28832M13517K05585K4907n5972j98091l68899l88572
$$ 676478 506342 478141 806973 1220490 1426075 1450982 1395010 1196919 828020 439448
32360D39448l05656l08399l26456j26126K19717L51083J53142p2649n4113J11731
$$ 439448 133792 -174607 -501063 -627189 -407472 -56389 96753 24104 -30009 81722
32350H1722J70335O0809m8038L3371L07644N36372M48862P1460k64393l21134
$$ 81722 252057 312866 264828 298199 605843 1142215 1591077 1662537 1398144 1077010
32340A077010j90883l8478J31776K78243K01467r1618k07559O4942K85120n0855
$$ 1077010 886127 847649 979425 1257668 1459135 1367517 1159958 1224900 1510020 1459165
32330A459165o59986p91191l03430J83142K32502P9180M6629P1059M1396R2069
$$ 1459165 799179 7988 -295442 -112300 120202 199382 246011 317070 358466 450535
32320D50535K51236K39426n0327k66305j49623k732j79735m16305j85909M31616
$$ 450535 701771 941197 890870 624565 474942 472210 292475 -123830 -309739 121877
32310A21877P63975M40236j59576m47003k92402j7483M6475j46731l62377k88404
$$ 121877 885852 1326088 1166512 719509 427107 409624 456099 309368 -53009 -341413
32300c41413J51004O22341O53079J69065l48336l79450J4710K60836q599m85636
$$ -341413 -190409 431932 1085011 1254076 905740 526290 541000 801836 793237 307601
32290C07601n89116k15882J74575K30424J40651K27244L97962L39388Q7190j0325
$$ 307601 -281515 -497397 -322822 -92398 48253 275497 673459 1012847 1100037 1089712
32280A089712J21049J49650r2978k88697j17311K08533K09049j82179n07250l72218
$$ 1089712 1210761 1360411 1267433 978736 861425 1069958 1279007 1096828 589578 217360
32270B17360P2242L41719K07398o1976q0512J39799K22617j4879k68459j69799
$$ 217360 289602 631321 838719 776743 696231 836030 1058647 1043768 775309 605510
32260F05510J93590M37440M19790K98868J33232j80849n36316n81497k21020J69550
$$ 605510 799100 1236540 1656330 1955198 2088430 1907581 1371265 789768 568748 738298
32250G38298K30009N6799m9415l8369n5708j03686m1449J25990J80834n1225m62321
$$ 738298 968307 1025106 975691 937322 881614 777928 736479 862469 1043303 992078 529757
32239E29757o90877m21643K36871P18671N49084o2637m20126j77678K89736M47593
$$ 529757 -161120 -582763 -345892 372779 921863 859226 439100 261422 551158 998751
32229I98751K32753n2957k06844k35294j85952j13621j00827j34503p3525J29606
$$ 998751 1231504 1178547 971703 736409 550457 436836 336009 201506 127981 257587
32219B57587L14418L30384K01734j3803l03963n32556m68689j42375J14598J53424
$$ 257587 572005 902389 1104123 1090320 786357 253801 -214888 -357263 -242665 -89241
32209h9241K04341L80645L87160N4349k27432n8669K96783L01429k6175k11413
$$ -89241 115100 495745 882905 937254 709822 651153 947936 1249365 1223190 1011777
32199A011777r0559P2372J28835J52488P1170k35493m91770k77473K25468L41052
$$ 1011777 921218 993590 1122425 1274913 1346083 1110590 618820 341347 566815 907867
32189I07867j18107n57481m78994r6711J67139K66111L00978J94738m1378j30149
$$ 907867 789760 232279 -246715 -343426 -176287 89824 390802 585540 544162 414013
32179D14013K0350O7026k01675m29827k40249J30748K12141K7151m7559P2904
$$ 414013 434363 501389 299714 -130113 -370362 -239614 -27473 -322 -47881 25023
32169B5023J76907K21003K91657K36958j33015n51600n41678j48144J08425M4755
$$ 25023 201930 422933 714590 951548 818533 266933 -274745 -422889 -314464 -269709
32159b69709K2473K30246L47333J79188P7682L19221N03802J09176o08786q46478
$$ -269709 -247236 -16990 330343 509531 587213 906434 1410236 1519412 910626 64148
32149F4148l40918K86032L86651P5359q4763R1912K42231N4764k69843l10357
$$ 64148 -276770 9262 395913 471272 386509 478421 720652 775416 505573 195216
32139A95216k3216J89430M0138k33982k03544J33672L39523J62108j06357o4490
$$ 195216 172000 361430 401568 167586 -35958 97714 437237 599345 492988 428498
32129D28498K09304K69087n9576m27013m23804r8852J48604J02702l8952k123
$$ 428498 637802 906889 847313 420300 -3504 -102356 46248 148950 109998 107875
32119A07875J64293J80140l1573k04514r9922J45079K06258K4572j33110o0342
$$ 107875 272168 452308 420735 216221 116299 261378 467636 492208 359098 298756
32109B98756J41029K56533K28387J28181J152j26752j73154p1285J05887J86517
$$ 298756 439785 696318 924705 1052886 1054038 927286 754132 682847 788734 975251
32099I75251O4505j98764l97619l26573j5027K00116L3677k89010k17295L43434
$$ 975251 1039756 840992 443373 116800 101773 301889 335566 46556 -170739 172695
32089A72695P65821N14630o3503k17717J17422K82934n3141m26444l72379j22506
$$ 172695 938516 1453146 1389643 1171926 1289348 1572282 1519141 1092697 720318 597812
32079E97812j04604j90108K1154M20002M78823P3220l12763k90045m4904M6538
$$ 597812 493208 303100 324254 744256 1223079 1296299 983536 693491 648587 695125
32069F95125n1623j10244k7395P2788M8288q3457j47982J3464L02694L66276Q923
$$ 695125 643502 533258 505863 578651 626939 543482 395500 408964 711658 1077934 1086857
32058A086857m56565n22485j42741K14009K23805R7663J51141K77848J33919l05947
$$ 1086857 630292 107807 -34934 179075 402880 500543 651684 929532 1063451 757504
32048G57504o60871n90341j45190L28380N19053L85589J35741j3008l3376j4944
$$ 757504 96633 -493708 -638898 -310518 208535 594124 729865 716857 683481 668537
32038F68537J9524P9913O8859r8668k71593k26084l9107K2575p597J61619M54164
$$ 668537 688061 767974 836833 738165 466572 240488 201381 223956 216359 377978 832142
32027H32142L58608k43913o89298m16753J63567K59923j27620k87414N9740L92065
$$ 832142 1190750 946837 257539 -159214 4353 264276 136656 -150758 -91018 301047
32017C01047K66645l6999j8818L16159N33298L33359j61723n30495l81528K43751
$$ 301047 567692 530693 511875 828034 1361332 1694691 1532968 1002473 620945 864696
32007H64696P73080O58332M7775l85887l03857k8547M8556l4180p5512q0268r8907
$$ 864696 1637776 2296108 2343883 1957996 1654139 1625592 1674148 1639968 1564456 1484188 1385281
31996A385281k5115J50575J57101j67720n19982m92418j37185J55024K18031K20832
$$ 1385281 1360166 1510741 1667842 1500122 980140 487722 350537 505561 723592 944424
31986I44424K72474K44879L6990k22284l24597k17569m3094J2309p6476j08574
$$ 944424 1216898 1461777 1498767 1276483 951886 734317 691223 703532 627056 518482
31976E18482R8670L86601L70730k7051l81420k82823J22616L38994J46940k06935
$$ 518482 617152 1003753 1374483 1347432 966012 683189 805805 1144799 1291739 1084804
31966A084804l76142k58056o161J32393K1901j94638j97585J22830M76434N03791
$$ 1084804 708662 450606 444445 576838 598739 404101 206516 329346 805780 1309571
31956A309571J99309j32569k39598j05068J11905J81939j3891k77567k48887Q1321
$$ 1309571 1508880 1376311 1136713 1031645 1143550 1325489 1311598 1034031 785144 866465
31946H66465K57477p243l52387k74565J12881K67670L8456j88917j46297j0035
$$ 866465 1123942 1116699 764312 489747 602628 870298 908754 719837 573540 563505
31936E63505k706r3506k08443l55655m16294j87367K11857L47276Q1953j71618
$$ 563505 560799 467293 258850 -96805 -513099 -700466 -488609 -141333 -59380 -230998
31926b30998n3887K18300K38282M7335J8579K60131M89317M54955K09562l7588
$$ -230998 -284885 -66585 171697 219032 237611 497742 987059 1442014 1651576 1613988
31916A613988j50422j52047j86779l44946m77614l37796K5089K49886J87913J57392
$$ 1613988 1463566 1311519 1124740 779794 302180 -35616 -10527 239359 427272 584664
31906E84664M13717O40760L68620k64837o28419m44218q0985N7196J5648J2737
$$ 584664 998381 1639141 2007761 1742924 1114505 670287 589302 646498 662146 674883
31896F74883N3752O0534J05782K44181L02841J13650j71849k58458j16566K8124
$$ 674883 728635 789169 894951 1139132 1441973 1555623 1383774 1125316 1008750 1036874
31886A036874N8052O4099R3185N3854p0115j40562j00972r5890k15319k83810
$$ 1036874 1094926 1159025 1252210 1306064 1235949 1095387 994415 898525 683206 399396
31876C99396r4376K39346L64933J13437l04607n23736l40951J46162N83658N95463
$$ 399396 305020 544366 909299 1022736 718129 194393 -146558 -396 583262 1178725
31866A178725J53451l13916l83975j75265j38817l17057k32580K99415O98308
$$ 1178725 1332176 1018260 634285 459020 320203 3146 -229434 69981 768289
31857G68289L84164k93307m65716K1800M09611J53743l31276l59798M8794L05872
$$ 768289 1152453 859146 393430 415230 824841 978584 647308 287510 336304 642176
31847F42176J06324k75475m36011k52530J12044L61950K75461m0425j88761L4664
$$ 642176 748500 473025 37014 -215516 -103472 258478 533939 493514 304753 339417
31837C39417L38592L48414J39175K6812m071k06231m71907l80442N2186K30997
$$ 339417 678009 1026423 1165598 1192410 1188339 982108 510201 129759 181945 412942
31827D12942j26488m52038j30438N20157O48731R4951l98808k58695J88915L02470
$$ 412942 286454 -165584 -296022 224135 872866 967817 569009 310314 499229 801699
31817H01699K3150j87894q6204Q6132M2349j55938k42495r8270J49189K88863
$$ 801699 824849 636955 550751 636883 679232 523294 280799 182529 331718 620581
31807F20581K17549K0412j03177m0103J00186J15065k0429j14820l9926O2207
$$ 620581 838130 858542 755365 715262 815448 930513 910084 795264 755338 817545
31797H17545l1940k90237m24758k50993P1546K33524J49872M4563J46900L68570
$$ 817545 785605 495368 70610 -180383 -108837 124687 274559 319122 466022 834592
31787H34592L69954j4024m87472n68732j69964K60275K79168k3612k31902j96052
$$ 834592 1204546 1190522 703050 134318 -35646 224629 503797 480185 248283 52231
31777E2231j11608n6539J37375M24751L81444j71389o85223m82850K92605P99064
$$ 52231 -59377 -115916 21459 446210 827654 656265 -28958 -511808 -219203 579861
31767E79861N67116p71l02946k74523k20943k63497k69799j44435Q3163L34670
$$ 579861 1146977 1146206 843260 568737 347794 84297 -185502 -329937 -246774 87896
31757H7896M51527K53190j70242m13160k42439O2625J34150O2821J51600L13275
$$ 87896 539423 792613 622371 209211 -33228 29397 163547 226368 377968 691243
31747F91243K04870j07446j60981J57017L99486K67066L1372p528k0472k37049
$$ 691243 896113 788667 627686 784703 1184189 1451255 1482627 1475099 1454627 1217578
31737A217578m23327k35454J57636K82521N9560j42113q7669O4561O7820j50420
$$ 1217578 794251 558797 716433 998954 1058514 916401 828732 893293 961113 810693
31727H10693m80838o30965k74304M76168R26124N67515j56281l74642J2800K86547
$$ 810693 329855 -301110 -575414 -99246 826878 1394393 1238112 863470 876270 1162817
31717A162817O9046j84540o9823J05723l8149k54424j56050N1595n6913l27111
$$ 1162817 1231863 1047323 977500 1083223 1045074 790650 634600 686195 629282 302171
31707C02171k40029K18240N03619L13929o2988k45138j93619r3502j04517k51103
$$ 302171 62142 280382 784001 1097930 1034942 789804 596185 502683 398166 147063
31697A47063l36774p2307M53886O46574J38286n56864o39938j27850K51564J92246
$$ 147063 -189711 -262018 191868 838442 976728 419864 -220074 -347924 -96360 95886
31687I5886J23683L09799L92747J24404j27248k8087J27003m2696l27095l19700
$$ 95886 219569 529368 922115 1046519 919271 891184 1018187 975491 648396 328696
31677C28696j17787p7399j55318n7943J58745J95812Q1918R4958J95688P6246
$$ 328696 210909 133510 -21808 -79751 78994 274806 356724 451682 647370 723616
31667G23616k41781l67962j42822J76158L68080M45692L66155L2412l24627k72947
$$ 723616 481835 113873 -28949 147209 515289 960981 1327136 1359548 1034921 761974
31657G61974J37210L08983l5257l99355k65374J28930K13390l4601j54200K3353
$$ 761974 899184 1208167 1172910 773555 508181 637111 850501 815900 661700 685053
31647F85053J84017R5248q8710j56712j19784o0242J1061M4129n3990k07699j88797
$$ 685053 869070 964318 875608 718896 599112 538870 549931 594060 540070 332371 143574
31636A43574L7631K01418J04236r2984j30717j4832Q8605J58349K49380K33243
$$ 143574 181205 382623 486859 393875 263158 248326 336931 495280 744660 977903
31626I77903n7194m31930m50276l8383L20631K23998r2915j32592J28833K62379
$$ 977903 920709 488779 38503 120 320751 544749 451834 319242 448075 710454
31616G10454O6839j80918k09282j05110l8955K2007J09679O4426j62448k58499
$$ 710454 777293 596375 387093 281983 243028 265035 374714 439140 276692 18193
31606A8193M3918M71605N10929J34017j77056j47255m5049j77235m03331l80770
$$ 18193 62111 533716 1044645 1178662 1001606 854351 809302 632067 228736 -152034
31596a52034o3337K74326L79076K24603j2595p3011J52729M24651L74464K3599
$$ -152034 -215371 58955 438031 662634 650039 577028 729757 1154408 1528872 1552471
31586A552471j74787J3437K06899k1208m22754l78032J76224O21506N28464J84162
$$ 1552471 1377684 1391121 1598020 1576812 1154058 776026 952250 1573756 2102220 2286382
31576B286382M6857Q1232k9532k84368l75841j88997O9287K18665K75217K51342
$$ 2286382 2333239 2414471 2384939 2100571 1724730 1535733 1605020 1823685 2098902 2350244
31566B350244P8759j78916k82199j20107J20629K21502K07684K13650K24620J44537
$$ 2350244 2429003 2250087 1967888 1847781 1968410 2189912 2397596 2611246 2835866 2980403
31556B980403K5510J6752J13156J48882N9752j2616O8704K38769L02451J38977
$$ 2980403 3005913 3022665 3135821 3284703 3344455 3331839 3400543 3639312 3941763 4080740
31546D080740j80548m21683l63508m5635K00640J10183j53601j84373J05115L42126
$$ 4080740 3900192 3478509 3115001 3069366 3270006 3380189 3226588 3042215 3147330 3489456
31536C489456K19982n9465p4290K23693M50042L04008n9615k40231o9232K00124
$$ 3489456 3709438 3649973 3575683 3799376 4249418 4553426 4493811 4253580 4184348 4384472
31526D384472J85070j57876m28077k48987K15846M29572J88367j22393j19325
$$ 4384472 4569542 4411666 3983589 3734602 3950448 4380020 4568387 4445994 4326669
31517D326669L5414l0928k68332l16307j32324m6585j70760k09748k869J66309
$$ 4326669 4362083 4331155 4062823 3746516 3614192 3567607 3396847 3187099 3184230 3350539
31507C350539M4030j58802j22443N8938P9412l2089K5510K81292M11482K45369
$$ 3350539 3394569 3235767 3113324 3172262 3251674 3219585 3245095 3526387 3937869 4183238
31497D183238M806o7636k4158j0830r670L1078K2024r1598j47715j0296J32704
$$ 4183238 4188044 4120408 4096250 4085420 4075750 4106828 4128852 4037254 3889539 3879243 4011947
31486D011947M927k85625l30819j1979L03649K68686j3825k30456k83761k55164
$$ 4011947 4016874 3731249 3400430 3388451 3692100 3960786 3946961 3716505 3432744 3177580
31476C177580j43737P5444K54359K21242O0264k1257l1743j09432j75111m4368
$$ 3177580 3033843 3109287 3363646 3584888 3645152 3623895 3592152 3482720 3307609 3263241
31466C263241J31919j0809l91074m23277J29986O74012N26816j57469o24660m76672
$$ 3263241 3395160 3384351 2993277 2570000 2699986 3373998 3900814 3743345 3118685 2642013
31456B642013J5999M13382N05551K90318n7898k19113n8140J19624l6016l56735
$$ 2642013 2658012 3071394 3576945 3867263 3809365 3590252 3532112 3651736 3615720 3258985
31446C258985l81518p8391J33363R5724J19972L45500M17517Q9651k92473k92417
$$ 3258985 2877467 2799076 2932439 3028163 3148135 3493635 3911152 4000803 3708330 3415913
31436C415913n0431k6894k70631l76549j31162J70769J40806k03167m80149m04541
$$ 3415913 3365482 3338588 3067957 2691408 2560246 2731015 2871821 2668654 2188505 1783964
31426A783964j01896O5819l9606j66688m6319K20785L34453K19523K3358j84676
$$ 1783964 1682068 1747887 1708281 1541593 1495274 1716059 2050512 2270035 2293393 2108717
31416B108717l74686l32882P0924M35257J95336m79336p42266k30118M18371N14267
$$ 2108717 1734031 1401149 1472073 1907330 2102666 1623330 881064 650946 1069317 1583584
31406A583584K16204N2480P9782O0503M1217J51913J68633j14759l71041k14039
$$ 1583584 1799788 1852268 1932050 1992553 2033770 2185683 2354316 2239557 1868516 1654477
31396A654477R4349P9719q0690Q9326L64499R5270n61901o94162q6962L56819
$$ 1654477 1748826 1828545 1747855 1837181 2201680 2296950 1735049 1040887 953925 1310744
31386A310744L6587m15107k03235L83611N30833J67740j02870l3527N7808j5283
$$ 1310744 1347331 932224 728989 1112600 1643433 1811173 1708303 1674776 1732584 1717301
31376A717301n4222N1731R4657j08385m42203o15039l92725J99507P58056P73215
$$ 1717301 1663079 1714810 1809467 1701082 1258879 643840 251115 450622 1208678 1981893
31366A981893K19457l46803m82417l50274k61103j26284J97407L92680J10378
$$ 1981893 2201350 1854547 1372130 1021856 760753 634469 831876 1224556 1334934
31357A334934l33943l54416m1292M18k87382l02004J51813M79519K89863K7431
$$ 1334934 1000991 646575 605283 605701 318319 16315 168128 647647 937510 964941
31347I64941J42219K82455m5268n07656m04191J71026M16909L5560l68966k39410
$$ 964941 1107160 1389615 1344347 836691 432500 603526 1020435 1055995 687029 447619
31337D47619J95895L90812K21881m9138k19063k37932r0782J33672K21282J13700
$$ 447619 643514 1034326 1256207 1207069 988006 750074 659292 792964 1014246 1127946
31327A127946N4072K25838M09677K68786j46199m66941n02932l64807j40408J96396
$$ 1127946 1182018 1407856 1817533 2086319 1940120 1473179 970247 605440 465032 661428
31317F61428N02001M52128j81m26880m22741j17335N4425m5407j65317j14017
$$ 661428 1163429 1615557 1615376 1188496 765755 648420 702845 657438 492121 378104
31307C78104m558N637k3095N6472K27616L28077K51493K4711k65230n03877n21301
$$ 378104 373546 379183 356088 412560 640176 968253 1219746 1244457 979227 475350 -45951
31296d5951j79953M00684P80975N57057j38097o47165m86102O1157K95508K2145
$$ -45951 -225904 174780 955755 1512812 1374715 727550 241448 302605 598113 620258
31286F20258k25124J316L92709L54295r9917l71555j47774J95590J80132j33879
$$ 620258 395134 396450 789159 1143454 1043537 671982 524208 719798 899930 766051
31276G66051l12592j46568J46567K37640M3412k17581k65377p3311Q3728k3430
$$ 766051 453459 306891 453458 691098 734510 516929 251552 178241 261969 238539
31266B38539k52431k85610j02341J756j08447k06104r3980Q2448J08539N4354
$$ 238539 -13892 -299502 -401843 -400087 -508534 -714638 -808618 -726170 -617631 -563277
31256e63277J05642K08435J62888j2810q4100M0642J72367J04420j27729k86171
$$ -563277 -457635 -249200 -86312 -99122 -183222 -142580 29787 134207 6478 -279693
31246b79693j60875K16911N38507M77554O7902k84379k72533m1619P5164J9839
$$ -279693 -440568 -223657 314850 792404 860306 575927 303394 261775 336939 356778
31236C56778j5130L7992N5852N993J7364J29985K09729J70483P3356m6514k29547
$$ 356778 341648 379640 435492 441485 458849 588834 798563 969046 1042402 995888 766341
31225G66341l93388l23832J466K88811K96047J45519Q0176P6455m8010k50438
$$ 766341 372953 49121 50587 339398 635445 780964 861140 937595 889585 639147
31215F39147k82554q5201J06096J04875l410n9991m6254J696R1270J58607N9752
$$ 639147 356593 271392 377488 482363 478953 418962 372708 374404 465674 624281 684033
31204F84033j52400j51957K15294N97060N62606K22881L6391J02795J56795K60261
$$ 684033 531633 379676 594970 1192030 1754636 1977517 2013908 2116703 2273498 2533759
31194B533759Q39235J762275K025042R21718q59322j925717j749172r77593l87303
$$ 2533759 3372994 5135269 7160311 8082029 7222707 5296990 3547818 2570225 2182922
31185B182922j89294k95596n54060o20658k36699K29423J35840l98112n19741
$$ 2182922 1993628 1698032 1143972 523314 286615 516038 651878 253766 -265975
31176b65975M2799M78372J65119l17124j41775M15806M62542o1436l61486q8914
$$ -265975 -223176 255196 420315 103191 -38584 377222 839764 778328 416842 327928
31166C27928K35523J72184m4708p2233Q977j4332j31386k51848l31786k43843
$$ 327928 563451 735635 690927 618694 627671 613339 481953 230105 -101681 -345524
31156c45524Q4138L42716J28805l47700l90654J51771N42334J80950n04340o47477
$$ -345524 -261386 81330 210135 -137565 -528219 -376448 165886 346836 -157504 -804981
31146h04981j03277M61459M79076O6598k72892k37454L3772J78985M6153j20539
$$ -804981 -908258 -446799 32277 98875 -174017 -411471 -377699 -198714 -152561 -273100
31136b73100k5701K32192K98550Q8541j43618k40294k68169k04477N1072K85760
$$ -273100 -298801 -66609 231941 320482 176864 -63430 -331599 -536076 -485004 -199244
31126a99244J15826l25880m03331O6085M46980K48537j21945p3744K19255K23736
$$ -199244 -83418 -409298 -812629 -746544 -299564 -51027 -172972 -246716 -27461 196275
31116A96275o861k1444J51029P4860k43693l13713N555K78538K01456k7366j56823
$$ 196275 189414 167970 318999 393859 150166 -163547 -157992 120546 322002 294636 137813
31105A37813j85999j06622J52314L93014K61266j52124l16014n1648J84858N8000
$$ 137813 -48186 -154808 -2494 390520 651786 499662 183648 132000 316858 374858
31095C74858j24640J800K19629J41278r1142n5211K02663K15158j41635m19662
$$ 374858 250218 252018 471647 612925 521783 466572 669235 884393 742758 323096
31085C23096k48358J49162K87084N2073k13413j99340k902O7385m8757r9707M5012
$$ 323096 74738 223900 510984 563057 349644 150304 147402 214787 166030 66323 111335
31074A11335J41998m0413k86361k22628O4910J34173q7301j61796J23813L62552
$$ 111335 253333 212920 -73441 -296069 -231159 -96986 -184287 -346083 -222270 140282
31064A40282J66201k04415k49895K5505K32786K49531K58064K42871j3348l95024
$$ 140282 306483 102068 -147827 -122322 110464 359995 618059 860930 847582 452558
31054D52558m36235k9816K80604K6553m80030n54460q3876L62768L63136J52626
$$ 452558 16323 -13493 267111 293664 -186366 -740826 -824702 -461934 -98798 53828
31044E3828J26034J88508j1936l70906l41854K34001P47432N69441j11050n70766
$$ 53828 179862 368370 356434 -14472 -356326 -122325 625107 1194548 1083498 512732
31034E12732m89329j79959K6013J44441K30637J61770q5826k86037k90630k30578
$$ 512732 23403 -156556 -130543 13898 244535 406305 320479 34442 -256188 -486766
31024d86766k23614j67316K514J42846J80749K51523L62971K79496m134p6462
$$ -486766 -710380 -877696 -875182 -732336 -551587 -300064 62907 342403 338269 261807
31014B61807K35455M19257j0327o56852o98532m1035N82967O14958K12038k12813
$$ 261807 497262 916519 906192 249340 -449192 -490227 92740 707698 919736 706923
31004G06923m43120l86193o5053K00891O9043k65586k46808J96085M88615K74514
$$ 706923 263803 -122390 -187443 13448 82491 -183095 -429903 -233818 254797 529311
30994E29311q8856j68677q4398j24831j74028J6797K84236K52601q3967l68683
$$ 529311 440455 271778 187380 62549 -111479 -94682 189554 442155 358188 -10495
30984a0495l59022r4725K71271N27251M42550M1050l04833l13199j55516j19042
$$ -10495 -369517 -464242 -192971 334280 776830 817880 513047 199848 44332 -74710
30974g4710j36426n247J32072k2008l51198m10387q7583K34134K45517Q1052R576
$$ -74710 -211136 -216383 -84311 -106319 -457517 -867904 -955487 -721353 -475836 -394784 -385208
30963c85208N7049Q5898M2021j3109o095O8332J05005j9108k12541j66666K33146
$$ -385208 -328159 -242261 -200240 -213349 -219444 -151112 -46107 -65215 -277756 -444422 -211276
30952b11276O41997O43906K72182j21591l54262m36030k91791Q6486L19707J8987
$$ -211276 430721 1074627 1346809 1225218 870956 434926 143135 229621 549328 568315
30942E68315n10214n22559P5587M73360P8743o19258p27187j18613N32516O75999
$$ 568315 58101 -464458 -388871 84489 163232 -456026 -1183213 -1301826 -769310 -93311
30932i3311M01900J08303J4605M5939O584j70231l11222k25567k0574K5363p6373
$$ -93311 308589 416892 431497 477436 484020 313789 2567 -223000 -243574 -218211 -294584
30921b94584j0122K91977M47041J84081k26260l79866k76407j40170N901K13377
$$ -294584 -304706 -12729 434312 618393 392133 12267 -264140 -404310 -398409 -185032
30911a85032K94049N6012k89174l51721j01050J68915K97013L21166K12639n5135
$$ -185032 109017 165029 -124145 -475866 -576916 -408001 -110988 210178 422817 367682
30901C67682k60531j73861J4998o0441l16079l12958O095K01853P7620l93K34697
$$ 367682 107151 -66710 -51712 -112153 -428232 -741190 -735095 -533242 -455622 -456015 -221318
30890b21318M53037K64283j13393j65773J43204L51269J83412j33216k79072k48075
$$ -221318 231719 496002 382609 216836 360040 711309 894721 761505 482433 234358
30880B34358k13884k06593j15260O3165J62999Q5693k8779Q787J35814J08513
$$ 234358 20474 -186119 -301379 -238214 -75215 10478 -18301 -9514 126300 234813
30870B34813j04967k16042k1518K70920L12449P1985j84508k72681k31412j56748
$$ 234813 129846 -86196 -107714 163206 475655 547640 363132 90451 -140961 -297709
30860b97709r9354p6307k4507J62381L98344L78218K530l71060l83603j72014
$$ -297709 -397063 -473370 -497877 -335496 62848 441066 443596 72536 -311067 -483081
30850d83081o7064l1257J41820K74655M3839l24952k57289K42342N25783K92431
$$ -483081 -550145 -581402 -439582 -164927 -121088 -446040 -703329 -460987 64796 357227
30840C57227j3559p332R6411N5604O9454K57446K55591j61936n59868m88330k10160
$$ 357227 343668 336336 432747 488351 557805 815251 1070842 908906 349038 -139292 -349452
30829c49452j90697k58994L6992N15746N44408M3826l62608k41501J54323L49207
$$ -349452 -540149 -799143 -762151 -246405 298003 341829 -20779 -262280 -107957 241250
30819B41250J67605k44821n49585l82468K41780P52353O38351J48153p3187N6789
$$ 241250 408855 164034 -385551 -768019 -526239 226114 864465 1012618 939431 996220
30809I96220K1819l70871o54411m64693q9630L6287l9314l391J76709K68055J65990
$$ 996220 1018039 647168 -7243 -471936 -561566 -525279 -564593 -567984 -391275 -123220 42770
30798D2770p216j16935j38260j09389p5047m3004L4314J71858K58529J56213j07171
$$ 42770 35554 -81381 -219641 -329030 -404077 -447081 -412767 -240909 17620 173833 66662
30787F6662l25478k84710P1429N38912P06583L37057k37985m12303j26063J3665
$$ 66662 -258816 -543526 -472097 66815 773398 1110455 872470 460167 334104 347769
30777C47769l23950o25536l46040J94624L46772J58341J12726J55736j21043m96140
$$ 347769 23819 -601717 -947757 -753133 -406361 -248020 -135294 20442 -100601 -596741
30767e96741l14027L15170N26314R0073k13280O8693L53488J43744j04971R5252
$$ -596741 -910768 -595598 -69284 20789 -192491 -123798 229690 373434 268463 363715
30757C63715L28138P0882k78632r1683L12329J63094m28778o31088k31227J18436
$$ 363715 691853 762735 484103 392420 704749 867843 439065 -192023 -423250 -304814
30747c04814Q912k09289j58859J6423N7280J2833M0668J51659K82276L42739J96501
$$ -304814 -295902 -505191 -664050 -647627 -590347 -577514 -536846 -385187 -102911 239828 436329
30736D36329j21061k68000l3254K46035J47044j21783k2505L87976M79181L8035
$$ 436329 315268 47268 14014 260049 407093 285310 262805 650781 1129962 1167997
30726A167997m00467l86633j49198r8884k18180k51704j44484k860J16585J61518
$$ 1167997 767530 380897 231699 132815 -85365 -337069 -481553 -484413 -367828 -206310
30716b06310N9971j05579j37453l8364j5285q8339l0139J86136K44115j6958k91693
$$ -206310 -146339 -251918 -389371 -427735 -443020 -531359 -561498 -375362 -131247 -148205 -439898
30705d39898k33647P8132L27546L77672K72052L8601k60250m34731l46496r1197
$$ -439898 -673545 -595413 -267867 109805 381857 420458 160208 -274523 -621019 -712216
30695g12216J31099K24475K00426J19196Q9114J58315J76654k1944k83906k65841
$$ -712216 -581117 -356642 -156216 -37020 52094 210409 387063 365119 81213 -184628
30685a84628M9475K92516K56712J49531J40013M2846k82249n49692m09796K2918
$$ -184628 -135153 157363 414075 563606 703619 746465 464216 -85476 -495272 -472354
30675d72354L19724K74073L7913j41525j13969R7387K46501Q2576k44098k76820
$$ -472354 -152630 121443 159356 17831 -96138 1249 247750 330326 86228 -190592
30665a90592O4209K62712k4104l67340j99879K74148L96457R1684q5136Q2298
$$ -190592 -126383 136329 112225 -255115 -454994 -180846 215611 307295 222159 304457
30655C04457J50346j58437m38799k69917Q3502J01135j68496k20705Q7590L20208
$$ 304457 454803 296366 -142433 -412350 -328848 -227713 -396209 -616914 -529324 -209116
30645b09116J30701k31408k81021N9706M14015M53664K18309p7209l27960m99930
$$ -209116 -78415 -309823 -590844 -531138 -117123 336541 554850 477641 149681 -350249
30635c50249m76481j84121J73588K66005P0853p5895L4606J91013J27864m4199
$$ -350249 -826730 -1010851 -837263 -571258 -500405 -576300 -541694 -350681 -222817 -267016
30625b67016m3276J03538J13174o6969j54793K6274K75388L03131J01779r8295
$$ -267016 -310292 -206754 -93580 -160549 -315342 -289068 -13680 289451 391230 292935
$$ [...]
##END NTUPLES=NMR SPECTRUM
##END=
