##TITLE=31Pdec_BAU-J-2312
 DMSO, 24 sc
 23.12.2019
##JCAMPDX= 6.0         $$ Bruker NMR JCAMP-DX V2.0
##DATA TYPE= NMR SPECTRUM
##DATA CLASS= NTUPLES
##ORIGIN= UXNMR, Bruker Analytische Messtechnik GmbH
##OWNER= root
$$ XWIN-NMR		Version 3.5
$$ Mon Dec 23 14:14:15 2019 Russian Standard Time (UT+4h)  she@DPX200
##.OBSERVE FREQUENCY= 81.013821
##.OBSERVE NUCLEUS= ^31P
##.ACQUISITION MODE= SIMULTANEOUS
##.ACQUISITION SCHEME= undefined
##.AVERAGES= 24
##.DIGITISER RES= 17
##SPECTROMETER/DATA SYSTEM= spect
##.PULSE SEQUENCE= zgpg30
##.SOLVENT NAME= CDCl3
##.SHIFT REFERENCE= (INTERNAL, CDCl3, 0, 182.463)
##AUDIT TRAIL= $$ (NUMBER, WHEN, WHO, WHERE, WHAT)
$$ ##TITLE= Audit trail, XWIN-NMR		Version 3.5
$$ ##JCAMPDX= 5.01
$$ ##ORIGIN= Bruker BioSpin GmbH
$$ ##OWNER= she
$$ F:/spectra/data/she/nmr/P31/1/pdata/1/auditp.txt
$$ ##AUDIT TRAIL=  $$ (NUMBER, WHEN, WHO, WHERE, WHAT)
(   1,<2019-12-23 14:13:22.07 +0400>,<she>,<DPX200>,
      <created by zg, POWCHK disabled, PULCHK disabled
       configuration hash MD5:
       00 E9 B6 7A A2 85 ED C7 34 08 36 98 17 FE 4E 26
       data hash MD5: 32K
       94 1B 53 85 6A EB BC DC 42 DB F9 5F F6 8E B6 7D>)
(   2,<2019-12-23 14:13:27.28 +0400>,<she>,<DPX200>,
      <Start of raw data processing
       efp BC_mod = 2 LB = 1 FT_mod = 6 PKNL = 1 PHC0 = -1696.912 PHC1 = 99.4012 SI = 64K 
       data hash MD5: 64K
       1C 7C 07 D3 71 4B 0C A3 4D E7 D3 89 D2 CB 4A 5A>)
(   3,<2019-12-23 14:13:40.23 +0400>,<she>,<DPX200>,
      <pk PHC0 = 6.418795 PHC1 = 0 
       data hash MD5: 64K
       25 DF 7A CB 4F 42 CF DF C6 2E CC 50 87 D5 9D E1>)
(   4,<2019-12-23 14:13:43.12 +0400>,<she>,<DPX200>,
      <abs ABSG = 5 
       data hash MD5: 64K
       64 91 62 67 00 8D BD F9 A1 60 23 D3 63 E4 F0 D2>)
$$ ##END=
$$ 
$$ hash MD5
$$ FE 5D F5 3B E2 A3 E8 4B 35 E9 49 6C 22 AF D2 7A
##$RELAX= 
##$RELAX= 
##$RELAX= 
##$RELAX= 
##$RELAX= 
##$RELAX= 
##$RELAX= 
##$RELAX= 
$$ Bruker specific parameters
$$ --------------------------
##$DU= <F:/spectra>
##$EXPNO= 1
##$NAME= <P31>
##$PROCNO= 1
##$TYPE= <nmr>
##$USER= <she>
##$AMP= (0..31)
100 100 100 100 100 100 100 100 100 100 100 100 100 100 100 100 100 100 
100 100 100 100 100 100 100 100 100 100 100 100 100 100 
##$AQSEQ= 0
##$AQ_mod= 1
##$AUNM= <au_zg>
##$AUTOPOS= <>
##$BF1= 81.014009
##$BF2= 200.13
##$BF3= 200.13
##$BF4= 200.13
##$BF5= 200.13
##$BF6= 200.13
##$BF7= 200.13
##$BF8= 200.13
##$BYTORDA= 1
##$CFDGTYP= 0
##$CFRGTYP= 5
##$CHEMSTR= <none>
##$CNST= (0..31)
1 1 145 1 1 1 1 1 1 1 1 1 1 1 1 1 1 1 1 1 1 1 1 1 1 1 1 1 1 1 1 1 
##$CPDPRG= <waltz16>
##$CPDPRG1= <>
##$CPDPRG2= <waltz16>
##$CPDPRG3= <>
##$CPDPRG4= <mlev>
##$CPDPRG5= <mlev>
##$CPDPRG6= <mlev>
##$CPDPRG7= <mlev>
##$CPDPRG8= <mlev>
##$CPDPRGB= <>
##$CPDPRGT= <>
##$D= (0..31)
0 1 0 0 0 0 0 0 0 0 0 0.03 2e-05 3e-06 0 0 0 0 0 0 0 0 0 0 0 0 0 0 0 0 
0 0 
##$DATE= 1577096001
##$DBL= (0..7)
120 120 120 11 120 120 24 19 
##$DBP= (0..7)
150 150 150 150 150 150 150 150 
##$DBP07= 0
##$DBPNAM0= <>
##$DBPNAM1= <>
##$DBPNAM2= <>
$$ [...]
##$SUBNAM3= <"">
##$SUBNAM4= <"">
##$SUBNAM5= <"">
##$SUBNAM6= <"">
##$SUBNAM7= <"">
##$SUBNAM8= <"">
##$SUBNAM9= <"">
##$SW= 369.568048894756
##$SWIBOX= (0..15)
0 1 3 0 0 0 0 0 0 0 0 0 0 0 0 0 
##$SW_h= 29940.119760479
##$TD= 32768
##$TD0= 1
##$TE= 0
##$TE2= 300
##$TE3= 300
##$TEG= 300
##$TL= (0..7)
0 120 53 12 22 120 120 120 
##$TP= (0..7)
150 150 150 150 150 150 150 150 
##$TP07= 0
##$TPNAME0= <>
##$TPNAME1= <>
##$TPNAME2= <>
##$TPNAME3= <>
##$TPNAME4= <>
##$TPNAME5= <>
##$TPNAME6= <>
##$TPNAME7= <>
##$TPOAL= (0..7)
0.5 0.5 0.5 0.5 0.5 0.5 0.5 0.5 
##$TPOFFS= (0..7)
0 0 0 0 0 0 0 0 
##$TUNHIN= 0
##$TUNHOUT= 0
##$TUNXOUT= 0
##$USERA1= <user>
##$USERA2= <user>
##$USERA3= <user>
##$USERA4= <user>
##$USERA5= <user>
##$V9= 5
##$VALIST= <valist>
##$VCLIST= <CCCCCCCCCCCCCCC>
##$VD= 0
##$VDLIST= <DDDDDDDDDDDDDDD>
##$VPLIST= <PPPPPPPPPPPPPPP>
##$VTLIST= <TTTTTTTTTTTTTTT>
##$WBST= 1024
##$WBSW= 4
##$XGAIN= (0..3)
0 0 0 0 
##$XL= 0
##$YL= 0
##$YMAX_a= 33666
##$YMIN_a= -34856
##$ZGOPTNS= <>
##$ZL1= 120
##$ZL2= 120
##$ZL3= 120
##$ZL4= 120
##$ABSF1= 182.463
##$ABSF2= -187.1042
##$ABSG= 5
##$ABSL= 3
##$ALPHA= 0
##$AQORDER= 0
##$ASSFAC= 0
##$ASSFACI= 0
##$ASSFACX= 0
##$ASSWID= 0
##$AUNMP= <proc_1d>
##$AZFE= 0.1
##$AZFW= 0.5
##$BCFW= 0
##$BC_mod= 2
##$BYTORDP= 0
##$COROFFS= 0
##$CY= -3
##$DATMOD= 1
##$DC= 0
##$DFILT= <>
##$DTYPP= 0
##$F1P= 0
##$F2P= 0
##$FCOR= 1
##$FTSIZE= 65536
##$FT_mod= 6
##$GAMMA= 0
##$GB= 0
##$INTBC= 1
##$INTSCL= 5.30512e-09
##$ISEN= 30
##$LB= 1
##$LEV0= 0
##$LPBIN= 0
##$MAXI= 10000
##$MC2= 0
##$MEAN= 0
##$ME_mod= 0
##$MI= 50
##$NCOEF= 0
##$NC_proc= -4
##$NLEV= 6
##$NOISF1= 182.463
##$NOISF2= 159.3651
##$NSP= 0
##$NTH_PI= 0
##$NZP= 0
##$OFFSET= 182.463
##$PC= 4
##$PHC0= -1690.493
##$PHC1= 99.4012
##$PH_mod= 1
##$PKNL= yes
##$PPARMOD= 0
##$PSCAL= 0
##$PSIGN= 0
##$REVERSE= no
##$SF= 81.0140089999434
##$SI= 65536
##$SIGF1= 159.3651
##$SIGF2= -187.1042
##$SINO= 113.3802
##$SIOLD= 16384
##$SREGLST= <1H.CDCl3>
##$SSB= 0
##$STSI= 65536
##$STSR= 0
##$SW_p= 29940.119760479
##$SYMM= 0
##$S_DEV= 0
##$TDeff= 32768
##$TDoff= 0
##$TI= <>
##$TILT= no
##$TM1= 0
##$TM2= 0
##$TOPLEV= 0
##$USERP1= <user>
##$USERP2= <user>
##$USERP3= <user>
##$USERP4= <user>
##$USERP5= <user>
##$WDW= 1
##$XDIM= 65536
##$YMAX_p= 403299790
##$YMIN_p= -8116940
$$ End of Bruker specific parameters
$$ ---------------------------------
##NTUPLES= NMR SPECTRUM
##VAR_NAME=  FREQUENCY,     SPECTRUM/REAL,   SPECTRUM/IMAG
##SYMBOL=    X,             R,               I
##VAR_TYPE=  INDEPENDENT,   DEPENDENT,       DEPENDENT
##VAR_FORM=  AFFN,          ASDF,            ASDF
##VAR_DIM=   65536,         65536,           65536
##UNITS=     HZ,            ARBITRARY UNITS, ARBITRARY UNITS
##FACTOR=    0.456856943014862, 1,           1
##FIRST=     14782.0589164792, 0,            0
##LAST=      -15158.0608439998, 0,           0
##MIN=       -15158.0608439998, -8116940,    0
##MAX=       14782.0589164792, 403299790,    0
$$ Real data points
##PAGE= N=1
##DATA TABLE= (X++(R..R)), XYDATA
$$ [...]
41519 858736 1438501 1433620 995691 549469 322241 279256 347384 489140 597259 514463
41509 514463 218075 -120699 -317456 -349685 -312134 -261851 -176188 -45924 60876 73457
41499 73457 42242 123864 384970 643586 597037 157695 -385674 -605262 -334098 193079
41489 193079 579205 608052 356815 31595 -229187 -365886 -309470 -28963 323996 485945
41479 485945 400125 330100 507680 784430 834733 620670 400776 306473 203224 17494
41469 17494 -106497 -105831 -162455 -352705 -375228 72046 767380 1117857 820897 145823 -451033
41458 -451033 -788003 -976909 -1125513 -1132065 -787839 -84306 635625 961801 862153 673556
41448 673556 605270 493401 193018 -46840 112194 564919 849361 727440 421018 284211
41438 284211 461510 848220 1172663 1139928 715796 257114 150843 350973 496397 435648
41428 435648 341503 315840 231696 58935 12413 195864 366220 277973 68100 53171 259831
41417 259831 401995 299387 114637 114685 308266 419144 219701 -194144 -558081 -817490
41407 -817490 -1137756 -1485209 -1495109 -989048 -363990 -106080 -105192 92336 455873 454173 -75653
41396 -75653 -603735 -656975 -401472 -203307 -69265 106321 134021 -166541 -512428 -470420
41386 -470420 -76490 262323 366046 386309 385434 200021 -249523 -781877 -1098657 -958295
41376 -958295 -350197 306865 382993 -213315 -730099 -446874 330768 675923 323420 -84927
41366 -84927 -74920 27720 -196725 -523500 -498733 -199645 -94047 -342330 -651867 -723576
41356 -723576 -518771 -158287 172373 285440 195562 192200 489255 881996 981466 723329
41346 723329 406682 272843 288509 327924 319609 188645 -104085 -392611 -385548 -24684 389886
41335 389886 535670 398005 167555 -52520 -290768 -551118 -780959 -971424 -1149968 -1274688
41325 -1274688 -1268244 -1177470 -1157695 -1225599 -1157439 -776694 -277909 -81947 -336800 -713513
41315 -713513 -785519 -498581 -142557 62130 173165 317635 458571 488729 458978 540822
41305 540822 737133 769825 375135 -328528 -887475 -947840 -554199 -4033 448929 667375
41295 667375 583330 287914 84926 215438 538132 704327 644673 620341 764637 892553
41285 892553 872123 838456 830276 556641 -138007 -834922 -978008 -610207 -273513 -257402
41275 -257402 -353430 -326879 -203448 -26033 273798 623962 758509 574584 284609 85867
41265 85867 -67511 -235950 -292567 -108379 256447 657058 959285 969369 550406 -70359
41255 -70359 -397695 -238844 71225 155418 18152 -174222 -393068 -580126 -511784 -160685
41245 -160685 71845 -161997 -654835 -962942 -1002212 -948021 -770379 -351756 60219 36577
41235 36577 -395488 -749632 -752927 -610573 -548839 -506616 -389295 -263699 -170200 -46181 72186
41224 72186 75995 63747 236532 449936 300820 -200472 -508180 -323369 -30270 -10217
41214 -10217 29267 543035 1293146 1598530 1297279 886433 726098 660385 521003 468288
41204 468288 574998 494184 -83535 -870660 -1242519 -973189 -430828 -75389 -17534 -98822
41194 -98822 -171600 -179099 -99421 39669 130391 82228 -44654 -74682 98492 404273 671459
41183 671459 768782 684986 539188 501718 607204 646602 387042 -63042 -291078 -90228
41173 -90228 260835 406625 405756 533042 745017 728162 443387 210395 184690 153221 -15340
41162 -15340 -121760 -48615 -24036 -176357 -202172 122821 424850 222938 -284674 -486949
41152 -486949 -296050 -202992 -380930 -381711 56532 469628 311698 -263505 -684089 -750339
41142 -750339 -714115 -726455 -637717 -340741 23251 261739 302393 116656 -322244 -897174
41132 -897174 -1279142 -1137586 -460437 351396 788405 727462 575079 764292 1145670 1122572
41122 1122572 436344 -463387 -964353 -937085 -644554 -282610 91815 365033 433215 373364
41112 373364 281207 57706 -360637 -701698 -641623 -290322 -12352 154874 454725 810880
41102 810880 810890 415260 158070 374984 675932 535584 52800 -282304 -320036 -315711 -405953
41091 -405953 -437513 -292556 -58529 139873 242166 194756 -12945 -279870 -505931 -689473
41081 -689473 -778827 -605008 -190231 58138 -214444 -776916 -1043191 -782040 -293582 60183
41071 60183 165925 39803 -234066 -427268 -377702 -307305 -575378 -1077182 -1281620 -954703
41061 -954703 -434894 -53137 280742 685103 931860 816278 583241 605948 855649 1028238
41051 1028238 1005213 862857 612370 280860 90570 191075 339161 216738 -43767 -57082
41041 -57082 168209 239337 54674 -772 321429 722235 801059 604982 453831 415313
41031 415313 251043 -169573 -630551 -795482 -580604 -240714 -60788 6253 265059 787357
41021 787357 1195037 1129112 765177 564944 622365 623719 430284 282337 332013 370938 202526
41010 202526 -56695 -254944 -451647 -627440 -480762 111549 671826 605291 2470 -475666
41000 -475666 -503545 -451068 -727983 -1155361 -1247824 -892580 -448679 -239790 -211665 -147343
40990 -147343 -24460 6984 -67337 -47285 180797 435359 498865 466363 591380 831440
40980 831440 849088 522114 151843 29105 72711 81172 62093 56328 -106537 -542789 -995199
40969 -995199 -1139937 -1066493 -1068162 -1083432 -803336 -280283 78556 172776 346414 728788
40959 728788 965272 856010 755057 953284 1099984 729464 45541 -364716 -395283 -425006
40949 -425006 -554515 -440388 51257 564058 776027 758383 655546 453404 275243 458055
40939 458055 1016579 1408535 1208826 713716 472174 484382 341334 -18962 -224790 -96561
40929 -96561 132867 260499 329257 327577 105434 -283075 -549532 -620220 -715354 -835614 -645522
40918 -645522 -127192 144996 -200697 -680974 -619327 -133830 140064 84136 151212 447152
40908 447152 504517 119210 -264217 -289933 -224661 -372457 -473985 -189339 215434 246419
40898 246419 627 -10389 236735 178519 -435002 -1093446 -1235770 -1000878 -923802 -1120295
40888 -1120295 -1156705 -705390 -35292 280271 38079 -356307 -375778 -17213 208562 -22858
40878 -22858 -378509 -316113 142995 432197 241401 -64356 -4871 326350 432512 130983
40868 130983 -230312 -287801 -120253 -70029 -276260 -554018 -682299 -655083 -600561 -545201
40858 -545201 -372860 -42361 245731 220047 -110843 -396941 -330380 -21195 145129 8602
40848 8602 -176919 -125750 72548 98762 -132515 -379812 -447289 -407206 -352025 -162783 250464
40837 250464 623166 550294 32786 -433329 -394458 90585 580490 717594 509857 262674
40827 262674 262127 420211 270885 -479744 -1412638 -1705204 -1091759 -226461 103419 -136094
40817 -136094 -379884 -260038 109639 496933 780468 822788 508218 18499 -238015 -133539
40807 -133539 -26429 -279205 -739586 -907973 -551226 25431 327412 189439 -95824 -140205
40797 -140205 99911 306865 215850 -78618 -297979 -325167 -240818 -134513 -62883 -100903
40787 -100903 -213724 -141616 328785 987720 1357772 1259809 975825 796501 670295 408996
40777 408996 2478 -418609 -748178 -900836 -818719 -610282 -503422 -523802 -412423 -39144
40767 -39144 291063 192388 -250361 -544666 -387874 6952 210750 44523 -323026 -656470
40757 -656470 -925789 -1235145 -1502934 -1394073 -756145 -4108 247534 -51761 -338103 -241307
40747 -241307 -54684 -169003 -415178 -358508 4106 280926 275841 101771 -208837 -721438
40737 -721438 -1204367 -1204939 -677651 -134274 34597 29806 191635 423201 428316 294821 406137
40726 406137 821589 1133452 1022891 670024 462726 480881 447260 129217 -345477 -598010
40716 -598010 -390890 100266 432625 348520 49100 -52440 179866 477704 539442 377058
40706 377058 200627 90267 -37297 -189624 -246620 -194904 -211665 -391554 -555903 -516431
40696 -516431 -406672 -508016 -790209 -895925 -629874 -208973 86163 266755 450191 521911
40686 521911 280849 -143877 -331321 -96266 253340 318468 96592 -118657 -219458 -405343
40676 -405343 -780046 -1074661 -973141 -579726 -293165 -242941 -162229 91687 231395 -600
40666 -600 -345163 -366455 -110176 -5840 -186283 -343765 -265090 -56582 218853 630706
40656 630706 964637 754409 13630 -562103 -509669 -264098 -434262 -820246 -762276 -201933
40646 -201933 267483 288247 36362 -316568 -773768 -1078025 -769391 93465 811775 920282
40636 920282 724854 689106 733951 525336 112089 -156790 -162820 -92536 -84438 -101146 -93555
40625 -93555 -54951 58949 296163 607710 855968 882015 585018 79717 -265689 -195877
40615 -195877 35621 -50783 -465856 -743288 -709585 -753025 -1075712 -1209452 -734867 -58935
40605 -58935 123923 -111607 -69333 438064 778367 462741 -137448 -329940 10200 419466
40595 419466 514697 379314 316364 412141 419169 58906 -597113 -1140072 -1246689 -950881
40585 -950881 -431479 232549 890230 1143630 718846 -72344 -607307 -674968 -580519 -541020
40575 -541020 -400273 -60583 215382 185396 7994 -47170 -49119 -249315 -609444 -817473
40565 -817473 -753943 -649926 -714705 -834741 -773319 -525177 -308403 -254999 -273986 -255611 -263305
40554 -263305 -393746 -529342 -426985 -79126 199517 141759 -166588 -471769 -690469 -881887
40544 -881887 -997299 -897852 -608877 -355780 -310384 -430516 -560662 -581198 -468108 -306785
40534 -306785 -218280 -184907 -26654 334748 697495 822174 733447 589361 397945 136274
40524 136274 16285 256184 628513 649363 277783 24208 221503 561006 570068 239489
40514 239489 -88542 -226624 -262282 -311988 -378900 -379576 -205414 113293 268560 -35763 -557349
40503 -557349 -623003 11967 734369 811398 282183 -244239 -425724 -374467 -183380 205648
40493 205648 660673 855067 707798 484324 384964 351045 328500 368633 378085 136803 -286101
40482 -286101 -483556 -272217 20989 66400 13193 163268 432207 509155 383415 319461
40472 319461 388671 408194 336741 366647 560775 720145 713607 649654 594727 405905 27522
40461 27522 -303408 -390281 -401872 -567152 -708300 -458939 88837 361265 44855 -483262
40451 -483262 -673430 -484820 -262816 -120904 164874 633204 877619 526962 -193826 -644441
40441 -644441 -508825 -155473 -153552 -544257 -785403 -449457 217528 603699 478548 169907
40431 169907 14104 -31771 -85340 14858 418101 806064 657793 -22612 -613888 -625802
40421 -625802 -253562 -36340 -193293 -483654 -573227 -359285 -8989 202289 139328 -58873
40411 -58873 -165810 -165237 -199537 -251501 -154109 35336 17197 -224770 -233039 280381 880772
40400 880772 900167 309241 -321526 -626720 -737346 -765800 -522636 44357 538383 568034
40390 568034 280795 134722 278347 449203 417103 239859 60665 -96856 -231573 -246556
40380 -246556 -87200 88652 49511 -196666 -370136 -255047 54616 337918 543991 719442
40370 719442 725080 319377 -406608 -947856 -915903 -473899 -74274 60770 -2463 -179397
40360 -179397 -395294 -444077 -152021 302879 502019 264594 -178749 -491917 -517264 -291557
40350 -291557 -29019 -67910 -540854 -1074936 -1126659 -671033 -235335 -163147 -209764 -36776
40340 -36776 259813 389183 337329 280214 244852 175797 160811 269668 325698 173441 26356
40329 26356 161907 378480 211184 -317723 -646783 -494309 -270137 -411793 -685762 -532913
40319 -532913 96294 658595 731883 471249 284756 318111 408395 386579 236848 2351
40309 2351 -289441 -553609 -628487 -456388 -235214 -238254 -459452 -584403 -387703 -19705
40299 -19705 223134 283240 313081 348808 257598 27020 -120343 -5020 258996 398824
40289 398824 284328 19697 -199707 -260080 -199822 -137563 -112390 -46141 67996 47009 -229964
40278 -229964 -521415 -440353 11805 411365 488980 433386 466229 442415 162557 -169778
40268 -169778 -175882 147189 466496 619638 703310 694423 409746 -75158 -356814 -216307
40258 -216307 111624 338879 475130 583044 518248 216737 -26042 65359 257484 86598
40248 86598 -456363 -900090 -943473 -773207 -677313 -676006 -668919 -681658 -776178 -862965 -760915
40237 -760915 -396782 95221 411627 271715 -266772 -721389 -633781 -122356 222952 23501
40227 23501 -518686 -941944 -965076 -583273 -17865 354887 312477 107572 183641 512744
40217 512744 612625 334433 130919 281144 381113 39984 -397963 -403987 -148232 -146040 -303504
40206 -303504 -109555 345980 405160 -46309 -351062 -190121 -103313 -506748 -930364 -786960
40196 -786960 -301548 -33974 53122 332354 642272 460985 -155480 -528097 -302415 158704
40186 158704 433768 534353 542494 265141 -397641 -1048079 -1131525 -593691 46313 264598
40176 264598 34305 -253023 -294255 -225830 -384998 -751538 -848749 -328045 557313 1272720
40166 1272720 1602426 1649944 1426444 851789 123516 -328794 -337546 -139679 17169 94770
40156 94770 53910 -196935 -511086 -511449 -84747 408446 599639 528906 424452 350027 287294
40145 287294 295734 333716 168558 -254108 -591329 -577121 -486069 -718075 -1089878 -1031344 -454606
40134 -454606 73329 131439 -28080 38395 325204 508675 460535 307013 129330 -67236
40124 -67236 -144263 89920 536535 791391 597603 161853 -106766 -75083 27906 -46621
40114 -46621 -277058 -446806 -412454 -229006 -41794 74870 140131 153540 21565 -342333
40104 -342333 -838327 -1167154 -1070534 -592072 -58315 213397 171740 11904 -54481 2744
40094 2744 40387 -63154 -234833 -282468 -159640 -52761 -113091 -202743 -70836 276601 583078
40083 583078 690494 644191 449595 36344 -431617 -538473 -132715 394828 600323 521059
40073 521059 437908 350061 77094 -279899 -421638 -327139 -216149 -66324 367767 1005777
40063 1005777 1380534 1264766 946110 719091 513829 235488 65698 139589 258102 220375
40053 220375 150564 203952 241124 111148 -25144 -327 11993 -154544 -241169 28365 349895
40042 349895 220730 -193163 -199359 363628 821714 630825 129336 -21838 202783 206260
40032 206260 -392636 -1261812 -1717020 -1429417 -743085 -308267 -383504 -577344 -387888 125895
40022 125895 448180 311882 -12888 -168597 -139373 -119466 -212591 -404311 -626175 -712972
40012 -712972 -482288 9837 449971 610713 561470 470636 403715 409502 567600 797877
40002 797877 837596 587484 294728 211749 255375 199912 27828 -139127 -300213 -514756
39992 -514756 -698153 -723610 -626264 -472253 -159065 347862 686474 409983 -335379 -828614
39982 -828614 -624842 -85054 150564 -31242 -217576 -124138 93182 202496 272267 500665
39972 500665 820879 927683 721330 505139 576974 758845 604278 82770 -250119 51837
39962 51837 694948 1005690 798115 522627 542776 654349 511219 215547 153002 389520
39952 389520 600314 608735 655198 979018 1384410 1471820 1188148 887270 843093 931551 884203
39941 884203 684175 549323 585864 614954 386379 -96270 -521737 -577983 -318514 -146760
39931 -146760 -348398 -708055 -755970 -371388 82816 267094 239631 193471 101605 -125671
39921 -125671 -354278 -418874 -445687 -626259 -779172 -550668 -27298 285098 157939 -97178
39911 -97178 -173808 -163981 -228480 -277932 -238292 -279651 -484531 -603712 -464988 -327405 -457344
39900 -457344 -617966 -410890 72648 395632 425815 372496 275023 -29557 -437142 -592798
39890 -592798 -459813 -394757 -523565 -512501 -170523 153462 67858 -307832 -591190 -653595
39880 -653595 -576919 -352983 9702 253973 119562 -262755 -532337 -575967 -542364 -460923
39870 -460923 -206843 144405 283776 93643 -181690 -322403 -430567 -657841 -852075 -730389
39860 -730389 -303149 118371 318291 374699 439169 507619 499976 431355 373739 313805 179732
39849 179732 -5214 -114861 -91005 -25363 -20819 -47248 -7165 105760 202994 246512 315975
39838 315975 497849 748286 908349 859440 646581 428662 308565 249441 176367 94384
39828 94384 30560 -86485 -360148 -740340 -1034165 -1127758 -1074617 -937958 -697281 -371358
39818 -371358 -74424 148499 400382 735404 1014526 1071939 899345 565838 122989 -279654
39808 -279654 -382450 -114966 256467 473524 589806 711768 679601 342323 -49032 -135269
39798 -135269 -4783 -13882 -151002 -95170 105334 -15132 -581373 -1105022 -1189517 -1027182
39788 -1027182 -918560 -744573 -278936 321772 714924 801109 647398 267196 -185137 -287524
39778 -287524 168897 766360 913459 548766 43691 -383945 -729071 -848035 -565402 -98449
39768 -98449 99105 -40391 -142149 -8115 114460 -2068 -202347 -231985 -105945 3472
39758 3472 55055 132499 252824 310764 190650 -83695 -292796 -205064 111918 313872 240938
39747 240938 155284 314476 543339 544223 420203 481133 682912 727598 625937 638049 680551
39736 680551 373439 -230703 -547332 -297095 88776 174266 127099 253831 362464 63171
39726 63171 -554528 -981553 -888883 -356751 333437 854481 958364 736978 613955 835804
39716 835804 1147885 1200247 1025274 813358 479138 -134872 -791782 -1045775 -843106 -551787
39706 -551787 -409616 -300137 -96901 97468 132182 1114 -188746 -280116 -130147 219014
39696 219014 507729 569448 548702 608274 608309 379067 139031 248040 633523 862070 741599
39685 741599 470513 234823 74295 118222 478190 871027 847585 496863 408656 766192
39675 766192 1008202 670960 64538 -263114 -285863 -258754 -100380 396424 943397 964856
39665 964856 427012 -55146 -42684 205864 196687 -136087 -448204 -487483 -370618 -392043
39655 -392043 -661293 -969612 -1051766 -959541 -1017764 -1322989 -1478421 -1040495 -109981 767478
39645 767478 1218861 1296707 1157428 826081 390382 144683 302963 677766 852633 671877
39635 671877 415821 430639 666923 714273 333545 -177134 -321594 -58071 151511 16118
39625 16118 -159901 41957 484260 639766 339256 -12328 944 341745 711873 942198
39615 942198 1049743 1103827 1184606 1342637 1490131 1451636 1201044 907701 667436 356398
39605 356398 -122776 -601986 -817749 -721017 -470912 -209127 5268 109740 66283 -32323
39595 -32323 -21657 150383 376174 512953 493467 354815 227476 236747 332442 297897 49694
39584 49694 -160352 -35103 308970 410340 59306 -385964 -432609 -54631 337727 448446
39574 448446 366484 255673 34534 -434754 -969037 -1144096 -789402 -204067 211537 374849
39564 374849 445556 493966 460277 359331 277757 176619 -62225 -369436 -531137 -570553
39554 -570553 -785583 -1229796 -1448370 -1035515 -259780 228642 217752 79024 113231 175289
39544 175289 77004 -21612 111323 362253 431159 281383 163403 244380 435504 568050
39534 568050 559841 414725 209560 78652 88985 152998 171627 193740 282885 309930 103615
39523 103615 -221355 -339233 -147156 121222 272890 371279 450971 309062 -169376 -682638
39513 -682638 -813617 -561437 -289489 -202002 -169128 -73363 -23896 -131063 -306104 -406305
39503 -406305 -396364 -264577 30931 407918 634925 610586 502596 454803 357648 143098
39493 143098 107585 566051 1246248 1453671 957934 357366 330504 787370 1068099 828710
39483 828710 372090 106236 22684 -120703 -321927 -302198 75132 554671 749844 572535
39473 572535 300187 220423 307541 326174 201958 145031 342702 643012 695374 394134
39463 394134 34652 -33045 203706 472703 584095 599224 631960 630138 452563 100230
39453 100230 -239671 -392840 -374957 -337442 -368323 -387470 -249114 70691 421979 628694
39443 628694 645265 516949 244941 -165945 -518115 -492710 -68954 285463 100936 -473349
39433 -473349 -825231 -679747 -419338 -472855 -718204 -773490 -623257 -556225 -607002 -517418
39423 -517418 -283797 -292982 -727770 -1203830 -1282497 -1076620 -997770 -1065331 -879479 -292685
39413 -292685 268816 336508 30937 -79473 298501 798992 814010 202584 -546598 -877511
39403 -877511 -752217 -548532 -486775 -419823 -216685 -48112 -95264 -198382 -74285 241009
39393 241009 465325 528670 642362 889228 1056367 979292 782902 627442 445382 129288
39383 129288 -197045 -327413 -283490 -242812 -213539 -23640 341902 606343 513731 169331
39373 169331 -40922 147733 601767 906393 754541 243951 -202695 -225118 156050 583454
39363 583454 694814 432607 87538 39589 394164 864595 1067932 915914 624393 376946
39353 376946 152633 -93360 -289707 -390651 -467527 -520584 -388192 -32272 266525 253980
39343 253980 101919 158835 400892 496532 387579 378145 555252 572205 259177 53459
39333 53459 412812 1039608 1167032 567759 -155164 -352621 -38683 327076 453829 381933
39323 381933 236221 95049 40423 114375 223771 248632 248534 407085 741999 1025097 1071241
39312 1071241 977485 945727 958678 821500 525568 363491 559135 914995 1006216 682665
39302 682665 205197 -118760 -250938 -313335 -346731 -325255 -301836 -363287 -468301 -468387 -287211
39291 -287211 22199 370719 657766 723821 449266 -41449 -406001 -406597 -134493 148608
39281 148608 309007 395366 465566 489428 437536 370462 363230 353160 147308 -328877 -806278
39270 -806278 -843500 -324325 330227 608428 480709 305243 221823 -17230 -514650 -885387
39260 -885387 -726392 -196655 207826 314588 333811 323447 45851 -524781 -950677 -856303
39250 -856303 -461113 -289688 -478919 -663635 -523123 -188899 -45286 -279471 -710407 -993901
39240 -993901 -943948 -669296 -409422 -267392 -174390 -102279 -153839 -350491 -466631 -246792
39230 -246792 249932 660487 674259 300737 -189495 -516354 -618328 -682135 -879359 -1048130
39220 -1048130 -807034 -102119 559835 657072 289679 -13027 -18743 28691 -63751 -140015
39210 -140015 -49765 54499 173 -83346 18285 227876 253984 -46575 -552299 -1027081
39200 -1027081 -1252227 -1133923 -824147 -612511 -569944 -457809 -133224 163717 147578 -77991
39190 -77991 -197734 -141971 -59148 36422 220607 323615 40305 -575294 -1078474 -1190136
39180 -1190136 -1076855 -976843 -864085 -647106 -425217 -335160 -333615 -313470 -273478 -220008
39170 -220008 -75832 145549 240871 76807 -190166 -330433 -339270 -326576 -243543 39411
39160 39411 443615 694493 621905 306400 -29742 -140581 140392 695378 1052227 769758
39150 769758 -27036 -665408 -583899 111670 805768 989444 645314 109404 -300562 -482296
39140 -482296 -478526 -344664 -120696 158084 501822 952714 1433840 1679536 1466031 890453
39130 890453 279551 -150612 -384667 -415924 -221695 44564 107514 -84156 -284021 -294681
39120 -294681 -144962 143193 632501 1158774 1295293 895615 380210 190739 244095 263992
39110 263992 345448 714532 1135991 1114516 636647 204895 111894 153164 125564 139740 283904
39099 283904 383661 300472 158946 100793 80435 42743 30062 -15567 -262801 -648341 -811036
39088 -811036 -561199 -181922 -86537 -374232 -839735 -1178904 -1081082 -435478 377633 717805
39078 717805 436722 116043 315857 884957 1306092 1414704 1377088 1195502 731177 153418
39068 153418 -95577 137605 515235 659497 562072 454831 469934 547770 583869 570701
39058 570701 588671 660710 666981 509114 316154 284268 308787 60381 -479635 -871076 -779918
39047 -779918 -397836 -74672 165057 440636 630961 551366 320890 176070 77222 -119965
39037 -119965 -252378 -39159 399443 636050 516027 259008 29664 -180631 -272307 -89938
39027 -89938 200570 215925 -85589 -351837 -417024 -494384 -655470 -571760 -26522 667989
39017 667989 1030512 924238 510498 -14333 -399731 -349249 137979 610736 630521 281982
39007 281982 9496 64544 314386 494144 456388 237198 24249 11060 193742 379948
38997 379948 440978 438633 467077 518324 545132 497754 281363 -115693 -434177 -359689 -3083
38986 -3083 132197 -190815 -593576 -589054 -204064 127562 112782 -179870 -512302 -680989
38976 -680989 -599263 -321591 35280 402625 703416 781515 625367 568464 893302 1273726
38966 1273726 1104220 452890 105692 432979 806574 534768 -170531 -681100 -926076
38957 -926076 -1219521 -1456768 -1240162 -677445 -332894 -362884 -342786 -53367 161439 31611
38947 31611 -150129 17225 434333 648058 427448 -21710 -324946 -304257 -121325 -68984
38937 -68984 -197064 -271220 -176458 -108736 -161894 -35572 470916 943469 845862 368666 200744
38926 200744 489126 641633 268633 -262916 -440719 -281507 -110502 -54116 -47740 -61033
38916 -61033 -61636 19242 108669 16898 -227437 -342908 -227208 -122629 -209739 -359620 -449624
38905 -449624 -573297 -731674 -677926 -334800 -28843 745 15084 334406 741897 747536
38895 747536 306425 -123655 -203283 -72208 -75360 -344075 -666448 -666942 -172266 533621 944432
38884 944432 875273 588156 347854 165283 86518 329580 865563 1229619 1114290 857199
38874 857199 936036 1234728 1269298 945646 588322 337583 54618 -203084 -160980 138017
38864 138017 290813 187239 222734 596875 836600 434330 -302369 -520455 91118 883143
38854 883143 1035925 491383 -107814 -245776 -17706 201809 259988 214019 62232 -186093
38844 -186093 -284967 16201 510635 711587 576514 604309 1008779 1271594 893525 191337
38834 191337 -152232 -52636 20379 -124751 -229820 -222855 -406987 -867934 -1211661 -1130651
38824 -1130651 -832629 -655201 -589357 -465677 -349618 -436959 -697024 -886894 -864331 -710108
38814 -710108 -584387 -577201 -645158 -620886 -370568 -9662 152408 -15317 -244661 -153392
38804 -153392 281525 651439 543901 -16052 -599405 -824853 -692147 -432208 -173000 62963
38794 62963 140113 -81965 -395065 -367328 27899 262461 -46058 -631938 -1044835 -1219503
38784 -1219503 -1210826 -799944 55547 716702 538785 -103216 -218148 404336 964708 884117
38774 884117 461577 104662 -274511 -710426 -779091 -287776 206952 139503 -277892 -554435
38764 -554435 -728677 -1039115 -1212590 -853029 -290253 -243279 -720574 -1009403 -777718 -446925
38754 -446925 -332714 -143728 343629 721020 527848 2396 -226993 12078 318399 334854
38744 334854 116378 -91016 -124605 81897 499376 907486 977264 605623 94157 -140407
38734 -140407 -13885 178943 150547 -101342 -443455 -834299 -1231404 -1425671 -1243512 -876338
38724 -876338 -721151 -842596 -856256 -454633 170827 563116 483510 56356 -405871 -636402
38714 -636402 -641225 -743589 -1189641 -1682228 -1623727 -926139 -218585 -52711 -257468 -350514
38704 -350514 -240722 -159370 -177749 -211337 -312080 -553260 -767000 -767893 -688316 -710523 -627419
38693 -627419 -114586 662995 1176367 1224670 1072221 927182 729197 466056 264501 117731
38683 117731 -80795 -210746 -56131 209252 136262 -315882 -679521 -677118 -529885 -403825
38673 -403825 -77367 539833 1017972 928050 434435 21858 -96126 9381 260400 504523
38663 504523 426997 -72922 -589738 -657667 -345183 -69945 15087 61279 72395 -132297
38653 -132297 -489572 -645698 -467331 -280309 -416288 -739662 -838697 -587755 -315866 -381680
38643 -381680 -700294 -819008 -476833 50909 298551 199095 109269 286450 617209 901023
38633 901023 1095397 1164395 997515 671500 497171 549012 424695 -183139 -884480 -979737
38623 -979737 -378798 261931 353162 -2139 -283182 -195777 86810 185130 -84046 -522868
38613 -522868 -771700 -730539 -638417 -656939 -591406 -249719 110461 41918 -446268 -862123
38603 -862123 -891098 -761397 -839562 -1126645 -1315637 -1170727 -704533 -111101 345627 471228
38593 471228 291179 31390 -99488 -73165 3574 10978 -107236 -288183 -352534 -152599
38583 -152599 258825 666285 888688 885445 723977 541375 489870 603170 743906 769512
38573 769512 682467 527374 276297 -16350 -98963 168494 491371 458309 157804 111074
38563 111074 527581 1004992 1136964 1071374 1187859 1476447 1583198 1358426 1032291 849179
38553 849179 784923 682863 493116 303350 234052 348282 590652 788533 783038 597591
38543 597591 432642 446850 555052 500812 181056 -137599 -58744 423142 780502 500109
38533 500109 -296398 -978312 -1125453 -889601 -613017 -374469 -88762 150586 98729 -299123
38523 -299123 -777238 -996900 -855087 -555174 -411819 -550008 -769273 -757004 -438276 -22081
38513 -22081 287737 461003 488664 286309 -110325 -441723 -515472 -470547 -542949 -679545
38503 -679545 -633929 -383848 -174009 -127094 -76661 129527 383042 499846 486822 481532 536459
38492 536459 589408 562977 382894 -11473 -538152 -917312 -901922 -558697 -195044 -1278
38482 -1278 117969 340130 676794 979731 1089289 913413 470580 -34913 -271506 -86609
38472 -86609 253648 294960 -89911 -559782 -752554 -723890 -789291 -1028676 -1163661 -947857
38462 -947857 -498915 -144217 -41198 -74246 -99480 -169134 -438988 -882061 -1199380 -1113384
38452 -1113384 -727287 -455204 -534661 -737167 -681775 -322327 63345 306761 531150 861693
38442 861693 1170182 1227850 980553 563721 141388 -178172 -352995 -417918 -421263 -321261
38432 -321261 -63849 206505 207262 -101535 -398068 -435924 -395554 -525893 -609392 -204662 580844
38421 580844 1021124 684058 57360 -74174 339699 610191 279585 -316518 -571103 -356228
38411 -356228 -21900 134554 103071 -44253 -285475 -526797 -579030 -371637 -60840 159820
38401 159820 248914 261716 246974 284058 467777 720934 763554 452299 46474 -76198
38391 -76198 93139 216186 89163 -139268 -258344 -266178 -262828 -261874 -220820 -131399 2684
38380 2684 170821 294678 284676 182826 111843 84709 48525 99558 383307 745085 805296
38369 805296 495425 184437 116995 107260 21462 109444 442613 458420 -292693 -1205381 -1197863
38358 -1197863 -222808 561573 318321 -469459 -868181 -733838 -565842 -591128 -632159 -655734
38348 -655734 -835678 -1108751 -1163331 -896590 -493640 -57554 436009 796945 682779 143448
38338 143448 -279780 -202227 162983 412372 497927 594195 668824 536808 236144 32024
38328 32024 61541 211638 343116 428157 463470 438672 409597 439591 459024 344275 137722
38317 137722 6324 -38085 -172900 -456988 -691691 -702566 -588799 -549181 -595832 -600174 -519010
38306 -519010 -400170 -228062 54647 383215 586916 596186 518614 471131 422190 257019
38296 257019 -29837 -256027 -213667 59249 240374 82840 -218671 -215614 211272 691181
38286 691181 881106 870054 867878 773742 401491 -46552 -153984 102291 307198 190767
38276 190767 -96107 -316752 -387866 -230178 201255 604024 481459 -149186 -593368 -340866
38266 -340866 246389 481121 292622 158377 271872 297208 -33475 -506151 -728981 -571363
38256 -571363 -193756 165088 353093 389081 413119 476829 453232 259741 33947 -80305
38246 -80305 -161987 -299449 -313280 3512 486659 773745 793486 743870 668011 445474 158514
38235 158514 31130 -665 -197387 -458236 -377939 12040 125592 -290155 -692561 -562077
38225 -562077 -201296 -206432 -525981 -657984 -539640 -561138 -762115 -701387 -253421 77076
38215 77076 -78268 -348057 -169549 380613 731446 623991 345281 187591 81857 -107650
38205 -107650 -254062 -189833 -70261 -196070 -503316 -543497 -80052 544216 816806 640407
38195 640407 284248 -77881 -464498 -804583 -926137 -864833 -855523 -931861 -846740 -501639
38185 -501639 -125725 134379 452263 892838 1073159 624432 -208135 -799616 -856027 -556098
38175 -556098 -110679 427575 950202 1262952 1320103 1220379 975051 561458 181596 125420
38165 125420 336307 441268 282830 98104 82842 126170 126220 220341 471471 627421 483889
38154 483889 258399 284667 496622 554372 399167 341022 579640 928100 1091751 1006647
38144 1006647 806456 618586 500735 463360 439939 292891 -51978 -480998 -754193 -709056
38134 -709056 -407736 -90466 31002 -46878 -157078 -181762 -180865 -259852 -370178 -342085 -117655
38123 -117655 141278 226739 121685 18237 113993 408927 679243 640380 195296 -416117
38113 -416117 -758383 -598214 -167055 85830 26376 -31750 191555 529521 650050 589861
38103 589861 668331 915780 998152 804615 679466 826429 886779 504828 -9270 -104938
38093 -104938 116840 56790 -365827 -525984 -113506 296812 102040 -400667 -496467 -151403
38083 -151403 5245 -295116 -580150 -405567 16320 237508 256304 405837 739928 909761
38073 909761 663116 190391 -124695 -129351 41288 221809 376082 512532 579261 515953
38063 515953 347308 151405 -32225 -189472 -247901 -104334 227590 555058 638856 387696
38053 387696 -58330 -395932 -350396 83852 558275 629980 203138 -325816 -455612 -119524
38043 -119524 240616 186421 -198760 -431156 -277182 -84792 -277769 -670242 -656974 -126215
38033 -126215 257237 -44330 -622840 -662742 -75019 459506 511787 355956 286955 108127
38023 108127 -370164 -824071 -871779 -693095 -698844 -815356 -627984 -127074 221930 171488
38013 171488 -24290 -117428 -220977 -467583 -674675 -617721 -406309 -325561 -435237 -545252
38003 -545252 -507048 -340751 -113466 147150 406190 590084 638905 567217 466220 431922
37993 431922 468114 488853 450443 418409 434503 401262 220959 -22969 -180244 -268642 -400894
37982 -400894 -519273 -447240 -220980 -105506 -200087 -283148 -185874 -84142 -225657 -555975
37972 -555975 -839508 -1007234 -1138419 -1201154 -1088872 -883513 -806311 -863040 -776344 -362333
37962 -362333 216854 683302 952308 1069714 996660 676182 257648 23043 37307 43382
37952 43382 -197148 -578316 -783152 -665313 -367200 -101961 37282 55550 -3407 -46077
37942 -46077 19768 159565 237288 220965 245192 387123 500827 396289 95172 -212595
37932 -212595 -385031 -378728 -186880 98182 229502 18133 -398803 -660368 -547729 -122598
37922 -122598 429104 889579 995836 613272 -13776 -414066 -390218 -191920 -117804 -144884
37912 -144884 -68790 164374 418177 552124 529304 400051 229825 -10887 -428208 -927457
37902 -927457 -1068703 -527933 313013 653504 260258 -266421 -401158 -371621 -576247 -824717
37892 -824717 -733913 -517486 -659213 -975243 -799050 -132035 205748 -167380 -534955 -148563
37882 -148563 639719 922255 517094 36285 -115460 -124497 -165625 -55222 311784 656522
37872 656522 701126 537077 390850 296728 222652 271139 491581 675630 609391 397688
37862 397688 274786 212939 29405 -184723 -106271 306465 695266 832447 936881 1223089
37852 1223089 1427917 1162721 591593 328166 624941 1042174 1065299 743333 490678 482648
37842 482648 543542 538410 574315 761909 981135 999776 747043 385700 129135 38349 28646
37831 28646 52553 173170 380600 453608 204242 -184413 -328076 -184612 -127433 -350850
37821 -350850 -525979 -303681 109802 228367 -29342 -293352 -286749 -68895 205787 431379
37811 431379 492634 396128 408765 709705 978625 772712 270153 98627 381206 569761
37801 569761 392459 289143 555353 717683 316168 -231179 -229655 209268 421834 269287
37791 269287 176175 221473 30318 -367000 -384679 157830 620934 450505 -64615 -333258
37781 -333258 -278692 -178863 -86993 103567 283321 280917 227870 366544 621233 726270 673385
37770 673385 672180 735052 654464 385776 142567 68353 50962 -76693 -302634 -436480 -280594
37759 -280594 138770 475097 376261 -16518 -153614 153808 377208 25025 -543764 -563257
37749 -563257 40013 562488 536389 256953 155252 168083 20582 -249340 -390181 -329818
37739 -329818 -187463 -56917 1545 -93212 -306760 -431940 -333811 -122209 41957 136867
37729 136867 152043 515 -256423 -330112 -92230 170030 169087 85025 258648 563133 525317
37718 525317 61862 -352550 -371733 -237427 -322833 -524139 -436312 9922 421164 464152
37708 464152 268278 209137 435717 740124 846927 711869 501534 354376 250654 114913
37698 114913 -43809 -150841 -172618 -131140 -32056 145361 372462 541235 542692 354490
37688 354490 36479 -333261 -688456 -960473 -1094361 -1106763 -1072945 -997773 -766726 -350345
37678 -350345 -1906 -23893 -301785 -358818 -37320 177272 -180081 -824910 -1102330 -935707
37668 -935707 -841911 -1018943 -1052763 -714360 -431090 -595536 -918081 -939878 -773728 -785386
37658 -785386 -864640 -646221 -262783 -206966 -487079 -564513 -204148 204991 325943 321076
37648 321076 400549 419259 227445 28394 60061 218472 289796 290112 294961 187291 -121545
37637 -121545 -428993 -496013 -391297 -310158 -232298 -54828 100617 45660 -124486 -176440
37627 -176440 -162453 -346416 -712850 -903156 -732290 -476700 -491959 -747627 -922302 -843857
37617 -843857 -654711 -567316 -604669 -632263 -553961 -374765 -103708 254282 560344 576190
37607 576190 298912 108067 320045 683051 635898 63169 -547198 -753171 -614687 -403859
37597 -403859 -241508 -193785 -335658 -457620 -94673 785450 1444124 1168245 197921 -577974
37587 -577974 -693595 -427092 -178573 -41267 -6770 -130372 -359491 -510209 -508487 -424305
37577 -424305 -271123 -38122 114131 9849 -201519 -192566 50234 219462 177756 90415
37567 90415 34708 -138140 -472657 -804030 -1060545 -1304529 -1413001 -1150799 -669997 -459171
37557 -459171 -612727 -649720 -327766 -117593 -451138 -940787 -881638 -242788 380934 620513
37547 620513 607690 498901 241696 -164406 -583241 -946890 -1212669 -1156918 -609633 98660
37537 98660 353427 25496 -346943 -283579 72322 288961 227353 41411 -158007 -347593
37527 -347593 -437763 -354163 -230148 -294711 -564837 -818800 -889510 -830372 -747441 -616600 -382174
37516 -382174 -147032 -93850 -201653 -204641 58762 375454 407415 150809 -68631 -69061 -50520
37505 -50520 -267924 -663641 -962836 -986854 -743295 -350981 -15497 64825 -75500 -168187
37495 -168187 -74270 26692 -18501 -31924 171114 351048 129151 -386230 -684410 -581947
37485 -581947 -453359 -622192 -900683 -931708 -684790 -378843 -151045 -54729 -197924 -595692
37475 -595692 -975036 -990173 -624514 -195869 26657 48724 -4874 -109391 -335637 -696059
37465 -696059 -1043623 -1126568 -787880 -157109 400001 597172 486810 359467 402398 510052
37455 510052 431422 57341 -462782 -869613 -1019986 -950048 -768703 -578905 -489338 -553817
37445 -553817 -630854 -461341 -31773 279938 146077 -207600 -226617 232137 682065 640671
37435 640671 224779 -74122 -20956 185473 261166 124757 -153308 -491465 -814534 -1022733
37425 -1022733 -1015518 -754078 -312776 140060 470012 694515 905297 1079236 1090373 941297
37415 941297 823362 847632 864390 706370 491925 466660 587352 518014 118337 -268493
37405 -268493 -188247 354081 879363 992587 791610 637774 656265 650023 483154 325946
37395 325946 403219 652377 808432 751820 584710 394246 144733 -160998 -395457 -465132
37385 -465132 -432723 -410909 -436659 -503817 -607724 -690744 -648000 -470746 -314841 -357702 -618579
37374 -618579 -926554 -1020496 -740886 -244150 47198 -87190 -294900 -33696 654970 1101096
37364 1101096 862257 269941 -116288 -264342 -507713 -861239 -967556 -685428 -314813
37355 -314813 -157035 -162276 -121777 29466 218667 370363 438966 430072 438592 542886 635726
37344 635726 499680 91724 -358853 -560883 -384869 89325 624322 962713 1048929 1067420
37334 1067420 1135486 1088357 792818 527572 685025 1136022 1313594 1000422 604260 480961
37324 480961 411679 53934 -440698 -656370 -532908 -343635 -182321 116884 572837 933932
37314 933932 1010658 863203 623873 369694 191197 153520 163319 90906 19171 112267 236748
37303 236748 47661 -452537 -777612 -573875 -96116 173845 156916 139820 276662 453098
37293 453098 569644 637255 593941 333612 -13453 -100559 202051 601788 771176 776049
37283 776049 914407 1220704 1367753 1100205 594233 268822 302793 462739 435636 226455
37273 226455 101416 162582 173120 -70084 -345552 -241164 246457 631805 567107 300177
37263 300177 298251 597733 823618 788385 734199 886409 1041670 817741 187599 -451866
37253 -451866 -724253 -621669 -388840 -207654 -87211 13328 80639 84344 32464 -67405
37243 -67405 -246553 -484072 -600126 -376586 147275 602800 642888 340222 126280 318774
37233 318774 779433 1056505 830348 232135 -252494 -256198 41880 63936 -469149 -1097550
37223 -1097550 -1096946 -356153 478570 781236 597745 386699 368222 392830 325517 260781 326199
37212 326199 464383 482541 243350 -199049 -598603 -705562 -541577 -415167 -542110 -733739
37202 -733739 -649940 -316643 -137982 -326061 -557870 -385102 149359 531091 396372 -56789
37192 -56789 -342457 -227309 124456 462055 720629 941259 1068648 970833 629870 205415
37182 205415 -93031 -128582 131494 584802 986011 1095444 896357 601956 426720 420706
37172 420706 525575 683039 855989 1027866 1197135 1304208 1214230 903067 591633 491317
37162 491317 472535 263727 -49427 -96862 146306 244640 9099 -128256 224113 772573
37152 772573 981274 841535 714292 670771 552754 503540 800293 1214839 1195306 742216
37142 742216 462751 601516 653775 217287 -355572 -539021 -377862 -207429 -30313 322906
37132 322906 681933 700643 409608 176866 174180 219769 108442 -166076 -455476 -522700
37122 -522700 -198774 319071 518947 182499 -265104 -318263 -85476 -37060 -242355 -326264
37112 -326264 -112546 158685 270881 262701 167314 -74881 -341691 -331451 21633 425614
37102 425614 624952 629422 477403 121107 -302344 -420288 -71356 437875 720533 734678
37092 734678 646405 518899 370491 321454 400579 359083 -29667 -574980 -857458 -778005
37082 -778005 -650115 -723399 -863389 -801165 -514202 -203202 23085 266607 608400 877309
37072 877309 780575 269313 -335861 -637491 -499249 -63212 410145 611742 298693 -402608
37062 -402608 -923868 -799452 -258070 37092 -163479 -461582 -479410 -343942 -304534 -250483
37052 -250483 49256 464225 619649 387742 -12490 -314076 -377084 -192713 48442 28277
37042 28277 -295787 -500411 -213657 310892 509725 317783 228535 524329 883534 883689
37032 883689 515278 18343 -447422 -751209 -728393 -448981 -298349 -494207 -733262 -635495
37022 -635495 -347657 -311005 -531692 -528753 -60524 489901 618725 311267 -42569 -151217
37012 -151217 -52156 45907 1233 -120733 -81332 256470 654511 677141 231198 -259467
37002 -259467 -352380 -72347 270010 536529 767408 877491 692679 268879 -129377 -385484
36992 -385484 -578406 -650847 -373960 223428 698255 683769 327219 35080 -32814 -820
36982 -820 21181 17954 -53542 -228510 -415124 -483859 -424884 -285898 -60034 213028 372765
36971 372765 356807 352410 510301 665651 612099 484196 520070 590803 404509 100046 121846
36960 121846 469583 619198 344062 66149 111541 143125 -234058 -728841 -769988 -386285
36950 -386285 -109567 -142943 -206555 -184871 -328681 -662697 -717281 -163252 625894 983845
36940 983845 736085 291316 79255 177848 448664 768698 1057954 1248580 1332854 1372592
36930 1372592 1398865 1362924 1253863 1201856 1331579 1501225 1346732 709732 -77123 -500461
36920 -500461 -415349 -103641 172681 411518 622210 648868 426223 171402 86331 63780
36910 63780 -42777 -41671 335382 875269 1008146 567120 61684 21384 350126 562097
36900 562097 450476 235021 139807 129473 116469 188706 463457 827457 1023417 1001251
36890 1001251 993329 1137651 1194201 853460 248911 -119611 -15088 250224 265015 2940
36880 2940 -304174 -528196 -644213 -576082 -336674 -187041 -352616 -657843 -719063 -432323
36870 -432323 -8372 375383 640916 618174 178307 -439446 -805330 -842251 -840680 -905437
36860 -905437 -798547 -426783 -57269 125161 271700 466522 476152 194613 -29576 124308
36850 124308 434460 490738 317154 224755 240704 143807 -40733 -51196 121110 186749 57279
36839 57279 4014 218507 552265 823101 1075019 1355216 1476097 1220738 663588 127312
36829 127312 -108432 21532 372894 672305 687279 421536 109209 -23182 53972 215208
36819 215208 319661 292001 151119 -11293 -130378 -234491 -354179 -410975 -292776 -2334
36809 -2334 370007 769641 1151248 1390026 1382653 1206851 1018019 817701 507915 152091
36799 152091 -41086 -25243 3462 -101722 -250841 -297852 -244180 -179529 -155316 -181104 -224284
36788 -224284 -183531 -3695 180423 202607 170268 367259 811889 1191634 1324055 1370865
36778 1370865 1442574 1325162 858292 303632 18483 -21275 -39781 3526 310766 802107
36768 802107 1180122 1381009 1570288 1722843 1634463 1381366 1314474 1466349 1397902 865693
36758 865693 274029 159896 491798 789638 754734 493519 261000 253959 543545 955225
36748 955225 1106804 804085 316571 45047 29270 33089 -5857 69183 289127 499624
36738 499624 646183 810647 950500 922607 806924 862812 1071488 1078283 749828 436874
36728 436874 439810 527057 311741 -125781 -368020 -280057 -115349 -39061 84208 357625
36718 357625 611589 645853 526007 486177 622065 788198 778860 569404 368986 399062
36708 399062 619159 769222 710548 565884 436666 189159 -283712 -761651 -924714 -780128
36698 -780128 -593991 -480531 -358004 -261120 -354113 -599878 -726642 -591933 -316326 -24433
36688 -24433 246641 347665 94637 -343658 -506952 -261770 3841 8421 3217 260853
36678 260853 521838 407365 127359 251225 863698 1439548 1575837 1413713 1243421 1084004
36668 1084004 846098 631318 622202 780092 826649 532752 -6221 -388440 -273055 219279
36658 219279 593139 554915 330615 255319 268283 100902 -206649 -351837 -256164 -116353
36648 -116353 14193 285276 634602 728937 473239 216965 256244 449136 548372 613624
36638 613624 811443 1064164 1246948 1564805 2331954 3383029 4045954 3826537 2938837
36629 2938837 2044631 1573802 1412514 1221646 923166 748653 828665 940277 820635 577055
36619 577055 514000 619774 567864 276707 106950 324036 666154 707233 444765 250042
36609 250042 356684 650491 890733 914565 668606 247676 -89434 -85916 295390 836859
36599 836859 1188746 1061559 504934 39429 234556 1011007 1640500 1640603 1360830 1378924
36589 1378924 1639114 1667390 1442944 1475431 2025303 2797616 3511643 4239434 4950516 5214126
36579 5214126 4748864 3952734 3466652 3386082 3288681 2928274 2495405 2188422 1906293 1499246
36569 1499246 1060463 796692 763903 870437 1016365 1091392 949640 568760 179998 47869
36559 47869 120637 94768 -123934 -234944 40278 524820 780972 650563 382826 267151
36549 267151 361949 573242 762434 756401 498151 230701 268767 530320 602646 370562
36539 370562 205426 335191 440239 223322 7576 268582 818829 1032855 777075 527595
36529 527595 563667 643822 594230 611518 724784 523527 -159991 -731157 -513753 296962
36519 296962 864680 774170 399872 255288 427297 731945 1036221 1238542 1200355 918419
36509 918419 620184 507408 495994 367078 113820 -34241 56602 214874 166405 -135576
36499 -135576 -478533 -643588 -575729 -316112 81532 501314 759095 755734 565573 302952
36489 302952 8590 -251105 -330720 -198997 -28754 93360 371428 948032 1507525 1595746
36479 1595746 1267492 1031470 1157499 1424386 1572387 1571450 1357066 775134 -3108 -432024
36469 -432024 -231170 255419 572720 681131 733429 726874 699213 880298 1254775 1336485
36459 1336485 832786 205317 60175 274512 301552 85397 1390 44291 -177633 -629910
36449 -629910 -750249 -299986 299074 643841 792697 856772 733616 486708 441754 636523
36439 636523 697449 528421 549773 916512 1108013 762454 345491 406518 682196 633908
36429 633908 450354 694425 1214305 1293766 830126 507219 693851 964977 950265 933024
36419 933024 1235106 1597128 1619913 1397171 1274747 1294454 1268386 1157116 1030953 881529
36409 881529 777634 953184 1397768 1614600 1208542 536306 306027 609136 829927 560572
36399 560572 156180 193082 694208 1148603 1156896 846767 663044 849528 1186077 1270517
36389 1270517 1028638 786045 777104 823475 708275 639169 977507 1618327 2055458 2061858
36379 2061858 1884163 1695112 1324829 750748 404175 601722 978062 942741 543206 401559
36369 401559 808188 1315208 1351407 913836 470149 388308 637812 922578 957761 682722
36359 682722 302108 88051 120337 280820 475964 721591 988570 1135527 1090195 986512
36349 986512 1025818 1267776 1610643 1898829 2014978 1975113 1982876 2265145 2778878 3203981
36339 3203981 3320072 3267292 3314783 3485149 3561648 3393789 3044334 2677953 2431109 2339279
36329 2339279 2272036 2020252 1597696 1351866 1546527 1905854 1888090 1445362 1161855 1460412
36319 1460412 1976756 2028937 1521478 1009368 914234 1069554 1143048 1152019 1301674 1539028
36309 1539028 1605357 1470402 1398102 1529008 1664681 1595579 1428385 1391032 1448396 1348008
36299 1348008 1017917 712096 718028 1055552 1506287 1835318 1945533 1896621 1807853 1705506
36289 1705506 1502886 1200071 1013237 1144741 1482780 1738126 1855404 2038922 2350648
36280 2350648 2573449 2565126 2452630 2330092 2077300 1701423 1544678 1820975 2199016 2245552
36270 2245552 2094624 2214576 2615328 2801564 2529110 2101447 1809653 1576517 1359036
36261 1359036 1424985 1897873 2398616 2519997 2383824 2348655 2403141 2280869 2022422 1961115
36251 1961115 2186150 2435073 2542633 2620963 2738127 2780044 2738023 2796670 2981638 3027439
36241 3027439 2807013 2638852 2901108 3492540 3927176 3888506 3501488 3134541 3115898 3576519
36231 3576519 4369082 5142925 5640325 5916018 6182217 6521994 6891311 7302792 7805389
36222 7805389 8349994 8911582 9694160 10895703 12214744 12930706 12670656 11852604 11148493
36213 11148493 10719269 10243777 9518547 8682060 7923939 7319613 6944553 6817253 6699322
36204 6699322 6304364 5798007 5732189 6312963 7071401 7492537 7644398 7871490 8172971 8328611
36194 8328611 8446284 8851542 9443119 9663926 9265545 8725876 8709075 9369898 10348949 11213447
36184 11213447 11734410 11936132 12054677 12324021 12720366 13083590 13514090 14348104 15621858
36175 15621858 16903669 17895329 18889801 20305637 22028054 23640718 25173467 27145932
36167 27145932 29844944 32983492 36227681 39741292 43982895 49157601 55125146 61809954
36159 61809954 69498455 78664480 89656756 102788093 118756907 138684735 163525008
36152 163525008 193771282 230092059 273349582 321953052 368217231 399061425 403299790
36145 403299790 379786920 338138467 291282512 247685411 209957686 178201911 152384970
36138 152384970 131975543 115500896 101545942 89617043 79622834 71104360 63453961
36131 63453961 56494775 50370970 45057246 40333025 36124600 32567796 29729401 27418174
36123 27418174 25274413 23021443 20706734 18679710 17188055 16033921 14850815 13674741
36115 13674741 12884353 12512069 12043966 11139378 10165801 9654555 9509214 9192006 8526886
36106 8526886 7856100 7460429 7266131 7134374 7007641 6694876 5944600 4909752 4174756
36097 4174756 4088057 4353985 4511307 4528463 4632820 4790901 4733713 4405644 4059462 3909166
36087 3909166 3919624 3927312 3783677 3421525 2961953 2695456 2762021 2915490 2814884 2475144
36077 2475144 2185426 2053017 1932710 1786842 1770276 1895512 1948923 1869276 1897247 2152554
36067 2152554 2328687 2069307 1482043 1025795 982192 1250709 1594515 1879612 2083106 2221266
36057 2221266 2294201 2254342 2090041 1982625 2238884 2930226 3688892 4014783 3757596 3209051
36047 3209051 2779265 2667906 2778830 2852864 2724694 2504282 2436919 2562432 2651003 2527299
36037 2527299 2277694 2037415 1773284 1439036 1162579 1070842 1068439 999553 901794 883723
36027 883723 883019 793557 711325 771279 839156 691420 447885 461298 755159 945772 833064
36016 833064 714302 904253 1236502 1338510 1225759 1272978 1603379 1823610 1529698 897357
36006 897357 510704 604601 748412 464364 -48428 -153325 316629 811239 840265 593396
35996 593396 540876 780966 1127996 1526939 1927106 1975627 1374743 465952 -45173 54876
35986 54876 351336 496633 540164 530227 344964 93079 174393 670115 1079834 952903
35976 952903 445962 -11892 -274760 -401743 -330687 7001 438180 739873 951833 1234562
35966 1234562 1533437 1628406 1445270 1140166 939897 993856 1267109 1523371 1587990 1656766
35956 1656766 2077932 2765270 3169020 2983538 2550328 2355375 2441757 2545697 2500664 2251374
35946 2251374 1769950 1231301 976352 1022632 924780 427917 -73969 -91964 271315 592168
35936 592168 758988 866374 777655 351401 -100998 -160182 28349 -13184 -292438 -370715
35926 -370715 -155172 -58607 -305765 -649507 -897638 -1178611 -1492065 -1492507 -998727 -348620
35916 -348620 21745 76903 51158 79459 168644 327597 525745 653377 656321 615551 635957
35905 635957 743499 878961 904114 716690 486809 579836 1011767 1223727 763840 -12847
35895 -12847 -377161 -199903 21962 -2960 -104046 -205124 -486841 -878160 -1003554 -835650
35885 -835650 -822400 -1105876 -1161558 -552574 418182 1158654 1486460 1533049 1337708 942188
35875 942188 608472 555157 651556 645231 503416 315829 90500 -140634 -237789 -154231 7859
35864 7859 253079 690029 1157474 1251005 914764 611395 681556 928201 1058447 1099187
35854 1099187 1106012 922247 558750 369107 492773 570615 381839 267743 479321 625618
35844 625618 332951 -29275 55738 335384 207162 -235124 -348904 20356 384405 424484
35834 424484 289770 122699 -86034 -183753 13211 279449 216213 -105221 -268532 -200969
35824 -200969 -157557 -109849 190651 577563 599479 313804 242631 461831 465906 76327 -271203
35813 -271203 -365680 -584274 -1087724 -1373357 -1066430 -538623 -277767 -203821 -93318 -136374
35803 -136374 -495453 -760078 -471114 124795 441015 424785 473244 648184 588006 187099
35793 187099 -164860 -125520 175939 356044 192146 -212249 -515295 -427020 -52198 150877
35783 150877 -103205 -579026 -856323 -839288 -729921 -672300 -673411 -740919 -840523 -808793 -541716
35772 -541716 -198032 -22016 -52393 -180993 -372924 -616000 -763177 -665302 -410289 -235607
35762 -235607 -240113 -326205 -360941 -264864 -30468 221113 304327 203622 111128 117392 48108
35751 48108 -221461 -474222 -405535 -50743 260087 289397 50979 -320221 -666773 -853398
35741 -853398 -881896 -898797 -971240 -966030 -771228 -491502 -277108 -112619 63992 198426
35731 198426 262520 394964 685043 956070 985089 820241 668419 580413 458204 275930
35721 275930 95305 -55261 -162554 -199870 -236660 -405636 -637738 -669727 -475357 -382915
35711 -382915 -528841 -550870 -183473 186553 47031 -422713 -631552 -502578 -488627 -715934
35701 -715934 -781986 -514311 -303911 -441443 -644569 -550198 -251582 -25273 108231 205914
35691 205914 110128 -257864 -540841 -325429 216188 481672 254757 1770 223842 783677
35681 783677 1096350 866540 399690 160964 228592 336152 337083 365883 503430 558074 365413
35670 365413 104578 49687 117206 -36387 -473004 -807482 -659203 -76443 558510 891562
35660 891562 808960 441920 56529 -126107 -48618 239651 663731 1064002 1192559 959963
35650 959963 613874 474449 548254 615331 642155 836432 1264976 1668008 1748594 1485105
35640 1485105 1090673 798094 734200 886652 1131145 1325773 1360526 1123173 589916 38242
35630 38242 -73414 341124 774303 734112 369917 151715 144178 67967 -63462 52540
35620 52540 366713 435726 156170 -20818 157400 301449 30931 -376562 -423029 -163594
35610 -163594 -72953 -301488 -496761 -334051 102494 490162 598625 430079 176106 56855
35600 56855 145376 363002 610711 786138 732624 409336 105961 192269 596638 847954
35590 847954 732538 564170 645479 827201 847019 768477 760960 710933 414651 -14227 -264682
35579 -264682 -245327 -112799 -2763 27742 -67090 -204020 -143343 166538 391682 248836
35569 248836 -30604 -1628 372947 757185 974552 1099285 1079124 722329 132218 -242584
35559 -242584 -148105 174181 371758 411092 453638 512885 456216 262968 105263 167248 454950
35548 454950 787699 961585 927399 790578 640386 463737 265969 154344 185855 213030
35538 213030 21040 -401334 -825323 -1013050 -938392 -795071 -790183 -897531 -880357 -651654
35528 -651654 -469510 -532934 -525388 10044 852534 1202014 772280 240079 276178 659008
35518 659008 835406 869361 1138112 1404167 1030249 92633 -500993 -196057 511656 804579
35508 804579 478041 -103776 -554636 -680639 -482964 -217268 -192951 -323256 -173937 344095
35498 344095 684395 373614 -280873 -572427 -308346 45723 67011 -141745 -224046 -60109
35488 -60109 136400 98604 -191237 -453608 -388352 -35342 219193 82631 -275729 -428808
35478 -428808 -225021 49163 85705 -16562 101549 513744 799448 511558 -238162 -847216
35468 -847216 -885151 -518648 -220121 -218303 -352693 -359948 -175077 19467 6584 -159029 -130602
35457 -130602 267589 647172 466836 -156553 -489680 -178933 275696 320603 127532 133138
35447 133138 245329 109660 -137236 -52738 331398 575030 599139 724812 946257 846358
35437 846358 349329 -73527 -130605 -80535 -184201 -320205 -357167 -398841 -437126 -258682
35427 -258682 76935 170750 -63586 -196564 12021 252194 302328 427382 740369 772387
35417 772387 212898 -446610 -608433 -455012 -499041 -657938 -504839 -137462 -17721 -119883
35407 -119883 -8083 319754 428241 282516 317083 552751 410958 -310030 -942837 -845063
35397 -845063 -280034 46312 -37420 -118754 96388 480226 807330 1014523 1096958 992028
35387 992028 673739 269696 91 -22214 77891 69848 -82946 -158026 -2837 202002
35377 202002 191183 28528 25489 267762 478517 411587 173507 56611 194158 478637
35367 478637 731999 864676 886324 808666 588379 227256 -112091 -241093 -203674 -200792
35357 -200792 -215493 12870 509006 866381 784506 532828 543552 747081 704132 281810
35347 281810 -202907 -478636 -589922 -654267 -666457 -595067 -436859 -162497 196735 460296
35337 460296 498520 420105 346142 175955 -134369 -292098 -82214 147415 -53631 -434845
35327 -434845 -332755 265742 636705 404455 20088 -76621 -89632 -286380 -405867 -155930
35317 -155930 183355 211083 87986 195774 409609 323720 20167 -16741 292584 484545
35307 484545 278724 -68490 -259394 -350200 -457751 -450340 -197302 121496 221461 95146
35297 95146 -21150 19053 147424 253907 342617 496806 762738 1092454 1373959 1502772
35287 1502772 1431886 1185271 873684 694787 827339 1252268 1716934 1949565 1909700 1798306
35277 1798306 1844879 2117104 2510121 2872422 3135320 3334569 3515668 3644107 3634814 3450985
35267 3450985 3146390 2834296 2634253 2596880 2644421 2645291 2575451 2505326 2388161 2034679 1431233
35256 1431233 921389 864030 1204995 1580253 1748640 1721073 1574428 1393751 1330469 1469417
35246 1469417 1692243 1878016 2100865 2368896 2380367 1945680 1469551 1483353 1797352 1733127
35236 1733127 1193606 811548 914724 1081928 993552 968919 1226578 1339710 1038016 905709
35226 905709 1498056 2255227 2207047 1473543 1100104 1471265 1849817 1645957 1263309 1325932
35216 1325932 1771535 2173410 2437507 2700431 2931113 3120727 3584371 4583413 5812495
35207 5812495 6724214 7296528 8053338 9319864 10877662 12470139 14231460 16289398 18193938
35198 18193938 19203626 19169639 18735180 18459389 18073680 16958189 15133086 13285782 11851751
35189 11851751 10605237 9301723 8187244 7525502 7044258 6318091 5434755 4803203 4470281
35180 4470281 4113601 3630127 3255018 3091721 2954722 2733861 2539262 2418716 2276143
35171 2276143 2139737 2179791 2381927 2516720 2503097 2475150 2417881 2114995 1607390 1331881
35161 1331881 1560417 1981741 2096667 1819463 1451551 1233377 1146045 1018769 644589 -61161
35151 -61161 -824576 -1098293 -638523 93497 365904 -6396 -503440 -576203 -256679 13501
35141 13501 -7748 -135619 -119627 -6677 10705 -22918 136927 493596 691263 500155
35131 500155 191631 183850 462932 635332 483402 198506 75557 201618 449707 604335
35121 604335 517620 290753 223135 422730 602007 466483 136661 -78382 -130861 -119693
35111 -119693 63850 526962 968762 1007830 827447 922447 1243428 1244790 840541 596117
35101 596117 770281 891112 632300 421232 676352 1030735 927503 540427 438046 628158
35091 628158 594546 131622 -437053 -790735 -870222 -686388 -330731 -110950 -243879 -469531
35081 -469531 -372671 -8091 218744 215528 266065 432293 389853 -14361 -442545 -491162 -178287
35070 -178287 134319 136699 -172415 -496633 -537929 -393484 -500249 -992935 -1363957 -1115792
35060 -1115792 -539622 -364618 -736287 -1074512 -956233 -602876 -370237 -252947 -116817
35051 -116817 -15629 -7439 43685 225886 358962 229602 -119118 -483689 -721215 -758152
35041 -758152 -553087 -178318 179886 373327 362376 183495 -6593 26588 263480 285563
35031 285563 -182337 -717487 -669552 -133597 123216 -221370 -622001 -571415 -312873 -289845
35021 -289845 -430810 -447300 -395489 -414781 -267247 282328 879255 976330 681746 612442
35011 612442 931463 1119842 820906 398361 400399 808626 1112004 966989 536481 190044
35001 190044 35931 -122336 -365387 -399374 38759 640991 814359 536559 406231 648771
34991 648771 673023 52442 -615394 -502717 186742 543167 320880 123743 264854 344283
34981 344283 142525 87881 461716 834170 741240 360937 64263 -193966 -548335 -753871
34971 -753871 -589634 -346799 -346904 -303983 219932 980117 1325509 1153684 928865 825832
34961 825832 554455 94076 -89356 206742 515512 357619 -109568 -404054 -355897 -144284
34951 -144284 47323 148712 159688 187751 368699 631908 753547 732119 827406 1099883
34941 1099883 1239231 1041085 719393 501609 261735 -117003 -348938 -153858 186981
34932 186981 184745 -80134 -59920 393152 766313 606758 95740 -255822 -166994 306777
34922 306777 941701 1447929 1620542 1539083 1459075 1443065 1316660 1049969 894431 990213
34912 990213 1095506 912949 498413 145011 1647 -20758 -83735 -295583 -616580 -787836
34902 -787836 -543703 -16199 311741 235926 145718 441027 892317 961744 584791 182869
34892 182869 -23644 -216682 -450296 -439083 -93490 181806 77466 -62505 278138 923199
34882 923199 1120645 549171 -230546 -491112 -156247 336176 699637 963235 1107749 956495
34872 956495 498723 12725 -260425 -337808 -289885 -83054 207145 298907 75650 -170348
34862 -170348 -158395 -64730 -183442 -352020 -208360 97157 45322 -360664 -485336 -45664
34852 -45664 408132 346152 32666 -41656 -25900 -373596 -943817 -1137060 -834353 -550397
34842 -550397 -604951 -717277 -573021 -308561 -204063 -252873 -274814 -212174 -109549 30688
34832 30688 215745 396665 526516 606834 660278 727312 826696 834348 560394 102926 -101151
34821 -101151 154179 457324 325554 -86385 -286336 -250893 -342159 -536400 -433963 -65580
34811 -65580 49079 -193718 -274223 -33295 -80842 -730505 -1241300 -818228 153757 653313
34801 653313 455509 219639 334442 495816 443495 363846 383797 283198 -24349 -201544
34791 -201544 26217 438607 645073 578970 419733 230908 -63769 -444077 -737582 -779496
34781 -779496 -534789 -106959 302317 474957 282458 -241024 -867493 -1227704 -1052452 -468664
34771 -468664 58768 198241 59679 -63810 -84104 -71137 113 181725 327256 218725
34761 218725 -100818 -357828 -399393 -299666 -135323 110680 390527 535437 425066 108198
34751 108198 -247891 -443641 -344733 -14217 309585 460790 471050 376387 116663 -200931
34741 -200931 -194681 327277 973163 1185336 935169 652184 559326 467911 199482 -172685
34731 -172685 -521145 -763296 -756147 -437521 -88448 -99323 -430955 -645918 -512613 -230966
34721 -230966 -26085 98269 139450 36720 -58384 147970 609010 905859 846097 698669
34711 698669 667453 572216 306582 184315 479443 966324 1292684 1522171 1901926 2309878
34701 2309878 2365240 1994467 1528412 1271810 1239736 1273690 1205061 962832 682733 609129
34691 609129 749633 786606 497651 83562 -113809 -34449 168952 427269 728344 951236
34681 951236 986372 911376 840926 734785 543844 376274 313645 251590 143838 191743 533723
34670 533723 953632 1166951 1177479 1072414 743257 182094 -218730 -132436 146677 127754
34660 127754 -70100 64634 492613 575408 69690 -469534 -523573 -303048 -266353 -377602
34650 -377602 -263571 147471 543465 681614 627482 568158 572083 539250 328882 -26978
34640 -26978 -261479 -149162 183812 397713 365339 261621 253574 335829 463290 593182
34630 593182 602768 442008 353504 610718 1026703 1104088 738357 364207 283554 283699 124092
34619 124092 -36559 -4900 36230 -137141 -323633 -158564 339716 817436 1005494 801412
34609 801412 174463 -630246 -1010485 -608957 101159 313348 -49457 -260991 142166 719957
34599 719957 797177 377302 23334 43451 195466 180977 86475 170591 397398 425942 79231
34588 79231 -368269 -500374 -245454 114065 338062 402250 303750 1775 -353783 -434198
34578 -434198 -161672 117044 105523 -27092 19687 139925 -20857 -483455 -888230 -1004694
34568 -1004694 -931078 -755795 -374785 222129 750394 888993 600680 115446 -253565 -232781
34558 -232781 258222 941099 1311118 1087850 487724 -18377 -159522 -41385 47961 -51705
34548 -51705 -224467 -218382 65885 477774 821878 1041913 1145157 1124534 1092073 1279535
34538 1279535 1665492 1789309 1269807 388703 -216230 -358131 -370865 -410423 -226358 240630
34528 240630 575811 508943 380629 602508 979790 1012066 664308 394524 493013 771393
34518 771393 896582 738316 383336 36485 -99688 -20483 58571 14235 8253 177551
34508 177551 323541 200894 -36571 -20585 298101 643369 850578 932077 784394 287804
34498 287804 -285230 -432774 -101791 230085 280447 305284 507730 590724 268154 -155288
34488 -155288 -163267 244062 622365 723640 659127 530591 313290 96145 82823 301480
34478 301480 561748 709623 709754 523619 169164 -128215 -123999 104897 269094 302678 393258
34467 393258 564501 568652 301211 31078 66864 402752 798211 1000855 823392 267647
34457 267647 -312011 -441705 -83152 290685 327164 217820 285808 454747 443586 256537
34447 256537 107463 -179 -236831 -550026 -656207 -433094 -39772 337367 586396 561732
34437 561732 202279 -234311 -388373 -297286 -348675 -662104 -869653 -655511 -185274 189869
34427 189869 354708 346012 158099 -88937 -72034 291161 548423 270684 -258043 -374220
34417 -374220 8750 285422 57803 -366215 -580724 -711908 -1061004 -1445140 -1375235 -781168
34407 -781168 -130543 189860 256158 296574 314277 187515 -56280 -243388 -233253 -1983
34397 -1983 336265 516677 293536 -247730 -687671 -735527 -569960 -541292 -660562 -631772
34387 -631772 -328297 42515 262047 316871 231642 -42276 -438512 -709702 -728433 -676134
34377 -676134 -756828 -893653 -902124 -785413 -612940 -279320 280352 736126 626839 10249
34367 10249 -523774 -597113 -452923 -458217 -551672 -475521 -279172 -204443 -213369 -44042 280107
34356 280107 396835 158810 -114742 -140159 -132666 -462870 -1017182 -1267135 -984615 -573757
34346 -573757 -566040 -997985 -1439884 -1486306 -1067229 -427159 2582 -155484 -832997 -1418847
34336 -1418847 -1357640 -847157 -602641 -871917 -1104533 -806217 -286618 -151760 -381446 -452040
34326 -452040 -201669 37770 153973 448987 942526 1090244 571696 -99721 -215075 191844
34316 191844 514362 459501 264420 142793 35244 -59987 27907 292752 451729 363129
34306 363129 249648 321647 432454 339228 128322 116135 381064 614148 481799 27164
34296 27164 -357741 -358274 -111644 -89187 -549359 -1184728 -1440061 -1133624 -593127 -193178
34286 -193178 14435 140862 171332 34419 -170296 -244488 -175169 -158616 -296510 -414315
34276 -414315 -277106 100043 477179 696698 827401 958191 991503 790173 452954 238506
34266 238506 212121 194823 134708 271332 739190 1216378 1250901 835240 377171 156102
34256 156102 103502 113039 237774 475157 624889 526169 275477 89552 84636 263783 565172
34245 565172 850267 1007687 1127380 1374932 1633368 1534705 984252 378214 83550 -44291
34235 -44291 -331495 -682987 -693127 -283063 147970 240580 37943 -229794 -441200 -553649
34225 -553649 -516701 -369766 -266643 -265143 -216671 7969 285218 357181 115174 -330450
34215 -330450 -778767 -1018543 -863800 -298643 385840 752049 618092 239057 -5837 -67072
34205 -67072 -238121 -697065 -1192950 -1322300 -1021540 -595097 -289812 -78883 82102 50068
34195 50068 -271273 -672495 -838673 -705938 -418015 -42992 407806 756886 783495 599344
34185 599344 583266 823573 913699 509402 -125445 -397136 -106885 356364 529939 355376
34175 355376 80194 -140149 -389127 -771826 -1177488 -1341210 -1131546 -702301 -319981 -108518
34165 -108518 -35862 -73221 -219762 -385847 -411557 -246529 -6585 164285 184666 23556
34155 23556 -221239 -249428 173604 802822 1049955 694871 201427 102841 317923 380889
34145 380889 150441 -101255 -215538 -344251 -583712 -776179 -786087 -694310 -614962 -567407
34135 -567407 -613189 -848619 -1142620 -1144711 -707084 -79123 439067 781353 920316 706881
34125 706881 153718 -380556 -573245 -497828 -349426 -72398 395869 757615 681439 352178
34115 352178 230706 356614 383102 259127 311809 577264 633171 312669 56954 243024
34105 243024 611163 734505 672151 723120 837333 755026 541506 500952 629417 562121
34095 562121 58128 -747122 -1499556 -1790137 -1349065 -426561 208501 84819 -312814 -200690
34085 -200690 335838 484310 609 -408007 -226850 86127 -65555 -413512 -307057 186408
34075 186408 382054 32284 -388457 -481520 -424840 -513749 -663028 -627684 -429422 -301219
34065 -301219 -349314 -454805 -441551 -247917 4598 82878 -122291 -414754 -460850 -161524
34055 -161524 252147 504640 532370 438101 324569 221929 88701 -133274 -382968 -440268
34045 -440268 -173987 194343 279208 13317 -274482 -328414 -265935 -266350 -214381 72753 420006
34034 420006 443169 118443 -111485 94405 538102 762236 592439 232413 -44268 -95922
34024 -95922 100091 420386 570090 328037 -120927 -311206 -57470 298945 338666 72378
34014 72378 -190064 -309957 -390641 -475311 -485373 -454660 -517304 -599726 -426923 20702 318834
34003 318834 85487 -507682 -921889 -852520 -474786 -171642 -166324 -357443 -405066 -70536
33993 -70536 430773 555381 53160 -679508 -1047592 -927433 -680882 -620095 -712229 -751354
33983 -751354 -567254 -87990 565734 1060359 1157552 1039349 1092798 1377478 1570014 1452080
33973 1452080 1151367 825585 430724 -31777 -329894 -316756 -230067 -390047 -707932 -783177
33963 -783177 -472485 -102529 -44422 -264266 -426243 -349564 -209722 -258616 -451544 -472692
33953 -472692 -131424 390079 748508 785130 558454 164522 -279676 -551875 -480228 -204282
33943 -204282 -53264 -115287 -157736 -58581 -62781 -430446 -1021575 -1457571 -1587248 -1569109 -1542740
33932 -1542740 -1444459 -1184920 -838311 -554375 -352570 -107347 233103 473939 338759 -138695
33922 -138695 -516922 -403376 65394 416767 482578 557305 850514 1108765 1010538 703831
33912 703831 641851 982532 1437755 1691927 1704171 1561114 1279328 885518 544355 446831
33902 446831 601061 827761 959453 974402 913291 740560 399581 8817 -151736 31322
33892 31322 311243 406717 434703 740932 1298633 1613878 1374345 891389 645375 620077
33882 620077 427019 -15797 -308755 -147007 208597 218802 -284966 -895807 -1085314 -778748
33872 -778748 -398596 -331638 -477553 -456860 -163718 145208 313912 519265 890991 1175941
33862 1175941 1037398 532174 52748 -98331 117620 586984 1089996 1337634 1215825
33853 1215825 953364 856742 944115 1010866 937030 721915 358677 -58987 -239136 -17771
33843 -17771 317151 368371 204914 200230 362486 323553 53542 47085 555962 1087279 1028027
33832 1028027 471021 45955 114420 481783 799963 926805 900114 808894 731817 670677
33822 670677 554775 396896 363827 569206 870290 997336 827856 441487 1368 -310603
33812 -310603 -364436 -237665 -185357 -285382 -246777 179877 693256 681997 23978 -681203
33802 -681203 -848766 -606692 -483020 -588685 -517524 -63429 391407 424750 186900 118029
33792 118029 261119 295109 170619 199426 429347 459621 122624 -147642 -8232 181712
33782 181712 -35663 -366667 -180921 430003 736257 468904 105930 -19434 -156745 -459486
33772 -459486 -572734 -273392 63750 60233 -109379 -169854 -242358 -410017 -303909 261748
33762 261748 673221 263781 -601067 -937476 -500498 6782 40672 -184858 -282765 -222037
33752 -222037 -107035 34644 82576 -97670 -305116 -200441 88232 87327 -230150 -394151
33742 -394151 -301650 -407626 -788130 -804276 -194734 241040 -223295 -1004153 -992337 -223153
33732 -223153 198340 -260087 -934021 -1104104 -892129 -691042 -441437 17788 401553 355643
33722 355643 79616 44344 256279 286327 -39740 -427279 -608823 -652865 -671436 -567135
33712 -567135 -274099 -6265 -6336 -163248 -128742 204467 559533 663999 594727 595280 662108
33701 662108 523231 57497 -441781 -557264 -232981 165417 261050 6422 -404212 -807990
33691 -807990 -1145274 -1355732 -1375298 -1249324 -1120632 -1062020 -1023735 -994940 -1089496 -1352785
33681 -1352785 -1573313 -1456689 -976222 -399178 50325 395818 722222 948229 913562 608247
33671 608247 203501 -89833 -120441 147083 555263 806368 723560 419868 118384 -98777
33661 -98777 -232580 -195012 62131 308712 217619 -179697 -489727 -492582 -410462 -493450 -605250
33650 -605250 -479157 -201633 -110958 -266635 -344862 -128327 173242 246975 125630 91404
33640 91404 221604 281670 105950 -138866 -208841 -137181 -117772 -122331 86833 543914 977409
33629 977409 1230203 1467899 1748888 1709752 1076992 282513 53776 425675 690314 432900
33619 432900 89690 215029 651979 828164 566531 176769 -65776 -119483 30468 384487
33609 384487 761485 930194 882839 732057 440010 -42275 -477400 -576351 -491516 -652445
33599 -652445 -1071944 -1247220 -881165 -308824 -12215 -42060 -133284 -98306 121693 519363
33589 519363 881260 841757 365253 -45771 61140 480722 674543 538030 419727 442118
33579 442118 285146 -234811 -775585 -909592 -699897 -555278 -636706 -687370 -458960 -84678
33569 -84678 90798 -43802 -236544 -205100 16495 158592 73906 -126399 -268478 -270157
33559 -270157 -83420 292393 640746 605870 140244 -301264 -255789 179136 514788 492844
33549 492844 247172 -63928 -412258 -664302 -576913 -184900 97132 -47391 -462873 -781260
33539 -781260 -844558 -692939 -352130 111532 464573 510621 372359 339256 449312 429720
33529 429720 81728 -437088 -766844 -686341 -280010 151731 327381 188372 -102682 -354066
33519 -354066 -484377 -477853 -321609 -54428 212545 388879 436744 288048 -105479 -562214
33509 -562214 -714199 -432419 -52267 22808 -189073 -369397 -382251 -368503 -430439 -505010
33499 -505010 -535807 -513563 -353322 -1586 316326 245543 -222929 -686342 -846416 -848314
33489 -848314 -961889 -1145106 -1127125 -797301 -323885 54897 218274 171606 -22539 -291963
33479 -291963 -546466 -655562 -541199 -347247 -361862 -626076 -787364 -569825 -217547 -142101
33469 -142101 -274130 -206339 79349 151912 -137675 -409478 -414394 -400525 -539970 -518083 -109570
33458 -109570 278302 141920 -355086 -655741 -599158 -435657 -258200 50390 415238 608923
33448 608923 633373 637511 549722 231504 -109860 -146256 8450 -36484 -269955 -297258 -29938
33437 -29938 195617 234050 304960 457840 429576 186894 53223 94238 -70328 -578922
33427 -578922 -979231 -886405 -514684 -217197 38203 351079 497138 323238 180110 474335
33417 474335 1044150 1418685 1463306 1344628 1085675 614529 95714 -216951 -347971 -467024
33407 -467024 -541623 -478023 -429301 -568511 -714075 -589145 -305099 -157062 -78713 214200
33397 214200 613502 663042 242728 -238294 -400148 -265368 -23499 206940 309549 203359
33387 203359 35023 56650 256020 368906 276654 117905 2386 -97887 -171580 -177121
33377 -177121 -221542 -422450 -605999 -484733 -148397 -17578 -248773 -519023 -485122 -169245
33367 -169245 177986 343687 259907 85279 129331 426597 530514 126891 -311309 -50229
33357 -50229 774875 1215690 803596 127190 -116506 -18795 -42622 -239869 -332854 -205785
33347 -205785 84891 493032 849465 855756 527601 342928 643820 1185147 1546393 1644141
33337 1644141 1542734 1158116 544907 125247 188548 437202 442207 282280 309871 537605
33327 537605 699427 714927 678543 575628 380471 227923 156828 -35971 -350862 -382838
33317 -382838 8807 280312 26100 -226963 215967 1019909 1243046 730291 177576 -71464
33307 -71464 -318982 -585130 -403138 235474 663972 607775 624214 1073835 1453491 1257282
33297 1257282 791298 566547 502241 336291 277666 589858 966132 994522 908489 1217641
33287 1217641 1851587 2313446 2500487 2759864 3251951 3832594 4479751 5269834 5948078
33278 5948078 6053801 5540190 4855571 4361504 4021402 3667428 3219633 2631637 1954989
33269 1954989 1461802 1382031 1522213 1460743 1110930 765941 592406 433422 170559 -38092
33259 -38092 7127 284875 590201 696895 522943 283678 355728 784836 1107387 937219
33249 937219 517188 319180 322404 187603 -25202 63103 397570 491350 276837 282739 740368
33238 740368 1151522 1080330 801737 744387 788004 603889 296094 186604 256381 284421
33228 284421 289476 371255 368085 160259 60493 352200 662523 433442 -122057 -248807 173511
33217 173511 431525 106586 -340459 -441569 -500569 -974937 -1575026 -1615803 -1016049 -356894
33207 -356894 -46160 50232 150466 218743 205104 244221 417393 552085 451945 204918
33197 204918 120211 406767 973601 1503372 1709128 1573920 1334763 1191553 1091151 872043
33187 872043 531112 215862 27939 -6303 160055 513779 829664 817563 450148 -26538
33177 -26538 -403210 -628986 -647471 -398264 -47543 70373 -121431 -317409 -269607 -101417
33167 -101417 -14891 37040 137846 119254 -186676 -572593 -665296 -407653 -42493 257007
33157 257007 426574 328780 -71563 -442127 -422050 -173521 -134263 -257476 -60513 506626
33147 506626 882195 812051 810326 1294816 1820617 1725358 1116683 601959 338175 11534
33137 11534 -421465 -662927 -695660 -811989 -962581 -708610 13007 641659 738249 488345
33127 488345 223279 -71018 -452243 -683243 -606441 -512228 -703123 -959851 -888334 -590342
33117 -590342 -506481 -703579 -807303 -637574 -447835 -439144 -449554 -314154 -201336 -321020
33107 -321020 -505766 -389356 49215 381044 233831 -263666 -666952 -752840 -688810 -657639
33097 -657639 -546649 -197147 195618 240756 -102226 -444851 -502791 -393228 -271625 -22300
33087 -22300 424595 765443 686948 383190 322347 586360 812494 744126 470239 138007
33077 138007 -173203 -260439 76681 573148 587926 -72969 -751335 -682818 79029 815605
33067 815605 1040090 861198 540378 124207 -365078 -695303 -618073 -187594 263619 416892
33057 416892 166578 -368171 -899168 -1092099 -807524 -278898 57585 6211 -169664 -70610
33047 -70610 338680 688254 663147 344902 37970 -79967 -28355 91250 114994 -139859
33037 -139859 -637097 -1023672 -1006543 -758199 -683354 -834041 -883904 -702040 -576890 -721997
33027 -721997 -892912 -744919 -343907 -54246 -57097 -212539 -299403 -191561 112890 452725
33017 452725 576255 415759 191591 85466 -53178 -460125 -1028392 -1379070 -1307760 -938151
33007 -938151 -487713 -118375 26222 -91551 -262467 -222625 -17924 57407 -78043 -152588
32997 -152588 42751 333645 403917 187108 -122779 -312169 -268169 8212 349215 470165
32987 470165 244937 -85944 -117468 280024 795399 986820 729742 319361 116198 138557
32977 138557 92424 -209288 -609990 -853514 -896571 -846695 -753406 -656587 -696954 -919184 -1063236
32966 -1063236 -845455 -398034 -124919 -144776 -202367 -131344 -37925 23682 158208 289120
32956 289120 110931 -421172 -910777 -1046531 -963840 -857919 -632484 -249303 -34415 -214703
32946 -214703 -475900 -448377 -334144 -506733 -742787 -514714 70795 342321 109105 -66170
32936 -66170 187134 500124 475263 348955 497884 739209 639191 229243 -87398 -175773
32926 -175773 -262862 -478745 -702144 -830086 -860428 -719016 -320190 174882 432673 337191
32916 337191 103657 -30229 -43960 -36047 -53479 -67482 -15150 138516 302283 290640 75987
32905 75987 -83051 59972 391055 596081 610976 660191 851772 1002039 930150 695882
32895 695882 445844 222319 43671 2712 137554 316762 382032 329744 261120 235474
32885 235474 256481 324159 426157 553841 770999 1137569 1485107 1430432 793972 -70351
32875 -70351 -547970 -366371 196213 680641 873507 840007 688238 436014 93501 -230238
32865 -230238 -394306 -406140 -440044 -590054 -688410 -541813 -306324 -358898 -722222 -922348
32855 -922348 -630051 -161307 1873 -36750 200470 691336 844528 434144 18227 85298
32845 85298 281958 8576 -555831 -659113 -85985 559248 725155 514560 281127 140330
32835 140330 107922 269073 511953 476122 90163 -191309 -53853 112482 -217971 -825964
32825 -825964 -982408 -465980 172845 370629 124462 -224907 -361371 -93096 499336 927488
32815 927488 706636 8686 -481555 -452070 -259408 -209504 -88630 278835 520861 257894
32805 257894 -204061 -276032 22854 141736 -102576 -258431 22811 427737 395608 -145640
32795 -145640 -673966 -636838 -29822 577016 613441 118536 -339295 -377429 -206407 -198991
32785 -198991 -336750 -359570 -243486 -175546 -180248 -125684 -28216 -10816 -11098 122535 272624
32774 272624 159172 -157460 -221759 262558 1055143 1613712 1529720 777440 -229203 -876113
32764 -876113 -898498 -628966 -474618 -353860 -28059 258177 73470 -371034 -398822 65649
32754 65649 338725 72810 -244456 -222943 -241797 -643892 -920863 -440910 449232 844164
32744 844164 579221 360828 661893 1159548 1342838 1137213 791414 540207 497040 598887
32734 598887 601794 338050 -63422 -393796 -635956 -778800 -616502 -113204 265258 66581
32724 66581 -451650 -640227 -356750 -18570 148857 322039 544723 594995 477000 482365
32714 482365 643454 664375 510196 490403 606037 435547 -90778 -431585 -284610 -97427
32704 -97427 -306514 -612605 -513489 -91345 267371 532419 842011 998139 747727 305624
32694 305624 15889 -262968 -811336 -1295472 -1077580 -236216 400668 320610 -147945 -464144
32684 -464144 -488435 -346166 -186408 -242719 -693927 -1309879 -1634620 -1618897 -1620676 -1690372 -1421584
32673 -1421584 -724813 -152174 -75248 -69538 381236 991921 1089181 656336 332432 452678
32663 452678 674312 610088 332362 91574 -79061 -260646 -392705 -323688 -17704 373029
32653 373029 569118 329787 -282391 -827208 -876240 -489052 -117463 -35410 -74065 57296
32643 57296 415082 838603 1105562 1010486 520808 -55171 -289654 -139284 6832 -91760
32633 -91760 -185300 8323 290084 264502 -58048 -340867 -494978 -733314 -1049814 -1104142
32623 -1104142 -775701 -444541 -477546 -718983 -759017 -500842 -189090 -19599 18649 5341
32613 5341 12490 83441 109256 -143903 -680352 -1112558 -1120685 -905154 -829109 -758262 -239896
32602 -239896 672516 1302901 1211664 702929 251084 -121138 -554254 -852771 -755030 -454089
32592 -454089 -345526 -377063 -142201 401086 787722 721280 491353 543645 927796 1346037
32582 1346037 1520658 1352513 913257 453570 281240 479817 825848 1048778 1056186 869803
32572 869803 526598 133014 -159674 -344046 -558626 -802994 -853568 -620114 -387615 -476102
32562 -476102 -795465 -977570 -849906 -522423 -82206 482859 1039786 1312250 1255917 1173417
32552 1173417 1267586 1292649 912255 270080 -131815 -125010 -93939 -351440 -613742 -427091
32542 -427091 66063 242356 -85677 -329532 38303 654775 691855 -36744 -835843 -1016063
32532 -1016063 -634316 -222858 -102583 -187966 -275240 -279047 -237442 -227312 -261606 -246881 -132056
32521 -132056 -88708 -354222 -841319 -1115744 -881170 -308921 227877 547174 643831 515962
32511 515962 236200 17592 -51932 -204573 -649049 -1146610 -1244143 -879276 -435841 -197555
32501 -197555 -67124 112128 271965 307098 305645 396624 510217 469567 252862 30050
32491 30050 -35732 54268 161360 164695 102666 133978 317909 500002 505053 364071 214806
32480 214806 62854 -156142 -326018 -220202 137706 420768 404041 239385 219584 415549
32470 415549 646439 689619 448152 36903 -232365 -88425 396399 849941 997057 899045
32460 899045 784031 804173 991609 1266778 1439727 1391093 1281089 1340090 1418515 1079184
32450 1079184 277611 -393899 -389325 139817 643615 859170 877521 768587 542233 341885
32440 341885 274186 126540 -345606 -885132 -909541 -295790 362652 415030 -170239 -870802
32430 -870802 -1136797 -794607 -135138 328298 327317 62394 -144204 -266530 -421847 -511933
32420 -511933 -414313 -382625 -742293 -1230874 -1222672 -682173 -279935 -373502 -507537 -248473
32410 -248473 108303 138941 45626 210472 441127 357193 204394 505308 1066683 1152281
32400 1152281 651158 272022 406525 557826 242322 -189115 -123948 365124 668300 474186
32390 474186 5222 -408962 -592304 -475031 -159086 19769 -187247 -571957 -679267 -378929
32380 -378929 595 104712 -97333 -409249 -647675 -721746 -620303 -404256 -159576 54333
32370 54333 168993 71421 -297312 -826643 -1302052 -1568847 -1572498 -1301908 -817196 -325656
32360 -325656 -105661 -280985 -680717 -947579 -825860 -399937 -37924 -26374 -269560 -439708
32350 -439708 -393059 -279310 -239562 -213490 -128836 -70490 -111667 -139176 -9715 242851 492754
32339 492754 678517 742539 584675 244499 -41500 -148715 -233059 -372488 -290266 221565
32329 221565 812127 949693 676781 504242 595705 606765 413994 412156 813329 1157960
32319 1157960 941707 387490 143489 409491 778161 837487 561723 151629 -190054 -324253
32309 -324253 -275728 -278202 -526012 -906338 -1151942 -1190805 -1142833 -1049770 -854653 -607853 -441747
32298 -441747 -347402 -209762 -64117 -80276 -267277 -415873 -374072 -185233 67554 348057
32288 348057 576985 673348 715270 831756 899271 610640 -60090 -706562 -933271 -754402
32278 -754402 -452775 -261533 -298286 -568476 -864753 -882113 -619910 -464149 -672332 -991783
32268 -991783 -1032538 -816036 -654124 -640103 -599631 -460745 -333166 -250643 -154901 -131808 -342720
32257 -342720 -685267 -832511 -680010 -460680 -328432 -141087 182914 378306 145765 -423414
32247 -423414 -953114 -1193189 -1151113 -944640 -725981 -670381 -838024 -1057470 -1073932 -805986
32237 -805986 -399070 -92061 -75453 -348093 -619653 -501194 60053 641438 774498 409469
32227 409469 -160768 -667011 -963119 -932604 -587591 -195689 -41585 -93666 -146959 -232173
32217 -232173 -563385 -1071077 -1334999 -1103732 -610692 -235820 -86582 -58639 -87464 -153651
32207 -153651 -202743 -229871 -308397 -397958 -286580 110897 540586 667960 432280 8632
32197 8632 -419510 -681976 -606929 -226924 140519 264483 309934 496805 614998 287341
32187 287341 -338759 -634734 -344558 15896 -148753 -718471 -1043692 -753951 -106149 401733
32177 401733 539260 464324 475650 681543 901906 930150 830943 818449 874870 758939 457392
32166 457392 311622 499062 668683 389088 -238661 -752678 -976001 -1107795 -1227634 -1136399
32156 -1136399 -773288 -413610 -277259 -233953 -93609 69152 116879 155116 345345 558029
32146 558029 530316 302279 170573 201284 120609 -204932 -478870 -367928 23694 310716
32136 310716 322536 191289 29831 -186852 -407986 -458757 -309920 -173674 -197467 -253695
32126 -253695 -188023 -85947 -83558 -88940 21948 53138 -306901 -944435 -1364400 -1357261 -1241706
32115 -1241706 -1267309 -1166771 -639318 19461 231919 -44658 -286087 -187360 -17608 -61556
32105 -61556 -135941 65171 455137 724283 830914 960852 1086940 942237 465786 -44097
32095 -44097 -322262 -415248 -440938 -344390 -112757 5458 -172755 -356203 -104635 440339
32085 440339 597338 84163 -509081 -520536 -150403 -106864 -512560 -770337 -548045 -273948
32075 -273948 -386685 -616644 -455956 6217 233838 59196 -148443 -90322 118487 243808
32065 243808 205048 5292 -288123 -458588 -360673 -247571 -504827 -1005202 -1166949 -800009
32055 -800009 -432204 -528714 -822696 -804116 -509192 -341738 -361702 -293842 -125731 -140375
32045 -140375 -333234 -318911 37186 334113 206373 -154860 -299975 -91648 265812 570165
32035 570165 739133 714154 494040 217298 35333 -56714 -140058 -206678 -215731 -221526 -260370
32024 -260370 -174353 227114 819937 1194097 1112669 787545 598527 661022 791077 798918
32014 798918 655946 408419 102131 -163986 -248403 -120073 79650 199502 215987 128548
32004 128548 -157138 -664064 -1127256 -1167064 -708538 -46660 530549 969487 1251549 1249323
31994 1249323 965720 690178 662656 725088 559906 161725 -197693 -388800 -510979 -592407
31984 -592407 -502195 -191270 220269 602533 833869 720220 229115 -214753 -88894 471185
31974 471185 694638 151870 -669861 -1024451 -797370 -427037 -239702 -239327 -348894 -481124
31964 -481124 -495769 -392138 -390205 -533531 -441614 160158 883268 1121993 896252 717614
31954 717614 723135 568294 200728 65983 342598 574422 366888 -62977 -358832 -549676
31944 -549676 -705769 -552755 37563 534723 337389 -330536 -700604 -526841 -294460 -384280
31934 -384280 -602239 -644502 -527225 -363593 -119546 180105 313836 164693 -59517 -94640
31924 -94640 69224 284824 468087 573190 510723 251268 -77776 -288459 -257144 32212
31914 32212 419601 582686 356294 33164 57246 385511 501418 169877 -200584 -163463
31904 -163463 143653 277273 107931 -173906 -453711 -732193 -913019 -900950 -820499 -829215
31894 -829215 -815693 -600002 -322244 -260259 -330484 -186628 170284 298296 -57501 -590921
31884 -590921 -837835 -684068 -349265 -116689 -190375 -570510 -950134 -964464 -639246 -349065
31874 -349065 -260491 -135115 184600 448755 384711 93956 -202322 -519495 -892219 -1069318
31864 -1069318 -821811 -382935 -184202 -264931 -323271 -252569 -206795 -175391 57730 474940
31854 474940 754330 752612 700477 783598 871844 839295 836164 1014644 1232333 1262129 1109490
31843 1109490 920346 749012 599314 509591 406630 70921 -533656 -1078125 -1249521 -1134581
31833 -1134581 -972868 -732866 -274245 223047 403933 265910 146658 179710 159979 8134
31823 8134 -48008 94928 190117 69954 -41160 69115 176607 -35872 -404116 -454064
31813 -454064 -81031 311302 370461 178620 5072 -55506 -67050 -56538 20736 192757
31803 192757 411203 533540 395180 17888 -289270 -220936 107971 218825 -188837 -898813
31793 -898813 -1445978 -1574819 -1353666 -986746 -643800 -391552 -188239 12944 131300 31524
31783 31524 -250389 -508373 -648621 -790117 -984186 -1030420 -745567 -268191 98783 244379
31773 244379 268979 257753 240397 289841 440300 561608 520133 398213 326771 179116 -262474
31762 -262474 -840551 -1058331 -685535 -57989 359686 474769 471977 427943 240361 -145094
31752 -145094 -594608 -840854 -635972 36019 841088 1316927 1282813 929936 514691 160629
31742 160629 -26506 55579 281517 342763 197144 200754 558293 912823 799542 293458
31732 293458 -152065 -338934 -394741 -342347 -77218 242752 274111 45593 -18352 213413
31722 213413 329478 78066 -133107 125048 489218 200735 -772802 -1581452 -1582853 -1116675
31712 -1116675 -918250 -1113434 -1207006 -910218 -511521 -354157 -353510 -284775 -256274 -499600
31702 -499600 -800504 -605734 180924 898884 899991 363562 21109 225004 647677 849377
31692 849377 773584 613126 496623 447569 435699 334034 -1948 -491897 -823327 -801701
31682 -801701 -558986 -301446 -24362 343720 643359 568221 50083 -592739 -931756 -798870
31672 -798870 -403544 -139095 -236850 -547752 -693542 -483065 -137014 -37685 -284290 -565831
31662 -565831 -490695 -20524 446554 463783 23540 -409668 -415335 -85157 138444 15021
31652 15021 -278271 -452063 -416772 -255402 -78630 16053 -9886 -64536 -29505 41188 3680
31641 3680 -69369 86064 490687 772006 635560 263764 5289 -146722 -453032 -893243
31631 -893243 -1072938 -725192 -65508 452374 580238 391537 89523 -169269 -303542 -285839
31621 -285839 -162032 -66450 -128773 -314899 -434632 -392901 -339397 -412617 -434487 -138868 297586
31610 297586 298035 -384088 -1254659 -1629500 -1403576 -1037148 -931913 -1082401 -1257577 -1273042
31600 -1273042 -1095454 -856638 -754713 -824172 -858415 -667757 -332836 -97565 -110575 -358670
31590 -358670 -702965 -879072 -673098 -255761 -102246 -359203 -551207 -232745 302590 384806
31580 384806 -93406 -558417 -559620 -260662 -60207 -97697 -259507 -382756 -328692 -79947
31570 -79947 154980 143524 -27811 -46524 161321 330124 281577 175355 220884 382660
31560 382660 515769 602264 697102 757501 653071 309988 -177075 -552898 -614775 -499814
31550 -499814 -590895 -974857 -1219140 -965514 -516878 -433302 -719429 -897087 -774383 -588954
31540 -588954 -421837 -92152 276761 222419 -312659 -782741 -850423 -831430 -1005498 -1065467
31530 -1065467 -716241 -314669 -333577 -556112 -425943 26187 226590 -53166 -415043 -482538
31520 -482538 -369506 -368790 -485429 -453966 -111038 330235 411334 -62834 -685470 -859058
31510 -859058 -541129 -233459 -193119 -139870 84709 132938 -218539 -570044 -499555 -219942
31500 -219942 -122800 -92378 128544 284990 36683 -258872 11965 646391 802551 228260
31490 228260 -453098 -736051 -765771 -751282 -582787 -285078 -214110 -491869 -764455 -799681
31480 -799681 -836473 -1056464 -1172677 -873789 -314624 119590 229777 -10394 -527990 -1015679
31470 -1015679 -1091257 -791285 -542872 -482364 -246893 331043 808102 761254 429671 320997
31460 320997 477102 529269 282278 -86201 -264222 -35523 535269 1005584 918581 398232
31450 398232 42781 102822 219341 164779 273026 766526 1208888 1140292 797258 627032
31440 627032 500954 82888 -345030 -201393 389123 669762 346432 -74587 -146936 -55802
31430 -55802 -120386 -243344 -147684 171811 471937 518804 201833 -391936 -943559 -1154945
31420 -1154945 -1070518 -940715 -805607 -508249 -107327 83806 -35304 -149747 56334 481934
31410 481934 723572 486106 -150303 -756215 -883406 -509906 -75389 74352 107278 329277
31400 329277 596706 492534 -15943 -508425 -667615 -518595 -152625 355252 737568 689005
31390 689005 316042 46359 30079 34323 -22328 80187 341185 360111 -81179 -667580
31380 -667580 -1017104 -1107460 -1011818 -647980 -107776 167541 -69493 -468368 -593635 -544690
31370 -544690 -662677 -889158 -871404 -532704 -116790 199843 358578 242932 -130415 -384799
31360 -384799 -201656 132371 78988 -305859 -418385 -49219 277785 101862 -337451 -566862
31350 -566862 -583204 -694325 -913606 -943975 -681323 -371710 -244491 -246238 -192049 -6461
31340 -6461 225851 318616 87812 -451633 -968449 -1061845 -709733 -333962 -299360 -465633
31330 -465633 -424118 -123477 3596 -361257 -920386 -1092241 -748681 -339823 -255520 -346420
31320 -346420 -244598 60424 245878 171145 56079 83420 100996 -93377 -358041 -364408
31310 -364408 -79750 192846 291067 417051 737015 1025754 981493 710042 543920 470047
31300 470047 152482 -441680 -873419 -855075 -655491 -636859 -735327 -716404 -632515 -632027 -561160
31289 -561160 -203726 253109 450231 419784 435492 420372 73841 -443689 -588585 -294730
31279 -294730 -118053 -304597 -345274 175550 845700 1029446 785060 639511 739847 784001
31269 784001 635908 484776 432458 354414 184820 9030 -128134 -236616 -246951 -128769
31259 -128769 -83288 -328746 -724319 -890922 -715797 -493004 -530669 -804245 -1024486 -928405
31249 -928405 -523936 -122946 -40053 -201020 -237888 -59457 -32212 -388455 -770365 -694979
31239 -694979 -228169 173512 289325 212927 -7507 -365289 -650332 -643332 -475935 -403630
31229 -403630 -343850 -76796 241689 294751 214818 363275 550909 201550 -594004 -935241
31219 -935241 -330076 589017 971710 823101 696903 774073 800713 651107 424275 152611
31209 152611 -135296 -202462 118791 529376 542037 116883 -328699 -516380 -569385 -649177
31199 -649177 -648455 -382652 89724 475599 538975 339792 166300 197750 287918 208716 45289
31188 45289 100396 388416 530485 277038 -147823 -398282 -444650 -452606 -463346 -438287 -431322
31177 -431322 -473120 -443934 -284970 -172829 -254658 -368133 -266501 9442 208427 195428
31167 195428 9954 -251065 -419238 -303585 39834 278169 245433 177286 265960 280964
31157 280964 -19532 -380772 -401118 -188077 -180768 -445296 -637248 -583810 -397769 -56783
31147 -56783 574298 1241130 1370433 828230 166310 -88988 -19478 -5841 -205034 -548326
31137 -548326 -927159 -1145579 -967816 -444857 33439 194590 161875 136001 96420 17968
31127 17968 75816 353068 582545 473217 114597 -202711 -383019 -477211 -444945 -293834
31117 -293834 -284475 -603059 -921572 -721559 -84787 268383 -107700 -783623 -1019312 -670779
31107 -670779 -210294 8937 107466 258385 296590 3610 -441516 -637174 -522978 -426187
31097 -426187 -502115 -484600 -171223 156724 95392 -299555 -604382 -570332 -276853 130796
31087 130796 514498 641017 382709 -5121 -163565 -150842 -284803 -500040 -375545 110934
31077 110934 409179 208854 -83102 -9982 244820 264873 129770 225033 542174 669877
31067 669877 389170 -135513 -678883 -1088256 -1180127 -906594 -590961 -609255 -840551 -817012
31057 -817012 -445505 -176277 -345344 -719430 -881605 -778951 -664036 -694072 -811582 -903613
31047 -903613 -887627 -704681 -387768 -118466 -85501 -244497 -287355 50105 609603 849470
31037 849470 446950 -167378 -170840 624282 1401430 1277461 387371 -340339 -358418 -896
31027 -896 190754 151146 95435 24295 -220609 -563399 -680710 -397385 88614 426404 469529
31016 469529 370679 356176 468331 582817 638453 700756 752999 615942 233442 -113450
31006 -113450 -94588 256058 619938 793339 781698 602296 290984 57134 113291 338451
30996 338451 397382 199434 -57995 -285912 -570323 -807902 -706183 -290948 -3311 -77773
30986 -77773 -204008 -70329 122858 29185 -280312 -513830 -670152 -915468 -1110800 -920797
30976 -920797 -347959 236385 581038 717823 652381 290260 -242687 -549895 -394805 28832
30966 28832 356236 405645 237710 66761 138384 469418 695310 450910 -61304 -218778
30956 -218778 192842 656792 640238 285798 67160 47375 -68982 -292369 -271350 92090
30946 92090 406780 360805 172475 206432 396463 383014 91612 -183277 -273526 -389807
30936 -389807 -753729 -1213181 -1416206 -1242326 -875883 -522730 -250829 -100919 -142427 -319571
30926 -319571 -385608 -153685 222065 363017 100107 -313094 -490950 -343564 -113891 -40381
30916 -40381 -138016 -326702 -575123 -782437 -690896 -174852 437352 623351 314255 23518
30906 23518 195349 650663 872860 660785 256595 -56475 -223170 -328627 -468210 -692463
30896 -692463 -907228 -877193 -521925 -148730 -153219 -507267 -784235 -701227 -406630 -210212
30886 -210212 -250414 -451583 -598035 -451289 -30639 242778 -18407 -574856 -744533 -247829
30876 -247829 479820 915517 1003620 921750 697210 330329 -19570 -253735 -464472 -600332
30866 -600332 -333850 413877 1136805 1326040 1123420 979349 918760 655030 261747 158579
30856 158579 432085 662361 503962 68303 -324741 -462808 -302989 -15181 72694 -135087
30846 -135087 -275440 -40349 249993 74994 -410690 -535786 -135053 250718 310936 410798
30836 410798 830115 1198974 1102626 728617 454787 223437 -189453 -633929 -820147 -829658
30826 -829658 -910163 -975246 -787919 -476797 -392028 -552682 -685153 -732266 -876952 -1087433
30816 -1087433 -1068889 -702707 -174331 360274 891360 1314236 1429414 1265725 1094467 1027951
30806 1027951 883014 546159 206379 72916 59754 -83321 -425553 -749395 -754420 -364161
30796 -364161 122992 271122 1737 -272359 -184590 58807 -28732 -483274 -808831 -662358
$$ [...]
##END NTUPLES=NMR SPECTRUM
##END=
