##TITLE=31Pdec_BAU-2.11
 CCl4+DMSO-d6, 24 sc
 11.2.2019
##JCAMPDX= 6.0         $$ Bruker NMR JCAMP-DX V2.0
##DATA TYPE= NMR SPECTRUM
##DATA CLASS= NTUPLES
##ORIGIN= UXNMR, Bruker Analytische Messtechnik GmbH
##OWNER= root
$$ XWIN-NMR		Version 3.5
$$ Mon Feb 11 15:50:00 2019 Russian Standard Time (UT+4h)  she@DPX200
##.OBSERVE FREQUENCY= 81.013821
##.OBSERVE NUCLEUS= ^31P
##.ACQUISITION MODE= SIMULTANEOUS
##.ACQUISITION SCHEME= undefined
##.AVERAGES= 24
##.DIGITISER RES= 17
##SPECTROMETER/DATA SYSTEM= spect
##.PULSE SEQUENCE= zgpg30
##.SOLVENT NAME= DMSO
##.SHIFT REFERENCE= (INTERNAL, DMSO, 0, 182.463)
##AUDIT TRAIL= $$ (NUMBER, WHEN, WHO, WHERE, WHAT)
$$ ##TITLE= Audit trail, XWIN-NMR		Version 3.5
$$ ##JCAMPDX= 5.01
$$ ##ORIGIN= Bruker BioSpin GmbH
$$ ##OWNER= she
$$ F:/spectra/data/she/nmr/P31/1/pdata/1/auditp.txt
$$ ##AUDIT TRAIL=  $$ (NUMBER, WHEN, WHO, WHERE, WHAT)
(   1,<2019-02-11 15:45:34.75 +0400>,<she>,<DPX200>,
      <created by zg, POWCHK disabled, PULCHK disabled
       configuration hash MD5:
       00 E9 B6 7A A2 85 ED C7 34 08 36 98 17 FE 4E 26
       data hash MD5: 32K
       27 E2 BE 1C D3 D6 A9 58 CD F2 62 BA 38 D2 FA 47>)
(   2,<2019-02-11 15:45:37.43 +0400>,<she>,<DPX200>,
      <Start of raw data processing
       efp BC_mod = 2 LB = 1 FT_mod = 6 PKNL = 1 PHC0 = -1452.384 PHC1 = 77.39893 SI = 64K 
       data hash MD5: 64K
       D7 79 00 84 B3 4E BB 36 B7 D9 79 0C 45 90 BC 5E>)
(   3,<2019-02-11 15:45:53.43 +0400>,<she>,<DPX200>,
      <pk PHC0 = -8.50609 PHC1 = 0 
       data hash MD5: 64K
       E1 CF 6C BA D5 D0 54 3E DB CC BE 31 88 F3 45 60>)
$$ ##END=
$$ 
$$ hash MD5
$$ B6 90 2F 6E F2 90 73 0C 1E 51 A8 6E 72 54 E1 8A
##$RELAX= 
##$RELAX= 
##$RELAX= 
##$RELAX= 
##$RELAX= 
##$RELAX= 
##$RELAX= 
##$RELAX= 
$$ Bruker specific parameters
$$ --------------------------
##$DU= <F:/spectra>
##$EXPNO= 1
##$NAME= <P31>
##$PROCNO= 1
##$TYPE= <nmr>
##$USER= <she>
##$AMP= (0..31)
100 100 100 100 100 100 100 100 100 100 100 100 100 100 100 100 100 100 
100 100 100 100 100 100 100 100 100 100 100 100 100 100 
##$AQSEQ= 0
##$AQ_mod= 1
##$AUNM= <au_zg>
##$AUTOPOS= <>
##$BF1= 81.014009
##$BF2= 200.13
##$BF3= 200.13
##$BF4= 200.13
##$BF5= 200.13
##$BF6= 200.13
##$BF7= 200.13
##$BF8= 200.13
##$BYTORDA= 1
##$CFDGTYP= 0
##$CFRGTYP= 5
##$CHEMSTR= <none>
##$CNST= (0..31)
1 1 145 1 1 1 1 1 1 1 1 1 1 1 1 1 1 1 1 1 1 1 1 1 1 1 1 1 1 1 1 1 
##$CPDPRG= <waltz16>
##$CPDPRG1= <>
##$CPDPRG2= <waltz16>
##$CPDPRG3= <>
##$CPDPRG4= <mlev>
##$CPDPRG5= <mlev>
##$CPDPRG6= <mlev>
##$CPDPRG7= <mlev>
##$CPDPRG8= <mlev>
##$CPDPRGB= <>
##$CPDPRGT= <>
##$D= (0..31)
0 1 0 0 0 0 0 0 0 0 0 0.03 2e-05 3e-06 0 0 0 0 0 0 0 0 0 0 0 0 0 0 0 0 
0 0 
##$DATE= 1549885534
##$DBL= (0..7)
120 120 120 11 120 120 24 19 
##$DBP= (0..7)
150 150 150 150 150 150 150 150 
##$DBP07= 0
##$DBPNAM0= <>
##$DBPNAM1= <>
##$DBPNAM2= <>
##$DBPNAM3= <>
##$DBPNAM4= <>
##$DBPNAM5= <>
##$DBPNAM6= <>
##$DBPNAM7= <>
##$DBPOAL= (0..7)
0.5 0.5 0.5 0.5 0.5 0.5 0.5 0.5 
##$DBPOFFS= (0..7)
$$ [...]
##$SUBNAM2= <"">
##$SUBNAM3= <"">
##$SUBNAM4= <"">
##$SUBNAM5= <"">
##$SUBNAM6= <"">
##$SUBNAM7= <"">
##$SUBNAM8= <"">
##$SUBNAM9= <"">
##$SW= 369.568048894756
##$SWIBOX= (0..15)
0 1 3 0 0 0 0 0 0 0 0 0 0 0 0 0 
##$SW_h= 29940.119760479
##$TD= 32768
##$TD0= 1
##$TE= 0
##$TE2= 300
##$TE3= 300
##$TEG= 300
##$TL= (0..7)
0 120 53 12 22 120 120 120 
##$TP= (0..7)
150 150 150 150 150 150 150 150 
##$TP07= 0
##$TPNAME0= <>
##$TPNAME1= <>
##$TPNAME2= <>
##$TPNAME3= <>
##$TPNAME4= <>
##$TPNAME5= <>
##$TPNAME6= <>
##$TPNAME7= <>
##$TPOAL= (0..7)
0.5 0.5 0.5 0.5 0.5 0.5 0.5 0.5 
##$TPOFFS= (0..7)
0 0 0 0 0 0 0 0 
##$TUNHIN= 0
##$TUNHOUT= 0
##$TUNXOUT= 0
##$USERA1= <user>
##$USERA2= <user>
##$USERA3= <user>
##$USERA4= <user>
##$USERA5= <user>
##$V9= 5
##$VALIST= <valist>
##$VCLIST= <CCCCCCCCCCCCCCC>
##$VD= 0
##$VDLIST= <DDDDDDDDDDDDDDD>
##$VPLIST= <PPPPPPPPPPPPPPP>
##$VTLIST= <TTTTTTTTTTTTTTT>
##$WBST= 1024
##$WBSW= 4
##$XGAIN= (0..3)
0 0 0 0 
##$XL= 0
##$YL= 0
##$YMAX_a= 16497
##$YMIN_a= -5523
##$ZGOPTNS= <>
##$ZL1= 120
##$ZL2= 120
##$ZL3= 120
##$ZL4= 120
##$ABSF1= 0
##$ABSF2= 0
##$ABSG= 0
##$ABSL= 0
##$ALPHA= 0
##$AQORDER= 0
##$ASSFAC= 0
##$ASSFACI= 0
##$ASSFACX= 0
##$ASSWID= 0
##$AUNMP= <proc_1d>
##$AZFE= 0.1
##$AZFW= 0.5
##$BCFW= 0
##$BC_mod= 2
##$BYTORDP= 0
##$COROFFS= 0
##$CY= -3
##$DATMOD= 1
##$DC= 0
##$DFILT= <>
##$DTYPP= 0
##$F1P= 0
##$F2P= 0
##$FCOR= 1
##$FTSIZE= 65536
##$FT_mod= 6
##$GAMMA= 0
##$GB= 0
##$INTBC= 1
##$INTSCL= 5.30512e-09
##$ISEN= 30
##$LB= 1
##$LEV0= 0
##$LPBIN= 0
##$MAXI= 10000
##$MC2= 0
##$MEAN= 0
##$ME_mod= 0
##$MI= 50
##$NCOEF= 0
##$NC_proc= -6
##$NLEV= 6
##$NOISF1= 182.463
##$NOISF2= 159.3651
##$NSP= 0
##$NTH_PI= 0
##$NZP= 0
##$OFFSET= 182.463
##$PC= 4
##$PHC0= -1460.89
##$PHC1= 77.39893
##$PH_mod= 1
##$PKNL= yes
##$PPARMOD= 0
##$PSCAL= 0
##$PSIGN= 0
##$REVERSE= no
##$SF= 81.0140089999434
##$SI= 65536
##$SIGF1= 159.3651
##$SIGF2= -187.1042
##$SINO= 113.3802
##$SIOLD= 16384
##$SREGLST= <1H.CDCl3>
##$SSB= 0
##$STSI= 65536
##$STSR= 0
##$SW_p= 29940.119760479
##$SYMM= 0
##$S_DEV= 0
##$TDeff= 32768
##$TDoff= 0
##$TI= <>
##$TILT= no
##$TM1= 0
##$TM2= 0
##$TOPLEV= 0
##$USERP1= <user>
##$USERP2= <user>
##$USERP3= <user>
##$USERP4= <user>
##$USERP5= <user>
##$WDW= 1
##$XDIM= 65536
##$YMAX_p= 309326365
##$YMIN_p= -13754379
$$ End of Bruker specific parameters
$$ ---------------------------------
##NTUPLES= NMR SPECTRUM
##VAR_NAME=  FREQUENCY,     SPECTRUM/REAL,   SPECTRUM/IMAG
##SYMBOL=    X,             R,               I
##VAR_TYPE=  INDEPENDENT,   DEPENDENT,       DEPENDENT
##VAR_FORM=  AFFN,          ASDF,            ASDF
##VAR_DIM=   65536,         65536,           65536
##UNITS=     HZ,            ARBITRARY UNITS, ARBITRARY UNITS
##FACTOR=    0.456856943014862, 1,           1
##FIRST=     14782.0589164792, 0,            0
##LAST=      -15158.0608439998, 0,           0
##MIN=       -15158.0608439998, -13754379,   0
##MAX=       14782.0589164792, 309326365,    0
$$ Real data points
##PAGE= N=1
##DATA TABLE= (X++(R..R)), XYDATA
$$ [...]
40912B094993J106456O90768p34136j969262k196874j426022o9404J068603J088168
$$ 2094993 3201449 3892217 3158081 1188819 -1008055 -2434077 -2503481 -1434878 -346710
40903c46710J30136m78085j3283N22362J5178q82990p42540L81863J059106N95345
$$ -346710 -216574 -694659 -707942 -185580 -170402 -1053392 -1795932 -1414069 -354963 240382
40893B40382k39135n47773k45330L71495R43194Q40693l36254j808603k077357
$$ 240382 1247 -546526 -791856 -420361 522833 1363526 1027272 -781331 -2858688
40884b858688o97038J108410J878757J302790j7085j336207j883587j047573Q04999
$$ -2858688 -3555726 -2447316 -568559 734231 717146 -619061 -2502648 -3550221 -2745222
40875b745222K191899J946225N40324n84374p08266k33839K77803O08554N05638
$$ -2745222 -553323 1392902 1933226 1348852 640586 406747 684550 1293104 1798742
40866A798742k33092j060543r69709L1898N46660l74760j668483j524850J28003
$$ 1798742 1565650 505107 -464602 -432704 113956 -260804 -1929287 -3454137 -3326134
40857c326134J519740J399819M19505j03784J69799O58571P91458L86011l05363
$$ -3326134 -1806394 -406575 12930 -90854 78945 737516 1528974 1914985 1609622
40848A609622n75748L4565P59258K83150j195361j807305o94855N15703K04218
$$ 1609622 1033874 1068439 1827697 2110847 915486 -891819 -1586674 -1070971 -866753
40839h66753o11269n0970J191182P21964j407923k169494K8371K747870K831022
$$ -866753 -1478022 -1528992 -337810 384154 -1023769 -3193263 -3164892 -417022 2414000
40830B414000N73222j200749j115485l67993l12663p38180q00251l83510L0858
$$ 2414000 2987222 1786473 670988 302995 -9668 -747848 -1548099 -1931609 -1900751
40821a900751J90936K84670N64806R98017J237472R44151J68213o73775j179056
$$ -1900751 -1709815 -1425145 -860339 137678 1375150 2319301 2487514 1813739 634683
40812F34683j179899p31607j68572k860l73689p63795o63462k18624K64082R36578
$$ 634683 -545216 -1276823 -1445395 -1448255 -1821944 -2585739 -3249201 -3467825 -3203743 -2267165
40802b267165J762656J886856Q27115k51064K1236R01551N53174p83366r20164
$$ -2267165 -504509 1382347 2209462 1958398 1979634 2881185 3434359 2650993 1730829
40793A730829O55456J766239J008202k44995n71794p30122j396441j190211O11905
$$ 1730829 2386285 4152524 5160726 4915731 4343937 3613815 2217374 1027163 1639068
40784A639068J638412k19662k742082k222048P13528J990414M12869r51584j68478
$$ 1639068 3277480 3057818 315736 -1906312 -1192784 797630 1210499 258915 90437
40775I0437Q03771J45190o16419L98959J979308J830668Q9039j438380k002053
$$ 90437 894208 1039398 422979 821938 2801246 4631914 4720953 3282573 1280520
40766A280520j852527r29257L45710L69269j355187k511907r52500J720552K236301
$$ 1280520 -572007 -1501264 -1155554 -786285 -2141472 -4653379 -5605879 -3885327 -1649026
40757a649026N29791m70991L51582R70981J56401m68976L99748J315823O93305
$$ -1649026 -1119235 -1590226 -1238644 -267663 -111262 -580238 -180490 1135333 1828638
40748A828638m00933k94788K25805n18638j686342r80436J281823K142272M85660
$$ 1828638 1427705 1132917 1358722 840084 -846258 -1826694 -544871 1597401 2083061
40739B083061j183136o18256Q42618O87024p21916q97782O65109J610044K84299
$$ 2083061 899925 281669 1124287 1811311 1089395 191613 856722 2466766 2751065
40730B751065j796298k093879m57398Q99517M33220q39990p93716J012652K620576
$$ 2751065 954767 -1139112 -1596510 -696993 -263773 -1103763 -1897479 -884827 1735749
40721A735749K008548k52772j518009m20379J345170J425515L7783o80068k4777
$$ 1735749 3744297 3491525 1973516 1553137 2898307 4323822 4361605 3681537 3656760
40712C656760M75704k19915j108113j084716p19932q76257r68304j20578R64074
$$ 3656760 4132464 3912549 2804436 1719720 999788 123531 -844773 -965351 -1277
40703a277R42006n975n31216k10713K41283N20652Q90268R39779j22420j759169
$$ -1277 940729 934754 403538 192825 434108 954760 1845028 2784807 2662387 903218
40693I03218k269505j102560L42690P30336L66497J97279L92951O62470J020146
$$ 903218 -1366287 -2468847 -2126157 -1395821 -1029324 -832045 -439094 223376 1243522
40684A243522J434728J410304O38373m19033j091668j170773p19094J43658R26355
$$ 1243522 2678250 4088554 4726927 4307894 3216226 2045453 1326359 1470017 2396372
40675B396372R20549O6796r16421j496328j693570j353200j23176J421676J824077
$$ 2396372 3316921 3383717 2467296 970968 -722602 -2075802 -2198978 -777302 1046775
40666A046775O94180m37743k07905N76414K62726j014175j526624n65624O26756
$$ 1046775 1740955 1303212 1095307 1671721 1934447 920272 -606352 -1171976 -545220
40657e45220Q01661L30005K41515N29614L74793k66931l54723N92642J344497
$$ -545220 256441 586446 827961 1357575 1732368 1465437 1110714 1703356 3047853
40648C047853M33441j437527j798458K29854K296605J815931l97570j354850k84520
$$ 3047853 3481294 2043767 245309 475163 2771768 4587699 4190129 2835279 2550759
40639B550759M99638n57691j884981j410074L32926J311124Q84206m5748p97199
$$ 2550759 3050397 2492706 607725 -802349 -469423 841701 1725907 1680159 882960
40630H82960j197798q46965K96121J102541N99070k90080J16786J607678K149552
$$ 882960 -314838 -1161803 -865682 236859 835929 545849 662635 2270313 4419865
40621D419865O88384j498012k488795j702654l9864J061397O89318o16744j172464
$$ 4419865 5108249 3610237 1121442 -581212 -621076 440321 1129639 512895 -659569
40612f59569j79446J003690O92842n92912r27615Q7945R80493R11013N73231L26521
$$ -659569 -839015 164675 857517 264605 -663010 -575065 405428 1316441 1889672 2216193
40602B216193n10112j791682j965273n15962P16956J35539j089612p74277R94589
$$ 2216193 1706081 -85601 -2050874 -2566836 -1849880 -1714341 -2803953 -3578230 -2583641
40593b583641K133457J574878K83163n37450o78750l31192L36963P54578L04812
$$ -2583641 -450184 1124694 1407857 870407 191657 -139535 197428 952006 1256818
40584A256818n56011o03398L39021R27948K14167r40959j196676p16969p21343
$$ 1256818 700807 97409 436430 1364378 1578545 637586 -559090 -1276059 -1997402
40575a997402j430492j693640p87493N12817J144408J155777J173753J171433
$$ -1997402 -3427894 -5121534 -5909027 -5396210 -4251802 -3096025 -1922272 -750839
40567g50839P55604K66516M11947Q80140N72761n44421j125414n33855P0956l21803
$$ -750839 4765 271281 683228 1563368 2136129 1591708 466294 -67561 3395 -318408
40557c18408q02531j15386R94226Q23864m24218q52100P3986P30682J00647o22012
$$ -318408 -1120939 -1236325 -242099 581765 157547 -694553 -620567 110115 210762 -411250
40547d11250j88301N91981K91316p37860r49911N2555J173478J489923J049764
$$ -411250 -599551 -7570 283746 -454114 -1404025 -1351470 -177992 1311931 2361695
40538B361695K01537p44451j213929p25895L21949R80276R25611O34674L93992
$$ 2361695 2563232 1818781 604852 -121043 200906 1181182 2106793 2741467 3135459
40529C135459p6843q54132j404339j293653p59613k07937M04656J204947J713292
$$ 3135459 3058616 2204484 800145 -493508 -1253121 -1461058 -1056402 148545 1861837
40520A861837J167672l23314j459808j096399K21006P09526m03325j720332j400962
$$ 1861837 3029509 2706195 1246387 149988 370994 1080520 677195 -1043137 -2444099
40511b444099M10956J812048J606839M65899m68527r31545j066503q11652n24301
$$ -2444099 -2033143 -221095 1385744 1851643 1383116 451571 -614932 -1426584 -1950885
40502a950885j125757k545062k920017p50820K631662M207940K804791K32663
$$ -1950885 -3076642 -5621704 -8541721 -9292541 -6660879 -2452939 351852 584515
40494E84515j148072p94375K58465Q30317L97994o00037r24179J30355J381970
$$ 584515 -563557 -1357932 -1099467 -269150 128844 -471193 -1395372 -1265017 116953
40485A16953R07100j114829k149859p51927J211613J229731j65888m53887P41928
$$ 116953 1024053 -90776 -2240635 -2992562 -1780949 -551218 -717106 -1170993 -429065
40476d29065J100165m51288j750778p43711J188911J340727j48150p79705Q1587
$$ -429065 671100 219812 -1530966 -2274677 -1085766 254961 106811 -672894 -591307
40467e91307L01826j110324j888617j871K747253L011297P11606j059706p04730
$$ -591307 -289481 -1399805 -3288422 -3290293 -543040 2468257 3179863 2120157 1415427
40458A415427k471o76697j530054n93224J505404K319937J027091p56921j475357
$$ 1415427 1412956 736259 -793795 -1387019 118385 2438322 3465413 2708492 1233135
40449A233135j356858j338133j521829j353064o07980L85398J130468J198525
$$ 1233135 -123723 -1461856 -2983685 -4336749 -4944729 -4559331 -3428863 -2230338
40441b230338M51062n97623r38805n9510J294509J769774R55009m6974N8899J028361
$$ -2230338 -1779276 -2376899 -3315704 -3375214 -2080705 -310931 644078 597104 656003 1684364
40431A684364J255772q5603j700767j677639j5824J312451R23808l32426p59391
$$ 1684364 2940136 2854533 1153766 -523873 -539697 772754 1696562 1364136 604745
40422F04745k3413P66390O85429j01405q52108r87866l83502N58589J126259R29317
$$ 604745 581332 1347722 2033151 1931746 1079638 91772 -291730 266859 1393118 2322435
40412B322435K49793m20582q95929j103543q55605k84042k2391k90150k23739
$$ 2322435 2572228 2151646 1255717 152174 -703431 -987473 -1009864 -1300014 -1523753
40403a523753R80334K483495K462414N28493j519511j870094q35254q8369l25680
$$ -1523753 -543419 1940076 4402490 4930983 3411472 1541378 706124 617755 292075
40394B92075o71415l11338L34698N35554N25964R41089J370178P11163q40240
$$ 292075 -379340 -690678 -355980 179574 705538 1646627 3016805 3727968 2887728
40385B887728j462988j86689J399577J204435l66750j115360l77542K84220j24626
$$ 2887728 1424740 1238051 2637628 3842063 3475313 2359953 1982411 2266631 2142005
40376B142005n75829j16070M20554J2160p08535o26212l9488M3731l64756n47430
$$ 2142005 1566176 1450106 1870660 1882820 1174285 548073 508585 552316 187560 -359870
40366c59870l51538O3679Q62756J682607J248044o24493j786011m64217J736022
$$ -359870 -711408 -647729 215027 1897634 3145678 2521185 735174 270957 2006979
40357B006979J800920l57605j974779j545018l43577K01687J60315k06308j007409
$$ 2006979 3807899 3450294 1475515 -69503 -413080 -211393 -51078 -257386 -1264795
40348a264795j485975n13898J148473J423612K81183o6268R36925J056698o74968
$$ -1264795 -2750770 -3264668 -2116195 -692583 -411400 -477668 459257 1515955 840987
40339H40987j860135o87780Q85724M71938p73994n43035M34965R9853p03408L30575
$$ 840987 -1019148 -1706928 -821204 -349266 -1123260 -1666295 -1231330 -1131477 -1834885 -1504310
40329a504310K218814J641846j359234k823846q83758J504592J403411O2153M1466
$$ -1504310 714504 2356350 997116 -1826730 -2710488 -1205896 197515 259668 301134
40320C01134R66853Q78011j22543m30327J0049o1864n51949j82821P79787M75880
$$ 301134 1267987 2145998 2023455 1593128 1603177 1541313 989364 806543 1586330 2062210
40310B062210j402119k632503j633812J83743O39475K0166K78662J645555K116596
$$ 2062210 660091 -1972412 -3606224 -3422481 -2783006 -2762840 -2484178 -838623 1277973
40301A277973O25154j106236r74313N03397J133271L47578k58808K19777M61061
$$ 1277973 1903127 796891 -177422 325975 1459246 1806824 1548016 1767793 2228854
40292B228854q48600k620787k662456p42225J085913J184068J82892j91138O40363
$$ 2228854 1380254 -1240533 -3902989 -4645214 -3559301 -2375233 -2192341 -2383479 -1743116
40283a743116J551918J168317m60719j816114j625351l08463P99256J313865J812221
$$ -1743116 -191198 977119 516400 -1299714 -2925065 -3233528 -2434272 -1120407 691814
40274F91814K064758R11482j434335k659146j298833R19049J379580J71303n88299
$$ 691814 2756572 3668054 2233719 -425427 -1724260 -805211 574369 745672 157373
40265A57373k13288P5147j76256M9041R86224J390124P36471J61869M29188P45916
$$ 157373 -55915 19232 -157024 -107983 878241 2268365 3004836 3166705 3595893 4341809
40255D341809M63335K25074M36592K49793p79357j555211j201352n11354l65732
$$ 4341809 4805144 5030218 5466810 5716603 4937246 3382035 2180683 1669329 1303597
40246A303597k07118M22159L96649j014947k067244p86045J630591K233891O98392
$$ 1303597 1096479 1518638 1915287 900340 -1166904 -1952949 -322358 1911533 2609925
40237B609925m05771K36582R85991L65916o47361o96838l24688n96174j042043
$$ 2609925 2204154 2440736 3426727 3792643 3145282 2448444 2123756 1527582 485539
40228D85539p01842k7144L5656n4025O46866J367538M87973j493136k061973l04833
$$ 485539 -216303 -243447 -207791 -261816 385050 1752588 2240561 747425 -1314548 -1619381
40218a619381J589895J514106L86877L15177J103236P35395j125091k365924j549931
$$ -1619381 -29486 1484620 1871497 2186674 3289910 4025305 2900214 534290 -1015641
40209a015641O7100N43750j56914p39852o83071m44471k08858K48180P35398Q35838
$$ -1015641 -948541 -404791 -561705 -1301557 -1984628 -2429099 -2637957 -2389777 -1654379 -818541
40199h18541P68906J047620J416635J147223L17793k07895r2213J24942j664l85091
$$ -818541 -49635 997985 2414620 3561843 3879636 3671741 3579528 3704470 3702806 3317715
40189C317715q63518j155986n57997J148043K627837K231832L09039j194641j478344
$$ 3317715 2454197 1298211 740214 1888257 4516094 6747926 7056965 5862324 4383980
40180D383980j456697j422032l92299J406907J787347j25456j925834j270354
$$ 4383980 2927283 1505251 1112952 2519859 4307206 4181750 2255916 985562
40172I85562N08168N46633j054253j671140m84642N53422K20051k38164L39826
$$ 985562 1493730 2040363 986110 -685030 -1169672 -616250 -396199 -634363 -294537
40163b94537J012777N26371n32893p62404p8487M36559K32824j90278k29606M0340
$$ -294537 718240 1244611 711718 -50686 -129173 307386 540210 349932 120326 160666
40153A60666M0892n23862j026218m22914J164802J992241Q02323j099254j320417
$$ 160666 201558 -322304 -1348522 -1771436 -606634 1385607 2187930 1088676 -231741
40144b31741K14184J062370j65965j800402j635439k3000R58956N60240M6651
$$ -231741 -17557 1044813 878848 -921554 -2556993 -2579993 -1621037 -1060797 -1014146
40135a014146N36306J448672J478102M02154o32312n59943K45543M77548k79626
$$ -1014146 -477840 970832 2448934 2851088 2218776 1658833 1904376 2381924 2102298
40126B102298r92651q88046p84619j645923k582301j930167K895J164065Q50022
$$ 2102298 1109647 221601 -563018 -2208941 -4791242 -6721409 -6718514 -5554449 -4704427
40117d704427N83849J354183K009626J442370M98820K87414K17394n45795j048847
$$ -4704427 -4120578 -2766395 -756769 685601 1184421 1471835 1689229 1143434 94587
40108I4587j5806J621473J838218O10559k82642k74627n32210j322980j235136
$$ 94587 78781 1700254 3538472 4149031 3866389 3591762 3059552 1736572 501436
40099E01436J91508J168917L17263j016015p62807O29995Q97565m85567j395405
$$ 501436 692944 1861861 2179124 1163109 400302 1030297 1927862 1442295 46890
40090D6890j75034J872844K217828M88394j258223j504778j024813j052527j061822
$$ 46890 -128144 1744700 3962528 4450922 3192699 1687921 663108 -389419 -1451241
40081a451241J47787J864962J970172K14999r97695l7449J504078J286133k43713
$$ -1451241 -1303454 561508 2531680 2746679 1748984 1711535 3215613 4501746 4258033
40072D258033p65812K64979J089114N92227l22665o33107o07935p16937p36666
$$ 4258033 3492221 3757200 4846314 5438541 5115876 4482769 3874834 3157897 2421231
40063B421231o77329j137616j869666j385548Q57565L002200K841897O26547j349394
$$ 2421231 1743902 606286 -1263380 -2648928 -1791363 1210837 4052734 4679281 3329887
40054C329887j433761J02987J891261K506510J210893j205712k673768j992398
$$ 3329887 1896126 1999113 3890374 6396884 7607777 6402065 3728297 1735899
40046A735899l83627J47589m83894p53629j93380O468p39328j277341n58925P77165
$$ 1735899 1352272 1499861 1015967 262338 68958 75426 -663902 -1941243 -2500168 -1723003
40036a723003J551583J606693J257449K93654j225981k071631j235559K62413
$$ -1723003 -171420 1435273 2692722 2986376 1760395 -311236 -1546795 -1284382
40028a284382N05193n62803j073418p4953J144648J153625M01138J83557O18172
$$ -1284382 -779189 -1341992 -2415410 -2490363 -1345715 -192090 209048 392605 1010777
40019A010777Q16315M55938n686l94673r59052j460363j173143o2551Q71003Q73440
$$ 1010777 1827092 2283030 2277344 1882671 923619 -536744 -1709887 -1772438 -901435 -27995
40009b7995M71591O66987J413138J528689K36979j619980k316511j208151M46866
$$ -27995 443596 1110583 2523721 4052410 4289389 2669409 352898 -855253 -408387
40000d08387R82474L32403j18256L98534J044549Q00352k5388m16068j04096L89922
$$ -408387 574087 906490 788234 1186768 2231317 3031669 3006281 2590213 2486117 2876039
39990B876039O33780L98722n26651j719844j937663o70973P07379O96423j9629
$$ 2876039 3509819 3908541 3381890 1662046 -275617 -946590 -239211 457212 437583
39981D37583K71542J281335J046956o61389j707494j008817j29429k90823k38400
$$ 437583 709125 1990460 3037416 2376027 668533 -340284 -469713 -760536 -998936
39972i98936J096778K026568O98257j360011j196540R37311J912752M72547j242480
$$ -998936 97842 2124410 2822667 1462656 266116 1203427 3116179 3588726 2346246
39963B346246j318962n78207n09176q75454o95601o7497K93303L28129M07159
$$ 2346246 1027284 449077 -60099 -935553 -1631154 -1698651 -1405348 -1077219 -670060
39954f70060N40158N12821K01460n44941j534288j709476k34319J755668K049490
$$ -670060 -129902 382919 584379 39438 -1494850 -3204326 -3438645 -1682977 366513
39945C66513M45370p65878j46649Q60160M15365r25723j502128j198369r42837
$$ 366513 811883 46005 -100644 759516 1174881 249158 -1252970 -2451339 -3394176
39936c394176o50724K97768J244931R86979p2710m60672m9064N8450j41273M14621
$$ -3394176 -4044900 -3747132 -2502201 -1515222 -1587932 -2048604 -2097668 -2039218 -2180491 -1765870
39926a765870J353242Q72634j042923j864918k85620J481010J007624o22216p76993
$$ -1765870 -412628 460006 -582917 -2447835 -2733455 -1252445 -244821 -867037 -1644030
39917a644030M06919N56016o57526r01102P00425J781554M58879j531980j439387
$$ -1644030 -1237111 -681095 -1338621 -2239723 -1539298 242256 701135 -830845 -2270232
39908b270232L88635J308204M00814o93188p23013l40748l44006l80260p8638
$$ -2270232 -1881597 -573393 -172579 -865767 -1588780 -1929528 -2273534 -2653794 -2732432
39899b732432J58625K54100Q45771J754015J606519Q5194r90880k79545Q12956
$$ -2732432 -2573807 -2319707 -1473936 280079 1886598 1971792 980912 701367 1514323
39890A514323L35008r34003p61116O66837Q46581r61193k399426j600070J51543
$$ 1514323 1849331 915328 154212 821049 1667630 706437 -1692989 -3293059 -3141516
39881c141516O43343j33979o37918l02120J96840M22418M55208J56467n46329
$$ -3141516 -2498173 -2632152 -3270070 -3572190 -3375350 -2952932 -2497724 -2341257 -2887586
39872b887586r10084p3906J547291K470992J784550j6588j697209k253807j436710
$$ -2887586 -3797670 -3871576 -2324285 146707 1931257 1914669 217460 -2036347 -3473057
39863c473057J07337J291181J557840J249321Q67086M70655J03112J34229O15150
$$ -3473057 -3365720 -2074539 -516699 732622 1599708 2070363 2173475 2307704 2922854
39854B922854Q77507M30312k52152n02543m82186o50671p29903j74939O39679
$$ 2922854 3800361 4230673 3978521 3475978 2993792 2343121 1613218 1438279 2077958
39845B077958P76053K20920k8487M21564O07786l88715j914850k382202j310070
$$ 2077958 2854011 3074931 3046444 3468008 4075794 3687079 1772229 -609973 -1920043
39836a920043j4732J14304m54489l1475J689902K765988J497735j107036k599466
$$ -1920043 -1934775 -1820471 -2274960 -2306435 -616533 2149455 3647190 2540154 -59312
39827e9312k222237j239510m73659N54552J799017K023049Q02865m79491o71789
$$ -59312 -2281549 -3521059 -3994718 -3440166 -1641149 381900 1184765 705274 33485
39818C3485m33257p23812j109249p67997N3847P61325J369893J666412Q38743
$$ 33485 -399772 -1123584 -2232833 -3000830 -2946983 -2185658 -815765 850647 1689390
39809A689390q30639j503907m97481K94473m94243j089124M48442K357372J492209
$$ 1689390 858751 -645156 -1142637 -848164 -1342407 -2431531 -1983089 374283 1866492
39800A866492j526346k950331j410300N91210R35478M22942L12233K21574l41425
$$ 1866492 340146 -2610185 -4020485 -3429275 -2493797 -2070855 -1758622 -1537048 -1878473
39791a878473o47123j21743O83903J276201J746126J753762Q39797o3378L87608
$$ -1878473 -2525596 -2647339 -1963436 -687235 1058891 2812653 3652450 3589072 3976680
39782C976680J289646M14038j826778k324640r1587J964005J501465k3012m59771
$$ 3976680 5266326 5680364 3853586 1528946 1437359 3401364 4902829 4879817 4420046
39773D420046m11821j174337j728283o15014J036477J180766J93914r6201L98506
$$ 4420046 4008225 2833888 1105605 490591 1527068 2707834 2901748 2805547 3204053
39764C204053L40479l91039p45710n41193l71928j28134N27376R73372O69364
$$ 3204053 3544532 3153493 2407783 1866590 1494662 1366528 1893904 2867276 3536640
39755C536640L96702O99049L73106j389920k739669j602817P48747J379926J14319
$$ 3536640 3933342 4632391 5005497 3615577 875908 -726909 21838 1401764 1516083
39746A516083o54848p252O79187O82382O85261N69755n46268j848041j374115
$$ 1516083 861235 853983 1533170 2215552 2900813 3470568 2924300 1076259 -297856
39737b97856N04243J063942n81421k036030j298698O61849K008819K311488J704779
$$ -297856 206387 1270329 688908 -1347122 -2645820 -1983971 24848 2336336 4041115
39728D041115J42973j402594j278047K09762P51082l13936q32117L74773J323381
$$ 4041115 4184088 2781494 1503447 1713209 2464291 2150355 1318238 1693011 3016392
39719C016392L14527j109561j013471m60512j226735k137139r70222J327769J818130
$$ 3016392 3330919 2221358 1207887 747375 -479360 -2616499 -3586721 -2258952 -440822
39710d40822L40094l26474Q84217J769881P04180q21675q54948J7968M3226p51606
$$ -440822 -100728 -427202 457015 2226896 2931076 2109401 1254453 1272421 1315647 564041
39700E64041p97779M15927J543905J267193n4344j031763j011649n86001m10167
$$ 564041 -233738 182189 1726094 2993287 2938943 1907180 895531 309530 -100637
39691a00637k60285J95561L28217o10481j786499j411950N78204K007151J412728
$$ -100637 -360922 -165361 162856 -447625 -2234124 -3646074 -3067870 -1060719 352009
39682C52009O8380j35332N01346M20816m28649o99369r1099K37681k19226m86172
$$ 352009 420389 285057 786403 1207219 778570 79201 -11898 225783 6557 -479615
39672d79615J99224J185456J429858P65154k70448j079045j171923m28081N15030
$$ -479615 -280391 905065 2334923 3100077 2829629 1750584 578661 150580 665610
39663F65610P37446J30773m90363m61635N8068M94494M01270l52498j345039j613830
$$ 665610 1403056 1533829 1043466 581831 639899 1134393 1535663 1183165 -161874 -1775704
39653a775704n56584J156536K132924J708944L89256r53133j710784j619181r40829
$$ -1775704 -2332288 -1175752 957172 2666116 3055372 2102239 391455 -1227726 -2168555
39644b168555m27375m22321k62867O56372J617310J443812L57417l07160j51527
$$ -2168555 -2595930 -3018251 -3281118 -2624746 -1007436 436376 793793 486633 335106
39635C35106m7574k90423k6399R25671J268772K49331q27722m08811R32479J368151
$$ 335106 287532 -2891 -29290 896381 2165153 2414484 1586762 1177951 2110430 3478581
39625C478581M59707n62492q85546r72503j238437j261752p55307j87404J54645
$$ 3478581 3938288 3375796 2490250 1517747 279310 -982442 -1737749 -1925153 -1770508
39616a770508P44042J722779K102687J063329n47652j184628p81901o85786j401271
$$ -1770508 -1026466 696313 2799000 3862329 3314677 2130049 1348148 662362 -738909
39607g38909j806310j073680l7770K33319P8045K65573L64461l55270j085177
$$ -738909 -2545219 -3618899 -3656669 -3423350 -3345305 -3079732 -2715271 -3070541 -4155718
39598d155718m56893Q90060Q67135o42948j185158M98328K234048J576419n05028
$$ -4155718 -4612611 -3722551 -2855416 -3498364 -4683522 -4185194 -1951146 -374727 -879755
39589h79755j202252k7351R45307N42945j43739n8235K47087L9978k08248J74919
$$ -879755 -2082007 -2109358 -1164051 -621106 -764845 -823080 -575993 -536015 -744263 -569344
39579e69344P92949Q64535M49593J69812J97430K28352J55778J62723K36295K6031
$$ -569344 223605 1088140 1537733 1707545 1904975 2133327 2289105 2451828 2688123 2714154
39569B714154o99727j585442j853596j148482j39890J67734k12526k58100M54973
$$ 2714154 2014427 428985 -1424611 -2573093 -2712983 -2545249 -2757775 -3015875 -2560902
39560b560902J025102O70958k4945j97869j34301m35919n19990N17118J953422
$$ -2560902 -1535800 -864842 -889787 -1087656 -1221957 -1657876 -2177866 -1660748 292674
39551B92674K020533M58902r82264q76388K27565P94049O2589j335860j898149
$$ 292674 2313207 2772109 1789845 913457 1141022 1935071 1997660 661800 -1236349
39542a236349o33454J451281K011708M52059q65019p6078J000524k62893k452813
$$ -1236349 -1869803 -418522 1593186 2045245 1180226 1104148 2104672 1841779 -611034
39533f11034j789844J581875L164421R27231j588670j013042Q04240M70214j326096
$$ -611034 -2400878 -819003 2345418 3272649 1683979 670937 1475177 1945391 619295
39524F19295j549999p1186O97247J95198M4525N85931N40790o8837J14493Q42127
$$ 619295 -930704 -1001890 -304643 -109445 -64920 521011 1061801 992964 1107457 1949584
39514A949584L76986j127821j378113K64940J550141Q67937n18820r27567o36690
$$ 1949584 2326570 1198749 -179364 85576 1635717 2503654 1984834 1057267 420577
39505D20577m93564k02933N11237P71421Q6342m30541J81532J061634J006951
$$ 420577 -72987 -275920 235317 1006738 1093080 662539 844071 1905705 2912656
39496B912656L90394J68954J12623m46319j039404q07962j18289M0656l13511
$$ 2912656 3303050 3472004 3584627 3138308 2098904 1290942 1172653 1213309 899798
39487H99798n06126n84684r06690r03605J31219J364543J259318M3075m11679
$$ 899798 393672 -191012 -1097702 -2001307 -1870088 -505545 753773 796848 385169
39478C85169N40595J302107N96444n41862n62478Q189n46028k119022k501385
$$ 385169 925764 2227871 2824315 2282453 1719975 1728164 1182136 -936886 -3438271
39469c438271n42972J902761K281703O65535o41746m34317J51832O001j43152
$$ -3438271 -3981243 -2078482 203221 868756 227010 -207307 -55475 -49474 -192626
39460a92626N95887J245935L94500j144035j152664O48263K086171J680556M46824
$$ -192626 403261 1649196 2043696 899661 -253003 395260 2481431 4161987 4608811
39451D608811r6342k6677j67154n44818p82926r22053r01333l21087M08388M034
$$ 4608811 4512469 4485792 4318638 3773820 2990894 2068841 1167508 846421 1254809 1258843
39441A258843j515473k050912l32016J729117J506445n35294j678195r64122k7201
$$ 1258843 -256630 -2307542 -2639558 -910441 596004 60710 -1617485 -2581607 -2608808
39432b608808o0177l01244L2508L46972m279n27053m86013J51522J146626K210289
$$ -2608808 -2668985 -2970229 -2937721 -2590749 -2595028 -3122081 -3608094 -3456572 -2309946 -99657
39422i9657K478288J111351j125611k229782j446537q7736O26589J028635J572571
$$ -99657 2378631 3489982 2364371 134589 -1311948 -1399684 -773095 255540 1828111
39413A828111J564715N07403o15544p43923l87165n38964r04568o47968r6792
$$ 1828111 3392826 3900229 3284685 2540762 2153597 1614633 710065 62097 -34695
39404c4695j32225m47760m4710Q30071Q55363k38142j155113q93227O0006O96740
$$ -34695 -166920 -614680 -659390 170681 1026044 787902 -367211 -1260438 -1200432 -503692
39394e03692P13058M57927L56204N58619O87914J28566q49659q04893R82960K822145
$$ -503692 209366 667293 1023497 1582116 2270030 2398596 1548937 744044 1727004 4549149
39384D549149K322439k89532k209749j703870q2871N92345J89757j62427r7922
$$ 4549149 6871588 6582056 4372307 2668437 2585566 3177911 3367668 3205241 3107319
39375C107319J8590K72664Q94289J234896M25089j088562j859153j336675m44878
$$ 3107319 3125909 3398573 4292862 5527758 5952847 4864285 3005132 1668457 1223579
39366A223579j50651l82326o06239o44755n11889n6929P25408J351726J223312
$$ 1223579 1072928 690602 84363 -560392 -1072281 -1129210 -403802 947924 2171236
39357B171236K58605r79056j678864j356341k87959O59440R06938P65745P99433
$$ 2171236 2429841 1450785 -228079 -1584420 -1872379 -1212939 -306001 459744 1259177
39348A259177Q07116J56232q64217r76506L05772J647360J500811K31600m31502
$$ 1259177 2066293 2222525 1358308 381802 687574 2334934 3835745 4067345 3635843
39339C635843J09831N86756j15022j362716j920716j750153j592660j357129k92879
$$ 3635843 3745674 4332430 4217408 2854692 933976 -816177 -2408837 -3765966 -4058845
39330d058845J292183J894643Q95306l44101k67441P95998J286040O02308m18727
$$ -4058845 -2766662 -872019 23287 -320814 -588255 207743 1493783 2096091 1677364
39321A677364r46823r51108n14295N05837J697915J927483O96375r00148j376123
$$ 1677364 730541 -220567 -734862 -229025 1468890 3396373 4092748 3192600 1816477
39312A816477o90494n8197j00263k00034P8466N1030p71828j313237l10877J248976
$$ 1816477 1125983 1067786 967523 767489 845955 896985 125157 -1188080 -1498957 -249981
39302b49981R32062j416036k706560q04723J989682J963905n51182j720727n6596
$$ -249981 682081 -733955 -3440515 -4245238 -2255556 -291651 -842833 -2563560 -2620156
39293b620156J623768J022915j96297J65072Q94662j71379j859523j373329Q86494
$$ -2620156 -996388 26527 -169770 -4698 889964 718585 -1140938 -2514267 -1627773
39284a627773J874410Q34804Q6750P41272J154536L54239k88930O3440J71457
$$ -1627773 246637 1081441 1168191 1909463 3063999 3418238 3129308 3192748 3364205
39275C364205o04095q63201R2784P41965J70718k52292J87110k25802k215729
$$ 3364205 2760110 1896909 1989693 2731658 2902376 2650084 2837194 2611392 395663
39266C95663l146990r67858J911658K001903L5267o58434M45248J015243K16011
$$ 395663 -2751327 -3719185 -1807527 194376 229643 -428791 16457 1031700 1247711
39257A247711n77798q22038j080504p77378Q63697K158457R34726j250656r22429
$$ 1247711 669913 -152125 -1232629 -2010007 -1146310 1012147 1946873 696217 -226212
39248b26212J423828J745267p91153k291894o59341J159516N62266n58314J22081
$$ -226212 1197616 2942883 2151730 -140164 -799505 360011 922277 363963 486044
39239D86044J139115M34745o24518p2001O72862n19130k189805j653813K18086
$$ 486044 1625159 2059904 1435386 1363385 2036247 1517117 -672688 -2326501 -2108415
39230b108415O08090l12841j55635J005779Q90287n31242q83095K90991Q27185
$$ -2108415 -1500325 -1813166 -1968801 -963022 -72735 -603977 -1487072 -1196081 -368896
39221c68896j05045q49709n41587j83164J27546J620873L603379L224870l5998
$$ -368896 -473941 -1323650 -1865237 -2048401 -1920855 -299982 3303397 6528267 6492269
39212F492269k746489k200893n7710O80314p1403n06760k89186l98701q36363
$$ 6492269 3745780 1544887 1487177 2167491 2096088 1589328 1300142 901441 65078
39203F5078p46148j37377K82287L79038K83813l77316j509437j703711l6855J972964
$$ 65078 -681070 -818447 -536160 -157122 126691 -250625 -1760062 -3463773 -3500628 -1527664
39193a527664K010792K05018j055111m70938P44482J086963P51212O06498M48104
$$ -1527664 483128 688146 -366965 -837903 -93421 993542 1744754 2351252 2799356
39184B799356n05226j918219k388957j331030J01290M87808k8392j56002N48109
$$ 2799356 2294130 375911 -2013046 -3344076 -3242786 -2754978 -2783370 -2939372 -2391263
39175b391263J091260O61201j48705l05980K62456R18444J209270P82076o97341
$$ -2391263 -1300003 -638802 -787507 -1093487 -831031 87413 1296683 2078759 1381418
39166A381418k531363k856926r26641J279495J391714n2690n92524L59476J038054
$$ 1381418 -1149945 -4006871 -4933512 -3654017 -2262303 -2314993 -2907517 -2548041 -1509987
39157a509987O00515K89214P24596N70433q64028j836042o33425J713248K822786
$$ -1509987 -909472 -620258 104338 674771 -189257 -2025299 -2658724 -945476 1877310
39148A877310J975580L38448q46208j003916n6272J237869J504872L92624p51066
$$ 1877310 3852890 4191338 3345130 2341214 2284942 3522811 5027683 5420307 4669241
39139D669241p35555j36437q6946n07893p02338p34916r29515q41737o4923O67843
$$ 4669241 3933686 3797249 3710303 3202410 2500072 1765156 835641 -6096 -71019 596824
39129E96824N12429l064J59494P86598Q58771K96905p0172O075m4808m98090r43966
$$ 596824 1109253 1106189 1265683 2052281 2911052 3207957 3137785 3143860 3099052 2600962 1656996
39118A656996r06686k48618O97211J029895R9163j179170j034559M95752J172029
$$ 1656996 750310 501692 1198903 2228798 2327961 1148791 114232 609984 1782013
39109A782013j31536j474615q25577O99541P14254o91453j547036j331883j049942
$$ 1782013 1650477 175862 -649715 49826 764080 72627 -1474409 -2806292 -3856234
39100c856234o57350P33695K309021K076968J69783j019820m25674M79821N76487
$$ -3856234 -4513584 -3779889 -1470868 606100 775883 -243937 -669611 -189790 386697
39091C86697N98534Q98831L06058j420987k245926o93627J632935K117025N24864
$$ 386697 985231 1884062 2190120 769133 -1476793 -2170420 -537485 1579540 2104404
39082B104404j203421j633553r11098J73838R75047J178524R41699N65539r5889
$$ 2104404 900983 -732570 -1643668 -1469830 -494783 683741 1625440 2190979 2095090
39073B095090j151360j687815o15779J305174J878144M29835j227332j458910
$$ 2095090 943730 -744085 -1359864 -54690 1823454 2253289 1025957 -432953
39065d32953p68608k36612K35646Q86297R23943n7121p81214k2546J367995J693997
$$ -432953 -1201561 -1438173 -1202527 -316230 607713 550592 -230622 -253168 1114827 2808824
39055B808824Q06380j85966p63670j064447q50504L2675P09954K74683o70853
$$ 2808824 3615204 3429238 2665568 1601121 750617 783292 1493246 1767929 1097076
39046A097076q13195o1334O00633P65130P78592O29063J8148o50297o04580P0206
$$ 1097076 283881 222547 823180 1588310 2366902 2995965 3014113 2363816 1759236 1829442
39036A829442N91244O64347N22783J09058o74589j173261o15945N47080R85933
$$ 1829442 2420686 3085033 3607816 3716874 3042285 1869024 1253079 1800159 2786092
39027B786092J57365j172180j908381j433590J87665J991945K510015J232169
$$ 2786092 2943457 1771277 -137104 -1570694 -1383029 608916 3118931 4351100
39019D351100o58103j663928j514707p53835K20910Q58095L96787p22466o82458
$$ 4351100 3692997 2029069 514362 -239473 -18563 839532 1236319 513853 -168605
39010a68605J031028K202641J001423r50927j023924K40480L59509o55641n96479
$$ -168605 862423 3065064 4066487 3115560 2091636 2332116 2691625 2035984 1439505
39001A439505N97113O31564o67323o48692J310999K164208K40529j724971j147461
$$ 1439505 2036618 2668182 2000859 1352167 2663166 4827374 5067903 3342932 2195471
38992B195471J06417p89475k492969j734305R78603J981485K08568j478113r80386
$$ 2195471 2301888 1512413 -980556 -2714861 -1736258 245227 453795 -1024318 -2004704
38983b004704L34927N27150l0462m0139L15172q9416j281774j902742q16907J413056
$$ -2004704 -1669777 -1142627 -1173089 -1213228 -898056 -987472 -2269246 -4171988 -4988895 -3575839
38973c575839K747141J726292n41062j325919K63819J977888J574751r1425p26826
$$ -3575839 -828698 897594 356532 -969387 -705568 1272320 2847071 2755646 2028820
38964B028820j03984K11163j88616k63830J57103J54655k19786N6863P91110O42119
$$ 2028820 1924836 2135999 1947383 1683553 1840656 1995311 1775525 1832388 2623498 3265617
38954C265617l70668p04453k498L61059q5866k00939K12697j95934j403492j319741
$$ 3265617 2894949 2190496 2187998 2549057 2463191 2262252 2474949 2279015 875523 -444218
38944d44218N46627J576049J41412j499573q61074P35579P39221k09227Q2075
$$ -444218 102409 1678458 1819870 320297 -540777 194802 934023 724796 806871
38935H06871R62141J22499j741677j582006P86742K106346Q48101p80493r93383
$$ 806871 1769012 1891511 149834 -1432172 -645430 1460916 2309017 1528524 535141
38926E35141r83152j781694j929301m24845Q59494K35819o90483K42294J825608
$$ 535141 -448011 -2229705 -4159006 -4583851 -3724357 -3488538 -4179021 -3936727 -2111119
38917b111119J422742m56849r10510M97326J011081p10717k265055j107747J674792
$$ -2111119 -688377 -1145226 -2055736 -1558410 -547329 -1258046 -3523101 -4630848 -2956056
38908b956056K936882J606013m37688j157905o03366j43736l92180n68847J85071
$$ -2956056 -19174 1586839 1149151 -8754 -612120 -755856 -1148036 -1716883 -1531812
38899a531812J456667K016420J444593O15698L99529N87271N16661J21972k10938
$$ -1531812 -75145 1941275 3385868 4001566 4401095 4988366 5505027 5626999 5416061
38890E416061l34569l04035p3370K64722L85303L02947M24940N98690j401j332754
$$ 5416061 5081492 4777457 4704087 4968809 5354112 5657059 6081999 6680689 6679288 5346534
38880E346534j878310p19716P08063M37383j084493j591379l05128J111852J064686
$$ 5346534 3468224 2748508 3456571 3893954 2809461 1218082 912954 2024806 3089492
38871C089492j04291j138753j389052q40835J81573Q61618M84033m43251o80809
$$ 3089492 2985201 1846448 457396 -383439 -201866 659752 1143785 700534 19725
38862A9725r2208K37168n1415n8699M35440K49670r59424j434816J14672K024363
$$ 19725 -72483 164685 113270 54571 490011 739681 -219743 -1654559 -1539887 484476
38852D84476J749979l59698j552910p29592K24168l69728j466657j145725M30718
$$ 484476 2234455 1874757 321847 -407745 -183577 -553305 -2019962 -3165687 -2734969
38843b734969J428176J039292K60043N6976J22406j28968m08283k07512Q4338
$$ -2734969 -1306793 -267501 -7458 49518 171924 42956 -365327 -572839 -488501
38834d88501k43792q13538m59385R22209J916470J443972J12919q97456j328012
$$ -488501 -732293 -1545831 -2005216 -1083007 833463 2277435 2390354 1492898 164886
38825A64886j343707n65372J053702K122219J266647o06005j246668k57968M83088
$$ 164886 -1178821 -1744193 -690491 1431728 2698375 2092370 845702 587734 1070822
38816A070822j02934p56045k20685O71742N42843l11485p03767n17040l65741
$$ 1070822 967888 211843 -8842 662900 1205743 894258 190491 -326549 -692290
38807f92290p1548R06479J914088J548252k85630j978410k107204r09167K69457
$$ -692290 -763838 142641 2056729 3604981 3319351 1340941 -766263 -1675430 -1405973
38798a405973M08575l39876q70217l44853O28186O35100m13063p79919O54433
$$ -1405973 -997398 -1337274 -2207491 -2552344 -1924158 -1289058 -1702121 -2482040 -1827607
38789a827607K430256K263363J38427j744081j773848l36145J346939K340434
$$ -1827607 602649 2866012 3004439 1260358 -513490 -849635 497304 2837738
38781B837738J996068L24867j333340j334505J07942R19217j40347j800354j988856
$$ 2837738 4833806 5158673 3825333 2490828 2598770 3517987 3377640 1577286 -411570
38772d11570m13924J327536J730060P99409k79123m57573J14678K83982o53913
$$ -411570 -825494 502042 2232102 3031511 2752388 2294815 2409493 2693475 2039562
38763B039562j897435k067945j000265K06113Q86574J509001K336204K467062
$$ 2039562 142127 -1925818 -2926083 -2719970 -1833396 -324395 2011809 4478871
38755D478871J076033r86376j818060o63914J148277J641464K79036j513123j863079
$$ 4478871 5554904 4568528 2750468 2086554 3234831 4876295 5155331 3642208 1779129
38746A779129m51235J117558J048112p07767k478742k654925j110879R59777K149908
$$ 1779129 1327894 2445452 3493564 2785797 307055 -2347870 -3458749 -2498972 -349064
38737c49064J832457N43994n17080o55439l06024k64938n81203p13305n26504
$$ -349064 1483393 2027387 1510307 854868 548844 283906 -297297 -1010602 -1537106
38728a537106l96206l66643j2234O76178J007776N73595o2630j33214K63594L89172
$$ -1537106 -1933312 -2299955 -2312189 -1636011 -628235 -54640 -117270 -250484 13110 402282
38718D02282r810l21052N5025P64369P99782j92013j248078j146281J5323R01694
$$ 402282 392472 71420 126445 890814 1690596 1498583 250505 -895776 -880453 21241
38708B1241P06977J37470K34323Q48426R37486J8281j292625j980256j439870
$$ 21241 728218 865688 1100011 1948437 2885923 2904204 1611579 -368677 -1808547
38699a808547J08551J590726J838526Q43889j14968M049Q41987J369473J089703
$$ -1808547 -1699996 -109270 1729256 2573145 2458177 2462226 3304213 4673686 5763389
38690E763389J9314j650369l122088l146819j605754q5582K10483J56946R62208
$$ 5763389 5782703 4132334 1010246 -2136573 -3742327 -3827909 -3617426 -3460480 -2498272
38681b498272J810945J165034l37645n87175O11792J208281J90814j047179j182469
$$ -2498272 -687327 477707 140062 -447113 164679 1372960 1563774 516595 -665874
38672f65874o84107k65912L68666J179110J046811l03030j250605o21178L25845
$$ -665874 -1349981 -1615893 -1247227 -68117 978694 675664 -574941 -1196119 -870274
38663h70274j17399j301091j261840J69632J252724J100147P16779R82292J128325
$$ -870274 -987673 -2288764 -3550604 -3380972 -2128248 -1028101 -311322 670970 1799295
38654A799295K5424j898206k961999k257199o64251L63675N55693P69265J356141
$$ 1799295 1824719 -73487 -3035486 -5292685 -5956936 -5593261 -5037568 -4268303 -2912162
38645b912162J567042R87013M88446P87792J000080O5137j087423o47467J064054
$$ -2912162 -1345120 -358107 130339 918131 1918211 1983348 895925 248458 1312512
38636A312512J741840M87582r64298j046756m95604o77802j371441j457222p11446
$$ 1312512 3054352 3541934 2577636 1530880 1035276 357474 -1013967 -2471189 -3182635
38627c182635K13832P98323Q22723K81956l11410l39036p2743k25207m41159K60048
$$ -3182635 -2968803 -2170480 -1347757 -1065801 -1377211 -1716247 -1788990 -2014197 -2455356 -2195308
38617b195308J375536J201258k48663p80482N51304J773573J153690j02496j33898
$$ -2195308 -819772 381486 132823 -647659 -96355 1677218 2830908 2728412 2594514
38608B594514M80415Q7090j021105j238681l51076M63055O20882L61922k66283
$$ 2594514 3074929 3162019 2140914 902233 551157 1014212 1635094 1997016 1730733
38599A730733j050429j110473k86399M2656q75263j480851k74271J507019J832715
$$ 1730733 680304 -430169 -716568 -673912 -1549175 -3030026 -3304297 -1797278 35437
38590C5437J199886J374894J900146R03206j172896j833326n32367N97226L68041
$$ 35437 1235323 2610217 4510363 5413569 4240673 2407347 1874980 2472206 2840247
38581B840247L5526M93238O43567l46035j365077j158938j30224O62281Q79044
$$ 2840247 2875773 3369011 4012578 3666543 2301466 1142528 1012304 1674585 2553629
38572B553629N21795m12089j231199q76739M37036J219531Q63538M64984R50655
$$ 2553629 3075424 2663335 1432136 555397 992433 2211964 3075502 3540486 4491141
38563D491141J722333J773563R66345l36214j771120k632378k133381n10679J027432
$$ 4491141 6213474 7987037 8953382 8617168 6846048 4213670 2080289 1569610 2597042
38554B597042J717789J754901J424919Q03947K61412J29609N760m87720o87949
$$ 2597042 4314831 6069732 7494651 8298598 8560010 8689619 8695379 8207659 7519710
38545G519710o9773J89009j202380k930046k372781L43188K136947J319289l28017
$$ 7519710 7449937 7638946 6436566 3506520 1133739 1476927 3613874 4933163 4605146
38536D605146o78250j28067q4598n32467n86941j35456L03628M11084L1480p26169
$$ 4605146 3926896 3798829 3714231 3181764 2594823 2459367 2762995 3174079 3205559 2479390
38526B479390j029875j58543J091828J256477M11744j43689k02290n39237p38120
$$ 2479390 1449515 1290972 2382800 3639277 4051021 3907332 3705042 3165805 2427685
38517B427685K42241J378674N82110j327665j239163Q50870J101944j831642l919421
$$ 2427685 2669926 4048600 4630710 3303045 2063882 2914752 4016696 2185054 -1734367
38508a734367j959234J167837J136134j010402j036740J510851L058181J847225
$$ -1734367 -3693601 -2525764 -1389630 -2400032 -3436772 -1925921 1132260 2979485
38500B979485j21986q83321p31787m06410P6007M21538J59603j66563J70770M27465
$$ 2979485 2857499 1974178 1242391 835981 911988 1333526 1493129 1326566 1497336 1924801
38490A924801m26946j495380j223330k32160k88875r77782l38153J341296J538575
$$ 1924801 1497855 2475 -1220855 -1453015 -1741890 -2719672 -3057825 -1716529 -177954
38481a77954k44622j302254J51768K295512K539483J003867l49444n55154j74539
$$ -177954 -422576 -1724830 -1573062 722450 3261933 4265800 3916356 3361202 3186663
38472C186663M9627p8286l03034j61904M21375P37606J75532p09052r49064o38197
$$ 3186663 3236290 3158004 2854970 2693066 3114441 3852047 4027579 3318527 2369463 1731266
38462A731266m61012k10855O63874J367794M97636j479436k365563j186803O75954
$$ 1731266 1270254 1059399 1723273 3091067 3588703 2109267 -256296 -1443099 -767145
38453g67145J664670J690458J189566K46751o76275o46187L51997J131107R36452
$$ -767145 897525 2587983 3777549 4024300 3348025 2701838 3053835 4184942 5121394
38444E121394J91087o82417j732103k380430j518201N65590J851251J078181p04118
$$ 5121394 5312481 4630064 2897961 517531 -1000670 -435080 1416171 2494352 1790234
38435A790234j856859k086805j789111q65004N90075J523670J170040L20889K14323
$$ 1790234 -66625 -2153430 -3942541 -4807545 -4217470 -2693800 -1523760 -1202871 -988548
38426i88548P73088R99567N88772J06835q6086j56841k17920j49006P4286L18447
$$ -988548 -215460 784107 1372879 1479714 1393628 1236787 1018867 869861 944147 1262594
38416A262594M35906K63891k27875o87220p25194n52955o65013q83165n62718
$$ 1262594 1698500 1962391 1734516 1047296 322102 -230853 -895866 -1779031 -2341749
38407b341749J39911K65617l16506m11357O62662J735838J295991l05383j230172
$$ -2341749 -2201838 -1936221 -2252727 -2664084 -2001422 -265584 1030407 725024 -505148
38398e05148m89012J003913J710055J129200K3227o33524o60009n80253o41177
$$ -505148 -994160 9753 1719808 2849008 2872235 2238711 1578702 998449 357272
38389C57272l64647N44582J313004R50173j98550p61650l04672Q4224m33241j104553
$$ 357272 -7375 537207 1850211 2800384 2601834 1840184 1535512 1619736 1186495 81942
38379H1942p44966M78897J264607Q17317m01500j348950j291544k28097J065377
$$ 81942 -663024 -184127 1080480 1897797 1496297 147347 -1144197 -1372294 -306917
38370c06917J529581Q07066l06403p33705l63833m6110l51121q27302p64545k89220
$$ -306917 1222664 2029730 1723327 989622 625789 579679 228558 -598744 -1363289 -1652509
38360a652509j03840k58112M656Q79569J349770O54670l34807l30094L41448L66830
$$ -1652509 -1756349 -2014461 -2009805 -1130236 219534 874204 539397 209303 550751 917581
38350I17581k25154j89863M40755J44098j191251j416617N08227K344951J650527
$$ 917581 692427 502564 943319 1087417 -103834 -1520451 -1012224 1332727 2983254
38341B983254n77029j493291n10542M87278L59078j27815j46200J30151L62623
$$ 2983254 2406225 912934 402392 889670 1248748 1120933 974733 1104884 1467507
38332A467507M54656K00810l00039l30340K12051J52870r70497j478980r0595
$$ 1467507 1922163 2122973 1822934 1492594 1704645 1857515 887018 -591962 -682557
38323f82557J355996L74539j835608j709195J180196L227657K001068o77859j934110
$$ -682557 673439 1047978 -787630 -2496825 -1316629 1911028 3912096 3234237 1300127
38314A300127j485789o92584j54121J42823j00486p98843j038431m34155J35549
$$ 1300127 -185662 -878246 -1032367 -889544 -990030 -1788873 -2827304 -3261459 -3125910
38305c125910j8621l38186j57424K42264M52040P20264J190186J307834O62758
$$ -3125910 -3144531 -3482717 -3640141 -3397877 -2945837 -2225573 -1035387 272447 935205
38296I35205l05742q55169n97155L94821J414105J366312J35117q19738m21477
$$ 935205 629463 -225706 -822861 -428040 986065 2352377 2487494 1667756 1246279
38287A246279K23518m03104j486949j048839P13067J714486J395655J234225J733630
$$ 1246279 1469797 1066693 -420256 -1469095 -756028 958458 2354113 3588338 5321968
38278E321968J545647J13292j230023j508713j355333j375735j166762m88873
$$ 5321968 6867615 6980907 5750884 4242171 2886838 1511103 344341 -144532
38270a44532K78345J066627J860831J760492K50444j093823n18963Q70475O94726
$$ -144532 133813 1200440 3061271 4821763 5072207 3978384 3459421 4329896 5024622
38261E024622p06918r82106Q0478N86447K93185N08720N88280j164913l213483
$$ 5024622 4317704 3335598 3416076 4002523 4295708 4804428 5392708 4227795 1014312
38252A014312k208307R76351J806786m85489j548733N60196K227858R62134m11573
$$ 1014312 -1193995 -217644 1589142 1103653 -445080 115116 2342974 3305108 2893535
38243B893535O60478J860569O63064r61841m18836Q75563N64706m31303l71092
$$ 2893535 3554013 5414582 6077646 5115805 4696969 5572532 6137238 5705935 5334843
38234E334843j16776q07870j297926q66913j131414k544894k690969o59931R64289
$$ 5334843 5218067 4410197 3112271 2245358 1113944 -1430950 -4121919 -4781850 -3817561
38225c817561R77450J674512L446281K789751r50364k808036k37378K182259P23037
$$ -3817561 -2840111 -1165599 2280682 5070433 4120069 1312033 1074655 3256914 3979951
38216C979951j188039r916J160327q10910k238614M28571K994285P84424k316202
$$ 3979951 2791912 2781996 3942323 3131413 892799 1321370 4315655 5100079 2783877
38207B783877o63814K793523K116785p58741m11908J511453K31675k011308k13952
$$ 2783877 2120063 4913586 7030371 6271630 5859722 7371175 7602850 5591542 5377590
38198E377590K982630J867965j222282l11731K772476K748474K083554N508834
$$ 5377590 8360220 10228185 9005903 8694172 11466648 14215122 16298676 21807510
38190B1807510Q401946M355259j068676O15510M205765R33504j942761O503802
$$ 21807510 30209456 34564715 33496039 34111549 38317314 39250818 37308057 43811859
38182D3811859J6388614J3362166J3955598M6119933Q9884334Q2307985L495876
$$ 43811859 60200473 73562639 87518237 133638170 223522504 305830489 309326365
38175C09326365q1207902r7982512n4439922j5312375j1103113j6175391p577505
$$ 309326365 228118463 130135951 75696029 60383654 49280541 33105150 25527645
38168B5527645K624544K97463m963997k102897J439217k513265o442769k710950
$$ 25527645 28152189 28449652 23485655 21382758 22821975 20308710 13865941 11154991
38160A1154991J693520r51426m982432l147655J86469j033045k706932L75905
$$ 11154991 12848511 11897085 6914653 3766998 3953467 2920422 213490 589395
38152E89395L631128J379908k286213j393803J017636m08715k857236j107244
$$ 589395 4220523 5600431 3314218 1920415 2938051 2529336 -327900 -1435144
38144a435144K355495K194452j15406j36480Q59615n80227k302249n13254K274786
$$ -1435144 920351 3114803 2999397 2862917 3722532 3142305 840056 326802 2601588
38135B601588J267583j857652j899360Q62150J936974O84342J59221O98368J35296
$$ 2601588 3869171 2011519 112159 974309 2911283 3595625 3754846 4453214 4588510
38126D588510j052993p37891J44553o51847j800367o33218J426421J118611n63840
$$ 4588510 3535517 2797626 2942179 2290332 489965 -143253 1283168 2401779 1837939
38117A837939j67075J661771J221375j391126k234106k23698J489599J173731
$$ 1837939 1670864 3332635 4554010 3162884 928778 705080 2194679 3368410
38109C368410O02116Q41545M83142r08951j489200m24601P08814P68120M97319
$$ 3368410 3970526 4812071 5295213 4386262 2897062 2472461 3181275 3949395 4446714
38100D446714M28211r1206j098604j513972j013912n06030m03819j45770M01247
$$ 4446714 4874925 4783719 3685115 2171143 1157231 651201 247382 101612 502859
38091E02859N92130J27526o27938j184984r53105M10704J839035J481546m11537
$$ 502859 1094989 1222515 594577 -590407 -1543512 -1132808 706227 2187773 1776236
38082A776236j117816N39931J982513P56469j548049j871111k65251J016299J396719
$$ 1776236 658420 1198351 3180864 3937333 2389284 518173 252922 1269221 2665940
38073B665940J799092J844751M75361j388122j805043r09502m30721p82819j133053
$$ 2665940 4465032 6309783 6785144 5397022 3591979 2682477 2251756 1468937 335884
38064C35884j526802k318908k348359m55324J910822K380027J284058Q01114J177215
$$ 335884 -1190918 -3509826 -5858185 -6313509 -4402687 -2022660 -738602 62512 1239727
38055A239727Q04914l94206p71239m1734L16388j60500l81937k6508N9177j68687
$$ 1239727 2044641 1650435 879196 837462 1153850 993350 611413 584905 644082 475395
38045D75395Q5661N71172L44572j54083K81878J137509P51654p21171j364461
$$ 475395 561056 1132228 1476800 1322717 1604595 2742104 3493758 2772587 1408126
38036A408126n11883O12608J198404J485271J240707J105j269404j183261m60854
$$ 1408126 896243 1508851 2707255 4192526 5433233 5434338 4164934 2981673 2520819
38027B520819r29896k131248j723919N48366K152523J586934K69846j79189j86860
$$ 2520819 1590923 -540325 -2264244 -1715878 436645 2023579 2293425 2114236 1927376
38018A927376p81243j771209k255974j655773M4229J880935K126613M57516q51130
$$ 1927376 1146133 -625076 -2881050 -4536823 -4492594 -2611659 -485046 -27530 -878660
38009h78660J13674J745485J310061n09136p58924O83588R76652o25456j519001
$$ -878660 -764986 980499 2290560 1781424 1022500 1706088 2682740 2057284 538283
38000E38283l24209J022506R33805M56287M78913k8752j319219j513656J64936
$$ 538283 214074 1236580 2170385 2626672 3105585 3076833 1757614 243958 408894
37991D08894J610126J191120K14917R4284k01910j592649k361259q51482J412894
$$ 408894 2019020 3210140 3425057 3519341 3317431 1724782 -636477 -1487959 -75065
37982g5065K013907J287258R96819R43349k04584j821201k014328q42729j41690
$$ -75065 1938842 3226100 4222919 5166268 4961684 3140483 1126155 283426 141736
37973A41736l41202K3619J400286K047529N54986j948113l029193j732727N10743
$$ 141736 -199466 -175847 1224439 3271968 3826954 1878841 -1150352 -2883079 -2372336
37964b372336J615775J165600O43943J157048J716045Q64768o64582p97909N04827
$$ -2372336 -756561 409039 1052982 2210030 3926075 4790843 4126261 3328352 3833179
37955C833179R92566k37753j217202l77053Q72676N65047o23444o91294L88685
$$ 3833179 4825745 4587992 3370790 2993737 3866413 4431460 3808016 3116722 3505407
37946C505407Q78058J70312n20125k55787M26913N86300L7152p70704j341799
$$ 3505407 4383465 4553777 4033652 3777865 4204778 4791078 4828230 4057526 2715727
37937B715727j431500j077983m28333L58797Q59374N03044m40062o23935N74025
$$ 2715727 1284227 206244 -222089 136708 996082 1499126 1059064 435129 1009154
37928A009154J702678J161632j84105k46190R32114J410220O94789J47175k0928
$$ 1009154 2711832 3873464 3689359 3443169 4375283 5785503 6480292 6627467 6606539
37919F606539j089038k605218k132792N56445K253414J016299q98178r00009J238
$$ 6606539 5517501 2912283 779491 1335936 3589350 4605649 3707471 2807462 2808700
37910B808700l15407j196632p99430L67838N43477k1679K28525J180958J383599
$$ 2808700 2493293 1296661 497231 865069 1408546 1386867 1615392 2796350 4179949
37901D179949N83063k86149q59129j190729q86220j58502l80748j694563j762006
$$ 4179949 4763012 4476863 3617734 2427005 1540785 1382283 1001535 -693028 -2455034
37892b455034Q11022L552282L317863Q44251q15207r58453j103306j374014n72462
$$ -2455034 -1644012 1908270 5226133 6070384 5255177 4296724 3193418 1819404 1246942
37883A246942P61230Q12577k17988m40993L00390L71988m72776q71708o54646
$$ 1246942 2008172 2820749 2602761 2161768 2462158 2834146 2361370 1489662 835016
37874H35016q57643j114249j34290J349848J324095Q6043k28210M08829Q3550
$$ 835016 -22627 -1136876 -1271166 78682 1402777 1488820 1260610 1669439 1752989
37865A752989r49628m13683J336769J231280r63819j610719O13296K115955M45187
$$ 1752989 803361 389678 1726447 2957727 1993908 383189 996485 3112440 3557627
37856C557627j433300k03761K225980K105869j20733j237256n80068K1434O9052
$$ 3557627 2124327 1920566 4146546 6252415 6131682 4894426 4314358 4335792 4404844
37847D404844L89369M67368o62379j795787j221034j18225q10100k357959j717355
$$ 4404844 4794213 5261581 4599202 2803415 1582381 1464156 654056 -1703903 -3421258
37838c421258R44709K085812M56863r03529L89344K497581K589976R82712r5088
$$ -3421258 -2476549 -390737 66126 -837403 -448059 2049522 4639498 5622210 5527122
37829E527122j093J62312k91856j083265j792553j916957q39790J143705K514782
$$ 5527122 5526029 5688341 5396485 4313220 2520667 603710 -236080 907625 3422407
37820C422407K248153J093310K55399k49009q12813q18017M42739J985867J966209
$$ 3422407 5670560 6763870 7019269 6770260 5957447 5139430 5582169 7568036 9534245
37811I534245K40845j363993j525873q35877l90723k72508j11460q7804m20321
$$ 9534245 9775090 8411097 6885224 6049347 5658624 5386116 5274656 5186852 4766531
37802D766531n71650M952P20069M57655p90317j790948j626082o43264K38893
$$ 4766531 4194881 4199833 4919902 5377557 4587240 2796292 1170210 526946 765839
37793G65839N03551K01015k11236o0692Q71141J757383J511791K98625n79350
$$ 765839 1269390 1470405 1259169 1198477 2069618 3827001 5338792 5637417 5058067
37784E058067n21311l46271p20577j002131n21991l3940o49804j898982k151646
$$ 5058067 4536756 4190485 3469908 2467777 1945786 1911846 1262042 -636940 -2788586
37775b788586q17056R70384J859642J584582P20029q0572m52885m39134l33856
$$ -2788586 -3605642 -2635258 -775616 808966 1528995 1448423 995538 556404 222548
37766B22548k17412J00772N03005M95221L1947l02276l07357m41915o29301l8480
$$ 222548 5136 105908 608913 1104134 1136081 833805 526448 84533 -544768 -583248
37756e83248J194397J526410M70860j20615J064072K230501J080348j316817k018672
$$ -583248 611149 2137559 2608419 2487804 3551876 5782377 6862725 5545908 3527236
37747C527236p35132J86928q2599M611Q84172Q42607o73926j713225j007232R4121
$$ 3527236 2792104 2979032 2896433 2901044 3785216 4627823 3953897 2240672 1233440 1327561
37737A327561J81431j18159M8212J32617k15770r1454P25739R27835J59556J7986
$$ 1327561 1508992 1390833 1439045 1571662 1355892 1264438 1990177 2918012 3077568 3095554
37727C095554J043459J248733m30768j803655r24081N06562L4154j427583j502612
$$ 3095554 4139013 5387746 4956978 3153323 2229242 2735804 2769958 1342375 -160237
37718a60237n01741k28975j77220J305136L058407K312654m81638j882818o94096
$$ -160237 -661978 -890953 -1068173 236963 3295370 5608024 5126386 3243568 2549472
37709B549472O61841M87694q526K20551J52026q17107j384047q46257n12813j057496
$$ 2549472 3211313 3699007 3690481 3911032 4063058 3245951 1861904 1015647 502834 -554662
37699e54662r08893R16893K554915J918946j07223j147315o73643O8724L90552
$$ -554662 -1463555 -546662 2008253 3927199 3819976 2672661 1999018 2067742 2458294
37690B458294N10635L76781j07578k73495L15698O16975n32045k206530k243343
$$ 2458294 2968929 3345710 3238132 2964637 3280335 3897310 3365265 1158735 -1084608
37681a084608k85118J570130J499101P0244r45782q86997m06874J27260J228306
$$ -1084608 -1369726 200404 1699505 1769749 823967 -63030 -469904 -342644 885662
37672H85662K884857L554190J846495r77548j856742O2291J963494J337436j96362
$$ 885662 3770519 7324709 9171204 8193656 6336914 6399205 8362699 9700135 9503773
37663I503773N96587L329786M464008K906369J575116K286486K519396m17012
$$ 9503773 10100360 13430146 17894154 20800523 22375639 24662125 27181521 26764509
37655B6764509m643397o157449m410640k321869j582464j121178j85529J11948
$$ 26764509 22121112 15963663 11553023 9231154 7648690 6527512 6341983 6453931
37647F453931p99257j389546k85880J428835J604101r8202j895378k116586r00180
$$ 6453931 5654674 4265128 3979248 5408083 7012184 6913982 5018604 2902018 2001838
37638B001838K94555M01251j71864k09481O06725J163606M80437q00861j316155
$$ 2001838 2296393 2697644 2525780 2316299 2923024 4086630 4567067 3766206 2450051
37629B450051r00169m76067k85050L24956J159381Q31967r89755k325975j257247
$$ 2450051 1549882 1073815 788765 1113721 2273102 3105069 2115314 -210661 -1467908
37620a467908J201141K194124Q40125o56785j67941J499272J986076P34585n26746
$$ -1467908 -266767 1927357 2767482 2110697 1942756 3442028 5428104 6162689 5635943
37611E635943m87607N8735k18386j103270j333580n56759L17776N19158J72864
$$ 5635943 5148336 5207071 4988685 3885415 2551835 1995076 2312852 2832010 3004874
37602C004874l50545r11264j206042p12412N47976J693397J782897O69599r69487
$$ 3004874 2654329 1743065 537023 -175389 372587 2065984 3848881 4518480 3548993
37593C548993k059623j734737k00952J069828Q34430k39044l90154O37059J125635
$$ 3548993 1489370 -245367 -446319 623509 1457939 1218895 828741 1465800 2591435
37584B591435K0133j352647j235281j1733N60342K9829l71960R2583N48282k0280
$$ 2591435 2611568 1258921 23640 11907 572249 602078 230118 322701 870983 850703
37574H50703j142648j391062k28074J190791J283544M2535p52845J28711J385319
$$ 850703 -291945 -1683007 -1911081 -720290 563254 605789 -147056 -18345 1366974
37565A366974Q43861j048032j365095R11758K785721J331043j774496k417197
$$ 1366974 2210835 1162803 -202292 709466 3495187 4826230 3051734 634537
37557F34537M5420K003951R32639j331952j781189m15893N33170J25710m93454
$$ 634537 679957 2683908 3616547 2284595 503406 87513 620683 746393 252939
37548B52939k68217M11658N65244j47206j174562j600197j013067o2511K30210
$$ 252939 -15278 396380 961624 814418 -360144 -1960341 -2973408 -3035919 -2805709
37539b805709j56012k38812L64065P79801L82602o8561K79648Q20273M43570n42396
$$ -2805709 -2961721 -3200533 -2836468 -2056667 -1674065 -1742626 -1462978 -642705 -199135 -741531
37529g41531q38202k43538J13223k88798n95514j62220L51601K03160j24031J93462
$$ -741531 -1579733 -1823271 -1710048 -1998846 -2594360 -2756580 -2404979 -2201819 -2325850 -2132388
37519b132388P98143O56804j58478l34019Q16772K227815K325169Q69857r60265
$$ -2132388 -1334245 -677441 -835919 -1169938 -353166 1874649 4199818 5069675 4109410
37510D109410j954278j738232n21121J196434K488809K338850O71386j294872
$$ 4109410 2155132 416900 -104221 1092213 3581022 5919872 6591258 5296386
37502E296386k205882j838912q78986N9034N39614r483j578183k703137j693625
$$ 5296386 3090504 1251592 372606 431640 971254 961771 -616412 -3319549 -5013174
37493e013174R35487K577712J755299l7014o87250l69940n35901j019913l51527
$$ -5013174 -4077687 -1499975 255324 218310 -468940 -838880 -1374781 -2394694 -2746221
37484b746221J305903J916414Q15545l5589P67839J590052K88915k163710k877922
$$ -2746221 -1440318 476096 1291641 1256052 2023891 3613943 3902858 1739148 -1138774
37475a138774j211141O28206J108570J129438J619990J620389J56485j605485
$$ -1138774 -2349915 -1721709 -613139 516299 2136289 3756678 3913163 2307678
37467B307678j841839p31708J11042K30755N10717J026601P13952m85229r94235
$$ 2307678 465839 -265869 -154827 75928 586645 1613246 2327198 1841969 847734
37458H47734J9168J123766O53111q59665j610711j106589l61303K1570L92305
$$ 847734 866902 1990668 2643779 1784114 173403 -933186 -1294489 -1272919 -880614
37449h80614P46269M41326m19072p17631q0441L31085l12165r23913m4858J728695
$$ -880614 -134345 306981 -112091 -829722 -910163 -579078 -891243 -1815156 -1860014 -131319
37439a31319K325645J020635p14262j338387r60904m87441j63727K64793O76632
$$ -131319 2194326 3214961 2500699 1162312 201408 -286033 -449760 -184967 491665
37430D91665O74826K02441m73308j013055r00361K45714J735437K015932O66549
$$ 491665 1166491 1368932 895624 -117431 -1017792 -772078 963359 2979291 3645840
37421C645840o05430j34416J208598J213179l71689j575656j307873p20396q55097
$$ 3645840 3040410 2905994 4114592 5327771 4956082 3380426 2072553 1352157 497060
37412D97060q92188M1867R59621N24324o83817j118913o49903k69774r0710N16369
$$ 497060 -395128 -353261 606360 1130684 446867 -672046 -1321949 -1591723 -1682433 -1166064
37402a166064J179638Q53980k10703o96865m43307n13433q84067k38956J348929
$$ -1166064 13574 867554 656851 -40014 -483321 -996754 -1880821 -2119777 -770848
37393g70848J786098J67460j399185p76749J004191J376530r8573j593199j768950
$$ -770848 1015250 1182710 -216475 -993224 10967 1387497 1288924 -304275 -2073225
37384b073225q91350K61763R59072M70690r35140j469938j7545J692231J151785
$$ -2073225 -2964575 -2702812 -1743740 -1273050 -2208190 -3678128 -3695673 -2003442 -851657
37375h51657j026766j732876m2049J416659O82525n96366j85368J003381O92912
$$ -851657 -1878423 -3611299 -3653348 -2236689 -1554164 -2150530 -2335898 -1332517 -639605
37366f39605o82341o36159J050039J678833l2794j612482m37024K168298K660419
$$ -639605 -1321946 -1958105 -908066 770767 737973 -874509 -1311533 856765 3517184
37357C517184L04936j877880j398250N46407J217565J00093j068567j213988j015005
$$ 3517184 3822120 1944240 545990 1092397 2309962 2410055 1341488 127500 -887505
37348h87505j100313q90052J22653J221164J479996J021882L96206m63630j629242
$$ -887505 -1987818 -2877870 -2755217 -1534053 -54057 967825 1364031 900401 -728841
37339g28841k222461j349860L26523J196362Q19699L06385N04108R07787O78405
$$ -728841 -2951302 -4301162 -3974639 -2778277 -1958578 -1652193 -1148085 -240298 438107
37330D38107j59746r42837j116697m55715Q37346J935267J856057N01867j117937
$$ 438107 278361 -664476 -1781173 -2236888 -1399542 535725 2391782 2893649 1775712
37321A775712j897539j560827n66953M44554J009580J028312P23471K68420l36272
$$ 1775712 -121827 -1682654 -2249607 -1805053 -795473 232839 956310 1224730 888458
37312H88458q24141o27416K39376Q56696O28355J56801N2650k60535j302099j985697
$$ 888458 64317 -563099 -323723 532973 1161328 1318129 1370779 1110244 -191855 -2177552
37302b177552j072096M75437P16754l6745K85119J717709J813367k14960j768841
$$ -2177552 -3249648 -2774211 -2057457 -2094202 -1809083 -91374 1721993 1507033 -261808
37293b61808q31113Q76355P81634n66888q60809J51875P75032L34151l62589q80475
$$ -261808 -1092921 -216566 565068 -1820 -862629 -710754 64278 398429 35840 -844635
37283h44635j265368q67884P33598K085354J390802n55935j209361K9781J187343
$$ -844635 -2110003 -2977887 -2244289 -158935 1231867 675932 -533429 -503648 683695
37274F83695Q84538r7892p38827j075801j050710j48335J063928R79508n39910
$$ 683695 1568233 1470341 731514 -344287 -1394997 -1543332 -479404 500104 -39806
37265c9806j455197l95031J338755J738109P41563k28627l26822J68711N61189
$$ -39806 -1495003 -1890034 -551279 1186830 1928393 1699766 1372944 1541655 2102844
37256B102844K27257q28318j493760o55685R34288J305157J93035m01732O59606
$$ 2102844 2330101 1501783 8023 -647662 286626 1591783 1784818 1383086 2042692
37247B042692J830537J372233p9577r51423j167557j394082j221599j20764Q22360
$$ 2042692 3873229 5245462 5165885 4214462 3046905 1652823 431224 310460 1132820
37238A132820K63262r95515j080411q7200J31284q82677j419822l66025J125603
$$ 1132820 1396082 400567 -679844 -767044 -635760 -1518437 -2938259 -3304284 -2178681
37229b178681J440082O04173j79093j64240M05999Q23100N86507j07364n43481
$$ -2178681 -738599 -134426 -313519 -477759 -71760 751340 1337847 1230483 687002
37220F87002m27038k36080k24152J56076J066090J457558O24902l06709J6939
$$ 687002 259964 23884 -200268 -44192 1021898 2479456 3104358 2797649 2814588
37211B814588Q43970M50906q79314j150258J29296J160901O21471p18817j596671
$$ 2814588 3658558 4109464 3230150 2079892 2209188 3370089 3991560 3272743 1676072
37202A676072j681004r63298M28240J303844K78183j745787k027343J20252K004283
$$ 1676072 -4932 -968230 -539990 763854 1042037 -703750 -2731093 -2610841 -606558
37193f06558J409819l21787q02082k48948l87053j135059r54715K03732P65421
$$ -606558 803261 481474 -320608 -569556 -956609 -2091668 -3046383 -2842651 -2077230
37184b077230K24577j22169O14296J613951J675359P26431l18486n52594P0378
$$ -2077230 -1852653 -1974822 -1360526 253425 1928784 2655215 2336729 1784135 1854513
37175A854513N10379k32447j454563j317634L02353J130989j13466j441367o56392
$$ 1854513 2364892 2132445 677882 -639752 -337399 793590 680124 -761243 -1417635
37166a417635R92007Q82872n63560q01941K56824K93869q03705m00873J889707
$$ -1417635 -425628 457244 -106316 -908257 -651433 -357564 -1161269 -1562142 327565
37157C27565K695268L12973j980453q88653J587356J340995j335930k414785m74143
$$ 327565 3022833 3335806 1355353 466700 2054056 3395051 2059121 -355664 -829807
37148h29807J527447J156368j89423j30917R80747R72430p60189k358105j812503
$$ -829807 697640 1854008 1664585 1533668 2514415 3486845 2726656 368551 -1443952
37139a443952O22728K558472K049888j19025j405410q21673M012l15405p11564
$$ -1443952 -821224 1737248 3787136 3668111 2262701 1441028 1445040 1129635 418071
37130D18071K04474J370439R17431m55513m58355Q99032J312556J67003n49121
$$ 418071 622545 1992984 2910415 2454902 1996547 2895579 4208135 4375138 3826017
37121C826017k582o5523j659783k477259o17131J803319J467616j175848k670615
$$ 3826017 3823435 3757912 2098129 -379130 -996261 807058 2274674 1098826 -1571789
37112a571789j543748K51314P61960L29170K997j76613m44280l88893K97799J111941
$$ -1571789 -3115537 -2864223 -2102263 -1773093 -1770096 -1946709 -2390989 -2779882 -2482083 -1370142
37102a370142J441045J278957Q69170L07948k68147p19303j151246j465589r34390
$$ -1370142 70903 1349860 2219030 2526978 2258831 1539528 388282 -1077307 -2011697
37093b011697P18866K060123J288380r66875j859660o4149K220329K169014N6810
$$ -2011697 -1292831 767292 2055672 1088797 -770863 -835012 1385317 3554331 3611141
37084C611141j405747p84748O27558R87230J16907q52409j108743q19951n84579
$$ 3611141 2205394 1420646 2048204 3035434 3152341 2299932 1191189 371238 -213341
37075b13341o98905r09117p33840o0150O13808O61724N7398m89223j99685R20252
$$ -213341 -912246 -1821363 -2555203 -2615353 -2001545 -1339821 -1282423 -1771646 -1971331 -1051079
37065a051079J927431J835604P31112l09331n59961l85529k64052J78276J233580
$$ -1051079 876352 2711956 3443068 3133737 2573776 2188247 1924195 2102471 3336051
37056C336051J835493O67533j569875k605035j634488l20485r1475r9470R32685
$$ 3336051 5171544 5839077 4269202 1664167 29679 -290806 -382281 -481751 450934
37047D50934K243471K085083L99795j249335j963918k125375j969468j145053
$$ 450934 2694405 4779488 5179283 3929948 1966030 -159345 -2128813 -3273866
37039c273866K03084J251707J607179J526802J006401j82154j449474j621663
$$ -3273866 -3070782 -1819075 -211896 1314906 2321307 2139153 689679 -931984
37031i31984n25769O88094J067173P43528J81814l52737l96670M22132J368300
$$ -931984 -1457753 -769659 297514 1041042 1222856 870119 473449 895581 2263881
37022B263881J093365m18627j593271j406734n00979L54564J374175K422367K172896
$$ 2263881 3357246 2938619 1345348 -61386 -562365 -207801 1166374 3588741 5761637
37013E761637J05902j856882j546557K91040R24755m62844j719515j003589N41786
$$ 5761637 5867539 4010657 2464100 2755140 3679895 3217051 1497536 493947 1035733
37004A035733N41905j067285j749056J29649K639428K366777r96786l744956k797836
$$ 1035733 1577638 510353 -1238703 -1109054 1530374 3897151 2900365 -844591 -3642427
36995c642427J89380J308221M3712m32983J295198K507516Q78364j591656j685414
$$ -3642427 -3453047 -2144826 -2101114 -2534097 -1238899 1268617 2146981 555325 -1130089
36986a130089J80467J187725P20634N30977J109241J154530M88092L91760Q09049
$$ -1130089 -949622 238103 958737 1489714 2598955 3753485 4241577 4633337 5442386
36977E442386J74675j406952j701965k0382J334941N93508q93452j108756l20372
$$ 5442386 5617061 4210109 2508144 2487762 3822703 4416211 3522759 2414003 2093631
36968B093631J01859L6595K5312j96519q85892j236007o53715Q9782L42478Q05534
$$ 2093631 2195490 2232085 2257397 2060878 1174986 -61021 -714736 -624954 -282476 523058
36958E23058J782952J783870j65294k208943j978031j92767N23782k68024o01423
$$ 523058 2306010 4089880 3924586 1715643 -262388 -455155 68627 -199397 -800820
36949h00820K31807N42833p04612k050457j726337J6359J737003K638166K646473
$$ -800820 -569013 -26180 -730792 -2781249 -4507586 -4491227 -2754224 -116058 2530415
36940B530415J733087J46118j259392j661073j021874P562O34531M29965k78142
$$ 2530415 4263502 4409620 3150228 1489155 467281 474843 1109374 1539339 1261197
36931A261197o82509n76117o91739j371829j617831m75876J267787K034446J598012
$$ 1261197 578688 2571 -689168 -2060997 -3678828 -4154704 -2886917 -852471 745541
36922G45541R22724L45960m69273j107418p60866L1981j16731j057955j131310
$$ 745541 1668265 2014225 1544952 437534 -323332 -291351 -408082 -1466037 -2597347
36913b597347Q3372J022784P41745K58950M26706M36103l15724o97080K19006
$$ -2597347 -2513975 -1491191 -749446 -490496 -63790 372313 56589 -640491 -421485
36904d21485J189058O06430q18077j087794P4193J121259J200442R51934Q33254
$$ -421485 767573 1374003 555926 -531868 -457675 663584 1864026 2815960 3649214
36895C649214L67470n50799j000581l68664N97950Q01837K74254r3492k2986k27081
$$ 3649214 4016684 3465885 2465304 2096640 2694590 3496427 3770681 3677189 3654203 3427122
36885C427122j059272j478509k68862J803754K268973O0794k691702l151582j274153
$$ 3427122 2367850 889341 620479 2424233 4693206 4754000 2062298 -1089284 -2363437
36876b363437O46511J291702J257285R52347j05628j467197j507590K5674J205752
$$ -2363437 -1716926 -425224 832061 1784408 1678780 211583 -1296007 -1270333 -64581
36867f4581P96248J9592J52020L45545l94725r38834k0607R76572j03674k390085
$$ -64581 731667 751259 903279 1248824 854099 -84735 -105342 871230 767556 -1622529
36857a622529k859282q14268J149074J003236j80327l19689Q68269K106034K355164
$$ -1622529 -4481811 -5296079 -4147005 -3143769 -3324096 -3643785 -2775516 -669482 1685682
36848A685682J501931O2463j114446j322652n74940M63438J017346N55651p70476
$$ 1685682 3187613 3250076 2135630 812978 238038 701476 1718822 2274473 1503997
36839A503997j704598r23936Q38928J086484q75806k282007p21774J904344J964655
$$ 1503997 -200601 -1124537 -285609 800875 -74931 -2356938 -3078712 -1174368 790287
36830G90287l39251j292976N42344K311737J461706p69196j910831j690613j117363
$$ 790287 451036 -841940 -299596 2012141 3473847 2704651 793820 -896793 -2014156
36821b014156l02932Q02376J181268K82075n13132J19624J103325N93964r34667
$$ -2014156 -2317088 -1514712 -333444 -51369 -564501 -444877 658448 1252412 317745
36812C17745j368453k56642O58478K35940o06902o66610k04098j83487o85165
$$ 317745 -1050708 -1307350 -648872 -412932 -1019834 -1686444 -1890542 -2074029 -2759194
36803b759194q84029k93414N33835O81364J16596r6904P78772J849122J580911
$$ -2759194 -3643223 -3936637 -3402802 -2721438 -2604842 -2701746 -1922974 -73852 1507059
36794A507059Q2149p81271J3369J107890P13631q16417j546269o51284N92274
$$ 1507059 1589208 807937 821306 1929196 2642827 1826410 280141 -371143 221131
36785B21131N56921p50297j706806q82011J241992K564075J724586j84904j063823
$$ 221131 778052 27755 -1679051 -2561062 -1319070 1245005 2969591 2784687 1720864
36776A720864o00885l05843p86010p63854N25198J658281J023441p11122j548093
$$ 1720864 1119979 814136 28126 -735728 -210530 1447751 2471192 1760070 211977
36767B11977q16299M25128J094126J017535N11752N404j51673j06048l20590o52607
$$ 211977 -604322 -179194 914932 1932467 2444219 2449623 2297950 2191902 1871312 1218705
36757A218705m36511J79536K23637k22511K47150J764561K151063J17572k177871
$$ 1218705 782194 961730 1185367 962856 1210006 2974567 5125630 5243202 3065331
36748C065331j950499J28106J148156L29762n71308p24339j124978j925436j778224
$$ 3065331 1114832 1242938 2391094 2720856 2149548 1425209 300231 -1625205 -3403429
36739c403429n19213J55494k81814K1664K034207L604936K479928r5840j069046
$$ -3403429 -3922642 -3767148 -4048962 -4027298 -1993091 1611845 4091773 3995933 2926887
36730B926887P2863R73004J99411q61382n34498M31433N3025j700985k495561
$$ 2926887 2999750 3972754 4172165 3310783 2776285 3207718 3260743 1559758 -935803
36721i35803q02765J702402K129631K67285j144704l13097J211813J118687k71119
$$ -935803 -1738568 -36166 2093465 2360750 1216046 902949 2114762 3233449 2962330
36712B962330r73654o12470n15611j023705j024250k66149P1588l66822l05495
$$ 2962330 1988676 1376206 860595 -163110 -1187360 -1453509 -1381921 -1748743 -2054238
36703b054238Q91418J880000J315284j94414j138155j016617l30455L53498N70583
$$ -2054238 -1162820 717180 2032464 1838050 699895 -316722 -647177 -293679 276904
36694B76904J41982k22204M31619J561840J400195l48639j614984q38996P35411
$$ 276904 418886 196682 628301 2190141 3590336 3241697 1626713 787717 1523128
36685A523128J042445J96240j83932K69319M52639j04254o79544q54965j041232
$$ 1523128 2565573 2761813 2577881 2847200 3299839 3195585 2516041 1661076 619844
36676F19844j313693j018959K2315Q56537M89516q34268j832749j498454o5519
$$ 619844 -693849 -1712808 -1690493 -833956 -344440 -1178708 -3011457 -4509911 -4575430
36667d575430J298829J756854J558524J291648Q17954k32534j202763r25911L49147
$$ -4575430 -3276601 -1519747 38777 1330425 2148379 1915845 713082 -212829 136318
36658A36318R36944J11792q57328q00291l39497l96249l61372O93297J925592
$$ 136318 1073262 1185054 327726 -472565 -812062 -1208311 -1569683 -876386 1049206
36649A049206J624305j57228j454184r20999O70861J608221J091798j76235p78770
$$ 1049206 2673511 2516283 1062099 141100 811961 2420182 3511980 3335745 2556975
36640B556975o4860R61878P52940o56419j618255j290901o99240o86488m84914
$$ 2556975 2492115 3453993 4206933 3550514 1932259 641358 -57882 -744370 -1229284
36631a229284M00028N83610j003609k672932k054675K54552J565791J091698N08399
$$ -1229284 -829256 -245646 -1249255 -3922187 -5976862 -5722310 -4156519 -3064821 -2556422
36622b556422O94074N91203k84916p03776P1166R83428J002113M91014k3672o97531
$$ -2556422 -1862348 -1271145 -1556061 -2259837 -2188671 -1205243 -203130 287884 264212 -433319
36612d33319j156732k90079J647093K464927R55119j099680j341859l3959P70523
$$ -433319 -1590051 -1880130 -233037 2231890 3187009 2087329 745470 711511 1482034
36603A482034K71352n80562j007675j117393r07158r8494Q87413R87343j05568
$$ 1482034 1753386 1172824 165149 -952244 -1859402 -1957896 -1070483 -83140 -188708
36594a88708j349355j496676m51219O89949Q06517k5149n50069J51381J368805
$$ -188708 -1538063 -3034739 -3485958 -2796009 -1989492 -2014641 -2564710 -2413329 -1044524
36585a044524J634917P59975q294L6586J66551k23417m84527m2801L03155l48643
$$ -1044524 590393 1350368 1342074 1378660 1545211 1321794 837267 794466 1097621 748978
36575G48978j278680j082586J62274J054212R75983P10060Q80357R82990L42877
$$ 748978 -529702 -1612288 -1450014 -395802 580181 1290241 2170598 3153588 3496465
36566C496465q00005j573756j365324k43055J090894J693461J136447o1477j028749
$$ 3496465 2696460 1122704 -242620 -485675 605219 2298680 3435127 3373650 2344901
36557B344901j428213j417732j046337l26486K59342J23632m13267j89924J311600
$$ 2344901 916688 -501044 -1547381 -1873867 -1614525 -1490893 -1904160 -2094084 -782484
36548g82484K991884L146112J354220r83271k065540j465130l43331J2758m42369
$$ -782484 2209400 5355512 6709732 5726461 3660921 2195791 1852460 1865218 1422849
36539A422849p95021n20941m7036K7211k61114m54598l47468j26587M542R5221
$$ 1422849 627828 106887 59851 87062 -174052 -628650 -976118 -1102705 -1098163 -1002942
36529a002942L21793O45165P04166K87834j60846r0095J7912r46906k586883k562073
$$ -1002942 -681149 -35984 668182 956016 795170 705075 722987 -223919 -2810802 -5372875
36519e372875K65691L306292L060396O1226j623312j73105J550440O38659j500872
$$ -5372875 -5107184 -1800892 1259504 1320730 -302582 -475687 1074753 1713412 212540
36510B12540j707676q390R02446R1191p09106m53038k27166p75824r65934J66660
$$ 212540 -1495136 -1503526 -601080 -509889 -1218995 -1672033 -1899199 -2675023 -3640957 -3474297
36500c474297J571679J680780O25461k46481l34262j27364M5769N47576J548212
$$ -3474297 -1902618 -221838 403623 157142 -177120 -304484 -258715 288861 1837073
36491A837073K265812J618275l20522j935597j721295k41955M28144m96185j382133
$$ 1837073 4102885 5721160 5400638 3465041 1743746 1501791 1929935 1433750 51617
36482E1617o56241P08283O29565q32958j460034j00796J731139J980387N56853
$$ 51617 -604624 103659 733224 -99734 -1559768 -1660564 70575 2050962 2607815
36473B607815r08622j052086k8114Q11049L60836q41478j093830O8144Q33396
$$ 2607815 1699193 647107 618993 1430042 1790878 949400 -144430 -76286 757110
36464G57110l17947j917884j317617J256407K818213J954084N07829J62023p0579
$$ 757110 439163 -1478721 -2796338 -1539931 1278282 3232366 3740195 3902218 3831639
36455C831639j354872k300014j077901J144052J493401m20499k000972j410702
$$ 3831639 2476767 176753 -901148 242904 1736305 1315806 -685166 -2095868
36447b095868K44419J003636O63338L84950P16897J014466N22233o11111j479085
$$ -2095868 -1851449 -847813 -184475 200475 917372 1931838 2454071 1842960 363875
36438C63875j434587q40404n66521p61607o68997J10080Q63963Q26852L72760
$$ 363875 -1070712 -1911116 -2477637 -3239244 -3908241 -3798161 -2934198 -2107346 -1734586
36429a734586L80565Q15667Q02024m5714j100307j497432q89373M50554J732149
$$ -1734586 -1354021 -538354 263670 217956 -882351 -2379783 -3269156 -2818602 -1086453
36420a086453J996320R65542m32854q58778M3414J289748J586702N95207p28111
$$ -1086453 909867 1875409 1442555 583777 627191 1916939 3503641 4098848 3370737
36411C370737j071664k82572L02830l82223j408858j036423M88904R79606l62731
$$ 3370737 2299073 2016501 2319331 1937108 528250 -508173 -19269 960337 597606
36402E97606j495061n68577J255958J721104Q57458L70503N55169J77575q98195
$$ 597606 -897455 -1466032 -210074 1511030 2368488 2738991 3294160 3471735 2573540
36393B573540j308861o07345k9065m05296j047191j167406q55848k54037P15443
$$ 2573540 1264679 657334 628269 222973 -824218 -1991624 -2847472 -3101509 -2386066
36384b386066J465995J163156K93812J20500L82454l63970j734381j417812R05613
$$ -2386066 -920071 243085 536897 657397 1039851 675881 -1058500 -2476312 -1570699
36375a570699K231824N39191j989134k244400n82598O19930R43310J445589J641409
$$ -1570699 661125 1200316 -788818 -3033218 -3615816 -2995886 -2052576 -606987 1034422
36366A034422L79778j068107l83654J582710J639848m41551j294008M32625J736242
$$ 1034422 1414200 346093 -37561 1545149 3184997 2743446 1449438 1882063 3618305
36357C618305L88775j286670n51638R42665R8290k078164k013141M14909J656425
$$ 3618305 4007080 2720410 2168772 3111437 3209727 1131563 -881578 -466669 1189756
36348A189756L25255q03546L10625J628141N37022j930518k780224j320395N45800
$$ 1189756 1515011 711465 1022090 2650231 3187253 1256735 -1523489 -2843884 -2298084
36339b298084J328444J176552N86380k72244r74277r43848k30624O43225J344696
$$ -2298084 -969640 206912 793292 521048 -453229 -1397077 -1627701 -984476 360220
36330C60220J512032N72135j127776j790503l27027J540159J267820o52681j122560
$$ 360220 1872252 2444387 1316611 -473892 -800919 739240 2007060 1354379 231819
36321B31819R25397K759641J856278n26074j544404q10314o0653l6253j63005
$$ 231819 1157216 3916857 5773135 5247061 3702657 2892343 2831690 2795437 2632432
36312B632432o34649k101189l350359k103892J192115K971609J265209j384872
$$ 2632432 1997783 -103406 -3453765 -5557657 -4365542 -1393933 -128724 -1513596
36304a513596j498096O37749K010596J381039K39077j87751l35853n32844j05523
$$ -1513596 -3011692 -2373943 -363347 1017692 1256769 1069018 733165 200321 94798
36295I4798J008733J574928R27432O9497p5803j74552j041833j850167j296460
$$ 94798 1103531 2678459 3605891 3675388 3599585 3425033 2383200 533033 -763427
36286g63427J61263Q53047L89274L340L13335L27509o73215j547270p42053J274316
$$ -763427 -602164 250883 640157 643497 956832 1284341 611126 -936144 -1678197 -403881
36276d03881K266314R87674j248487k209792j363634j51351J42150j04712J77720
$$ -403881 1862433 2850107 1601620 -608172 -1971806 -2123157 -1981007 -2085719 -1907999
36267a907999J032741J546358J266884N94857j75118j156808k001639j813167
$$ -1907999 -875258 671100 1937984 2532841 2357723 1200915 -800724 -2613891
36259b613891n04778O68644O78153P0527l8938L97308O64524O00670N46414M58606
$$ -2613891 -3118669 -2450025 -1771872 -1701345 -1740283 -1342975 -678451 -77781 468633 927239
36249I27239J46374l6635J68844Q7205q25805j575470q33872Q00261J513044J044766
$$ 927239 1073613 1036978 1205822 1293027 467222 -1108248 -1942120 -1141859 371185 1415951
36239A415951P16714O90434l49141k214750k581006o46199J029709K59928j317200
$$ 1415951 2132665 2823099 2473958 259208 -2321798 -2967997 -1938288 -1678360 -2995560
36230b995560r10052J000058J725775P89671K34475Q79786J229977L93783n44076
$$ -2995560 -3905612 -2905554 -1179779 -390108 -155633 724153 1954130 2347913 1803837
36221A803837p29263q36826j309095j296111l73933L90154J85880j71587K82530
$$ 1803837 1074574 237748 -1071347 -2367458 -2741391 -2351237 -2165357 -2336944 -2054414
36212b054414J064018J212769Q20028N39170M44053L13157K71282L08452r1367
$$ -2054414 -990396 222373 1042401 1581571 2025624 2338781 2610063 2918515 2827148
36203B827148j044249j686952j268598k35025M19851L61935j568j40731J74666
$$ 2827148 1782899 95947 -1172651 -1407676 -987825 -625890 -627458 -768189 -593523
36194e93523N61389K14849q31273j089751L93413J958915J290372p94176j183001
$$ -593523 -32134 182715 -648558 -1738309 -1344896 614019 1904391 1110215 -72786
36185g2786O12329J553976J42194j060988K5539J291687K29196j462741p94049
$$ -72786 539543 2093519 2235713 1174725 1200264 2491951 2721147 1258406 464357
36176D64357J191521J227429m64316p54358P35285J090733o30682j931540j401555
$$ 464357 1655878 2883307 2418991 1664633 2399918 3490651 2859969 928429 -473126
36167d73126o78502p73958k75606J275080J800060L57851q14180L3196J385619
$$ -473126 -1151628 -1925586 -2201192 -926112 873948 1231799 417619 450815 1836434
36158A836434J435373R47702Q84538L0882k309752l851417k579856k60913M04235
$$ 1836434 3271807 4219509 5104047 5134929 2825177 -1026240 -3606096 -3867009 -3462774
36149c462774O1264P76270J744587Q17546j017722q64043R91610J361650m71409
$$ -3462774 -3401510 -2625240 -880653 -63107 -1080829 -1944872 -953262 408388 -63021
36140f3021j701339q60903J03636k90799o36705L33983J326540R67670K15777
$$ -63021 -1764360 -2625263 -2521627 -2812426 -3449131 -3115148 -1788608 -820938 -605161
36131f05161L46792O44244Q1707n00969J6216P19631Q0058j304637j442463J02882
$$ -605161 -258369 385875 467582 -33387 -17171 702460 782518 -522119 -1964582 -1861700
36121a861700J744297K084183J182542j79269j267918j510295q40721K7407L20019
$$ -1861700 -117403 1966780 3149322 2970053 1702135 191840 -648881 -621474 -301455
36112c01455R9584k114L06462P30463P69077R6436j048685j754446j308551k35375
$$ -301455 -201871 -203985 102477 832940 1602017 1698453 649768 -1104678 -2413229 -2648604
36102b648604L14747K28088M22134J060110J117972J77991p40454q48640p33100
$$ -2648604 -2333857 -2105769 -1683635 -623525 494447 672438 -68016 -916656 -1649756
36093a649756r38603p43671M74315J776838J873234R43675O7736l61939n30534
$$ -1649756 -2588359 -3332030 -2857715 -1080877 792357 1736032 1803768 1441829 911295
36084I11295l79431q5151m58691j570903j899377l27439J827063K374409J134948
$$ 911295 531864 446713 -11978 -1582881 -3482258 -3809697 -1982634 391775 1526723
36075A526723l55770j262577j736309j488350k30243Q68669M28547o11726q4768
$$ 1526723 1170953 -91624 -1827933 -3316283 -3546526 -2677857 -2249310 -2861036 -2945804
36066b945804J764842K331209P58263p21556m75322K10247n8200k43426P54701
$$ -2945804 -1180962 1150247 1908510 1186954 711632 921879 863679 620253 1374954
36057A374954J398194j36205k385134k326973J8076J616100R90789j0891L60828
$$ 1374954 2773148 2636943 251809 -2075164 -2057088 -440988 549801 538910 899738
36048H99738J049671K43133j591253k370025j279006L98064J080104N49624j81745
$$ 899738 1949409 2192542 601289 -1768736 -3047742 -2649678 -1569574 -1019950 -1201695
36039a201695j10190P11490J213979N68569o43067j045361l37417K43573k18797
$$ -1201695 -1311885 -600395 613584 1182153 539086 -506275 -843692 -600119 -818916
36030h18916p92248L5480J947868K831925J460821q01840j641305n99642N92893
$$ -818916 -1611164 -1575684 372184 3204109 4664930 3863090 2221785 1622143 2215036
36021B215036L83328p75709j329024p13435J61975L24768j30416m95633m29204
$$ 2215036 2598364 1822655 493631 -219804 -57829 266939 136523 -359110 -788314
36012g88314q9013L04466N53185L92359j14963k15379P87380K226526K256415
$$ -788314 -877327 -572861 -19676 372683 257720 42341 829721 3056247 5312662
36003E312662L0098k685184l049690n35689K091642J890731o87292k388562j263102
$$ 5312662 5342760 2657576 -392114 -927803 1163839 3054570 2367278 -21284 -1284386
35994a284386J026253J604903J08356j188115o17095Q45746J193664P6191r51859
$$ -1284386 -258133 1346770 1455126 267011 -350084 495662 1689326 1765517 813658
35985H13658n65011P03698J224098L71888o05684j84486J205507J417471n14161
$$ 813658 248647 952345 2176443 2548331 1942647 1758161 2963668 4381139 3866978
35976C866978k645636k431321k08587J221895N11798o00676l22274L83292l10273
$$ 3866978 1221342 -1209979 -1418566 -196671 315127 -285549 -607823 -224531 -534804
35967e34804j645630j073615J679851L619582K326959q91718k885221k510901
$$ -534804 -2180434 -3254049 -1574198 2045384 4372343 3480625 595404 -1915497
35959a915497j184281k76626L43688J072655J362480N53604q71080j725968j493004
$$ -1915497 -3099778 -3376404 -3032716 -1960061 -597581 -43977 -915057 -2641025 -4134029
35950d134029n67899O03125J813128K538178K033074M30378r52806j052738l45721
$$ -4134029 -4701928 -4098803 -2285675 252503 2285577 2715955 1763149 710411 364690
35941C64690k7100l24762m95912k42464p1629k04349j88866J27719K61797J36542
$$ 364690 337590 12828 -483084 -725548 -797177 -1001526 -1190392 -1062673 -800876 -664334
35931f64334M28480J284511J747245J277476P98104J106483J246488P476j658692
$$ -664334 -235854 1048657 2795902 4073378 4871482 5977965 7224453 7231929 5573237
35922E573237j640215O2678J067311J7363j597120j872894j091203o11634m83932
$$ 5573237 3933022 3995700 5063011 5080374 3483254 1610360 519157 -92477 -576409
35913e76409J63570J053892Q57510o34734j856880j385516L91207J878391J902983
$$ -576409 -412839 641053 1498563 863829 -993051 -2378567 -1987360 -108969 1794014
35904A794014N08890j234328j911090q15948J213535K325807J436448n92263j775725
$$ 1794014 2302904 1068576 -842514 -1658462 -444927 1880880 3317328 2725065 949340
35895I49340r80655J009544K328767J856163K32775r34266q05575l5256K57919
$$ 949340 -31315 978229 3306996 5163159 5395934 4461668 3656093 3620837 3878756
35886C878756j56299o15323n95193k29313R3659J15393l27573j174043j810512
$$ 3878756 3722457 3107134 2511941 2282628 2376287 2491680 2164107 990064 -820448
35877h20448j420548l3315J177838J136864J88287l50562J04834P46003O11131
$$ -820448 -2240996 -2274311 -1096473 40391 228678 -121884 -17050 728953 1340084
35868A340084p3958l20147J31677M26674j70850j225539j677324j088527O8130
$$ 1340084 1266126 945979 1077656 1504330 1333480 107941 -1569383 -2657910 -2589780
35859b589780J125292J753229J887168J585829R84620J21070j015061j933896
$$ -2589780 -1464488 288741 2175909 3761738 4746358 4867428 3852367 1918471
35851A918471j609789K12181J984437J776773k21975j838697j774670q89425j32683
$$ 1918471 308682 520863 2505300 4282073 4060098 2221401 446731 -442694 -575377
35842e75377R64363K454442K472082j75752l092269k776094L03536K063247O01274
$$ -575377 388986 2843428 5315510 5139758 2047489 -728605 -425069 1638178 2239452
35833B239452j391057j139298K69082M89320p1115L17643J040645K14757j438409
$$ 2239452 848395 -290903 -21821 467499 396384 714027 1754672 1969429 531020
35824E31020j250602Q64102J859117K66676j559737j229613K86787Q14282L48462
$$ 531020 -719582 144520 2003637 2270313 710576 -519037 -232250 582032 930494
35815I30494J63197J92763m10493j194633j070219l05598J26804M51358J254911
$$ 930494 1093691 1286454 875961 -318672 -1388891 -1694489 -1567685 -1116327 138584
35806A38584J513139m3245j998320j557733J001641K179533M33356j456977q52241
$$ 138584 1651723 1608478 -389842 -1947575 -945934 1233599 1666955 209978 -642263
35797f42263O70142K59535j268737p72808J816292K960925Q43109j794225j603940
$$ -642263 27879 287414 -981323 -1754131 62161 3023086 3866195 2071970 468030
35788D68030O65705J457779n70581k852990k395394M84921K726346K252658J60707
$$ 468030 1133735 2591514 2020933 -832057 -3227451 -2742530 -16184 2236474 2397181
35779B397181j034011n47179J75428j39027r32169j025375l84012K54280O94779
$$ 2397181 1363170 815991 991419 852392 -79777 -1105152 -1489164 -1234884 -540105
35770e40105J075692R24571k38681j628886j884382r84455j76218L3090L78812
$$ -540105 535587 1460158 1221477 -407409 -2291791 -3276246 -3452464 -3419374 -3040562
35761c040562J100616J239019L09529o50045n61774K02730O38710M94342O9144
$$ -3040562 -1939946 -700927 -391398 -1041443 -1603217 -1400487 -761777 -267435 -198291
35752a98291m54705p02230q5072J082558J475941O79424L7422M54911P07644m16586
$$ -198291 -652996 -1355226 -1440298 -357740 1118201 1797625 1835047 2289958 2997602 2581016
35742B581016j592538q37752R36837R62130r88557k084802q20755Q62871R42129
$$ 2581016 988478 150726 1087563 2049693 1061136 -1023666 -1844421 -981550 -39421
35733c9421K15801J71016K14283p02557j412281j94074J841246J837380n03285
$$ -39421 176380 347396 561679 -140878 -1553159 -1747233 94013 1931393 1428108
35724A428108k292087j544520L42909J030165L10566l78488k22151L66581O52459
$$ 1428108 -863979 -2408499 -2065590 -1035425 -724859 -1103347 -1325498 -958917 -306458
35715c06458K38231o35252r97854p7955J372711J670243N08695n18841l11054
$$ -306458 -68227 -703479 -1701333 -1779288 -406577 1263666 1772361 1253520 942466
35706I42466J91944j88960q82801p50408j04553P5578R890L69480M43915p91404
$$ 942466 1134410 945450 62649 -687759 -792312 -716734 -706844 -337364 106551 -684853
35696f84853k223331j645890O90189K063667J298571K64036M46137O37597l57946
$$ -684853 -2908184 -4554074 -3863885 -1800218 -501647 -237611 208526 846123 488177
35687D88177j141602j34557J304793Q99018o85220r39424K13726L74443j089889
$$ 488177 -653425 -787982 516811 1415829 730609 -208815 4911 379354 -710535
35678g10535j835955l53008J691856K146846J219358K23894n94728j330873j092946
$$ -710535 -2546490 -2899498 -1207642 939204 2158562 2382456 1787728 456855 -636091
35669f36091O67351K513843K558190J025301l17306p62032j046110j455913j299836
$$ -636091 31260 2545103 5103293 6128594 5811288 5049256 4003146 2547233 1247397
35660A247397m58769K7096n26308j344670j208468K383J233279J443752O20113
$$ 1247397 788628 815724 289416 -1055254 -2263722 -2261339 -1028060 415692 1035805
35651A035805l19784o17942n66324r08914j421905r59763P22612K173345K051082
$$ 1035805 716021 98079 -468245 -1377159 -2799064 -3758827 -3036215 -862870 1188212
35642A188212R23960K87906M34583M13017l04300j222568j655965j245182K9713
$$ 1188212 2112172 2400078 2834661 3247678 2943378 1720810 64845 -1180337 -1150624
35633a150624J471956J771128M99562r73170j138295l29608K00670M31184J062251
$$ -1150624 321332 2092460 2592022 1618852 480557 150949 351619 782803 1845054
35624A845054J428237J24141k265323l271703j849733L68192J648393K006022
$$ 1845054 3273291 3397432 1132109 -2139594 -3989327 -3621135 -1972742 33280
35616C3280J808439O78042j049174j694122n26657Q65284R08087K54072K04355
$$ 33280 1841719 2519761 1470587 -223535 -750192 115092 1023179 1277251 1481606
35607A481606M64815K02910q4608K69311L34539q31405j896678j018359Q55054
$$ 1481606 1946421 2149331 2064723 2334034 2668573 1837168 -59510 -1077869 -222815
35598b22815J128420l38550j112243k93143K03471p53591j448816l27704J262418
$$ -222815 905605 567055 -545188 -838331 -634860 -1388451 -2837267 -3164971 -1902553
35589a902553J260202J04321l42362P9355l2702r32588j264505l43591Q48996
$$ -1902553 -642351 -538030 -880392 -801037 -833739 -1766327 -3030832 -3374423 -2525427
35580b525427J308740J240019J124690P67067O1220k03104O20597J626022J179500
$$ -2525427 -1216687 23332 1148022 1915089 1976309 1773205 2393802 4019824 5199324
35571E199324p29570k087951j460911r7586k53590j864178k512609r79569R15557
$$ 5199324 4469754 2381803 920892 823306 569716 -1294462 -3807071 -4786640 -3871083
35562c871083J055455Q4859M2787J031690J454916J069018J224395J820608P74194
$$ -3871083 -2815628 -2730769 -2687982 -1656292 -201376 867642 2092037 3912645 4686839
35553D686839k272892m194508k412323J079730K267663O54688n86007K61032J204308
$$ 4686839 2413947 -1780561 -4192884 -3113154 -845491 -190803 -776810 -515778 688530
35544F88530K70725j194243q10263R87382J653523L47235j140946j238976m29610
$$ 688530 959255 -234988 -1045251 -57869 1595654 1942889 801943 -437033 -866643
35535h66643K16838O38246J013773Q02441j89341p92716j3777J083057P09497
$$ -866643 -649805 -11559 1002214 1804655 1615314 822598 808821 1891878 2601375
35526B601375p50252j081188L53102J529017Q07663q18018j668531j783696j748547
$$ 2601375 1851123 769935 1123037 2652054 3459717 2641699 973168 -810528 -2559075
35517b559075p61330J790575L886171K798346p21297k895074j952524j55192M6712
$$ -2559075 -3320405 -1529830 2356341 5154687 4433390 1538316 -414208 -569400 -522688
35508e22688o19283k38801R80556J399794O72438j64008n48270o54472l71266
$$ -522688 -1141971 -1380772 -400216 999578 1672016 1508008 959738 305266 -66000
35499f6000M15313R48267M50494m94356p45471m21938n24154j029700q67573K23862
$$ -66000 349313 1297580 1748074 1253718 508247 86309 -437845 -1467545 -2335118 -2111256
35489b111256J187654J148642L09309p00264j315085r60477L42602J347744Q11081
$$ -2111256 -923602 225040 534349 -165915 -1481000 -2441477 -2098875 -751131 59950
35480E9950o34547j131783j68109R30909J205395J129531J076112M61534p30487
$$ 59950 -574597 -1706380 -1874489 -943580 261815 1391346 2467458 2928992 2198505
35471B198505j161097p7616J181928R28311n54053j677644j767364j319412o77108
$$ 2198505 1037408 959792 2141720 3070031 2515978 838334 -929030 -2248442 -2925550
35462b925550J84438Q84650Q89475M02036L6398j46869l53667k15123O03296J249649
$$ -2925550 -2741112 -1856462 -966987 -564951 -528553 -675422 -1029089 -1244212 -640916 608733
$$ [...]
##END NTUPLES=NMR SPECTRUM
##END=
