##TITLE=31Pdec_BAU-2.07
 CDCl3+DMSO-d6, 24 sc
 7.2.2019
##JCAMPDX= 6.0         $$ Bruker NMR JCAMP-DX V2.0
##DATA TYPE= NMR SPECTRUM
##DATA CLASS= NTUPLES
##ORIGIN= UXNMR, Bruker Analytische Messtechnik GmbH
##OWNER= root
$$ XWIN-NMR		Version 3.5
$$ Thu Feb  7 16:44:08 2019 Russian Standard Time (UT+4h)  she@DPX200
##.OBSERVE FREQUENCY= 81.013821
##.OBSERVE NUCLEUS= ^31P
##.ACQUISITION MODE= SIMULTANEOUS
##.ACQUISITION SCHEME= undefined
##.AVERAGES= 24
##.DIGITISER RES= 17
##SPECTROMETER/DATA SYSTEM= spect
##.PULSE SEQUENCE= zgpg30
##.SOLVENT NAME= CDCl3
##.SHIFT REFERENCE= (INTERNAL, CDCl3, 0, 182.463)
##AUDIT TRAIL= $$ (NUMBER, WHEN, WHO, WHERE, WHAT)
$$ ##TITLE= Audit trail, XWIN-NMR		Version 3.5
$$ ##JCAMPDX= 5.01
$$ ##ORIGIN= Bruker BioSpin GmbH
$$ ##OWNER= she
$$ F:/spectra/data/she/nmr/P31/1/pdata/1/auditp.txt
$$ ##AUDIT TRAIL=  $$ (NUMBER, WHEN, WHO, WHERE, WHAT)
(   1,<2019-02-07 16:42:47.23 +0400>,<she>,<DPX200>,
      <created by zg, POWCHK disabled, PULCHK disabled
       configuration hash MD5:
       00 E9 B6 7A A2 85 ED C7 34 08 36 98 17 FE 4E 26
       data hash MD5: 32K
       59 07 11 EC 1B 27 27 BF 18 37 C6 1A 0F F1 7F 61>)
(   2,<2019-02-07 16:42:50.65 +0400>,<she>,<DPX200>,
      <Start of raw data processing
       efp BC_mod = 2 LB = 1 FT_mod = 6 PKNL = 1 PHC0 = -1480.396 PHC1 = 81.19894 SI = 64K 
       data hash MD5: 64K
       EF 18 D6 64 A4 28 1A F8 1D A8 E2 C7 9F E1 92 AB>)
(   3,<2019-02-07 16:43:06.04 +0400>,<she>,<DPX200>,
      <pk PHC0 = 18.42861 PHC1 = 0 
       data hash MD5: 64K
       0F 73 F9 44 62 76 3F 9E 4D EA 54 2D 63 B1 34 6B>)
(   4,<2019-02-07 16:43:09.03 +0400>,<she>,<DPX200>,
      <abs ABSG = 5 
       data hash MD5: 64K
       94 86 3D 33 62 29 87 99 78 09 5C D4 22 18 52 99>)
$$ ##END=
$$ 
$$ hash MD5
$$ 57 86 4E 53 B5 F2 20 DC D1 BD AD B6 FE BD A4 B7
##$RELAX= 
##$RELAX= 
##$RELAX= 
##$RELAX= 
##$RELAX= 
##$RELAX= 
##$RELAX= 
##$RELAX= 
$$ Bruker specific parameters
$$ --------------------------
##$DU= <F:/spectra>
##$EXPNO= 1
##$NAME= <P31>
##$PROCNO= 1
##$TYPE= <nmr>
##$USER= <she>
##$AMP= (0..31)
100 100 100 100 100 100 100 100 100 100 100 100 100 100 100 100 100 100 
100 100 100 100 100 100 100 100 100 100 100 100 100 100 
##$AQSEQ= 0
##$AQ_mod= 1
##$AUNM= <au_zg>
##$AUTOPOS= <>
##$BF1= 81.014009
##$BF2= 200.13
##$BF3= 200.13
##$BF4= 200.13
##$BF5= 200.13
##$BF6= 200.13
##$BF7= 200.13
##$BF8= 200.13
##$BYTORDA= 1
##$CFDGTYP= 0
##$CFRGTYP= 5
##$CHEMSTR= <none>
##$CNST= (0..31)
1 1 145 1 1 1 1 1 1 1 1 1 1 1 1 1 1 1 1 1 1 1 1 1 1 1 1 1 1 1 1 1 
##$CPDPRG= <waltz16>
##$CPDPRG1= <>
##$CPDPRG2= <waltz16>
##$CPDPRG3= <>
##$CPDPRG4= <mlev>
##$CPDPRG5= <mlev>
##$CPDPRG6= <mlev>
##$CPDPRG7= <mlev>
##$CPDPRG8= <mlev>
##$CPDPRGB= <>
##$CPDPRGT= <>
##$D= (0..31)
0 1 0 0 0 0 0 0 0 0 0 0.03 2e-05 3e-06 0 0 0 0 0 0 0 0 0 0 0 0 0 0 0 0 
0 0 
##$DATE= 1549543366
##$DBL= (0..7)
120 120 120 11 120 120 24 19 
##$DBP= (0..7)
150 150 150 150 150 150 150 150 
##$DBP07= 0
##$DBPNAM0= <>
##$DBPNAM1= <>
##$DBPNAM2= <>
$$ [...]
##$SUBNAM3= <"">
##$SUBNAM4= <"">
##$SUBNAM5= <"">
##$SUBNAM6= <"">
##$SUBNAM7= <"">
##$SUBNAM8= <"">
##$SUBNAM9= <"">
##$SW= 369.568048894756
##$SWIBOX= (0..15)
0 1 3 0 0 0 0 0 0 0 0 0 0 0 0 0 
##$SW_h= 29940.119760479
##$TD= 32768
##$TD0= 1
##$TE= 0
##$TE2= 300
##$TE3= 300
##$TEG= 300
##$TL= (0..7)
0 120 53 12 22 120 120 120 
##$TP= (0..7)
150 150 150 150 150 150 150 150 
##$TP07= 0
##$TPNAME0= <>
##$TPNAME1= <>
##$TPNAME2= <>
##$TPNAME3= <>
##$TPNAME4= <>
##$TPNAME5= <>
##$TPNAME6= <>
##$TPNAME7= <>
##$TPOAL= (0..7)
0.5 0.5 0.5 0.5 0.5 0.5 0.5 0.5 
##$TPOFFS= (0..7)
0 0 0 0 0 0 0 0 
##$TUNHIN= 0
##$TUNHOUT= 0
##$TUNXOUT= 0
##$USERA1= <user>
##$USERA2= <user>
##$USERA3= <user>
##$USERA4= <user>
##$USERA5= <user>
##$V9= 5
##$VALIST= <valist>
##$VCLIST= <CCCCCCCCCCCCCCC>
##$VD= 0
##$VDLIST= <DDDDDDDDDDDDDDD>
##$VPLIST= <PPPPPPPPPPPPPPP>
##$VTLIST= <TTTTTTTTTTTTTTT>
##$WBST= 1024
##$WBSW= 4
##$XGAIN= (0..3)
0 0 0 0 
##$XL= 0
##$YL= 0
##$YMAX_a= 19887
##$YMIN_a= -19188
##$ZGOPTNS= <>
##$ZL1= 120
##$ZL2= 120
##$ZL3= 120
##$ZL4= 120
##$ABSF1= 182.463
##$ABSF2= -187.1042
##$ABSG= 5
##$ABSL= 3
##$ALPHA= 0
##$AQORDER= 0
##$ASSFAC= 0
##$ASSFACI= 0
##$ASSFACX= 0
##$ASSWID= 0
##$AUNMP= <proc_1d>
##$AZFE= 0.1
##$AZFW= 0.5
##$BCFW= 0
##$BC_mod= 2
##$BYTORDP= 0
##$COROFFS= 0
##$CY= -3
##$DATMOD= 1
##$DC= 0
##$DFILT= <>
##$DTYPP= 0
##$F1P= 0
##$F2P= 0
##$FCOR= 1
##$FTSIZE= 65536
##$FT_mod= 6
##$GAMMA= 0
##$GB= 0
##$INTBC= 1
##$INTSCL= 5.30512e-09
##$ISEN= 30
##$LB= 1
##$LEV0= 0
##$LPBIN= 0
##$MAXI= 10000
##$MC2= 0
##$MEAN= 0
##$ME_mod= 0
##$MI= 50
##$NCOEF= 0
##$NC_proc= -4
##$NLEV= 6
##$NOISF1= 182.463
##$NOISF2= 159.3651
##$NSP= 0
##$NTH_PI= 0
##$NZP= 0
##$OFFSET= 182.463
##$PC= 4
##$PHC0= -1461.967
##$PHC1= 81.19894
##$PH_mod= 1
##$PKNL= yes
##$PPARMOD= 0
##$PSCAL= 0
##$PSIGN= 0
##$REVERSE= no
##$SF= 81.0140089999434
##$SI= 65536
##$SIGF1= 159.3651
##$SIGF2= -187.1042
##$SINO= 113.3802
##$SIOLD= 16384
##$SREGLST= <1H.CDCl3>
##$SSB= 0
##$STSI= 65536
##$STSR= 0
##$SW_p= 29940.119760479
##$SYMM= 0
##$S_DEV= 0
##$TDeff= 32768
##$TDoff= 0
##$TI= <>
##$TILT= no
##$TM1= 0
##$TM2= 0
##$TOPLEV= 0
##$USERP1= <user>
##$USERP2= <user>
##$USERP3= <user>
##$USERP4= <user>
##$USERP5= <user>
##$WDW= 1
##$XDIM= 65536
##$YMAX_p= 413040294
##$YMIN_p= -19840394
$$ End of Bruker specific parameters
$$ ---------------------------------
##NTUPLES= NMR SPECTRUM
##VAR_NAME=  FREQUENCY,     SPECTRUM/REAL,   SPECTRUM/IMAG
##SYMBOL=    X,             R,               I
##VAR_TYPE=  INDEPENDENT,   DEPENDENT,       DEPENDENT
##VAR_FORM=  AFFN,          ASDF,            ASDF
##VAR_DIM=   65536,         65536,           65536
##UNITS=     HZ,            ARBITRARY UNITS, ARBITRARY UNITS
##FACTOR=    0.456856943014862, 1,           1
##FIRST=     14782.0589164792, 0,            0
##LAST=      -15158.0608439998, 0,           0
##MIN=       -15158.0608439998, -19840394,   0
##MAX=       14782.0589164792, 413040294,    0
$$ Real data points
##PAGE= N=1
##DATA TABLE= (X++(R..R)), XYDATA
$$ [...]
$$ plain form
40579 -394818 -213490 8965 -24690 -155618 -176706 -298097 -700674 -1018421 -843061 -434909
40569 -434909 -317266 -410397 -235334 187639 368800 234660 246373 538477 648463 332848
40559 332848 13703 77904 277110 238784 130890 329621 717065 810485 467681 51604
40549 51604 -68386 129778 430934 587201 444782 91994 -153777 -103567 28441 -67585
40539 -67585 -299822 -294175 -1205 174252 -31513 -345656 -386008 -217298 -160965 -227903 -145115
40528 -145115 96329 165928 -17831 -47291 354749 811050 764062 257587 -171239 -245728
40518 -245728 -141954 7396 281000 568487 524186 135366 -111207 84490 367828 277516
40508 277516 -72990 -234581 -68278 237849 562619 848270 892488 576640 171411 12020
$$ packed form
40579c94818J81328K22455l3655j30928k1088j21391m02577l17747J75360M08152
40569d34909J17643r3131J75063M22973J81161j34140J1713K92104J09986l15615
40559C32848l19145O4201J99206l8326j07894J98731L87444R3420l42804m16077
40549E1604j19990J98164L01156J56267j42419l52788k45771N0210J32008r6026
40539f7585k32237N647K92970J75457k05765l14143m0352J68710N6333o6938Q2788
40528a45115K41444O9599j83759k9460M02040M56301m6988n06475m28826p4489
40518b45728J03774J49350K73604K87487m4301l88820k46573J95697K83338r0312
40508B77516l50506j61591J66303L06127L24770K85651M4218l15848m05229j59391
$$ plain form
40498 12020 10219 -91656 -163599 74099 371918 159479 -521984 -949673 -768299 -494105
40488 -494105 -664603 -1044622 -1114999 -903322 -792517 -791048 -569644 -123278 132205 -17479
40478 -17479 -271457 -258046 -11665 159312 115742 35352 161913 505516 821836 882180
40468 882180 723400 567503 519157 460736 273565 43392 -26930 146877 412274 469133
40458 469133 142226 -344091 -480748 -53507 507710 637839 390556 281557 414905 313768
40448 313768 -213725 -617547 -407266 54929 92577 -279800 -497419 -399763 -368165 -516682
40438 -516682 -427162 99578 592936 554533 151986 -91994 -9780 178561 308805 341958
40428 341958 140121 -373580 -848423 -753983 -128228 310843 52401 -501963 -556897 37643
$$ packed form
40498A2020j801j01875p1943K37698K97819k12439o81463m27689J81374K74194
40488d94105j70498l80019p0377K11677J10805J469K21404M46366K55483j49684
40478a7479k53978J3411K46381J70977m3570q0390J26561L43603L16320O0344
40468H82180j58780j55897m8346n8421j87171k30173p0322J73807K65397N6859
40458D69133l26907m86317j36657M27241N61217J30129k47283j08999J33348j01137
40448C13768n27493m03822K10281M62195L7648l72377k17619R7656L1598j48517
40438e16682Q9520N26740M93358l8403m02547k43980Q2214J88341J30244L3153
40428C41958k01837n13701m74843R4440O25755M39071k58442n54364n4934N94540
$$ plain form
40418 37643 669071 827839 643278 449651 260998 -26312 -245515 -195602 -79627 -252868
40408 -252868 -608954 -690328 -427421 -266925 -430810 -549995 -299786 55893 127683 26576
40398 26576 75749 199234 118013 -48236 62093 396867 565924 546381 702448 1020189
40388 1020189 964265 347108 -240006 -239032 118752 318475 398393 707323 1112715 1119755 714957
40377 714957 454995 606503 748650 469342 14335 -95797 192590 468422 447709 225871
40367 225871 -13787 -236640 -431552 -458741 -162895 415310 1008809 1299003 1132105 621901
40357 621901 72457 -222201 -146466 212751 663568 1040527 1288187 1425185 1414531 1139168
40347 1139168 613532 170946 231256 790294 1308523 1274665 783947 373176 340905 456503
$$ packed form
40418C7643O31428J58768j84561j93627j88653k87310k19203M9913J15975j73241
40408b52868l56086q1374K62907J60496j63885j19185K50209L55679P1790j01107
40398B6576M9173J23485q1221j66249J10329L34774J69057j9543J56067L17741
40388A020189n5924o17157n87114R74L57784J99723P9918L08930M05392P040m04798
40377G14957k59962J51508J42147k79308m55007j10132K88387K75832k0713k21838
40367B25871k39658k22853j94912k7189K95846N78205N93499K90194j66898n10204
40357F21901n49444k94658P5735L59217M50817L76959K47660J36998j0654k75363
40347A139168n25636m42586O0310N59038N18229l3858m90718m10771l2271J15598
$$ plain form
40337 456503 368022 71755 -154778 -145645 -10563 38303 -109347 -410790 -707498 -804060
40327 -804060 -608796 -239831 62419 164362 140658 113859 48151 -200207 -613235 -907686
40317 -907686 -826324 -501332 -360381 -596241 -868060 -682081 -4662 670228 856438 529704
40307 529704 39253 -274475 -320055 -246752 -277977 -481474 -677753 -659573 -482762 -388453
40297 -388453 -448111 -509848 -540705 -734025 -1111784 -1294314 -958476 -364957 -106656 -387948
40287 -387948 -846001 -1081471 -1084571 -1071674 -1134462 -1175776 -1069511 -794162 -459816 -210387
40277 -210387 -50334 170054 514926 818347 919101 910031 942871 903418 571005 50250
40267 50250 -279605 -278294 -210861 -330221 -570726 -764331 -910944 -1084493 -1247975 -1293666
$$ packed form
40337D56503q8481k96267k26533R133J35082M8866j47650l01443k96708r6562
40327h04060J95264L68965L02250J01943k3704k6799o5708k48358m13028k94451
40317i07686Q1362L24992J40951k35860k71819J85979O77419O74890J86210l26734
40307E29704m90451l13728m5580P3303l1225k03497j96279J8180J76811R4309
40297c88453n9658o1737l0857j93320l77759j82530L35838N93519K58301k81292
40287c87948m58053k35470l100J2897o2788m1314J06265K75349L34346K49429
40277b10387J60053K20388L44872L03421J00754r070L2840l9453l32413n20755
40267E0250l29855J311O7433j19360k40505j93605j46613j73549j63482m5691
$$ plain form
40257 -1293666 -1157460 -851521 -511839 -380826 -534334 -672383 -471763 -120664 -124793 -536644
40247 -536644 -816038 -614359 -257414 -183688 -302562 -271845 -99725 -52120 -151425 -166248
40237 -166248 -14704 129945 79979 -216950 -638508 -839093 -481871 248906 643628 288023
40227 288023 -371203 -636036 -460450 -299795 -297604 -181860 128132 374902 439413 471675
40217 471675 502389 389737 216731 281114 585314 769135 667955 511720 437439 256874
40207 256874 -89516 -284136 -113810 168885 264200 279156 434614 600927 508641 246281
40197 246281 170839 390654 647117 694781 550850 346908 122508 -165764 -503945 -737225
40187 -737225 -670908 -317368 25649 98076 27252 131606 396407 439399 61112 -469127
$$ packed form
40257a293666J36206L05939L39682J31013j53508j38049K00620L51099m129m11851
40247e36644k79394K01679L56945P3726j18874L0717J72120M7605r9305j4823
40237a66248J51544J44649m9966k96929m21558k00585L57222P30777L94722l55605
40227B88023o59226k64833J75586J60655K191J15744L09992K46770O4511L2262
40217D71675L0714j12652j73006O4383L04200J83821j01180j56235p4281j80565
40207B56874l46390j94620J70326K82695R5315J4956J55458J66313r2286k62360
40197B46281p5442K19815K56463M7664j43931k03942k24400k88272l38181k33280
40187g37225O6317L53540L43017P2427p0824J04354K64801M2992l78287n30239
$$ plain form
40177 -469127 -798198 -879669 -827850 -666679 -445287 -370663 -562463 -816572 -832510 -569965
40167 -569965 -213662 86347 270006 286805 135647 -88590 -292266 -430367 -415460 -169465
40157 -169465 156271 241659 4708 -270037 -332627 -250146 -148776 30333 299138 425289
40147 425289 244847 -43268 -158824 -109179 -24996 125997 346032 360430 -50032 -615920
40137 -615920 -851370 -662164 -350720 -131321 611 10942 -171689 -420119 -517854 -497708
40127 -497708 -573208 -764595 -890126 -883368 -812325 -639252 -295117 48077 126079 -15574
40117 -15574 -98647 -52072 -22921 -3060 144251 308089 233199 27066 91634 472742 761508
40106 761508 762799 750461 866793 798120 356747 -81713 -98088 197558 483946 736502
$$ packed form
40177d69127l29071q1471N1819J61171K21392P4624j91800k54109j5938K62545
40167e69965L56303L00009J83659J6799j51158k24237k03676j38101J4907K45995
40157a69465L25736Q5388k36951k74745o2590Q2481J01370J79109K68805J26151
40147D25289j80442k88115j15556M9645Q4183J50993K20035J4398m10462n65888
40137f15920k35450J89206L11444K19399J31932J0331j82631k48430r7735K0146
40127d97708p5500j91387j25531O758P1043J73073L44135L43194P8002j41653
40117a5574q3073M6575K9151J9861J47311J63838p4890k06133O4568L81108K88766
40106G61508J291j2338J16332o8673m41373m38460j6375K95646K86388K52556
$$ plain form
40096 736502 988130 957102 476189 44668 314325 1085676 1417149 817590 -182991 -810330
40086 -810330 -934640 -922305 -961474 -913829 -699538 -495475 -510362 -733084 -960795 -1006793
40076 -1006793 -852313 -627027 -468678 -416937 -437763 -493379 -532465 -448555 -143558 330845
40066 330845 740331 834084 574772 202083 32515 167963 428065 590115 627399 644032
40056 644032 654044 557929 312738 763 -257947 -354924 -209387 108692 323109 225587
40046 225587 -14610 -48769 143315 224660 36773 -146864 -46309 227196 393663 385841
40036 385841 304385 225914 282716 678156 1308096 1584263 1042014 25372 -642194 -651951
40026 -651951 -474324 -581687 -823521 -766969 -337264 156280 452100 531633 468169 312589
$$ packed form
40096G36502K51628l1028m80913m31521K69657P71351L31473n99559j000581o27339
40086h10330j24310J2335l9169M7645K14291K04063j4887k22722k27711m5998
40076a006793J54480K25286J58349N1741k0826n5616l9086Q3910L04997M74403
40066C30845M09486R3753k59312l72689j69568J35448K60102J62050L7284J6633
40056F44032J0012r6115k45191l11975k58710r6977J45537L18079K14417r7522
40046B25587k40197l4159J92084Q1345j87887j83637J00555K73505J66467p822
40036C85841q1456p8471N6802L95440O29940K76167n42249j016642o67566r757
40026f51951J77627j07363k41834N6552M29705M93544K95820P9533o3464j55580
$$ plain form
40016 312589 129822 -15255 -149093 -372249 -706732 -1006532 -1064141 -815402 -435094 -211349
40006 -211349 -300898 -602189 -863510 -888945 -644842 -241209 135810 323463 287735 118915
39996 118915 -102859 -378746 -677214 -834214 -694548 -342137 -73917 -101787 -340401 -529578
39986 -529578 -529259 -437241 -400227 -365869 -137587 276859 507640 192106 -539267 -1146232 -1263005
39975 -1263005 -1000049 -642386 -325247 -140121 -276223 -778378 -1320691 -1505794 -1315679
39966 -1315679 -1023141 -734993 -310685 272438 753130 857739 547489 -39100 -689145
39957 -689145 -1120777 -1122826 -819839 -631586 -815990 -1146325 -1171265 -735121 -123901 279288
39947 279288 376485 362110 413759 469252 356985 73289 -204564 -368721 -464831 -487334 -324577
$$ packed form
40016C12589j82767j45077j33838k23156l34483k99800n7609K48739L80308K23745
40006b11349q9549l01291k61321k5435K44103M03633L77019J87653l5728j68820
39996A18915k21774k75887k98468j57000J39666L52411K68220k7870k38614j89177
39986e29578L19R2018L7014L4358K28282M14446K30781l15534p31373o06965j16773
39975a263005K62956L57663L17139J85126j36102n02155n42313j85103J90115
39966a315679K92538K88148M24308N83123M80692J04609l10250n86589o50045
39957f89145m31632k049L02987J88253j84404l30335k4940M36144O11220M03189
39947B79288R7197j4375N1649N5493j12267k83696k77853j64157r6110k2503J62757
$$ plain form
39936 -324577 -42598 25349 -275902 -583485 -444082 47813 399421 421028 355410 320165
39926 320165 118061 -252651 -378839 -22910 430759 476179 164215 -97969 -216705 -440627
39916 -440627 -802782 -976144 -750948 -320323 12164 146223 104315 -115111 -446787 -690815
39906 -690815 -698728 -539807 -379558 -279835 -203716 -123900 -30371 94879 224744 279431 250053
39895 250053 244346 311204 311587 107031 -186647 -313574 -236471 -190372 -327729 -491723 -454273
39884 -454273 -235164 -38699 19179 -40980 -190050 -361938 -363569 -73580 262934 225428
39874 225428 -203118 -527468 -379378 -1151 165579 143542 300086 674820 857036 589432
39864 589432 116680 -218786 -408957 -581148 -616910 -279428 375357 981343 1243419 1152502
$$ packed form
39936c24577K81979O7947l01251l07583J39403M91895L51608K1607o5618l5245
39926C20165k02104l70712j26188L55929M53669M5420l11964k62184j18736k23922
39916d40627l62155j73362K25196M30625L32487J34059m1908k19426l31676k44028
39906f90815p913J58921J60249R9723P6119P9816R3529J25250J29865N4687k9378
39895B50053n707O6858L83k04556k93678j26927P7103M6099j37357j63994L7450
39884d54273K19109J96465N7878o0159j49070j71888j631K89989L36514l7506
39874B25428m28546l24350J48090L78227J66730k2037J56544L74734J82216k67604
39864E89432m72752l35466j90171j72191l5762L37482O54785O05986K62076r0917
$$ plain form
39854 1152502 850737 480296 178680 35821 -14167 -128744 -315629 -365688 -113687 312379
39844 312379 600288 574627 327268 53104 -154410 -333073 -545871 -772710 -880115 -723017
39834 -723017 -355804 -121350 -369193 -1000385 -1440113 -1234946 -594108 -131909 -112112 -202495
39824 -202495 -22968 337835 517442 392233 178250 113793 220435 327574 209977 -225219
39814 -225219 -775408 -1064366 -951106 -706586 -651521 -757174 -775075 -615587 -381938 -157282
39804 -157282 1750 -22830 -242195 -414251 -345971 -220740 -296256 -409991 -218664 140002
39794 140002 146988 -275086 -566417 -339325 97542 281502 227564 193149 184382 79664 -28689
39783 -28689 9107 109792 151609 245538 475906 589828 333527 -73115 -208234 -74457
$$ packed form
39854A152502l01765l70441l01616j42859m9988j14577j86885n0059K52001M26066
39844C12379K87909k5661k47359k74164k07514j78663k12798k26839j07405J57098
39834g23017L67213K34454k47843o31192m39728K05167O40838M62199J9797r0383
39824b02495J79527L60803J79607j25209k13983o4457J06642J07139j17597m35196
39814b25219n50189k88958J13260K44520N5065j05653j7901J59488K33649K24656
39804a57282J59032k4580k19365j72056O8280J25231p5516j13735J91327L58666
39794A40002O986m22074k91331K27092M36867J83960n3938l4415q767j04718j08353
39783b8689L7796J00685M1817R3929K30368J13922k56301m06642j35119J33777
$$ plain form
39773 -74457 -41292 -245497 -483589 -679489 -1003875 -1436289 -1607310 -1266895 -657069 -257220
39763 -257220 -316938 -711426 -1083093 -1070377 -581360 78703 479563 501538 390189 402426
39753 402426 554607 704607 715152 535944 266167 113532 165218 268171 274147 276264 403006
39742 403006 523958 435422 226791 159822 274529 424938 592753 802994 854598 587488
39732 587488 317962 456066 726170 436477 -370920 -779452 -313875 311830 248621 -306872
39722 -306872 -621579 -616543 -770060 -1117216 -1162653 -739444 -250778 -17861 -2012 -216607
39712 -216607 -772265 -1381747 -1463180 -988538 -648757 -846420 -1066769 -688254 44115 399315
39702 399315 189482 -170770 -442590 -778836 -1187155 -1366785 -1220673 -1064211 -1123138 -1192514
$$ packed form
39773g4457L3165k04205k38092j95900l24386m32414j71021L40415O09826L99849
39763b57220n9718l94488l71667J2716M89017O60063M00860K1975j11349J2237
39753D02426J52181J50000J0545j79208k69777j52635N1686J02953N976K117J26742
39742D03006J20952q8536k08631o6969J14707J50409J67815K10241N1604k67110
39732E87488k69526J38104K70104k89693q07397m08532M65577O25705o3209n55493
39722c06872l14707N036j53517l47156m5437M23209M88666K32917J5849k14595
39712b16607n55658o09482q1433M74642L39781j97663k20349L78515P32369L55200
39702C99315k09833l60252k71820l36246m08319j79630J46112J56462n8927o9376
$$ plain form
39692 -1192514 -1017261 -707801 -537663 -570319 -713842 -916012 -1061161 -902441 -400250 54239
39682 54239 87105 -136946 -213226 -181323 -424339 -899069 -1024970 -528527 92997 267773
39672 267773 114285 110587 289949 233981 -261380 -931029 -1404941 -1489028 -1142377 -519489
39662 -519489 -7051 107683 -11122 -20968 55063 -63995 -327272 -346421 -32785 233676
39652 233676 199556 49893 -31063 -133515 -240600 -87397 267849 241653 -426053 -1046053
39642 -1046053 -800602 87513 642091 446176 35094 3047 323801 655223 797038 693092
39632 693092 404892 213652 353313 550118 275687 -417937 -823241 -559011 -110141 -49616
39622 -49616 -221020 -183953 -62079 -303315 -796852 -906035 -399878 231988 528543 619921
$$ packed form
39692a192514J75253L09460J70138l2656j43523k02170j45149J58720N02191M54489
39682E4239L2866k24051p6280L1903k43016m74730j25901M96443O21524J74776
39672B67773j53488l698J79362n5968m95361o69649m73912q4087L46651O22888
39662e19489N12438J14734j18805r846P6031j19058k63277j9149L13636K66461
39652B33676l4120j49663q0956j02452j07085J53203L55246k6196o67706o20000
39642a046053K45451Q88115N54578j95915m11082l2047L20754L31422J41815j03946
39632F93092k88200j91240J39661J96805k74431o93624m05304K64230M48870O0525
39622d9616j71404L7067J21874k41236m93537j09183N06157O31866K96555R1378
$$ plain form
39612 619921 813350 1028071 966121 597519 167552 -141105 -304080 -316492 -192713 -55204
39602 -55204 -29081 -69368 -40969 68173 162916 226771 318341 398703 355022 228354 225831
39591 225831 412551 547904 368915 -54371 -386981 -409546 -209682 -12573 67649 94076
39581 94076 200038 429645 646507 633032 345160 25843 -38064 143436 278222 152935
39571 152935 -141583 -377721 -458386 -440296 -386355 -298896 -158912 47040 311639 560730
39561 560730 662434 557017 359737 260990 313625 367594 236414 -91606 -424542 -549909
39551 -549909 -434130 -210656 27155 338511 770400 1158601 1246418 1009060 710053 570736
39541 570736 506147 295100 -61231 -281855 -127076 288432 566272 445899 130722 84111
$$ packed form
39612F19921J93429K14721o1950l68602m29967l08657j62975j2412J23779J37509
39602e5204K6123m0287K8399J09142R4743O3855R1570Q0362m3681j26668k523
39591B25831J86720J35353j78989m23286l32610k2565J99864J97109Q0222K6427
39581I4076J05962K29607K16862j3475k87872l19317o3907J81500J34786j25287
39571A52935k94518k36138q0665J8090N3941Q7459J39984K05952K64599K49091
39561E60730J01704j05417j97280r8747N2635N3969j31180l28020l32936j25367
39551e49909J15779K23474K37811L11356M31889L88201Q7817k37358k99007j39317
39541E70736o4589k11047l56331k20624J54779M15508K77840j20373l15177m6611
$$ plain form
39531 84111 452318 835955 775484 326257 -69905 -173637 -106825 14115 214756 388040
39521 388040 305852 61891 86347 466685 662071 263092 -324101 -434185 -116148 19150
39511 19150 -211757 -351718 -117521 158683 91023 -227311 -490903 -594578 -522169 -169242
39501 -169242 407056 817220 758486 460590 416194 744333 1066632 980880 477586 -83950
39491 -83950 -290461 -24035 401257 532467 287094 39731 106262 332961 384474 260403
39481 260403 235169 362962 374413 127601 -120094 -60851 216345 341989 170701 -45017
39471 -45017 -32251 135857 196313 96064 4141 -54495 -291854 -760990 -1118566 -1016139
39461 -1016139 -572510 -209025 -128813 -215316 -340489 -466675 -497372 -347038 -148071 -86978
$$ packed form
39531H4111L68207L83637o0471m49227l96162j03732O6812J20940K00641J73284
39521C88040q2188k43961K4456L80338J95386l98979n87193j10084L18037J35298
39511A9150k30907j39961K34197K76204o7660l18334k63592j03675P2409L52927
39501a69242N76298M10164n8734k97896m4396L28139L22299q5752n03294n61536
39491h3950k06511K66426M25292J31210k45373k47363O6531K26699N1513j24071
39481B60403k5234J27793J1451k46812k47695N9243K77196J25644j71288k15718
39471d5017J2766J68108O0456j00249r1923n8636k37359m69136l57576J02427
39461a016139M43629L63485Q0212q6503j25173j26186l0697J50334J98967O1093
$$ plain form
39451 -86978 -62775 150124 423770 377499 -2267 -292163 -289272 -269127 -410165 -449405 -191887
39440 -191887 88414 104061 6708 6717 -67580 -391087 -680211 -606473 -364346 -298521 -259992
39429 -259992 51109 342190 58438 -630219 -928339 -572602 -177330 -239156 -466395 -407228
39419 -407228 -159787 -41259 -1010 166953 322661 154069 -285650 -584554 -467698 -37656
39409 -37656 436586 782770 993739 1133836 1171389 947342 437513 -33648 -98395 152108
39399 152108 271727 91725 -84968 -807 189889 209632 10124 -293526 -545557 -510778
39389 -510778 -65421 462009 551860 249981 192134 640288 1023169 812840 344031 231995
39379 231995 397961 315290 -56523 -271610 -196912 -142487 -205190 -100258 265350 580472
$$ packed form
39451h6978K4203K12899K73646m6271l79766k89896K891K0145j41038l9240K57518
39440a91887K80301J5647r7353Rp4297l23507k89124P3738K42127O5825L8529
39429b59992L11101K91081k83752o88657k98120L55737L95272o1826k27239N9167
39419d07228K47441J18528M0249J67963J55708j68592m39719k98904J16856M30042
39409c7656M74242L46184K10969J40097L7553k24047n09829m71161o4747K50503
39399A52108J19619j80002j76693Q4161J90696J9743j99508l03650k52031L4779
39389e10778M45357N27430Q9851l01879n7847M48154L82881k10329m68809j12036
39379B31995J65966q2671l71813k15087P4698N4425o2703J04932L65608L15122
$$ plain form
39369 580472 617193 490789 329265 102667 -112946 -115986 38675 13369 -313838 -663080
39359 -663080 -786337 -751745 -689142 -609658 -593974 -773784 -974885 -787498 -208735 181343
39349 181343 -29675 -503533 -641120 -368785 -90407 -75249 -242524 -412980 -467462 -345786
39339 -345786 -122113 5693 -44160 -156731 -290513 -563134 -893816 -901310 -463203 -66354
39329 -66354 -209740 -709225 -1024146 -1050323 -1090320 -1199752 -1133311 -895006 -769665 -755801
39319 -755801 -515396 -9422 343452 327359 246090 342131 400386 261352 246669 605637
39309 605637 919795 637172 -14693 -256487 149463 606654 577606 255807 119035 219527
39299 219527 255342 110239 -36472 -70058 -118201 -324951 -623396 -800053 -701639 -356472
$$ packed form
39369E80472L6721j26404j61524k26598k15613l040J54661k5306l27207l49242
39359f63080j23257L4592O2603P9484J5684j79810k01101J87387N78763L90078
39349A81343k11018m73858j37587K72335K78378J5158j67275j70456n4482J21676
39339c45786K23673J27806m9853j12571j33782k72621l30682p494M38107L96849
39329f6354j43386m99485l14921k6177l9997j09432O6441K38305J25341J3864
39319g55801K40405N05974L52874j6093q1269R6041N8255j39034j4683L58968
39309F05637L14158k82623o51865k41794M05950M57191k9048l21799j36772J00492
39299B19527L5815j45103j46711l3586m8143k06750k98445j76657R8414L45167
$$ plain form
39289 -356472 29729 184342 -24511 -420397 -617321 -378286 128989 502878 528726 340969
39279 340969 159291 12168 -169775 -313559 -259993 -28345 185241 302292 445865 656474
39269 656474 749095 612415 458835 540359 729891 656391 231862 -217439 -390304 -348003
39259 -348003 -312238 -320009 -238135 -12059 256461 442162 500213 460876 393906 352982 308301
39248 308301 184494 10319 -60657 24439 61981 -171775 -556173 -697323 -426448 -51601
39238 -51601 21315 -208739 -399110 -361819 -270777 -331018 -455439 -412453 -166533 92507 198938
39227 198938 145676 11171 -105549 -101336 34675 145468 57036 -210574 -516400 -825503
39217 -825503 -1150413 -1303933 -1023050 -417337 27347 64326 6338 195492 453846 413735
$$ packed form
39289c56472L86201J54613k08853l95886j96924K39035N07275L73889K5848j87757
39279C40969j81678j47123j81943j43784N3566K31648K13586J17051J43573K10609
39269F56474R2621j36680j53580Q1524J89532p3500m24529m49301j72865M2301
39259c48003L5765p771Q1874K26076K68520J85701N8051l9337o6970m0924m4681
39248C08301j23807j74175p0976Q5096L7542k33756l84398j41150K70875L74847
39238e1601P2916k30054j90371L7291R1042o0241j24421M2986K45920K59040J06431
39227A98938n3262j34505j16720M213J36011J10793q8432k67610l05826l09103
39217h25503l24910j53520K80883O05713M44684L6979n7988J89154K58354m0111
$$ plain form
39207 413735 162651 117159 373969 650240 826476 1047117 1226099 989771 324997 -196983
39197 -196983 -173439 40786 -108301 -537681 -722828 -535709 -360818 -402171 -376825 -37008
39187 -37008 389061 510981 307805 127177 251365 603821 837561 655877 112669 -375243
39177 -375243 -398511 32167 514490 695825 594281 482294 566362 817546 1039977 1075216
39167 1075216 969100 904669 937574 906734 707878 516221 547403 711794 761167 701108
39157 701108 737385 823095 635689 114199 -337013 -384079 -201488 -116542 -78567 177312
39147 177312 600543 839512 758072 611430 654210 824050 899278 787698 566594 352135
39137 352135 196598 52544 -165337 -420528 -508301 -277996 149969 515681 706343 762665
$$ packed form
39207D13735k51084m5492K56810K76271J76236K20641J78982k36328o64774n21980
39197a96983K3544K14225j49087m29380j85147J87119J74891m1353K5346L39817
39187c7008M26069J21920k03176j80628J24188L52456K33740j81684n43208m87912
39177c75243k3268M30678M82323J81335j01544j11987Q4068K51184K22431L5239
39167A075216j06116o4431L2905l0840j98856j91657L1182J64391M9373o0059
39157G01108L6277Q5710j87406n21490m51212m7066J82591Q4946L7975K55879
39147A77312M23231K38969q1440j46642M2780J69840P5228j11580k21104k14459
39137C52135j55537j44054k17881k55191q7773K30305M27965L65712J90662N6322
$$ plain form
39127 762665 686715 467645 250571 208354 237103 74509 -220526 -242810 143456 488356
39117 488356 331541 -148915 -398094 -239623 -9669 -12677 -214925 -481103 -742272 -842411
39107 -842411 -570402 -19930 363097 298766 19716 -89653 33359 250103 567761 1016128
39097 1016128 1325778 1135517 518109 -41576 -233936 -198567 -182411 -240745 -349298 -493607
39087 -493607 -533739 -296679 49781 41931 -460083 -1012447 -1186507 -1097928 -1028732 -869941
39077 -869941 -401121 126859 248517 24802 -34298 198278 263275 -129670 -643903 -827301
39067 -827301 -667450 -401478 -144331 31024 -22306 -268201 -395938 -268519 -185629 -394222
39057 -394222 -624896 -508535 -227219 -278225 -681257 -884741 -503343 219101 769079 903699
$$ packed form
39127G62665p5950k19070k17074m2217K8749j62594k95035k2284L86266L44900
39117D88356j56815m80456k49179J58471K29954l008k02248k66178k61169j00139
39107h42411K72009N50472L83027o4331k79050j09369J23012K16744L17658M48367
39097A016128L09650j90261o17408n59685j92360L5369J6156n8334j08553j44309
39087d93607m0132K37060L46460p850n02014n52364j74060Q8579O9196J58791
39077h69941M68820N27980J21658k23715n9100K32576O4997l92945n14233j83398
39067h27301J59851K65972K57147J75355n3330k45895j27737J27419Q2890k08593
39057c94222k30674J16361K81316n1006m03032k03484L81398P22444N49978J34620
$$ plain form
39047 903699 748541 587110 636994 862948 962832 687719 184935 -141894 -116469 46753
39037 46753 79661 -25500 -99625 -51105 43463 39849 -110672 -273744 -250835 -17268 251612
39026 251612 426288 528855 520523 232196 -300907 -673487 -565443 -192038 4698 -34938
39016 -34938 -21262 172937 412094 632042 884593 1079003 1053508 888920 790768 701415
39006 701415 432309 140219 202557 608213 964257 1141625 1367714 1598177 1425038 818600
38996 818600 334553 266666 189810 -255725 -703594 -692799 -451122 -454617 -614644 -542077 -307701
38985 -307701 -282927 -447848 -499885 -474247 -610711 -743814 -505648 -64981 32454 -232530
38975 -232530 -305665 5234 244304 123683 -50953 -23756 -14080 -158692 -127070 263197
$$ packed form
39047I03699j55158j61431M9884K25954R9884k75113n02784l26829K5425J63222
39037D6753L2908j05161p4125M8520R4568l614j50521j63072K2909K33567K68880
39026B51612J74676J02567q332k88327n33103l72580J08044L73405J96736l9636
39016c4938J3676J94199K39157K19948K52551J94410k5495j64588r8152q9353
39006G01415k69106k92090O2338M05656L56044J77368K26089K30463j73139o06438
38996H18600m84047o7887p6856m45535m47869J0795K41677l495j60027P2567K34376
38985c07701K4774j64921n2037K5638j36464j33103K38166M40667R7435k64984
38975b32530p3135L10899K39070j20621j74636K7197R676j44612L1622L90267
$$ plain form
38965 263197 552630 285174 -220114 -280010 205275 702381 776759 433364 -132198 -670594
38955 -670594 -839500 -475311 64198 193999 -196495 -634215 -710427 -532189 -404822 -341867
38945 -341867 -131962 225751 402290 110355 -526906 -1076686 -1228470 -1013527 -588885 9740
38935 9740 742312 1334562 1449021 1084193 570326 159302 -130621 -254316 -72315 319120
38925 319120 517162 311945 20791 69526 423312 688452 632105 349217 37579 -139055
38915 -139055 -60975 225679 463316 468675 374696 376939 366601 99321 -351585 -626704 -557671
38904 -557671 -328013 -143157 -17788 62325 33015 -108056 -273971 -473714 -798384 -1134345
38894 -1134345 -1141634 -694731 -157641 462 -233580 -451938 -389582 -240436 -333929 -640071
$$ packed form
38965B63197K89433k67456n05288n9896M85285M97106P4378l43395n65562n38396
38955f70594j68906L64189N39509J29801l90494m37720p6212J78238J27367O2955
38945c41867K09905L57713J76539k91935o37261n49780j51784K14943M24642N98625
38935I740P32572N92250J14459l64828n13867m11024k89923j23695J82001L91435
38925C19120J98042k05217k91154M8735L53786K65140n6347k82888l11638j76634
38915a39055P8080K86654K37637N359r3979K243j0338k67280m50906k75119O9033
38904e57671K29658J84856J25369Q0113k9310j41071j65915j99743l24670l35961
38894a134345p289M46903N37090J58103k34042k18358O2356J49146r3493l06142
$$ plain form
38884 -640071 -764229 -435849 151851 599301 787390 904751 1023119 935107 537976 117679
38874 117679 13328 174936 324906 421161 625918 870941 831079 407345 -82783 -340296
38864 -340296 -451211 -635685 -837957 -807895 -500614 -171434 -61562 -134749 -176419 -72997
38854 -72997 86489 181842 244005 371772 515054 516750 399549 387565 521667 500060 136770
38843 136770 -243137 -213162 92054 146044 -167816 -373416 -112768 377983 686900 760729
38833 760729 778704 790682 772255 828211 1038309 1219519 1103227 692906 264496 72595
38823 72595 177881 452678 632158 499348 159838 -15371 136424 328756 230492 -80807
38813 -80807 -289314 -282395 -161479 23314 241624 310560 99846 -154388 -99164 177956
$$ packed form
38884f40071j24158L28380N87700M47450J88089J17361J18368q8012l97131m20297
38874A17679j04351J61608J49970R6255K04757K45023l9862m23734m90128k57513
38864c40296j10915j84474k02272L0062L07281L29180J09872p3187m1670J03422
38854g2997J59486R5353O2163J27767J43282J696j17201j1984J34102k1607l63290
38843A36770l79907K9975L05216N3990l13860k05600K60648M90751L08917P3829
38833G60729J7975J1978j8427N5956K10098J81210j16292m10321m28410j91901
38823G2595J05286K74797J79480j32810l39510j75209J51795J92332r8264l11299
38813h0807k08507O919J20916J84793K18310O8936k10714k54234N5224K77120
$$ plain form
38803 177956 205617 -193081 -629531 -698526 -496614 -387880 -480577 -585721 -575195 -541027
38793 -541027 -610793 -765401 -876391 -860146 -780169 -800377 -994854 -1195211 -1101900 -602296
38783 -602296 56623 463978 423871 137242 -4388 169085 422181 410909 139952 -24109
38773 -24109 163546 507042 647785 491120 186142 -163126 -524317 -763151 -710052 -404341
38763 -404341 -77681 100000 103474 -44613 -238732 -228963 134952 615118 803011 612133
38753 612133 283268 -54926 -455171 -758376 -587147 80386 722265 917945 850694 875777
38743 875777 910186 645312 143557 -215630 -284131 -236654 -160305 49420 353179 498257
38733 498257 392842 257974 282048 368458 357184 274063 200797 84590 -133695 -336189
$$ packed form
38803A77956K7661l98698m36450o8995K01912J08734r2697j05144J0526L4168
38793e41027o9766j54608j10990J6245P9977k0208j94477k00357R3311M99604
38783f02296O58919M07355m0107k86629j41630J73473K53096j1272k70957j64061
38773b4109J87655L43496J40743j56665l04978l49268l61191k38834N3099L05711
38763d04341L26660J77681L474j48087j94119R769L63915M80166J87893j90878
38753F12133l28865l38194m00245l03205J71229O67533O41879J95680o7251K5083
38743H75777L4409k64874n01755l59187o8501M7477P6349K09725L03759J45078
38733D98257j05415j34868K4074Q6410j1274q3121p3266j16207k18285k02494
$$ plain form
38723 -336189 -380760 -368633 -546944 -926082 -1167947 -949549 -352492 209290 413329 272782
38713 272782 -32816 -392541 -698593 -695674 -192925 529011 806490 285598 -630039 -1216567
38703 -1216567 -1187883 -806514 -368767 93937 578472 890349 850219 586401 450401 647052
38693 647052 1013650 1178700 947297 517379 233170 119043 -151251 -701495 -1108820 -914018
38683 -914018 -333519 -59871 -350489 -721298 -650494 -193155 291600 638921 803732 618047
38673 618047 34779 -572445 -761149 -570314 -349885 -157731 215735 654996 689684 209520
38663 209520 -268353 -310221 -139850 -168231 -315663 -263956 -132989 -337294 -823891 -1024378
38653 -1024378 -697759 -328421 -423306 -797436 -901278 -588218 -171592 115026 299699 367964
$$ packed form
38723c36189m4571J2127j78311l79138k41865K18398N97057N61782K04039j40547
38713B72782l05598l59725l06052K919N02749P21936K77479n20892r15637n86528
38703a216567K8684L81369M37747M62704M84535L11877m0130k63818j36000J96651
38693F47052L66598J65050k31403m29918k84209j14127k70294n50244m07325J94802
38683i14018N80499K73648k90618l70809P0804M57339M84755L47321J64811j85685
38673F18047n83268o07224j88704J90835K20429J92154L73466M39261L4688m80164
38663B09520m77873m1868J70371k8381j47432N1707J30967k04305m86597k00487
38653a024378L26619L69338r4885l74130j03842L13060M16626K86618J84673O8265
$$ plain form
38643 367964 198849 -104880 -174547 143154 492544 406812 -129575 -684734 -852190 -587281
38633 -587281 -175263 -13134 -332101 -957227 -1379963 -1234810 -697655 -273603 -212469 -312934
38623 -312934 -323547 -309798 -463483 -689503 -636981 -184161 301986 351658 -29551 -347092
38613 -347092 -206821 254567 625904 736027 703979 582523 260209 -228225 -568835 -504330
38603 -504330 -133331 258446 502263 552980 395742 150745 96511 332685 546659 394527
38593 394527 18829 -124362 95912 356159 390951 280167 152291 -39400 -280042 -346145
38583 -346145 -131306 104974 57053 -215123 -414398 -421071 -369862 -403849 -533003 -664733
38573 -664733 -637987 -331537 128108 403750 348977 216574 275478 395347 274441 -66643
$$ packed form
38643C67964j69115l03729o9667L17701L49390q5732n36387n55159j67456K64909
38633e87281M12018J62129l18967o25126m22736J45153N37155M24052O1134j00465
38623c12934j0613J3749j53685k26020N2522M52820M86147M9672l81209l17541
38613c47092J40271M61388L71337J10123l2048j21456l22314m88434l40610O4505
38603e04330L70999L91777K43817N0717j57238k44997n4234K36174K13974j52132
38593C94527l75698j43191K20274K60247L4792j10784j27876j91691k40642o6103
38583c46145K14839K36280m7921k72176j99275o673N1209l3987j29154j31730
38573f64733K6746L06450M59645K75642n4773j32403N8904J19869j20906l41084
$$ plain form
38563 -66643 -341391 -456068 -555101 -639776 -534760 -298192 -277309 -594419 -913831 -937718
38553 -937718 -832641 -872788 -905019 -556099 127976 644393 678186 458784 347031 329079
38543 329079 132210 -309253 -752404 -985043 -1052021 -1077893 -1027150 -782246 -387087 -48449
38533 -48449 120983 221809 362510 447787 293546 -91581 -458363 -562854 -399516 -195780
38523 -195780 -213641 -509870 -832172 -821109 -412323 32223 126021 -79120 -214073 -120678
38513 -120678 3530 16045 75489 313464 523508 447031 209444 161315 343336 422783
38503 422783 201290 -97964 -172797 -49019 37119 23963 77629 287534 485713 433227
38493 433227 115751 -204625 -239876 19742 275211 246430 16408 -60716 169249 426460
$$ packed form
38563f6643k74748j14677r9033q4675J05016K36568K0883l17110l19412k3887
38553i37718J05077m0147l2231L48920O84075N16417L3793k19402j11753j7952
38543C29079j96869m41463m43151k32639o6978k5872N0743K44904L95159L38638
38533d8449J69432J00826J40701Q5277j54241l85127l66782j04491J63338K03736
38523a95780j7861k96229l22302J1063M08786M44546R3798k05141j34953R3395
38513a20678J24208J2515N9444K37975K10044p6477k37587m8129J82021P9447
38503D22783k21493k99254p4833J23778Q6138j3156N3666K09905J98179n2486
38493D33227l17476l20376l5251K59618K55469k8781k30022p7124K29965K57211
$$ plain form
38483 426460 364967 62586 -74709 118886 347496 301858 103154 78856 226980 198161
38473 198161 -175353 -610665 -761190 -662348 -603913 -711914 -899310 -1137661 -1456872 -1635020
38463 -1635020 -1235100 -194558 823994 1001666 274629 -581253 -830746 -511332 -164395
38454 -164395 -58817 42061 384237 780873 818910 388927 -162230 -413273 -286407 -29052
38444 -29052 137292 221986 304526 311661 106407 -234183 -420328 -316205 -163059 -283544
38434 -283544 -642609 -880528 -757922 -385247 -518 277482 404997 324715 67273 -193040
38424 -193040 -329226 -398879 -456036 -363864 1860 453347 628733 407815 -5733 -383482
38414 -383482 -631945 -676681 -471320 -202399 -234085 -691459 -1247784 -1455103 -1184876 -669762
$$ packed form
38483D26460o1493l02381j37295J93595K28610m5638j98704k4298J48124k8819
38473A98161l73514m35312j50525R8842N8435j08001j87396k38351l19211j78148
38463a635020L99920J040542J018552J77672p27037q55882k49493L19414L46937
38454a64395J05578J00878L42176L96636L8037m29983n51157k51043J26866K57355
38444b9052J66344Q4694Q2540P135k05254l40590j86145J04123J53146j20485
38434b83544l59065k37919J22606L72675L84729K78000J27515q0282k57442k60313
38424a93040j36186o9653n7157R2172L65724M51487J75386k20918m13548l77749
38414c83482k48463m4736K05361K68921l1686m57374n56325k07319K70227N15114
$$ plain form
38404 -669762 -234379 -55903 -72665 -73575 26814 39026 -188414 -374468 -67007 658077
38394 658077 1161263 1069265 745228 677439 793375 745287 528349 357700 205932 -22369
38384 -22369 -64805 378327 1020122 1277046 1121676 1018178 1020446 669679 -55895 -455426
38374 -455426 -131712 369894 436059 306898 502381 799539 545287 -240778 -826811 -791061
38364 -791061 -426035 -77168 293457 705733 866297 577058 85548 -242978 -343843 -328969
38354 -328969 -207799 4910 97670 -120344 -476401 -559265 -217927 216687 278457 -111157
38344 -111157 -524724 -480898 -12235 329759 122797 -394865 -617493 -318891 122550 229489
38334 229489 -93198 -623944 -1104152 -1315775 -1100603 -525336 59951 314270 243736 135686
$$ packed form
38404f69762M35383J78476j6762r10J00389J2212k27440j86054L07461P25084
38394F58077N03186r1998l24037o7789J15936m8088k16938j70649j51768k28301
38384b2369m2436M43132O41795K56924j55370j03498K268l50767p25574l99531
38374d55426L23714N01606O6165j29161J95483K97158k54252p86065n86033L5750
38364g91061L65026L48867L70625M12276J60564k89239m91510l28526j00865J4874
38354c28969J21170K12709R2760k18014l56057q2864L41338M34614O1770l89614
38344a11157m13567M3826M68663L41994k06962n17662k22628K98602M41441J06939
38334B29489l22687n30746m80208k11623K15172N75267N85287K54319p0534j08050
$$ plain form
38324 135686 174031 227685 53458 -345459 -636615 -496830 -24350 311457 214406 -73992
38314 -73992 -117526 115362 244728 43152 -279771 -427295 -388505 -320370 -260952 -133297
38304 -133297 95834 400373 721624 905955 772112 378086 63124 58141 206847 263637
38294 263637 297935 528253 872411 1001818 826875 590916 429240 188863 -150270 -208349
38284 -208349 323103 1122525 1503919 1210610 645373 288368 193242 176883 208618 349672
38274 349672 497026 531775 674800 1328400 2448565 3364901 3433857 2695737 1702010 888056
38264 888056 379741 246026 526029 969158 1117388 815381 397337 212706 200262 131211
38254 131211 50126 172285 455376 602056 500208 380244 451609 605193 600429 384244
$$ packed form
38324A35686L8345N3654j74227l98917k91156J39785M72480L35807r7051k88398
38314g3992m3534K32888J29366k01576l22923j47524L8790O8135N9418J27655
38304a33297K29131L04539L21251J84331j33843l94026l14962m983J48706N6790
38294B63637L4298K30318L44158J29407j74943k35959j61676k40377l39133n8079
38284b08349N31452P99422L81394k93309n65237l57005r5126j6359L1735J41054
38274C49672J47354L4749J43025O53600J120165R16336O8956p38120r93727q13954
38264H88056n08315j33715K80003M43129J48230l02007m18044j84631j2444o9051
38254A31211q1085J22159K83091J46680j01848j19964P1365J53584m764k16185
$$ plain form
38244 384244 90509 -146450 -230836 -75302 270212 519008 410831 101425 56364 446154
38234 446154 859516 811970 365795 -36634 -244611 -514016 -912343 -1043201 -614354 48096
38224 48096 407328 420663 438866 550318 514166 342908 423747 865730 1167555 861354
38214 861354 188167 -228344 -191005 -47401 -110156 -342110 -624938 -980068 -1377188 -1566256
38204 -1566256 -1316176 -747154 -265141 -143078 -240943 -192019 153125 554815 710393 643777
38194 643777 596623 585372 341512 -223502 -762252 -892927 -662762 -393935 -231974 -100705
38184 -100705 20102 60836 43619 28820 -69042 -333921 -568543 -500614 -273145 -337333 -739391
38173 -739391 -906203 -399124 417242 797656 539196 139100 97401 392581 689065 782596
$$ packed form
38244C84244k93735k36959q4386J55534L45514K48796j08177l09406m5061L89790
38234D46154M13362m7546m46175m02429k07977k69405l98327j30858M28847O62450
38224D8096L59232J3335J8203J11452l6152j71258Q0839M41983L01825l06201
38214H61354o73187m16511L7339J43604o2755k31954k82828l55130l97120j89068
38204a566256K50080N69022M82013J22063r7865M8924L45144M01690J55578o6616
38194F43777m7154j1251k43860n65014n38750j30675K30165K68827J61961J31269
38184a00705J20807M0734j7217j4799r7862k64879k34622O7929K27469o4188m02058
38173g39391j66812N07079Q16366L80414k58460m00096m1699K95180K96484R3531
$$ plain form
38163 782596 701470 539140 360964 233007 217459 303550 380061 315705 88505 -176490
38153 -176490 -332678 -363203 -348763 -300064 -139227 112681 269468 219304 125161 213776 409191
38142 409191 378558 -11058 -447638 -488907 -29593 630234 1100855 1191552 959001 609562
38132 609562 360983 302489 352539 384299 377013 393630 436100 404675 212496 -105050 -385788
38121 -385788 -420508 -120130 302281 416379 26785 -512428 -668334 -394750 -125942 -67906
38111 -67906 93129 556200 895790 619037 -40156 -419310 -397266 -478543 -873005 -1096836
38101 -1096836 -728298 -59371 360189 459622 535359 668830 678295 517363 339996 204345
38091 204345 2740 -319318 -672207 -906797 -846836 -367516 365237 875618 835665 442431
$$ packed form
38163G82596q1126j62330j78176j27957j5548Q6091P6511o4356k27200k64995
38153a76490j56188l0525J4440M8699J60837K51908J56787n0164r4143Q8615J95415
38142D09191l0633l89616m36580m1269M59314O59827M70621R0697k32551l49439
38132F09562k48579n8494N0050L1760p286J6617M2470l1425j92179l17546k80738
38121c85788l4720L00378M22411J14098l89594n39213j55906K73584K68808N8036
38111f7906J61035M63071L39590k76753o59193l79154K2044q1277l94462k23831
38101a096836L68538O68927M19560R9433P5737J33471R465j60932j77367j35651
38091B04345k01605l22058l52889k34590N9961M79320P32753N10381l9953l93234
$$ plain form
38081 442431 134709 73428 133683 240779 400702 512076 475732 419054 503247 588450 421721
38070 421721 88175 -84675 -32749 1319 -92493 -189589 -258653 -382502 -434201 -180238 218898
38059 218898 281268 -73247 -330029 -127446 234846 320922 208411 259878 523367 714377
38049 714377 620468 252268 -244015 -607199 -583397 -230075 94272 197707 252006 371307
38039 371307 356266 111027 -65096 52084 209575 155379 163131 562808 1045083 1050127 667113
38028 667113 488815 648450 687158 418736 231897 355160 470204 347794 283530 506164
38018 506164 652845 332901 -143349 -143893 374538 851416 938696 861007 938056 1152528 1300184
38007 1300184 1267349 1034239 634907 241114 97594 232295 364819 238089 -59243 -238466
$$ packed form
38081D42431l07722o1281O0255J07096J59923J11374l6344n6678Q4193Q5203j66729
38070D21721l33546j72850N1926L4068r3812r7096o9064j23849n1699K53963L99136
38059B18898O2370l54515k56782K02583L62292Q6076j12511N1467K63489J91010
38049G14377r3909l68200m96283l63184K3802L53322L24347J03435N4299J19301
38039C71307j5041k45239j76123J17180J57491n4196P752L99677M82275N044l83014
38028F67113j78298J59635L8708k68422j86839J23263J15044j22410o4264K22634
38018E06164J46681l19944m76250n44N18431M76878Q7280p7689P7049K14472J47656
38007A300184l2835k33110l99332l93793j43520J34701J32524j26730k97332j79223
$$ plain form
37997 -238466 -206681 -154405 -245594 -367782 -277183 68653 417344 476792 223902 -70443
37987 -70443 -130206 22208 92223 -114633 -395941 -357302 67703 482915 543745 439090
37977 439090 623755 1165494 1657083 1766516 1549809 1167164 667611 227851 221578 721595
37967 721595 1203612 1127967 639948 302060 266396 162981 -221013 -614580 -710332 -554632
37957 -554632 -350383 -188513 -119006 -192475 -270870 -82011 345148 570500 314159 -82818
37947 -82818 -62561 413452 819341 710626 174686 -364837 -592970 -500561 -268880 -48467
37937 -48467 151288 375522 590149 718434 770534 803351 775680 618441 437035 412716
37927 412716 483226 417868 294314 535020 1246404 1876800 1894034 1527464 1380361 1494580
$$ packed form
37997b38466L1785N2276r1189j22188R0599L45836L48691N9448k52890k94345
37987g0443n9763J52414P0015k06856k81308L8639M25005M15212O0830j04655
37977D39090J84665N41739M91589J09433k16707l82645m99553m39760o273N00017
37967G21595M82017p5645m88019l37888l5664j03415l83994l93567r5752J55700
37957e54632K04249J61870O9507p3469p8395J88859M27159K25352k56341l96977
37947h2818K0257M76013M05889j08715n35940n39523k28133R2409K31681K20413
37937d8467J99755K24234K14627J28285N2100L2817k7671j57239j81406k4319
37927D12716P0510o5358j23554K40706P11384O30396J7234l66570j47103J14219
$$ plain form
37917 1494580 1361341 828342 385785 379957 493968 335554 83521 100220 239988 101611
37907 101611 -200734 -132905 365333 675324 403350 -19172 1049 354002 506843 398065
37897 398065 470041 842683 1031923 677639 103062 -144145 6477 224779 322806 362553
37887 362553 359323 251641 139674 218206 428858 467428 227164 -6863 68803 389266
37877 389266 638151 620090 401573 186948 163661 387862 717307 906922 852401 706785
37867 706785 705332 912875 1178105 1286402 1122297 739690 331923 111263 169821 435777
37857 435777 741999 925322 907495 742347 578303 540379 656440 886422 1143237 1270499
37847 1270499 1126049 756291 365569 36183 -359684 -849893 -1167021 -1080029 -748308 -462509
$$ packed form
37917A494580j33239n32999m42557n828J14011j58414k52033J6699J39768j38377
37907A01611l02345O7829M98238L09991k71974m22522K0221L52953J52841j08778
37897C98065P1976L72642J89240l54284n74577k47207J50622K18302R8027L9747
37887C62553l230j07682j11967P8532K10652L8570k40264k34027P5666L20463
37877C89266K48885j8061k18517k14625k3287K24201L29445J89615n4521j45616
37867G06785j453K07543K65230J08297j64105l82607m07767k20660N8558K65956
37857D35777L06222J83323j7827j65148j64044l7924J16061K29982K56815J27262
37847A270499j44450l69758l90722l29386l95867m90209l17128Q6992L31721K85799
$$ plain form
37837 -462509 -176794 327860 872758 921564 311399 -424113 -669278 -399246 -30757 165638
37827 165638 235093 257859 196253 45966 -46876 84305 414182 690420 653314 312091
37817 312091 -47940 -164677 -14380 312099 760119 1187245 1295242 962088 507009 312380
37807 312380 285429 51321 -397458 -670637 -596122 -414559 -287883 -76801 242699 397898
37797 397898 293229 267126 584060 986829 1040146 659722 63932 -518887 -856692 -733890
37787 -733890 -252673 143802 205618 159666 229322 243005 58807 -8937 331258 732657
37777 732657 627416 98354 -223181 -85075 87047 -112738 -516845 -678554 -416177 85901
37767 85901 531412 754791 787533 711213 474343 22708 -378770 -287341 287177 744524
$$ packed form
37837d62509K85715N04654N44898M8806o10165p35512k45165K70032L68489J96395
37827A65638O9455K2766o1606j50287r2842J31181L29877K76238l7106l41223
37817C12091l60031j16737J50297L26479M48020M27126J07997l33154m55079j94629
37807C12380k6951k34108m48779k73179P4515J81563J26676K11082L19500J55199
37797C97898j04669k6103L16934M02769N3317l80424n95790n82819l37805J22802
37787g33890M81217L96475O1816m5952O9656J3683j84198o7744L40195M01399
37777G32657j05241n29062l21535J38106J72122j99785m04107j61709K62377N02078
37767H5901M45511K23379L2742p6320k36870m51635m01478R1429N74518M57347
$$ plain form
37757 744524 655176 315787 211504 292197 240073 133156 272673 556481 615175 453555
37747 453555 380832 384473 173318 -171334 -197192 188659 540114 536925 339567 181905 98160
37736 98160 163802 507823 930721 981600 590695 192072 70319 49416 -6028 100376
37726 100376 420450 578024 316338 -52145 -100725 122805 311069 420535 602286 801209
37716 801209 797118 583887 445711 660114 1233127 1868565 2180869 2092373 2023965 2474946
37706 2474946 3405322 4287849 4760086 4892873 4805370 4451121 3929618 3598929 3629366 3729506
37696 3729506 3529627 3015552 2442778 2048970 1939032 1999660 1886341 1401397 889493 867357
37686 867357 1260898 1505842 1441995 1481434 1725045 1629387 944956 340781 527805 1229246
$$ packed form
37757G44524q9348l39389j04283Q0693n2124j06917J39517K83808N8694j61620
37747D53555p2723L641k11155l44652k5858L85851L51455l189j97358j57662q3745
37736I8160O5642L44021M22898N0879l90905l98623j21753k0903n5444J06404
37726A00376L20074J57574k61686l68483m8580K23530J88264J09466J81751J98923
37716H01209m091k13231j38176K14403N73013O35438L12304q8496o8408M50981
37706B474946R30376Q82527M72237J32787q7503l54249n21503l30689L0437J00140
37696C729506j99879n14075n72774l93808j09938O0628j13319m84944n11904k2136
37686H67357L93541K44944o3847L9439K43611r5658o84431o04175J87024P01441
$$ plain form
37676 1229246 1627137 1497705 1297043 1340407 1495462 1612606 1748468 1935879 2090248 2170618
37666 2170618 2199946 2160852 2045962 1924780 1827189 1697106 1556133 1504846 1476141 1269070
37656 1269070 934501 785727 875118 840524 491434 186411 365916 1001737 1716521 2165740
37646 2165740 2178736 1875914 1727222 2053250 2427247 2164906 1475170 1340591 2028529 2614173
37636 2614173 2419649 2016705 2142285 2453372 2217235 1598608 1336847 1582455 1915374
37627 1915374 2182242 2521967 2828731 2898392 2886752 3067320 3434825 3994760 4962744 6187679
37617 6187679 6972392 7023940 6937472 7195357 7495772 7691778 8398764 9857620 11287103
37608 11287103 12365960 14193281 17582731 21644660 25479329 29938685 35953423 42442668
$$ packed form
37676A229246L97891j29432k00662M3364J55055J17144J35862J87411J54369Q0370
37666B170618K9328l9094j14890j21182r7591j30083j40973n1287k8705k07071
37656A269070l34569j48774Q9391l4594l49090l05023J79505O35821P14784M49219
37646B165740J2996l02822j48692L26028L73997k62341o89736j34579O87938N85644
37636B614173j94524m02944J25580L11087k36137o18627k61761K45608L32919
37627A915374K66868L39725L06764O9661j1640J80568L67505N59935R67984J224935
37617F187679P84713N1548q6468K57885L00415J96006P06986J458856J429483
37608A1287103J078857J827321L389450M061929L834669M459356O014738O489245
$$ plain form
37600 42442668 48004210 53532072 60943781 70606528 82638653 99522196 124679668 160161339
37592 160161339 208668274 273503721 348004736 405738594 413040294 359424483 271248321
37585 271248321 189075265 134237870 101678266 79157025 62669099 53139051 48496170
37578 48496170 44793608 40754448 36893792 32618632 27256021 22001015 18269017 15524135
37570 15524135 12666406 10132337 8811853 8177137 7221899 6185479 5769741 5592750 4891208
37561 4891208 3946977 3483633 3378683 3163451 3046963 3289344 3315249 2626442 1892075 1949438
37551 1949438 2373175 2239699 1714715 1617513 1886444 1776525 1272576 1046372 1173994 1082867
37541 1082867 722838 674312 1021128 1124975 703219 284281 361025 760061 1047203 1021461
$$ packed form
37600D2442668N561542N527862P411709R662747J2032125J6883543K5157472L5481671
37592A60161339M8506935O4835447P4501015N7733858P301700n3615811q8176162
37585B71248321q2173056n4837395l2559604k2521241j6487926r530048m642881
37578D8496170l702562m039160l860656m275160n362611n255006l731998k744882
37570A5524135k857729k534069j320484o34716r55238j036420m15738j76991p01542
37561D891208r44231m63344j04950k15232j16488K42381K5905o88807p34367N7363
37551A949438M23737j33476n24984r7202K68931j09919n03949k26204J27622r1127
37541A082867l60029m8526L46816J03847m21756m18938P6744L99036K87142k5742
$$ plain form
37531 1021461 683473 176971 -176314 -176196 -42120 -48749 -35535 268518 650112 705681 550857
37520 550857 607437 803745 670116 203924 -58930 81249 202536 22246 -158920 -28986
37510 -28986 225020 282949 175934 100242 46968 -83076 -196197 -106803 175827 443554
37500 443554 519053 392176 188613 79089 185820 517308 953012 1275711 1313605 1178801
37490 1178801 1258795 1724910 2141766 1953691 1345564 1109627 1532429 1988417 1919548 1630867
37480 1630867 1668161 1944971 2078836 2165398 2547647 3126305 3582128 4027926 4705711 5213300
37470 5213300 4827784 3574203 2239955 1312033 629854 137668 162342 702255 1168230
37461 1168230 1177626 1009973 945850 751480 239823 -187229 -72566 391255 677438 663052
$$ packed form
37531A021461l37988n06502l53285J18J34076o629J3214L04053L81594N5569j54824
37520E50857N6580J96308j33629m66192k62854J40179J21287j80290j81166J29934
37510b8986K54006N7929j07015p5692n3274j30044j13121Q9394K82630K67727
37500D43554P5499j26877k03563j09524J06731L31488M35704L22699L7894j34804
37490A178801P9994M66115M16856j88075o08127k35937M22802M55988o8869k88681
37480A630867L7294K76810J33865Q6562L82249N78658M55823M45798O77785N07589
37470E213300l85516j253581j334248r27922o82179m92186K4674N39913M65975
37461A168230R396j67653o4123j94370n11657m27052J14663M63821K86183j4386
$$ plain form
37451 663052 593252 536178 351199 96058 40262 262762 528843 594295 445918 240054
37441 240054 124356 101557 25105 -191643 -369536 -240261 163486 525676 678666 727288
37431 727288 696081 442646 85754 94025 618040 1074227 823438 49971 -490218 -483448
37421 -483448 -347091 -502389 -828021 -998458 -986420 -943540 -808971 -384101 237433 620937
37411 620937 499049 141481 11969 133210 55844 -469988 -1040513 -1031242 -359454 418676
37401 418676 725236 467848 -31142 -378613 -362394 -63240 228071 325165 347350 465332
37391 465332 561768 418346 164839 173051 478203 696634 629776 552419 690752 782611 477639
37380 477639 -80830 -415119 -298925 108766 567411 879219 823489 330115 -270480 -475324
$$ packed form
37451F63052o9800n7074j84979k55141n5796K22500K66081O5452j48377k05864
37441B40054j15698k2799p6452k16748j77893J29275M03747L62190J52990M8622
37431G27288l1207k53435l56892Q271N24015M56187k50789p73467n40189O770
37421d83448J36357j55298l25632j70437J2038M2880J34569M24870O21534L83504
37411F20937j21888l57568j29512J21241p7366n25832n70525R271O71788P78130
37401D18676L06560k57388m98990l47471J6219K99154K91311R7094K2185J17982
37391D65332R6436j43422k53507Q212L05152K18431o6858p7357J38333R1859l04972
37380D77639n58469l34289J16194M07691M58645L11808n5730m93374o00595k04844
$$ plain form
37370 -475324 -167114 265904 430101 345750 270412 284179 232745 27820 -174659 -171504 -5793
37359 -5793 58052 -132280 -421129 -560545 -528062 -494760 -521180 -447676 -126448 332500 595280
37348 595280 383270 -224819 -761077 -784075 -388748 -98462 -140851 -139182 219045 558191
37338 558191 337759 -234299 -420899 -22955 405735 461566 357727 321332 185302 -102913
37328 -102913 -167702 166444 426645 152514 -390695 -641472 -540029 -404388 -313785 -144136
37318 -144136 570 -98292 -378716 -645638 -934173 -1314046 -1560759 -1481338 -1332206 -1403702
37308 -1403702 -1426894 -984907 -320221 -63416 -260223 -367263 -200336 -165433 -445310 -643327
37298 -643327 -439496 -16141 366633 671221 786387 518988 105778 136959 674620 1017943
$$ packed form
37370d75324L08210M33018J64197q4351p5338J3767n1434k04925k02479L155J65711
37359e793O3845j90332k88849j39416L2483L3302k6420P3504L21228M58948K62780
37348E95280k12010o08089n36258k2998L95327K90286m2389J669L58227L39146
37338E58191k20432n72058j86600L97944M28690N5831j03839l6395j36030k88215
37328a02913o4789L34146K60201k74131n43209k50777J01443J35641R0603J69649
37318a44136J44706r8862k80424k66922k88535l79873k46713P9421J49132p1496
37308a403702k3192M41987O64686K56805j96807j07040J66927L4903k79877j98017
37298f43327K03831M23355L82774L04588J15166k67399m13210L1181N37661L43323
$$ plain form
37288 1017943 687754 85874 -225795 -348871 -648702 -1019853 -1145540 -1126994 -1238978 -1316601
37278 -1316601 -999390 -424495 -90683 -116840 -176968 -123075 -133560 -220733 -112806 247084
37268 247084 507105 374034 -42161 -476030 -812147 -1022334 -1064435 -997371 -1006249 -1179213
37258 -1179213 -1386509 -1455536 -1351032 -1152774 -980996 -948566 -1041680 -1044850 -738948 -187746
37248 -187746 310240 552511 574876 483833 321942 123681 -43693 -141924 -182515 -190592 -212183
37237 -212183 -291915 -357877 -242687 44148 198858 -19565 -420151 -600275 -461142 -264929
37227 -264929 -241125 -388821 -618971 -821322 -821556 -551112 -236916 -133403 -99894 211591
37217 211591 750591 1047624 871693 510936 277178 142531 49213 144295 409497 447261
$$ packed form
37288A017943l30189o01880l11669j23076k99831l71151j25687J8546j11984p7623
37278a316601L17211N74895L33812k6157o0128N3893j0485q7173J07927L59890
37268B47084K60021j33071m16195m33869l36117k10187m2101O7064q878j72964
37258a179213k07296o9027J04504J98258J71778L2430r3114l170L05902N51202
37248a87746M97986K42271K2365r1043j61891j98261j67374r8231m0591q077k1591
37237b12183p9732o5962J15190K86835J54710k18423m00586j80124J39133J96213
37227b64929K3804j47696k30150k02351k34K70444L14196J03513L3509L11485
37217B11591N39000K97033j75931l60757k33758j34647r3318R5082K65202L7764
$$ plain form
37207 447261 29866 -429797 -386282 62000 336966 179676 -154484 -406949 -549254 -507453
37197 -507453 -139414 380361 563956 212632 -279548 -427164 -204222 106580 353683 523230
37187 523230 497609 163967 -270456 -383665 -37916 430108 610416 468566 301317 354617
37177 354617 599196 832194 895988 799671 687643 687055 746235 653679 292193 -140153 -277080
37166 -277080 -5528 352491 375533 9218 -404084 -523813 -312104 54665 412064 666457
37156 666457 745214 623451 394699 243848 317442 590524 825286 718925 218788 -313542
37146 -313542 -410122 -24333 394652 434489 174434 -8859 69702 297594 535753 752678
37136 752678 895362 838540 535749 116975 -201975 -258721 -42783 249807 331093 135117
$$ packed form
37207D47261m17395m59663M3515M48282K74966j57290l34160k52465j42305M1801
37197e07453L68039N19775J83595l51324m92180j47616K22942L10802K47103J69547
37187E23230k5621l33642m34423j13209L45749M68024J80308j41850j67249N3300
37177C54617K44579K32998O3794r6317j12028n88N9180r2556l61486m32346j36927
37166b77080K71552L58019K3042l66315m13302j19729K11709L66769L57399K54393
37156F66457P8757j21763k28752j50851P3594K73082K34762j06361n00137n32330
37146c13542r6580L85789M18985L9837k60055j83293P8561K27892K38159K16925
37136G52678J42684n6822l02791m18774l18950n6746K15938K92590Q1286j95976
$$ plain form
37126 135117 -38542 130232 529591 711543 441479 -59194 -450060 -625791 -654049 -581571
37116 -581571 -452721 -369399 -376818 -385329 -323446 -266129 -286548 -278503 -85720 225969 365119
37105 365119 118719 -384558 -738533 -626835 -175272 128029 -21244 -354592 -378999 -42133
37095 -42133 250910 284701 302935 491000 603724 407970 146449 150458 247132 37503 -381732
37084 -381732 -500602 -174766 195577 335186 435679 659361 778885 594520 322419 227259
37074 227259 175609 -66398 -325215 -235901 150882 391383 262396 -9185 -167687 -248078
37064 -248078 -371154 -497030 -543173 -560794 -634015 -724102 -743220 -681340 -538791 -233822 257047
37053 257047 703583 745660 283159 -343059 -635704 -384720 202776 763143 1088250 1190712
$$ packed form
37126A35117j73659J68774L99359J81952k70064n00673l90866j75731k8258P2478
37116e81571J28850Q3322p419q511O1883N7317k0419Q045J92783L11689J39150
37105C65119k46400n03277l53975J11698M51563L03301j49273l33348k4407L36866
37095d2133K93043L3791J8234J88065J12724j95754k61521M009R6674k09629m19235
37084c81732j18870L25836L70343J39609J00493K23682J19524j84365k72101r5160
37074B27259n1650k42007k58817Q9314L86783K40501j28987k71581j58502q0391
37064b48078j23076j25876m6143j7621p3221r0087j9118O1880J42549L04969M90869
37053B57047M46536M2077m62501o26218k92645K50984N87496N60367L25107J02462
$$ plain form
37043 1190712 1164550 1053784 828697 446458 -41695 -429945 -487785 -221970 68664 107586
37033 107586 -55303 -186269 -239141 -368023 -572814 -595170 -292140 86200 175893 -59517
37023 -59517 -343620 -466687 -462330 -424357 -335386 -150416 56617 135128 38655 -100793 -112328
37012 -112328 38397 278261 589027 974547 1226300 973992 195712 -511560 -516223 65958
37002 65958 542118 567635 453601 472144 378913 -77594 -600695 -719111 -438652 -110044
36992 -110044 129690 344638 401809 88182 -408778 -601824 -347411 -11328 87638 62582
36982 62582 180960 486425 816663 983932 860979 485288 126550 53385 198281 244938
36972 244938 55785 -198993 -343672 -400600 -466216 -586039 -766754 -937157 -934976 -720415
$$ packed form
37043A190712k6162j10766k25087l82239m88153l88250n7840K65815K90634L8922
37033A07586j62889j30966n2872j28882k04791k2356L03030L78340Q9693k35410
37023e9517k84103j23067M357L7973Q8971J84970K07033P8511r6473j39448j1535
37012a12328J50725K39864L10766L85520K51753k52308p78280p07272m663N82181
37002F5958M76160K5517j14034J8543r3231m56507n23101j18416K80459L28608
36992a10044K39734K14948N7171l13627m96960j93046K54413L36083R8966k5056
36982F2582J18378L05465L30238J67269j22953l75691l58738p3165J44896M6657
36972B44938j89153k54778j44679n6928o5616j19823j80715j70403K181K14561
$$ plain form
36962 -720415 -513473 -493311 -500395 -333805 -170019 -274200 -440818 -239097 248649 504328
36952 504328 397615 320471 418018 350306 26254 -87951 274470 703956 777646 669446
36942 669446 693841 744528 624212 467363 400775 254335 40585 179141 728578 986476
36932 986476 516970 7628 287549 979230 1078218 517549 105799 106839 -3911 -371624
36922 -371624 -457936 -88804 205338 182627 289981 725710 997744 842611 734367 975412
36912 975412 1091062 722536 361968 495650 689374 336071 -227628 -234868 257140 520148
36902 520148 345361 218079 381259 529342 481954 460373 578429 651843 634314 709006
36892 709006 826081 661399 188520 -178051 -182546 -41458 13828 76469 225889 262273
$$ packed form
36962g20415K06942K0162p084J66590J63786j04181j66618K01721M87746K55679
36952E04328j06713p7144R7547o7712l24052j14205L62421M29486P3690j08200
36942F69446K4395N0687j20316j56849o6588j46440k13750J38556N49437K57898
36932I86476m69506n09342K79921O91681R8988n60669m11750J040j10750l67713
36922c71624q6312L69132K94142k2711J07354M35729K72034j55133j08244K41045
36912I75412J15650l68526l60568J33682J93724l53303n63699p240M92008K63008
36902E20148j74787j27282J63180J48083m7388k1581J18056P3414j7529P4692
36892G09006J17075j64682m72879l66571m495J41088N5286O2641J49420L6384
$$ plain form
36882 262273 78912 -30034 223780 630988 729294 408799 -4834 -180552 -59425 212214
36872 212214 388423 218273 -312955 -825695 -855466 -383502 128554 311344 288232 348313
36862 348313 436935 299233 45794 132324 640423 1007010 791536 352728 284528 450238
36852 450238 232603 -339206 -484816 117158 745146 667761 150105 -114112 -87455 -250319
36842 -250319 -687415 -983015 -878310 -448052 243770 1069489 1525342 1151750 291724 -174653
36832 -174653 70355 508196 671655 675882 690066 517611 43715 -389208 -419469 -122498
36822 -122498 241276 559116 696345 425587 -146542 -481564 -300605 -780 -1789 -75727
36812 -75727 187894 597851 633661 293348 64501 135288 207730 102172 18678 115637 285798
$$ packed form
36882B62273j83361j08946K53814M07208R8306l20495m13633j75718J21127K71639
36872B12214J76209j70150n31228n12740k9771M71964N12056J82790k3112O0081
36862C48313Q8622j37702k53439Q6530N08099L66587k15474m38808o8200J65710
36852D50238k17635n71809j45610O01974O27988p7385n17656k64217K6657j62864
36842b50319m37096k95600J04705M30258O91822Q25719M55853l73592q60026m66377
36832a74653K45008M37841J63459M227J4184j72455m73896m32923l0261K96971
36822a22498L63774L17840J37229k70758n72129l35022J80959K99825j009p3938
36812g5727K63621M09957L5810l40313k28847P0787P2442j05558q3494R6959J70161
$$ plain form
36801 285798 456611 695035 887349 718745 157341 -384128 -574395 -556740 -607928 -688657
36791 -688657 -605605 -408204 -307889 -295794 -131359 273898 667229 720396 390683 -40125
36781 -40125 -270708 -303880 -421503 -792871 -1187797 -1222355 -847305 -385469 -72616 170201
36771 170201 393497 349841 -137330 -712273 -784158 -295148 160698 110580 -208776 -260532
36761 -260532 36677 303971 343216 365027 487710 401788 -163911 -858739 -975397 -296586
36751 -296586 611771 1018990 728628 107485 -345200 -334983 105681 627086 801350 527344
36741 527344 133602 -39964 -38687 -94762 -163983 38598 526573 864441 667160 106690
36731 106690 -275305 -191529 135994 345862 384770 471121 694459 820762 561509 -55054
$$ packed form
36801B85798J70813K38424J92314j68604n61404n41469j90267J7655n1188q0729
36791f88657Q3052J97401J00315J2095J64435M05257L93331N3167l29713m30808
36781d0125k30583l3172j17623l71368l94926l4558L75050M61836L12853K42817
36771A70201K23296m3656m87171n74943p1885M89010M55846n0118l19356n1756
36761b60532K97209K67294L9245K1811J22683q5922n65699o94828j16658O78811
36751b96586R08357M07219k90362o21143m52685J0217M40664N21405J74264k74006
36741E27344l93742j73566J277n6075o9221K02581M87975L37868j97281n60470
36731A06690l81995Q3776L27523K09868L8908Q6351K23338J26303k59253o16563
$$ plain form
36721 -55054 -688137 -1036261 -1088500 -1024225 -968676 -899846 -735680 -457831 -162256 13350
36711 13350 41507 47913 137793 239135 238705 205638 271750 306243 -5850 -657636 -1167209
36700 -1167209 -1136104 -755707 -517098 -586118 -751070 -857575 -933383 -905112 -575560 50
36690 50 425808 443905 280389 301961 499177 569357 423786 310336 375158 362976 -41705
36679 -41705 -680134 -966915 -538784 290666 846126 790219 385737 106503 149399 356257
36669 356257 466532 360501 138183 24808 136514 316281 297971 51214 -174025 -190167
36659 -190167 -96286 -75536 -133232 -162254 -133115 -91375 -90815 -235150 -615002 -1059933 -1152465
36648 -1152465 -709926 -99399 163196 -47 -270555 -404497 -378410 -204434 58412 189688
$$ packed form
36721e5054o33083l48124n2239O4275N5549O8830J64166K77849K95575J75606
36711A3350K8157O406Q9880J01342m30l3067O6112L4493l12093o51786n09573
36700a167209L1105L80397K38609o9020j64952j06505p5808K8271L29552N75610
36690E0M25758J8097j63516K1572J97216P0180j45571j13450O4822j2182m04681
36679d1705o38429k86781M28131Q29450N55460n5907m04482k79234M2896K06858
36669C56257J10275j06031k22318j13375J11706J79767j8310k46757k25239j6142
36659a90167R3881K0750n7696k9022K9139M1740N60j44335l79852m44931r2532
36648a152465M42539O10527K62595j63243k70508j33942K6087J73976K62846J31276
$$ plain form
36638 189688 49064 -126342 -22066 215339 155960 -210598 -421644 -261590 -41393 320
36628 320 62928 268505 268863 -193278 -684732 -563160 117781 668062 662093 358808 227261
36617 227261 430504 830505 1178143 1202999 779027 125341 -333324 -392178 -219081 -64869
36607 -64869 -13099 -70485 -287127 -634581 -896841 -855090 -541948 -190277 49858 226334
36597 226334 405197 504033 407231 180148 9090 -86339 -287663 -607893 -688819 -233686
36587 -233686 454107 704032 291850 -294510 -517020 -413827 -368103 -511900 -639035 -563406
36577 -563406 -302908 7610 175340 15353 -426800 -795423 -777334 -469544 -200534 -70662
36567 -70662 94919 384465 634775 638406 340556 -149894 -588163 -699179 -448199 -140352
$$ packed form
36638A89688j40624j75406J04276K37405n9379l66558k11046J60054K20197M1713
36628C20O2608K05577L58m62141m91454J21572O80941N50281n969l03285j31547
36617B27261K03243M00001L47638K4856m23972o53686m58665n8854J73097J54212
36607f4869N1770n7386k16642l47454k62260M1751L13142L51671K40135J76476
36597B26334J78863R8836r6802k27083j71058r5429k01324l20230q0926M55133
36587b33686O87793K49925m12182n86360k22510J03193M5724j43797j27135P5629
36577e63406K60498L10518J67730j59987m42153l68623J8089L07790K69010J29872
36567g0662J65581K89546K50310L631k97850m90450m38269j11016K50980L07847
$$ plain form
36557 -140352 -55199 -88110 -2580 102051 -48836 -346874 -374549 -112238 -89254 -602670
36547 -602670 -1199308 -1267567 -834338 -393267 -166592 28843 283585 406016 273696 19468
36537 19468 -238494 -571402 -1008424 -1353754 -1398700 -1168210 -819065 -430416 -44610 212227
36527 212227 247566 174324 167565 179567 13306 -300776 -443738 -240811 49054 64518 -179595
36516 -179595 -369771 -358005 -285182 -266865 -250202 -250473 -440743 -835287 -1107389 -957013 -534680
36505 -534680 -270261 -341721 -521889 -531023 -346350 -128949 7681 84867 183059 336398
36495 336398 510922 689706 921382 1182435 1243992 891468 318786 45970 288078 626272
36485 626272 525581 13202 -399850 -351428 52413 447269 514641 183337 -245758 -296252
$$ packed form
36557a40352Q5153l2911Q5530J04631j50887k98038k7675K62311K2984n13416
36547f02670n96638o8259M33229M41071K26675J95435K54742J22431j32320k54228
36537A9468k57962l32908m37022l45330m4946K30490L49145L88649L85806K56837
36527B12227L5339p3242o759J2002j66261l14082j42962K02927K89865J5464k44113
36516a79595j90176J1766P2823J8317J6663k71j90270l94544k72102J50376M22333
36505e34680K64419p1460j80168r134J84673K17401J36630P7186R8192J53339
36495C36398J74524J78784K31676K61053O1557l52524n72682k72816K42108L38194
36485F26272j00691n12379m13052M8422M03841L94856O7372l31304m29095n0494
$$ plain form
36475 -296252 121670 493332 328980 -157620 -365162 -144391 141024 300214 498784 709049
36465 709049 570095 21156 -433311 -411813 -202522 -262723 -502795 -480313 -98718 291136
36455 291136 402189 305339 235930 317533 455254 396905 471 -483591 -581786 -163641
36445 -163641 366482 568490 420996 140464 -151318 -354981 -290515 19285 189669 -75969
36435 -75969 -547826 -765611 -581737 -136181 445101 955796 984736 395964 -221337 -141226
36425 -141226 489578 772522 246970 -564869 -960964 -931233 -959020 -1298851 -1750584 -1950201
36415 -1950201 -1656445 -896967 -11461 550758 598371 313961 18262 -48691 218602 695222
36405 695222 975375 692948 -40346 -739081 -1105885 -1229915 -1223267 -1017222 -633854 -332242
$$ packed form
36475b96252M17922L71662j64352m86600k07542K20771K85415J59190J98570K10265
36465G09049j38954n48939m54467K1498K09291o0201k40072K2482L81595L89854
36455B91136J11053r6850o9409Q1603J37721n8349l96434m84062r8195M18145
36445a63641N30123K02008j47494k80532k91782k03663O4466L09800J70384k65638
36435g5969m71857k17785J83874M45556N81282N10695K8940n88772o17301Q0111
36425a41226O30804K82944n25552q11839l96095K9731k7787l39831m51733j99617
36415a950201K93756P59478Q85506N62219M7613k84410k95699o6953K67293M76620
36405F95222K80153k82427p33294o98735l66804j24030O648K06045L83368L01612
$$ plain form
36395 -332242 -309236 -497578 -772406 -1075933 -1233723 -1006958 -518458 -268995 -469217 -687704
36385 -687704 -473985 -13382 226422 234427 376325 734686 1014347 1058324 1000378 873992
36375 873992 503488 -89966 -532369 -535194 -250159 -26274 1162 -57096 -62902 37142 220470
36364 220470 417366 590905 786667 985254 949119 451321 -299145 -724727 -524123 -45056
36354 -45056 177252 80111 21167 178950 331541 276156 172655 280104 523618 572279
36344 572279 317514 49106 89239 419593 776850 972870 961823 708103 228060 -253783
36334 -253783 -436747 -301372 -135161 -121319 -117276 25398 145389 3274 -321962 -524283
36324 -524283 -473436 -281346 -40831 212325 296584 -22797 -637304 -1069231 -1011466 -698262
$$ packed form
36395c32242K3006j88342k74828l03527j57790K26765M88500K49463k00222k18487
36385f87704K13719M60603K39804Q005J41898L58361K79661M3977n7946j26386
36375H73992l70504n93454m42403k825K85035K23885K7436n8258n806J00044J83328
36364B20470J96896J73539J95762J98587l6135m97798p50466m25582K00604M79067
36354d5056K22308r7141n8944J57783J52591n5385j03501J07449K43514M8661
36344E72279k54765k68408M0133L30354L57257J96020j1047k53720m80043m81843
36334b53783j82964J35375J66211J3842M043J42674J19991j42115l25236k02321
36324e24283N0847J92090K40515K53156Q4259l19381o14507m31927N7765L13204
$$ plain form
36314 -698262 -566917 -710296 -854667 -761616 -445167 -56271 241844 299559 83236 -197378
36304 -197378 -215202 133095 593731 830345 767795 596622 495357 454791 381287 270432
36294 270432 199148 184028 145313 36101 -71980 -95372 -82271 -166611 -386140 -614710 -683515
36283 -683515 -522266 -186076 200008 520556 745057 924865 1079333 1124135 987049 748740
36273 748740 546960 363872 64069 -345141 -674263 -828406 -922684 -1006722 -886769 -431541
36263 -431541 110224 381143 425215 615676 1066043 1429016 1384228 1047089 721894 481835
36253 481835 229882 17330 17661 217349 368831 292613 79304 -47824 17000 160103
36243 160103 149829 -113068 -409939 -401643 -107783 3580 -382030 -915843 -1010951 -666166
$$ packed form
36314f98262J31345j43379j44371R3051L16449L88896K98115N7715k16323k80614
36304a97378j7824L48297M60636K36614o2550j71173j01265m0566p3504j10855
36294B70432p1284j5120l8715j09212j08081k3392J3101q4340k19529k28570o8805
36283f83515J61249L36190L86084L20548K24501J79808J54468M4802j37086k38309
36273G48740k01780j83088k99803m09210l29122j54143r4278q4038J19953M55228
36263d31541N41765K70919M4072J90461M50367L62973m4788l37139l25195k40059
36253D81835k51953k12552L31J99688J51482p6218k13309j27128O4824J43103
36243A60103j0274k62897k96871Q296K93860J11363l85610n33813r5108L44785
$$ plain form
36233 -666166 -433373 -551248 -606907 -252124 205225 277269 16506 -171283 -192661 -253183
36223 -253183 -305338 -52976 453248 735125 578366 373925 501526 731150 610986 220939
36213 220939 94221 423366 749666 578603 33365 -315282 -146757 281648 483043 255979
36203 255979 -192863 -521493 -551186 -354242 -166772 -218103 -538776 -892625 -967936 -671652
36193 -671652 -181517 283665 630758 818450 786987 558076 278306 62305 -98515 -208305
36183 -208305 -226478 -256225 -535908 -1044996 -1352468 -1141713 -686368 -453652 -404957 -139215
36173 -139215 345576 555464 252008 -168890 -239221 15207 275007 360244 243258 -65453
36163 -65453 -395043 -438251 -154097 73122 -78164 -426407 -581870 -482963 -361636 -328708
$$ packed form
36233f66166K32793j17875n5659L54783M57349P2044k60763j87789k1378o0522
36223b53183n2155K52362N06224K81877j56759k04441J27601K29624j20164l90047
36213B20939j26718L29145L26300j71063n45238l48647J68525M28405K01395k27064
36203B55979m48842l28630k9693J96944J87470n1331l20673l53849p5311K96284
36193f71652M90135M65182L47093J87692l1463k28911k79770k16001j60820j09790
36183b08305j8173k9747k79683n09088l07472K10755M55345K32716M8695K65742
36173a39215M84791K09888l03456m20898p0331K54428K59800Q5237j16986l08711
36163f5453l29590m3208K84154K27219j51286l48243j55463R8907J21327L2928
$$ plain form
36153 -328708 -283850 -160251 -18651 73021 111783 166462 363590 709028 888826 523797
36143 523797 -270529 -899986 -1026956 -917336 -830059 -524500 197718 857607 797397 113504
36133 113504 -486394 -662832 -726047 -956065 -1180031 -1125425 -778735 -300222 89022 122725
36123 122725 -255159 -660017 -668376 -428838 -453240 -815024 -1046752 -893898 -655799 -628166
36113 -628166 -689404 -644781 -539685 -397491 -58884 453869 786201 738477 556985 464817
36103 464817 267521 -224180 -693183 -659553 -151243 338441 465954 320488 178256 219601
36093 219601 429337 603818 528528 245572 8559 -85022 -183977 -329037 -327080 -137843
36083 -137843 -42472 -188391 -299018 -136764 55378 -67104 -395499 -587202 -623747 -726817
$$ packed form
36153c28708M4858J23599J41600R1672L8762N4679J97128L45438J79798l65029
36143E23797p94326o29457j26970J09620Q7277L05559P22218O59889o0210o83893
36133A13504n99898j76438o3215k30018k23966N4606L46690M78513L89244L3703
36123A22725l77884m04858q359K39538k4402l61784k31728J52854K38099K7633
36113f28166o1238M4623J05096J42194L38607N12753L32332m7724j81492r2168
36103D64817j97296m91701m69003L3630N08310M89684J27513j45466j42232M1345
36093B19601K09736J74481p5290k82956k37013r3581r8955j45060J957J89237
36083a37843R5371j45919j10627J62254J92142j22482l28395j91703l6545j03070
$$ plain form
36073 -726817 -871659 -817815 -547889 -284712 -118564 30909 130625 56513 -136035 -287810
36063 -287810 -434877 -700525 -936757 -840861 -438527 -109182 -92565 -263377 -401539 -382263
36053 -382263 -109215 390701 781236 694833 269329 43936 213766 360065 92015 -400852
36043 -400852 -686004 -681656 -604416 -521525 -289918 124626 543019 801042 896665 882020 744397
36032 744397 452156 60421 -279949 -440946 -458246 -510065 -681480 -776035 -483219 224768
36022 224768 956899 1244919 997095 557151 312506 302387 278036 118535 19070 161728
36012 161728 376687 379955 241043 271873 472135 500334 286267 217547 494839 737385
36002 737385 559130 153374 -84416 -160377 -261923 -276058 -68926 39418 -292626 -713335
$$ packed form
36073g26817j44842N3844K69926K63177J66148J49473R9716p4112j92548j51775
36063b87810j47067k65648k36232R5896M02334L29345J6617j70812j38162J9276
36053c82263K73048M99916L90535q6403m25504k25393J69830J46299k68050m92867
36043d00852k85152M348P7240Q2891K31607M14544M18393K58023R5623j4645j37623
36032G44397k92241l91735l40370j60997j7300n1819j71415r4555K92816P07987
36022B24768P32131K88020k47824m39944k44645j0119k4351j59501r9465J42658
36012A61728K14959L268j38912L0830K00262K8199k14067o8720K77292K42546
36002G37385j78255m05756k37790p5961j01546j4135K07132J08344l32044m20709
$$ plain form
35992 -713335 -567745 96113 597609 665195 686995 872345 917823 681198 460943 350053
35982 350053 19286 -525904 -682505 -201692 241815 995 -553270 -614382 -92873 446780
35972 446780 665584 622808 336579 -156855 -461318 -187031 396968 642093 404050 109075
35962 109075 -6091 -131936 -343914 -417799 -311297 -299940 -465174 -526667 -366325 -243643
35952 -243643 -257909 -71562 496917 1017167 1009045 665458 554450 786477 956973 845758
35942 845758 691497 708526 766966 725492 709451 794469 726851 335799 10446 273782 927535
35931 927535 1175596 747710 333037 525603 859365 524123 -289974 -583250 -45391 484477
35921 484477 299214 -200351 -270816 52096 211538 88811 37243 186708 343388 470868
$$ packed form
35992g13335J45590O63858N01496O7586K1800J85350M5478k36625k20255j10890
35982C50053l30767n45190j56601M80813M43507k40820n54265o1112N21509N39653
35972D46780K18804m2776k86229m93434l04463K74287N83999K45125k38043k94975
35962A09075j15166j25845k11978p3885J06502J1357j65234o1493J60342J22682
35952b43643j4266J86347N68479N20250q122l43587j11008K32027J70496j11215
35942H45758j54261J7029N8440m1474j6041Q5018o7618l91052l25353K63336O53753
35931I27535K48061m27886m14673J92566L33762l35242q14097k93276N37859N29868
35921D84477j85263m99565p0465L22912J59442j22727n1568J49465J56680J27480
$$ plain form
35911 470868 690984 852793 664835 287885 256250 684286 1024349 807558 246179 -117286
35901 -117286 -71363 156393 233813 -1445 -434368 -721911 -595679 -185545 100012 36878
35891 36878 -233779 -464688 -519427 -339258 40787 396610 475519 304606 132041 65084
35881 65084 26500 55134 297016 627975 660442 296475 -52394 -18427 226093 287977 154581
35870 154581 172176 512405 917117 991937 633023 150535 -24045 186999 378110 163106
35860 163106 -260750 -327561 123735 648522 867720 939167 1107386 1140905 635795 -282256
35850 -282256 -974295 -1006982 -556167 -70354 200680 261649 180757 17445 -129464 -153710
35840 -153710 -78862 -105177 -405747 -836720 -976800 -587871 55329 473301 542011 508326
$$ packed form
35911D70868K20116J61809j87958l76950l1635M28036L40063k16791n61379l63465
35901a17286M5923K27756P7420k35258m32923k87543J26232M10134K85557o3134
35891C6878k70657k30909n4739J80169L80045L55823P8909j70913j72565o6957
35881F5084l8584K8634K41882L30959L2467l63967l48869L3967K44520O1884j33396
35870A54581J7595L40229M04712P4820l58914m82488j74580K11044J91111k15004
35860A63106m23856o6811M51296N24787K19198P1447J68219L3519n05110r18051
35850b82256o92039l2687M50815M85813K71034O0969q0892j63312j46909k4246
35840a53710P4848k6315l00570m30973j40080L88929O43200M17972O8710l3685
$$ plain form
35830 508326 497916 339695 -43534 -391062 -435739 -251353 -78165 12428 79387 90239
35820 90239 -36201 -230013 -295858 -139197 121089 266805 203746 100936 225378 536939
35810 536939 609244 201850 -246377 -99906 554966 965315 746179 330902 214039 295322
35800 295322 289565 271602 373069 364481 50509 -249675 -152149 124070 93097 -195555 -267938
35789 -267938 -12997 217123 235905 196531 156339 17952 -71458 184247 651422 812303
35779 812303 513634 166009 57008 -5235 -154631 -114621 276396 627281 485555 -37516
35769 -37516 -494314 -694538 -726146 -620202 -375918 -172447 -198969 -343470 -332823 -121660
35759 -121660 98713 212355 269624 314852 330719 327262 322225 269973 149854 72951 164128
$$ packed form
35830E08326j0410j58221l83229l47528m4677J84386J73188R0593O6959J0852
35820I0239j26440j93812o5845J56661K60286J45716o3059j02810J24442L11561
35810E36939P2305m07394m48227J46471O54872M10349k19136m15277j16863Q1283
35800B95322n757j7963J01467q588l13972l00184R7526K76219l0973k88652p2383
35789b67938K54941K30120J8782l9374m0192j38387q9410K55705M67175J60881
35779H12303k98669l47625j09001o2243j49396M0010L91017L50885j41726n23071
35769c7516m56798k00224l1608J05944K44284K03471k6522j44501J0647K11163
35759a21660K20373J13642N7269M5228J5867l457n037n2252j20119p6903R1177
$$ plain form
35748 164128 378072 536949 503784 261425 -74527 -260782 -105809 249148 401260 179885
35738 179885 -103286 -65794 260276 557239 658205 597088 375584 179 -328669 -401649
35728 -401649 -359433 -527801 -855819 -882044 -414708 78731 36481 -442836 -733475 -509115
35718 -509115 -120478 -77002 -416171 -783371 -982044 -1159444 -1432981 -1613176 -1478796 -1153600
35708 -1153600 -951449 -904335 -718179 -239043 288851 544135 503411 355597 223445 144998
35698 144998 175345 288213 281445 18923 -284218 -259717 126618 509972 589259 439160
35688 439160 274471 115791 -128870 -374697 -382687 -82776 294801 480708 449146 354018
35678 354018 273793 154130 -33674 -236242 -434818 -652947 -802323 -723542 -492032 -453184
$$ packed form
35748A64128K13944J58877l3165k42359l35952j86255J54973L54957J52112k21375
35738A79885k83171L7492L26070K96963J00966o1117k21504l75405l28848p2980
35728d01649M2216j68368l28018k6225M67336M93439m2250m79317k90639K24360
35718e09115L88637M3476l39169l67200j98673j77400k73537j80195J34380L25196
35708a153600K02151M7114J86156M79136N27894K55284m0724j47814j32152p8447
35698A44998L0347J12868o768k62522l03141K4501L86335L83354P9287j50099
35688D39160j64689j58680k44661k45827p990K99911L77577J85907l1562r5128
35678C54018q0225j19663j87804k02568j98576k18129j49376P8781K31510L8848
$$ plain form
35668 -453184 -740685 -976922 -770450 -344168 -248528 -523464 -640838 -334402 37162 139552
35658 139552 154817 302414 341281 10509 -387191 -370784 -18315 213958 247381 391752
35648 391752 674532 744617 490082 211732 80248 -55090 -159912 141312 923639 1617556
35638 1617556 1678271 1271608 930683 801158 614376 223011 -219837 -525571 -609426 -441070
35628 -441070 -110354 146579 217424 290887 523288 687030 476510 52002 -104647 140805
35618 140805 423796 446430 334464 310447 338339 294845 253243 359271 557161 638135 489743
35607 489743 166144 -198416 -418217 -302599 149220 636136 797405 582135 271474 129387
35597 129387 144425 150505 83993 7500 -72007 -244491 -483461 -531935 -199872 257918 321902
$$ packed form
35668d53184k87501k36237K06472M26282R5640k74936j17374L06436L71564J02390
35658A39552J5265J47597L8867l30772l97700J6407L52469K32273L3423J44371
35648C91752K82780P0085k54535k78350j31484j35338j04822L01224P82327O93917
35638A617556O0715m06663l40925j29525j86782l91365m42848l05734q3855J68356
35628d41070L30716K56933P0845P3463K32401J63742k10520m24508j56649K45452
35618A40805K82991K2634j11966k4017K7892m3494m1602J06028J97890Q0974j48392
35607D89743l23599l64560k19801J15618M51819M86916J61269k15270l10661j42087
35597A29387J5038O080o6512p6493p9507j72484k38970m8474L32063M57790O3984
$$ plain form
35586 321902 -128343 -577988 -525646 -159360 -45145 -270021 -366121 -142259 -68159 -519725
35576 -519725 -1046145 -888658 -68269 555635 352401 -371645 -864800 -788038 -379687 -26536
35566 -26536 63881 -102038 -356038 -494634 -492492 -511408 -578460 -410451 207887 966418 1254077
35555 1254077 873597 271252 -31905 2103 78071 53801 46133 168624 399461 674245
35545 674245 910927 956656 705834 290734 -27444 -192773 -390767 -687710 -847289 -655264
35535 -655264 -259875 7366 42472 -10164 -74163 -221544 -412770 -396610 2611 621343
35525 621343 1083827 1126542 760318 217140 -210040 -382215 -436855 -609124 -898915 -1049690
35515 -1049690 -906456 -614148 -356976 -104441 199023 378116 233789 -92257 -246326
$$ packed form
35586C21902m50245m49645N2342L66286J14215k24876r6100K23862P4100m51566
35576e19725n26420J57487Q20389O23904k03234p24046m93155P6762M08351L53151
35566b6536R0417j65919k54000j38596K142j8916o7052J68009O18338P58531K87659
35555A254077l80480o02345l03157L4008P5968k4270p668J22491K30837K74784
35545F74245K36682M5729k50822m15100l18178j65329j97994k96943j59579J92025
35535f55264L95389K67241L5106n2636o3999j47381j91226J6160L99221O18732
35525F21343M62484M2715l66224n43178m27180j72175n4640j72269k89791j50775
35515a049690J43234K92308K57172K52535L03464J79093j44327l26046j54069
$$ plain form
35506 -246326 -122654 68967 170776 225785 253336 188059 98895 151942 263893 133259
35496 133259 -235612 -404751 -135835 202154 190315 8599 93122 380080 420461 163333
35486 163333 79027 427775 873932 988217 761482 443383 191327 78169 189828 513386
35476 513386 899724 1242588 1496106 1480979 1003143 284600 -91107 109206 423918 322554
35466 322554 -107337 -383962 -283408 40540 361388 492298 309279 -22931 -73292 279827
35456 279827 561193 376652 73056 191218 521204 386878 -234684 -626908 -434183 -119873
35446 -119873 -119416 -221073 -125190 -20376 -170893 -402869 -447482 -413774 -495774 -557363 -433616
35435 -433616 -319829 -424290 -541553 -425865 -290866 -447170 -724865 -789560 -763217 -929742
$$ packed form
35506b46326J23672J91621J01809N5009K7551o5277q9164N3047J11951j30634
35496A33259l68871j69139K68916L37989j1839j81716Q4523K86958M0381k57128
35486A63333q4306L48748M46157J14285k26735l18099k52056j13158J11659L23558
35476E13386L86338L42864K53518j5127m77836p18543l75707K00313L14712j01364
35466C22554m29891k76625J00554L23948L20848J30910j83019l32210n0361L53119
35456B79827K81366j84541l03596J18162L29986j34326o21562l92224J92725L14310
35446a19873M57j01657R5883J04814j50517k31976m4613L3708q2000o1589J23747
35435d33616J13787j04461j17263J15688J34999j56304k77695o4695K6343j66525
$$ plain form
35425 -929742 -1066893 -778087 -336064 -401303 -909155 -1063669 -581252 -121467 -188251 -381978
35415 -381978 -190721 161635 226156 128519 216398 334418 139464 -146607 -1696 513828
35405 513828 784917 516103 9759 -417637 -737915 -880663 -649223 -126091 274194 320080
35395 320080 175322 6334 -213876 -391569 -259024 143037 344747 87797 -285791 -401788
35385 -401788 -441440 -736157 -1067876 -914420 -285469 221721 257640 150190 329566 694480
35375 694480 824314 597362 290968 141265 84169 -9813 -56514 114870 433188 587256
35365 587256 413883 121692 -3171 18678 -24261 -121730 -31617 301164 612053 696882
35355 696882 642158 546551 331053 48735 55892 511165 941980 754723 57157 -483755
$$ packed form
35425i29742j37151K88806M42023o5239n07852j54514M82417M59785o6784j93727
35415c81978J91257L52356O4521r7637Q7879J18020j94954k86071J44911N15524
35405E13828K71089k68814n06344m27396l20278j42748K31440N23132M00285M5886
35395C20080j44758j68988k20210j77693J32545M02061K01710k56950l73588j15997
35385d01788l9652k94717l31719J53456O28951N07190L5919j07450J79376L64914
35375F94480J29834k26952l06394j49703n7096r3982m6701J71384L18318J54068
35365E87256j73373k92191j24863K1849m2939r7469R0113L32781L10889Q4829
35355F96882n4724r5607k15498k82318P157M55273M30815j87257o97566n40912
$$ plain form
35345 -483755 -556138 -487957 -576270 -655203 -534045 -403396 -477284 -570177 -404766 -113104 -50798
35334 -50798 -248142 -409935 -395351 -355146 -395768 -422012 -371214 -339784 -377913 -361016 -184364
35323 -184364 44037 104106 -114642 -529631 -925067 -1085300 -963929 -730596 -566575 -443961
35313 -443961 -229215 42245 192007 202365 256913 396650 378983 58157 -286858 -260112
35303 -260112 108555 395080 345343 154853 128445 292686 469299 543462 487497 262532
35293 262532 -88547 -336579 -296994 -142060 -228707 -582824 -827885 -731096 -532536 -521338
35283 -521338 -550644 -315255 48030 60942 -392502 -855180 -896065 -583710 -208941 136311
35273 136311 450914 555932 278147 -197273 -456448 -332100 -36828 178346 311743 509002
$$ packed form
35345d83755p2383O8181q8313p8933J21158J30649p3888r2893J65411K91662O2306
35334e0798j97344j61793J4584M0205m0622k6244N0798L1430l8129J6897J76652
35323a84364K28401O0069k18748m14989l95436j60233J21371K33333J64021J22614
35313d43961K14746K71460J49762J0358N4548J39737j7667l20826l45015K6746
35303b60112L68667K86525m9737j90490k6408J64241J76613P4163n5965k24965
35293B62532l51079k48032L9585J54934q6647l54117k45061R6789J98560J1198
35283e21338k9306K35389L63285J2912m53444m62678m0885L12355L74769L45252
35273A36311L14603J05018k77785m75420k59175J24348K95272K15174J33397J97259
$$ plain form
35263 509002 779434 881315 535887 -167999 -656074 -401569 385205 905578 748545 377917
35253 377917 397467 695832 745222 471729 274616 299603 281244 135764 143336 388819 523234
35242 523234 313867 12112 -83918 -62232 -111217 -136141 13821 196904 186190 32423
35232 32423 -74975 -136623 -249270 -333551 -233886 14067 236585 329716 249103 -25275 -334914
35221 -334914 -386448 -165510 -36193 -168508 -199787 158970 524589 381275 -41685 -84189
35211 -84189 272022 366641 -44111 -375288 -142788 321714 463049 319279 306947 539270
35201 539270 796976 944358 979422 839386 504170 153613 -84115 -388378 -936579 -1489441
35191 -1489441 -1636450 -1353390 -963365 -622768 -231533 171844 348860 277691 247516 381118
$$ packed form
35263E09002K70432J01881l45428p03886m88075K54505P86774N20373j57033l70628
35253C77917J9550K98365M9390k73493j97113K4987j8359j45480P572K45483J34415
35242E23234k09367l01755r6030K1686m8985k4924J49962J83083j0714j53767
35232C2423j07398o1648j12647q4281R9665K47953K22518R3131q0613k74378l09639
35221c34914n1534K20938J29317j32315l1279L58757L65619j43314m22960m2504
35211h4189L56211R4619m10752l31177K32500M64502J41335j43770j2332K32323
35201E39270K57706J47382L5064j40036l35216l50557k37728l04263n48201n52862
35191a489441j47009K83060L90025L40597L91235M03377J77016p1169l0175J33602
$$ plain form
35181 381118 406811 133650 -140183 -14721 389651 551506 254116 -146249 -221202 20682
35171 20682 257526 289623 167210 8714 -88693 1533 349861 790691 1011771 902014
35161 902014 658149 469360 279304 -6828 -270130 -347451 -311025 -323666 -317580 -118974
35151 -118974 152059 147735 -189737 -490010 -444706 -172896 17463 -15235 -239541 -529036
35141 -529036 -615054 -264695 298139 454025 -61875 -739658 -933114 -665777 -425968 -377363
35131 -377363 -250809 63715 308792 298580 166084 76467 25032 11893 109589 260885
35121 260885 302140 281292 446594 799536 975631 746602 359582 173655 209485 278595
35111 278595 325718 386916 394370 291344 204566 247533 267169 45882 -321690 -505403 -358886
$$ packed form
35181C81118K5693k73161k73833J25462M04372J61855k97390m00365p4953K41884
35171B0682K36844L2097j22413j58496r7407R0226L48328M40830K21080j09757
35161I02014k43865j88789j90056k86132k63302p7321L6426j2641O086J98606
35151a18974K71033m324l37472l00273M5304K71810J90359l2698k24306k89495
35141e29036q6018L50359N62834J55886n15900o77783j93456K67337K39809M8605
35131c77363J26554L14524K45077j0212j32496q9617n1435j3139R7696J51296
35121B60885M1255k0848J65302L52942J76095k29029l87020j85927L5830O9110
35111B78595M7123O1198P454j03026q6778M2967J9636k21287l67572j83713J46517
$$ plain form
35100 -358886 -54172 169624 209916 103037 9661 146591 540545 895987 902159 621379
35090 621379 365876 253716 151422 29601 52106 229612 279004 624 -403623 -570574
35080 -570574 -409263 -147574 -46876 -194812 -485019 -675975 -552300 -156807 194638 238590
35070 238590 46638 -115492 -126414 -64987 -3470 46537 -18000 -350510 -829013 -971234
35060 -971234 -440440 411818 804228 432951 -133970 -190162 188359 319993 -66125 -475563
35050 -475563 -459318 -299691 -494533 -891305 -886609 -379189 52806 16377 -174232 -82759
35040 -82759 160724 120351 -245979 -526972 -411486 -15093 318214 339958 52881 -303344
35030 -303344 -450491 -346998 -195431 -134498 -96192 -47619 -121607 -328966 -402878 -196126
$$ packed form
35100c58886L04714K23796M0292j06879r3376J36930L93954L55442O172k80780
35090F21379k55503j12160j02294j21821K2505J77506M9392k78380m04247j66951
35080e70574J61311K61689J00698j47936k90207j90956J23675L95493L51445M3952
35070B38590j91952j62130j0922O1427O1517N0007o4537l32510m78503j42221
35060i71234N30794Q52258L92410l71277n66921n6192L78521J31634l86118m09438
35050d75563J6245J59627j94842l96772M696N07420M31995l6429j90609R1473
35040h2759K43483m0373l66330k80993J15486L96393L33307K1744k87077l56225
35030c03344j47147J03493J51567O0933L8306M8573p3988k07359p3912K06752
$$ plain form
35020 -196126 3168 -114265 -356479 -331434 -120983 -168426 -532052 -757803 -572833 -231753
35010 -231753 -20938 136744 357290 475647 348568 168670 163766 222503 127677 -30336
35000 -30336 12607 267494 468497 400745 65995 -364253 -603583 -427023 28439 327012
34990 327012 282607 214115 434175 766192 880597 824510 802930 680836 221217 -325899
34980 -325899 -435535 -80034 243110 266915 198223 161370 -6708 -263252 -270584 -46658
34970 -46658 -104718 -592798 -884531 -525109 -61613 -275849 -952474 -1152854 -556415 194578
34960 194578 481138 362030 131032 -149799 -414612 -391362 20354 484508 628539 472705
34950 472705 246725 33737 -161077 -208141 9253 383327 705231 877348 869753 665197
$$ packed form
35020a96126J99294j17433k42214K5045K10451m7443l63626k25751J84970L41080
35010b31753K10815J57682K20546J18357j27079j79898m904N8737r4826j58013
35000c0336M2943K54887K01003o7752l34750m30248k39330J76560M55462K98573
34990C27012m4405o8492K20060L32017J14405n6087k1580j22094m59619n47116
34980c25899j09636L55501L23144K3805o8692l6853j68078k56544p332K23926
34970d6658n8060m88080k91733L59422M63496k14236o76625k00380N96439P50993
34960A94578K86560j19108k30998k80831k64813K3250M11716M64154J44031j55834
34950D72705k25980k12988j94814m7064K17394L74074L21904J72117p595k04556
$$ plain form
34940 665197 418913 434127 728298 849234 449624 -135752 -286242 26844 206499 -105038
34930 -105038 -584560 -804898 -835857 -970545 -1144077 -1013877 -524880 -57696 25169 -232246
34920 -232246 -497232 -513910 -305155 -103203 -114154 -304255 -424665 -283317 48356 338631
34910 338631 432912 333672 149368 60711 221338 544935 693485 462361 94897 -3795
34900 -3795 197215 362434 299258 150784 51193 -66898 -201522 -157639 97405 249587
34890 249587 73019 -194784 -198663 37834 283795 544618 919162 1174924 972359 491777
34880 491777 329152 671388 1034525 974723 616283 259825 -83385 -435666 -536976 -248009
34870 -248009 714 -311012 -981108 -1279529 -964208 -584735 -616992 -775798 -536765 -22610
$$ packed form
34940F65197k46284J5214K94171J20936l99610n85376j50490L13086J79655l11537
34930a05038m79522k20338l0959j34688j73532J30200M88997M67184Q2865k57415
34920b32246k64986j6678K08755K01952j0951j90101j20410J41348L31673K90275
34910C38631R4281r9240j84304q8657J60627L23597J48550k31124l67464r8692
34900c795K01010J65219o3176j48474r9591j18091j34624M3883K55044J52182
34890B49587j76568k67803l879K36497K45961K60823L74544K55762k02565m80582
34880D91777j62625L42236L63137n9802l58440l56458l43210l52281j01310K88967
34870b48009K48723l11726o70096k98421L15321L79473l2257j58806K39033N14155
$$ plain form
34860 -22610 105142 -424920 -1110050 -1350759 -1183061 -1070294 -1171443 -1197362 -980569 -780960
34850 -780960 -835692 -934546 -769647 -488764 -489590 -760367 -876227 -675078 -486299 -564044 -729601
34839 -729601 -791817 -911126 -1227112 -1460906 -1275007 -800359 -426719 -237992 -24634 269027
34829 269027 468768 463391 276618 -45190 -337745 -290400 129901 403962 42277 -691376
34819 -691376 -1105754 -1011752 -786913 -599799 -238821 220045 291063 -114499 -395913 -150248
34809 -150248 196165 83935 -329532 -525345 -436156 -340631 -242563 31242 277498 76542
34799 76542 -507565 -910049 -803107 -429214 -156932 -97291 -205842 -378410 -375291 -19592
34789 -19592 442702 537381 208419 -100586 -122402 -100949 -244269 -286113 28646 355481
$$ packed form
34860b2610J27752n30062o85130k40709J67698J12767j01149k5919K16793J99609
34850g80960n4732r8854J64899K80883q26k70777j15860K01149J88779p7745j65557
34839g29601o2216j19309l15986k33794J85899M74648L73640J88727K13358K93661
34829B69027J99741n377j86773l21808k92555M7345M20301K74061l61685p33653
34819f91376m14378R4002K24839J87114L60978M58866P1018m05562k81414K45665
34809a50248L46413j12230m13467j95813Q9189R5525R8068K73805K46256k00956
34799G6542n84107m02484J06942L73893K72282N9641j08551j72568L119L55699
34789a9592M62294R4679l28962l09005k1816K1453j43320m1844L14759L26835
$$ plain form
34779 355481 147739 -494077 -869950 -611196 -135114 -21632 -286939 -528073 -544413 -477535
34769 -477535 -419653 -239313 114600 414557 458606 398873 519759 781020 875093 743586
34759 743586 706973 933143 1069950 692766 -47656 -557629 -544251 -314330 -276532 -426452
34749 -426452 -473395 -276659 41704 314653 464093 438527 191153 -209273 -533803 -561004
34739 -561004 -300504 5921 141405 131367 146996 239337 295697 269068 290917 465742 682617
34728 682617 754967 648044 441591 178949 -82626 -185877 -68035 27567 -190578 -598230
34718 -598230 -753270 -533254 -360336 -599450 -998256 -1027731 -634005 -295878 -323412 -429887
34708 -429887 -169506 410247 805100 689554 273949 -44623 -184096 -336624 -535578 -553746
$$ packed form
34779C55481k07742o41816l75873K58754M76082J13482k65307k41134j6340O6878
34769d77535N7882J80340L53913K99957M4049n9733J20886K61261R4073j31507
34759G43586l6613K26170J36807l77184p40422n09973J3378K29921L7798j49920
34749d26452m6943J96736L18363K72949J49440k5566k47374m00426l24530k7201
34739e61004K60500L06425J35484j0038J5629R2341N6360k6629K1849J74825K16875
34728F82617P2350j06923k06453k62642k61575j03251J17842R5602k18145m07652
34718e98230j55040K20016J72918k39114l98806k9475L93726L38127k7534j06475
34708d29887K60381N79753L94853j15546m15605l18572j39473j52528j98954j8168
$$ plain form
34698 -553746 -298449 -40592 -47923 -171796 -77402 200538 258101 -81504 -475229 -511473
34688 -511473 -230222 -1617 -36666 -222467 -355195 -337911 -180249 25650 124307 24577
34678 24577 -175681 -282683 -217150 -55655 93532 148793 45021 -176788 -297372 -136962
34668 -136962 126257 81426 -358774 -740138 -609421 -123913 152589 5314 -183025 3612
34658 3612 478048 828812 830685 585039 292522 89692 21444 -13107 -206952 -551721 -707564
34647 -707564 -420445 18994 74518 -273119 -437239 -13603 697308 1157230 1257123 1229842
34637 1229842 1155605 925705 572264 275525 72064 -149592 -371145 -433917 -324053 -220522
34627 -220522 -213461 -190719 -70587 28054 -71260 -386835 -727440 -793673 -411429 203184 518758
$$ packed form
34698e53746K55297K57857p331j23873R4394K77940N7563l39605l93725l6244
34688e11473K81251K28605l5049j85801j32728J7284J57662K05899R8657r9730
34678B4577k00258j07002O5533J61495J49187N5261j03772k21809j20584J60410
34668a36962K63219m4831m40200l81364J30717M85508K76502j47275j88339J86637
34658C612M74436L50764J873k45646k92517k02830o8248l4551j93845l44769j55843
34647g07564K87119M39439N5524l47637j64120M23636P10911M59922R9893k7281
34637A229842p4237k29900l53441k96739k03461k21656k21553o2772J09864J03531
34627b20522P061K2742J20132R8641r9314l15575l40605o6233L82244O14613L15574
$$ plain form
34616 518758 239023 -287335 -436971 -48462 454129 643548 521330 345774 286313 312306
34606 312306 236547 -141348 -745128 -1124139 -905060 -304866 106204 127906 74049 202944
34596 202944 409121 546935 653736 740331 742124 761746 922977 913636 256914 -772816
34586 -772816 -1187514 -632550 -27936 -280026 -957443 -1032081 -475485 -158147 -378621 -526059
34576 -526059 -270592 -107991 -405514 -731894 -608424 -290625 -266460 -447112 -415086 -156422
$$ packed form
34616E18758k79735n26358j49636L88509N02591J89419j22218j75556n9461K5993
34606C12306p5759l77895o03780l79011K19079O00194M11070K1702n3857J28895
34596B02944K06177J37814J06801Q6595J793J9622J61231r341o56722j029730
34586g72816m14698N54964O04614k52090o77417p4638N56596L17338k20474j47438
34576e26059K55467J62601k97523l26380J23470L17799K4165j80652L2026K58664
$$ [...]
##END NTUPLES=NMR SPECTRUM
##END=
