##TITLE=31Pdec_BAU-29P(II)
 CDCl3, 124 sc
 29.1.2020
##JCAMPDX= 6.0         $$ Bruker NMR JCAMP-DX V2.0
##DATA TYPE= NMR SPECTRUM
##DATA CLASS= NTUPLES
##ORIGIN= UXNMR, Bruker Analytische Messtechnik GmbH
##OWNER= root
$$ XWIN-NMR		Version 3.5
$$ Wed Jan 29 14:29:54 2020 Russian Standard Time (UT+4h)  she@DPX200
##.OBSERVE FREQUENCY= 81.013821
##.OBSERVE NUCLEUS= ^31P
##.ACQUISITION MODE= SIMULTANEOUS
##.ACQUISITION SCHEME= undefined
##.AVERAGES= 24
##.DIGITISER RES= 17
##SPECTROMETER/DATA SYSTEM= spect
##.PULSE SEQUENCE= zgpg30
##.SOLVENT NAME= CDCl3
##.SHIFT REFERENCE= (INTERNAL, CDCl3, 0, 182.463)
##AUDIT TRAIL= $$ (NUMBER, WHEN, WHO, WHERE, WHAT)
$$ ##TITLE= Audit trail, XWIN-NMR		Version 3.5
$$ ##JCAMPDX= 5.01
$$ ##ORIGIN= Bruker BioSpin GmbH
$$ ##OWNER= she
$$ F:/spectra/data/she/nmr/P31/1/pdata/1/auditp.txt
$$ ##AUDIT TRAIL=  $$ (NUMBER, WHEN, WHO, WHERE, WHAT)
(   1,<2020-01-29 14:28:58.14 +0400>,<she>,<DPX200>,
      <created by zg, POWCHK disabled, PULCHK disabled
       configuration hash MD5:
       00 E9 B6 7A A2 85 ED C7 34 08 36 98 17 FE 4E 26
       data hash MD5: 32K
       45 7D DE D7 90 60 97 9A FB FC 1D F3 AA 3B 2F 2E>)
(   2,<2020-01-29 14:29:00.62 +0400>,<she>,<DPX200>,
      <Start of raw data processing
       efp BC_mod = 2 LB = 1 FT_mod = 6 PKNL = 1 PHC0 = -1630.276 PHC1 = -2.798706 SI = 64K 
       data hash MD5: 64K
       F2 26 80 99 41 A2 87 5A 95 4D 88 C5 AC 61 16 3D>)
(   3,<2020-01-29 14:29:18.70 +0400>,<she>,<DPX200>,
      <pk PHC0 = -0.9675631 PHC1 = -2.8 
       data hash MD5: 64K
       93 39 13 C4 82 B1 0B D9 3D DA 2C A2 09 36 BC A9>)
(   4,<2020-01-29 14:29:21.48 +0400>,<she>,<DPX200>,
      <abs ABSG = 5 
       data hash MD5: 64K
       29 91 E7 87 77 7F 69 62 12 F5 72 C3 8D 93 2C 68>)
$$ ##END=
$$ 
$$ hash MD5
$$ 13 EE F9 83 2E FC 48 6B 37 40 74 D1 17 DF B2 BB
##$RELAX= 
##$RELAX= 
##$RELAX= 
##$RELAX= 
##$RELAX= 
##$RELAX= 
##$RELAX= 
##$RELAX= 
$$ Bruker specific parameters
$$ --------------------------
##$DU= <F:/spectra>
##$EXPNO= 1
##$NAME= <P31>
##$PROCNO= 1
##$TYPE= <nmr>
##$USER= <she>
##$AMP= (0..31)
100 100 100 100 100 100 100 100 100 100 100 100 100 100 100 100 100 100 
100 100 100 100 100 100 100 100 100 100 100 100 100 100 
##$AQSEQ= 0
##$AQ_mod= 1
##$AUNM= <au_zg>
##$AUTOPOS= <>
##$BF1= 81.014009
##$BF2= 200.13
##$BF3= 200.13
##$BF4= 200.13
##$BF5= 200.13
##$BF6= 200.13
##$BF7= 200.13
##$BF8= 200.13
##$BYTORDA= 1
##$CFDGTYP= 0
##$CFRGTYP= 5
##$CHEMSTR= <none>
##$CNST= (0..31)
1 1 145 1 1 1 1 1 1 1 1 1 1 1 1 1 1 1 1 1 1 1 1 1 1 1 1 1 1 1 1 1 
##$CPDPRG= <waltz16>
##$CPDPRG1= <>
##$CPDPRG2= <waltz16>
##$CPDPRG3= <>
##$CPDPRG4= <mlev>
##$CPDPRG5= <mlev>
##$CPDPRG6= <mlev>
##$CPDPRG7= <mlev>
##$CPDPRG8= <mlev>
##$CPDPRGB= <>
##$CPDPRGT= <>
##$D= (0..31)
0 1 0 0 0 0 0 0 0 0 0 0.03 2e-05 3e-06 0 0 0 0 0 0 0 0 0 0 0 0 0 0 0 0 
0 0 
##$DATE= 1580293737
##$DBL= (0..7)
120 120 120 11 120 120 24 19 
##$DBP= (0..7)
150 150 150 150 150 150 150 150 
##$DBP07= 0
##$DBPNAM0= <>
##$DBPNAM1= <>
$$ [...]
##$SUBNAM3= <"">
##$SUBNAM4= <"">
##$SUBNAM5= <"">
##$SUBNAM6= <"">
##$SUBNAM7= <"">
##$SUBNAM8= <"">
##$SUBNAM9= <"">
##$SW= 369.568048894756
##$SWIBOX= (0..15)
0 1 3 0 0 0 0 0 0 0 0 0 0 0 0 0 
##$SW_h= 29940.119760479
##$TD= 32768
##$TD0= 1
##$TE= 0
##$TE2= 300
##$TE3= 300
##$TEG= 300
##$TL= (0..7)
0 120 53 12 22 120 120 120 
##$TP= (0..7)
150 150 150 150 150 150 150 150 
##$TP07= 0
##$TPNAME0= <>
##$TPNAME1= <>
##$TPNAME2= <>
##$TPNAME3= <>
##$TPNAME4= <>
##$TPNAME5= <>
##$TPNAME6= <>
##$TPNAME7= <>
##$TPOAL= (0..7)
0.5 0.5 0.5 0.5 0.5 0.5 0.5 0.5 
##$TPOFFS= (0..7)
0 0 0 0 0 0 0 0 
##$TUNHIN= 0
##$TUNHOUT= 0
##$TUNXOUT= 0
##$USERA1= <user>
##$USERA2= <user>
##$USERA3= <user>
##$USERA4= <user>
##$USERA5= <user>
##$V9= 5
##$VALIST= <valist>
##$VCLIST= <CCCCCCCCCCCCCCC>
##$VD= 0
##$VDLIST= <DDDDDDDDDDDDDDD>
##$VPLIST= <PPPPPPPPPPPPPPP>
##$VTLIST= <TTTTTTTTTTTTTTT>
##$WBST= 1024
##$WBSW= 4
##$XGAIN= (0..3)
0 0 0 0 
##$XL= 0
##$YL= 0
##$YMAX_a= 16180
##$YMIN_a= -17941
##$ZGOPTNS= <>
##$ZL1= 120
##$ZL2= 120
##$ZL3= 120
##$ZL4= 120
##$ABSF1= 182.463
##$ABSF2= -187.1042
##$ABSG= 5
##$ABSL= 3
##$ALPHA= 0
##$AQORDER= 0
##$ASSFAC= 0
##$ASSFACI= 0
##$ASSFACX= 0
##$ASSWID= 0
##$AUNMP= <proc_1d>
##$AZFE= 0.1
##$AZFW= 0.5
##$BCFW= 0
##$BC_mod= 2
##$BYTORDP= 0
##$COROFFS= 0
##$CY= -3
##$DATMOD= 1
##$DC= 0
##$DFILT= <>
##$DTYPP= 0
##$F1P= 0
##$F2P= 0
##$FCOR= 1
##$FTSIZE= 65536
##$FT_mod= 6
##$GAMMA= 0
##$GB= 0
##$INTBC= 1
##$INTSCL= 5.30512e-09
##$ISEN= 30
##$LB= 1
##$LEV0= 0
##$LPBIN= 0
##$MAXI= 10000
##$MC2= 0
##$MEAN= 0
##$ME_mod= 0
##$MI= 50
##$NCOEF= 0
##$NC_proc= -6
##$NLEV= 6
##$NOISF1= 182.463
##$NOISF2= 159.3651
##$NSP= 0
##$NTH_PI= 0
##$NZP= 0
##$OFFSET= 182.463
##$PC= 4
##$PHC0= -1631.244
##$PHC1= -5.598706
##$PH_mod= 1
##$PKNL= yes
##$PPARMOD= 0
##$PSCAL= 0
##$PSIGN= 0
##$REVERSE= no
##$SF= 81.0140089999434
##$SI= 65536
##$SIGF1= 159.3651
##$SIGF2= -187.1042
##$SINO= 113.3802
##$SIOLD= 16384
##$SREGLST= <1H.CDCl3>
##$SSB= 0
##$STSI= 65536
##$STSR= 0
##$SW_p= 29940.119760479
##$SYMM= 0
##$S_DEV= 0
##$TDeff= 32768
##$TDoff= 0
##$TI= <>
##$TILT= no
##$TM1= 0
##$TM2= 0
##$TOPLEV= 0
##$USERP1= <user>
##$USERP2= <user>
##$USERP3= <user>
##$USERP4= <user>
##$USERP5= <user>
##$WDW= 1
##$XDIM= 65536
##$YMAX_p= 384348006
##$YMIN_p= -25928391
$$ End of Bruker specific parameters
$$ ---------------------------------
##NTUPLES= NMR SPECTRUM
##VAR_NAME=  FREQUENCY,     SPECTRUM/REAL,   SPECTRUM/IMAG
##SYMBOL=    X,             R,               I
##VAR_TYPE=  INDEPENDENT,   DEPENDENT,       DEPENDENT
##VAR_FORM=  AFFN,          ASDF,            ASDF
##VAR_DIM=   65536,         65536,           65536
##UNITS=     HZ,            ARBITRARY UNITS, ARBITRARY UNITS
##FACTOR=    0.456856943014862, 1,           1
##FIRST=     14782.0589164792, 0,            0
##LAST=      -15158.0608439998, 0,           0
##MIN=       -15158.0608439998, -25928391,   0
##MAX=       14782.0589164792, 384348006,    0
$$ Real data points
##PAGE= N=1
##DATA TABLE= (X++(R..R)), XYDATA
$$ [...]
43118 -2638432 -1778793 -1572530 -1053994 537933 1969032 1494727 -420507 -1353471 -12011
43109 -12011 2065070 2411109 555710 -1623182 -2217353 -1203771 196306 1325288 2315503
43100 2315503 2807196 1932805 149677 -391757 1370029 3378359 2958988 567994 -1045473
43091 -1045473 -941057 -710410 -1026280 -400024 1583013 2561693 831789 -1663225 -2058641
43082 -2058641 -725437 -254197 -1369333 -2444893 -2566724 -2517649 -2691693 -2352107 -1394650
43073 -1394650 -866040 -1065572 -781362 787436 2664756 3471634 3148635 2556935 2172936
43064 2172936 1883222 1503670 944012 243773 -257270 -173053 394070 1022243 1622154 2292222
43054 2292222 2591720 1799847 73785 -1383548 -1558682 -489823 1152323 2672445 3448325
43045 3448325 3154626 2165550 1254181 761893 446713 33348 -588936 -1467877 -2258790
43036 -2258790 -2173223 -1104148 -351772 -1060867 -2314947 -2297311 -1185142 -1008026 -2278445
43027 -2278445 -2762615 -621686 2867447 5052515 5094395 4024798 2751897 1688339 1609861
43018 1609861 3024143 4867355 5440649 4684809 4091967 4275395 4197421 3250472 2511985
43009 2511985 2908057 3365291 2291658 328679 -28494 2237982 5102157 6000086 4929739
43000 4929739 3949188 4088970 4158363 2852540 818371 -202033 380940 1479917 1729808
42991 1729808 679671 -1165180 -2758109 -3108049 -2166426 -1086547 -1039496 -1895416 -2616347
42982 -2616347 -2653203 -2200068 -1365626 -109939 1043377 1250667 438494 -678817 -1646354
42973 -1646354 -2390247 -2409062 -1115590 861885 2030095 1985688 1721123 1723782 1401752 923607
42963 923607 1646271 3519067 3992913 1429422 -1838831 -2166910 513373 2871775 2863228
42954 2863228 1655544 657670 -683766 -2894665 -4392361 -3324841 -470394 1491530
42946 1491530 1254220 -33408 -876561 -1205572 -1594902 -1849529 -1353816 -389114 -56463
42937 -56463 -721168 -1344668 -839097 533243 1790461 2712488 3648329 4121735 3031169
42928 3031169 552860 -1473924 -1761445 -1075621 -711602 -584873 8726 679289 466698
42919 466698 -443911 -960666 -727233 -199575 559134 1631616 2036123 610123 -1666449
42910 -1666449 -2113208 124242 2589139 2634823 774016 -360257 494652 2162229 3001419
42901 3001419 2644672 1765995 1092485 888020 895355 627528 -66074 -800174 -1160173 -1140321
42891 -1140321 -918970 -645700 -760316 -1975906 -4313047 -6435287 -6649194 -4646437 -1876369
42882 -1876369 -160503 -183841 -1274304 -2323083 -2783865 -2861373 -2862277 -2630767 -1891383 -956998
42872 -956998 -573935 -1001416 -1722472 -2175995 -2261524 -1973961 -1186307 -161193 338167 24201
42862 24201 -275743 372866 1633418 2244055 1686649 819996 652172 1017954 914070 -21430
42852 -21430 -823529 -268422 1474828 2675759 1840703 -536677 -2477668 -2711190 -1841014
42843 -1841014 -1245658 -1413901 -1734365 -1529025 -817888 -151983 41370 -56247 164817 931068
42833 931068 1637928 1645793 1370656 1850162 3117996 3856974 3102322 1550572 543297
42824 543297 349068 250838 -52730 -61927 517490 1120094 892045 -448472 -2376945 -3888334
42814 -3888334 -4118323 -3064890 -1819222 -1786790 -3407344 -5587704 -6507037 -5263057 -2913785
42805 -2913785 -1606187 -2303632 -3705280 -3993982 -3210144 -2825176 -3194288 -2983648 -1507507
42796 -1507507 -41679 110675 -504898 -744344 -759293 -1151061 -1302301 -429645 387999
42787 387999 -633401 -2967916 -4060481 -2899366 -1265334 -738620 -377640 1406848 4071029
42778 4071029 5483149 4544766 2157096 39457 -603038 295320 1629264 2032218 1248960
42769 1248960 191038 -501291 -1075040 -1558241 -1245557 -35590 840597 464846 -326737
42760 -326737 -305772 197582 95029 -360992 82216 1448444 2259884 1706096 730438 516016
42750 516016 949013 1121996 624208 -146686 -511320 -127915 562810 609845 -231720 -844760
42740 -844760 -88441 1491994 2332598 2068192 1815286 2155541 2266378 1532231 637949
42731 637949 226002 -353382 -1845624 -3505682 -3951430 -3156074 -2456543 -2729512 -3454790
42722 -3454790 -3547877 -2453301 -479495 1427096 2362882 2314802 2075585 2027118 1579121
42713 1579121 326825 -930009 -1155605 -523684 23074 170650 175295 -85371 -718765
42704 -718765 -825868 546819 2473959 2830200 1287612 20583 662759 2023424 1941471
42695 1941471 257015 -1376405 -1844354 -1380346 -523509 374686 756157 149231 -1053232
42686 -1053232 -1931557 -2133216 -1948149 -1532528 -885937 -327038 9789 908354 3035526
42677 3035526 5195921 5144315 2645464 315060 467864 2216333 2899336 1645255 109727
42668 109727 -71240 834402 1572829 1603724 1280971 978817 692088 276260 -372613 -1289382
42658 -1289382 -2263334 -2733033 -2185919 -807229 437078 587268 -396360 -1598800 -2038891
42649 -2038891 -1471666 -329776 811208 1492279 1401952 592907 -416791 -1150359 -1702126
42640 -1702126 -2340116 -2711529 -2094609 -533152 934699 1431186 1076347 470302 -9295
42631 -9295 -102247 387961 1046634 945737 -120859 -1185753 -1522726 -1665013 -2109880 -1961848
42621 -1961848 -306996 1709743 1978045 445120 -776854 -509588 142442 49998 -253318
42612 -253318 -132597 -343983 -1542550 -2686503 -2535052 -1663770 -1352990 -1428622 -976023
42603 -976023 -305145 -140942 421738 2690636 5396617 5680665 3346696 1319638 1051247
42594 1051247 414835 -2208624 -4545420 -3709908 -838310 647147 251847 636537 2957600
42585 2957600 5170346 5494596 4798884 4481600 4256679 3416379 2517205 2295623 2200942
42576 2200942 1447577 520387 262371 276668 -409864 -1667619 -2478260 -2383001 -1643046 -436376
42566 -436376 1004547 1907675 1778908 1329366 1392106 1308869 -134669 -2306260 -2960608
42557 -2960608 -1287847 817268 1384775 1011188 1603909 3206848 3636018 1498382 -1557329
42548 -1557329 -2436406 -150646 2979072 3902147 2090482 -331077 -1354611 -1037989 -534249
42539 -534249 -238611 301287 1242512 2146485 2623065 2602272 2162499 1633110 1516845 1693352
42529 1693352 1171234 -529879 -2179425 -2071578 -243619 1624988 2444185 2712973 3184538
42520 3184538 3627232 3291091 1899742 -25267 -1334155 -984834 641323 1600262 666754
42511 666754 -711287 -243665 1746942 2642445 1412464 57798 561516 2434967 4232930
42502 4232930 5520371 6043353 4839353 1940277 -460901 -391523 1384479 2845840 3562724
42493 3562724 4247004 4550932 3538689 1798135 950042 1257879 1556891 1318272 996380
42484 996380 618770 -48550 -162707 1250797 3008020 2641999 -95386 -2736820 -3587304
42475 -3587304 -3516031 -3533591 -2940455 -1287231 -146986 -1001199 -2688173 -2933731 -1647694
42466 -1647694 -844293 -1632841 -2967025 -3440965 -2956782 -2248926 -1717979 -1275217 -881484
42457 -881484 -743722 -964789 -1228842 -1132719 -904119 -1310498 -2432607 -3077691 -2214411 -549721
42447 -549721 377549 318819 186638 2491 -1288345 -3610504 -5110095 -4570735 -3105133
42438 -3105133 -2458789 -2742763 -2832357 -2074694 -673378 789861 1419819 486135 -1397792
42429 -1397792 -2532580 -2315095 -2043997 -2700919 -3265858 -2472259 -973999 -205923 -111056
42420 -111056 263349 696329 216128 -842325 -1071532 -162705 843428 1442238 2106613
42411 2106613 2659460 1903438 -463379 -2796365 -3177417 -1510811 511180 1100026 -133559
42402 -133559 -1945850 -2661047 -1838809 -475158 594747 1636244 2815871 3216659 2218740
42393 2218740 911059 659716 1023971 743417 157810 703250 2307496 3323383 3080362
42384 3080362 2543259 2246390 1546378 352945 -286281 51283 491713 522221 649640
42375 649640 860935 250119 -1093758 -1692547 -1071708 -647304 -1138300 -1113107 366229
42366 366229 1566363 551852 -1637941 -2461913 -1483842 -331967 173830 613186 1097791
42357 1097791 1019646 642098 961931 1800325 1816405 743280 -20118 505372 1663175
42348 1663175 2542402 3208370 3873822 4005439 3087570 1500719 -19438 -1178444 -1917732
42339 -1917732 -2087830 -1793144 -1432524 -972756 136044 1812157 2801272 2015775 -6426
42330 -6426 -1681997 -2153871 -1824896 -1308285 -623067 382495 1397382 1888962 1773391
42321 1773391 1444329 1136050 617021 -321572 -1386095 -2116515 -2496717 -2814631 -3052194
42312 -3052194 -2933945 -2528572 -2179803 -1787481 -886602 338090 897417 302189 -626410
42303 -626410 -731293 264076 1862884 3299169 3429726 1213466 -2632082 -5278967 -4463517
42294 -4463517 -1151182 1657514 2416528 2063346 1926198 2197826 2546421 2691478 2048009
42285 2048009 240748 -1593440 -1524730 417293 1651530 268646 -2377393 -3603731
42277 -3603731 -2929219 -2081308 -2054093 -1930936 -707196 1220202 2823700 3592239 3438185
42268 3438185 2437145 1249730 947326 1662050 2079852 1144250 -278531 -526865 353271
42259 353271 584805 -626570 -1724275 -991834 912686 1827173 910760 -732894 -1990869
42250 -1990869 -2814694 -3216135 -2728770 -1544213 -927634 -1559774 -2395384 -2117797 -898388
42241 -898388 284158 1209060 2032611 2079194 623142 -1381574 -1942429 -543105 1255427
42232 1255427 1859592 1090178 -485037 -2273296 -3366790 -2879044 -1190001 193048 536712
42223 536712 620553 1135113 1562932 1343719 956326 930875 846742 328603 43890 543033
42213 543033 1011397 527482 -190406 150336 1114394 1039009 -287411 -1223081 -836203 -174026
42203 -174026 -268861 -391133 541965 1890180 2083441 1020999 230209 587277 1190937
42194 1190937 1005880 534055 868311 1722512 1721292 662780 157951 1384590 3302238
42185 3302238 4183357 4112316 4449720 5165589 4589350 2248388 184427 328490 1852120
42176 1852120 2503909 1649966 410734 -623475 -1957773 -3467040 -3933165 -2994370 -2177747
42167 -2177747 -2932081 -4450417 -4586011 -2637600 -226851 700822 25750 -746942 -431502
42158 -431502 605528 1178081 826585 259312 352132 1137394 1935769 2168712 1792595 1114172
42148 1114172 398096 -393468 -1466804 -2644883 -3132733 -2304968 -652476 668767 1226442
42139 1226442 1498256 1650337 1184629 118139 -662855 -836034 -1222778 -2081501 -2138692
42130 -2138692 -653277 701912 -231429 -3016861 -5272302 -5853955 -5467473 -4537155 -2783677
42121 -2783677 -1027401 -1020481 -2758447 -3970813 -3177380 -1461927 -292310 573332 1762000
42112 1762000 2532668 1881275 209459 -1448383 -2762934 -3497580 -2880066 -1010707 377564
42103 377564 179990 -259433 633478 1830596 1286394 -521329 -1123183 194613 1580544
42094 1580544 1599234 787853 -17735 -776946 -1183376 -478188 1004679 1784359 1322873
42085 1322873 609771 255671 -178434 -410479 891317 3583911 5147205 3846031 1331611
42076 1331611 479483 1716236 3040608 2912689 1725604 910393 1575054 3469899 4675962
42067 4675962 3304306 152209 -1698218 -814730 714800 639081 -98041 655094 2547941
42058 2547941 3581080 3576355 3953622 4600377 3941760 2173798 1532848 2748919 3805960
42049 3805960 3134610 1766287 1230186 1341755 1325032 1352362 1617083 1407533 511460 232061
42039 232061 1537564 3220313 3322306 1672403 -183673 -941422 -422956 820718 1829842
42030 1829842 1734557 718144 -81259 -116290 -11022 -171948 -65726 453737 518145 -144925
42020 -144925 -485270 -137536 -481798 -2175257 -3343632 -2317764 -716816 -1254100 -3442125
42011 -3442125 -4270350 -2723989 -813803 -94657 50550 181356 -475294 -2079287 -3178028
42002 -3178028 -2833286 -1941249 -1343103 -384738 1374563 2655775 2233740 1017138 766352
41993 766352 1558461 2021982 1564737 1001627 1191221 2120034 3235372 3885692 3528557
41984 3528557 2136331 394466 -794659 -897140 100235 1582479 2355372 1612886 86896
41975 86896 -535618 402922 1862644 2546434 2112315 869754 -551196 -954785 659303
41966 659303 3504729 5364880 5144788 3910818 2876646 1813699 291085 -1003072
41958 -1003072 -1370957 -1336482 -1621350 -2020393 -2351740 -3201824 -4490551 -4735462 -3269633
41949 -3269633 -1761488 -1717630 -1885450 -374741 1824351 2101787 331770 -1044714 -828434
41940 -828434 -238824 -162674 73510 671240 684107 241983 1042957 3377499 4744729 3009537
41930 3009537 -556875 -2851421 -2428068 -251174 1902219 2641967 1612515 73704
41922 73704 -70901 1235403 1762236 71814 -2198527 -2565610 -1193731 -405753 -1217213
41913 -1217213 -2132557 -1462716 552163 2285369 2499905 1295522 -170320 -775696 -524591
41904 -524591 -357440 -676193 -688610 216923 1157122 814207 -568574 -1368469 -759534 275410
41894 275410 366351 -569658 -1517540 -1802339 -1849234 -2503361 -3836228 -4892719 -4768248 -3684056
41884 -3684056 -2555380 -1638254 -314832 1605762 3096453 2917245 1043472 -1260530
41876 -1260530 -2544831 -2271470 -1259725 -1080062 -2405736 -3956086 -3915293 -2485063 -1864234
41867 -1864234 -3232511 -4999223 -4944901 -3030864 -876539 717413 2170579 3333193
41859 3333193 2903473 165179 -3544125 -5719558 -4949623 -2277533 -378361 -1048483 -3284598
41850 -3284598 -4277411 -2556898 450724 2337395 2367989 1584715 1081835 1161237 1673738
41841 1673738 2138783 1767884 278804 -1453764 -2273246 -2035717 -1397206 -719138 25333
41832 25333 633347 837515 831440 871120 705182 158209 -237820 -122701 -218395 -1165895
41822 -1165895 -2003244 -1332441 258221 666365 -658722 -1807287 -1156122 403999 872359
41813 872359 -237957 -1612380 -1880687 -907664 320213 618048 -349574 -1731081 -2426913
41804 -2426913 -2262665 -1783086 -1151786 -63639 1338440 2363108 2683737 2597480 2386420
41795 2386420 2209584 2478997 3328686 3823540 2915951 1211058 417674 860818 1040977
41786 1040977 92336 -905019 -834067 -291831 -404231 -1124158 -1799150 -2302505 -2436706 -1355504
41776 -1355504 960196 2574278 1633260 -986970 -2706896 -2591593 -1987970 -1912627 -1675610
41767 -1675610 -623308 399641 408242 40187 680302 2225298 2902374 1502215 -975929
41758 -975929 -2350655 -1566890 484034 2278574 3147879 3232078 2637184 1430684 269580
41749 269580 141411 1237808 2661095 3447954 3380567 2692937 1638701 583045 -114290
41740 -114290 -586399 -1235128 -1836754 -1670348 -884160 -825203 -2326189 -4337679 -5020964
41731 -5020964 -3783894 -1660129 -106370 80980 -811146 -1495173 -679013 1460037 3250803
41722 3250803 3415801 2375203 1211040 165603 -1070283 -2324025 -3139476 -3482607 -3402592
41713 -3402592 -2527444 -768211 1001337 1867233 1992004 1999658 1910155 1636163 1761627 2594554
41703 2594554 3140228 2438975 1321179 1200439 1589749 735214 -1371487 -2616800 -1753918
41694 -1753918 6967 936482 751680 105465 -340113 273540 2485346 4968961 5114086
41685 5114086 2312489 -725306 -1247760 171552 1013684 448285 -248620 -277462 -341306
41676 -341306 -1065879 -2041948 -2810056 -3535747 -4211868 -4133640 -2714320 -253476 2421418
41667 2421418 4569034 5619981 5289468 3967020 2544165 1499205 463124 -1033380
41659 -1033380 -2697628 -3714667 -3682174 -2954274 -2062335 -1106264 91328 1396440 2284761
41650 2284761 2453301 2168243 1714212 860453 -538200 -1654095 -1345253 100560 871545
41641 871545 -84227 -1521174 -1642214 -809204 -1129249 -3301373 -5273063 -4730461 -1954897
41632 -1954897 759085 1922860 1952232 1701871 1271538 705022 714438 1698701 2637929 2104266
41622 2104266 229172 -1403584 -1917620 -2109278 -2880468 -3793735 -3974949 -3618799 -3539313
41613 -3539313 -3684211 -3201488 -1861729 -441483 365094 607400 569661 358777 156795
41604 156795 215283 389454 216040 -370331 -825952 -576079 519057 2069287 3049015
41595 3049015 2222602 -407940 -2821320 -2770421 -398927 2004298 2899041 2864109 2876490
41586 2876490 2796987 2365583 2323905 3282108 4303614 3904461 2087670 374032 20405
41577 20405 945499 2187973 2839284 2773605 2828909 3819171 5118121 5053399 3176210 1114646
41567 1114646 402365 539931 298613 -105930 371968 1583733 2440932 2737122 3033776
41558 3033776 3047121 1994809 489192 89705 647555 133903 -2097132 -3782409 -2766991
41549 -2766991 -67788 1571541 1109835 -358124 -1788949 -3095128 -4183583 -4696665
41541 -4696665 -4788961 -4881512 -4544396 -2890109 -338933 1293690 1075801 260027 498507
41532 498507 1597301 2051317 1278887 206602 -206746 29058 525437 1155431 1743107
41523 1743107 1867451 1467103 1091297 1081007 1030682 632887 572828 1804425 4120557 6135387
41513 6135387 6672996 5710517 4103186 2873786 2569783 2785620 2552566 1695497 1301860
41504 1301860 2078944 2901747 2263328 722539 272735 1354006 2308472 2084657 1549191
41495 1549191 1440975 1019660 -89345 -561901 523392 1792889 1604668 698552 836088
41486 836088 1823023 2056446 1321766 773596 525500 -447732 -2078575 -3061221 -3037982 -2846199
41476 -2846199 -2448103 -845121 1550504 2754561 2183708 1651803 2418196 3270865 2779497
41467 2779497 1599919 1071957 1099310 958782 836849 968368 488091 -1140434 -2564839
41458 -2564839 -2194589 -665700 69918 -457758 -1035362 -903278 -360070 524845 2034630
41449 2034630 3521765 3572461 1874650 -215049 -1331529 -1439297 -1293573 -1401308 -1761446
41440 -1761446 -1990977 -1560982 -383953 916681 1770462 2327727 2737571 2330542 591568
41431 591568 -1398021 -1795279 -359132 1132760 1059356 -383399 -1915664 -2652553 -2496615
41422 -2496615 -1808934 -1132010 -814898 -721546 -653594 -913227 -1803712 -2707396 -2568296 -1437640
41412 -1437640 -645784 -1048381 -1841628 -1698177 -627339 -47770 -1020105 -2837238 -3707124
41403 -3707124 -2862659 -1543530 -1321073 -1796837 -1145910 889699 2110505 921827 -1125864
41394 -1125864 -1443181 -43890 857898 316839 -464485 -672310 -1027281 -1830701 -1891886
41385 -1891886 -427327 1515228 2615200 3014725 3433094 3636005 2930209 1396150 -354921
41376 -354921 -1964551 -3056224 -2991103 -1810581 -677127 -410616 -261680 837817 2382498
41367 2382498 2745733 1201336 -1382436 -3522579 -4046771 -2601748 -247919 841714
41359 841714 -626332 -3455907 -5158751 -4598485 -2712123 -952962 -9503 87819 -342339
41350 -342339 -677487 -527379 -337217 -736023 -1261639 -655905 1222109 2580733 1507161
41341 1507161 -1668557 -4452197 -4797884 -3303127 -2352840 -3066299 -3815470 -2473226 418332
41332 418332 2053225 993232 -1111860 -2075390 -1976687 -2194041 -2786870 -2521695 -1035026
41323 -1035026 595643 1391422 1404896 1213601 1502672 2860357 4824654 5484777 3492403
41314 3492403 335515 -1005752 170229 1482660 843009 -990333 -1997556 -1616051
41306 -1616051 -825919 -538015 -925463 -1648285 -1924173 -1040409 538430 1349255 886086
41297 886086 460652 1256538 2476015 2568046 1510007 493566 -140461 -1107556 -2404989
41288 -2404989 -2810954 -1546808 580982 2110953 2295008 1352780 142547 -190449 935724
41279 935724 2628757 3163612 2024808 697637 843616 2223788 3192281 2895185 2011576
41270 2011576 1294668 446810 -948201 -2163696 -2090410 -1068479 -763461 -1826188 -2750946
41261 -2750946 -1947841 -162028 456476 -632413 -1743510 -1538301 -731584 -522780 -581586
41252 -581586 228761 1846307 2964346 2722768 1464426 -11549 -1057165 -1181809 -358920
41243 -358920 672544 1173190 1385296 1938603 2448905 1859858 335019 -448386 499768
41234 499768 2021809 2392253 1549793 733029 473537 201609 -315271 -450491 42925
41225 42925 379497 -14231 -456522 -124005 388806 -157762 -1447688 -1557210 386248
41216 386248 2653736 3005439 1560838 364116 514362 1144659 1250030 1033010 960551
41207 960551 850502 725267 1397084 3073377 4282942 3525161 1428048 -62220 -219651
41198 -219651 165300 738539 2092813 4054948 5097689 4245474 2431124 1177443 835237
41189 835237 842059 851101 772278 382314 -311172 -882599 -1281772 -2055083 -3055658 -2903635
41179 -2903635 -903008 1296243 1479621 -67811 -902836 178423 1725132 1999079 1213204
41170 1213204 612021 562058 586451 403643 -134614 -1436773 -3357354 -4513528 -3698585
41161 -3698585 -1752374 -708134 -1037770 -1124373 99343 1324389 620830 -1884073 -4222486
41152 -4222486 -4994035 -4424896 -3268567 -1898295 -691583 -211976 -440928 -552603 -27052
41143 -27052 545920 299535 -754741 -1933085 -2749728 -2961967 -2253532 -747164 451617
41134 451617 217344 -1055816 -1742699 -962949 511027 1497754 1728409 1581506 1291036
41125 1291036 980608 915271 1123469 1133647 561554 -357614 -1177624 -1770577 -2071723 -1770624
41115 -1770624 -750183 545675 1616479 2360540 2656481 2134386 949521 76801 2144
41106 2144 -203092 -1433991 -2817725 -2861570 -1947697 -1903669 -2989858 -3269164 -1715664 -107032
41096 -107032 -419397 -1730751 -1595853 195981 1258472 52286 -2083579 -2938722 -2125043
41087 -2125043 -888930 -168627 89819 105284 -207554 -797851 -1234094 -1126819 -481519
41078 -481519 428225 1215747 1364977 489826 -1096668 -2324047 -2271670 -1149773 -125236
41069 -125236 -112931 -919426 -1641891 -1740536 -1592499 -2029472 -3341523 -4728069 -4945868 -3731752
41059 -3731752 -2289459 -1808145 -1721141 -433995 2017480 3302302 1701283 -1354131 -3085864
41050 -3085864 -3086499 -3404955 -4954331 -5883287 -4371727 -1424815 415922 105121 -1401714
41041 -1401714 -2801657 -3267892 -2319931 -359064 1052890 869893 217780 905541 2571324
41032 2571324 3120298 2052623 1279900 1974367 2629997 1529050 -524469 -1571497 -1330906
41023 -1330906 -824461 -140353 1262361 2484306 1802643 -420203 -1696116 -1029256 -500741
41014 -500741 -1965789 -3985952 -3964784 -2149980 -1184183 -1988053 -2436911 -734846 1803433
41005 1803433 2602314 1293679 -132787 -171516 649099 1224868 1679518 2893356 4718610
40996 4718610 5646115 4573623 2370971 1033178 1322027 1920416 1234915 -586069 -2074785
40987 -2074785 -2415128 -2022417 -1287147 53372 1834241 2786615 1879658 -135919 -1429046
40978 -1429046 -1218105 -511157 -711476 -2018928 -3320561 -3358206 -1947329 -147646 884620
40969 884620 1175326 1634499 2477057 2768673 1949544 903226 733800 1293891 1933607
40960 1933607 2896131 4533470 5684668 4649597 1828573 -311400 -295031 826818 1448633
40951 1448633 1369771 1067191 491382 -369814 -875410 -722124 -581182 -821233 -670774 280046
40941 280046 846887 -143732 -1924368 -2910467 -3010318 -3244177 -3582958 -2858373 -745469
40932 -745469 1585940 2902159 2963907 2247332 1532348 1547376 2176930 2403816 1777229 1157320
40922 1157320 1097456 701055 -499805 -948784 553324 2174779 1524454 -148907 398658
40913 398658 2906221 3585358 1089371 -1473495 -1822795 -1842046 -3378129 -4369052 -2426385
40904 -2426385 511269 860744 -1120636 -2313604 -1978012 -2135697 -3214849 -3167601 -1326295
40895 -1326295 206090 -50075 -859333 -665885 116018 378456 165982 95637 132197 -186108
40885 -186108 -1096009 -2479121 -3563518 -3007485 -563361 1708801 1596704 -165248 -978786
40876 -978786 -397453 -530987 -2092704 -2870670 -1337366 723558 920723 -418376 -1541371
40867 -1541371 -2254700 -3457256 -4780751 -4885931 -3683804 -2487843 -2107885 -2134036 -1956018
40858 -1956018 -1387859 -428732 726241 1624395 2104913 2518778 2958415 2961576 2462565 2093502
40848 2093502 1914587 995503 -844596 -2108154 -1662410 -632520 -823456 -2131926 -3031781
40839 -3031781 -2890618 -2235243 -1335826 -177700 589492 304737 -387685 -385160 42402 -163017
40829 -163017 -784459 -620554 339734 919328 967262 1594004 2856206 3201087 1973473
40820 1973473 710301 900525 1899877 2244563 1883390 1802362 2180725 2209200 1472356 528413
40810 528413 95511 231210 417472 276200 120948 536146 1242770 1026537 -524328
40801 -524328 -1918743 -1588189 -270931 41626 -676047 -289006 2104242 4559867 4998421
40792 4998421 3849614 2781144 2202467 1507829 781686 676113 1111163 1410351 1374106
40783 1374106 1168723 624779 -234860 -419611 976397 3090998 3915071 2772197 1180649
40774 1180649 910825 1920171 2658730 2022044 547116 -362147 -178053 176981 -255905
40765 -255905 -1028263 -1106247 -784579 -1385616 -2865798 -3336287 -1786924 165059 476517
40756 476517 -579141 -1361896 -1536141 -1933032 -2360166 -1689459 -189289 243543 -1194882
40747 -1194882 -2856890 -2882377 -1601091 -721538 -978460 -1624021 -1782485 -1338620 -595681
40738 -595681 184598 757310 879390 571663 214005 143901 168839 -263378 -1234922 -2003650
40728 -2003650 -1929395 -1496411 -1638872 -2119059 -1656392 23818 1465967 1508469 876328
40719 876328 706521 559607 -626456 -2347153 -3030550 -2440381 -1876009 -1949971 -1824342
40710 -1824342 -992784 -296814 -528401 -1199691 -1388893 -944307 -324973 5328 -315813
40701 -315813 -1262326 -2013777 -1724342 -863473 -741543 -1522500 -1987729 -1607879 -1325305 -1570108
40691 -1570108 -1109699 870917 2859511 2804585 991754 -516549 -832413 -943894 -1568650
40682 -1568650 -1994734 -1539777 -886775 -1134943 -2147613 -2568316 -1335947 1150108 3305581
40673 3305581 3693203 2192059 -58497 -1803123 -2626355 -2871562 -3005694 -3183686 -3118465
40664 -3118465 -2312919 -797129 389039 62405 -1632197 -3278862 -3885370 -3755627 -3454570
40655 -3454570 -2890398 -1944477 -1061059 -510709 40511 446264 -442537 -3100485 -5938117
40646 -5938117 -6895381 -5867828 -4255644 -2660313 -622183 1588728 2667206 2070197
40638 2070197 753497 -265017 -911860 -1310444 -1237414 -812704 -667875 -908749 -871558
40629 -871558 -359857 -58105 -157715 252272 1558164 2467956 1687853 27649 -484338
40620 -484338 748133 2335667 2877996 2346806 1406516 453156 -235137 -188038 788498
40611 788498 2156066 3059347 3043938 2235861 1139247 458092 741290 1805410 2702075
40602 2702075 2688370 2191540 2375117 3612136 4788630 4487342 2682505 844663 354478
40593 354478 1175450 2190760 2486984 2056133 1475416 1230936 1361192 1620418 1915420
40584 1915420 2413586 3051768 3228999 2512615 1485101 1101848 1155772 374788 -1585887
40575 -1585887 -3358943 -3842687 -3896514 -4851267 -6151134 -6062882 -4377593 -2743686 -2263672
40566 -2263672 -2341410 -2215344 -2079627 -2074664 -1594540 -505999 80599 -731479 -2243537 -3139464
40556 -3139464 -3052322 -2286519 -872521 970332 2167683 1924009 1112185 1238240 2253465
40547 2253465 2680824 1857079 758959 417635 688747 957729 1046915 965785 642832 407748
40537 407748 934669 2128912 2804840 2156033 908569 214383 -36263 -728134 -1601384
40528 -1601384 -1105896 1416393 4347228 5339378 3814499 1278746 -544801 -1185415 -1157900
40519 -1157900 -1070965 -1293107 -1911681 -2584982 -2744971 -2236101 -1448958 -676827 88028 440846
40509 440846 -485448 -2582283 -4056553 -3378125 -1493713 -667122 -1269162 -1394720 47009
40500 47009 1673532 1923831 1351659 1231610 1181021 -7932 -1897481 -2719976 -2016783
40491 -2016783 -1168067 -1076669 -992097 -221207 463036 105953 -757248 -871369 -209231 -88887
40481 -88887 -1404519 -3502095 -4956884 -4997245 -3972515 -2723468 -1814384 -1372662 -1321077
40472 -1321077 -1364231 -865574 593029 2267289 2583377 1065620 -631661 -542343 1073654
40463 1073654 2070144 1233009 -386954 -1227680 -1210993 -1354400 -2157092 -3127936 -3547466
40454 -3547466 -3132599 -2151928 -1200612 -623221 -43185 1096687 2453941 2960475 2349530
40445 2349530 1655669 1604972 1342846 -252920 -2505667 -3362284 -1852583 840654 2900997
40436 2900997 3604824 3272183 2354276 1189510 178091 -477026 -1048793 -1798333 -2324716
40427 -2324716 -1982387 -1029598 -721913 -1781789 -3164421 -3085536 -1299653 388877 265675
40418 265675 -1243784 -2295138 -1983172 -1112252 -705967 -750425 -804995 -1017731 -1715083 -2348842
40408 -2348842 -1793878 82133 1773123 1588811 -413460 -2446742 -3018058 -2406829 -1744434
40399 -1744434 -1190251 -11405 1627597 2298649 1384275 366980 882973 2272816 2512646
40390 2512646 1164000 -208622 -500193 -262918 -146507 175613 845182 1126979 810358
40381 810358 890507 1712745 1817276 162500 -1668133 -1441385 206658 400394 -1836438
40372 -1836438 -4126731 -3978768 -1805831 133330 519212 -274785 -1243148 -1503838 -585805
40363 -585805 1075571 2257766 2324311 2157501 2941639 4288523 4572065 3255004 1894948
40354 1894948 2170375 3486518 3531744 1253993 -1653859 -2797697 -1941376 -923834 -1079862
40345 -1079862 -1934391 -2544955 -2788411 -2660904 -1541159 660976 2453290 2285148 719294
40336 719294 -345748 -424827 -821666 -2072499 -2727909 -1549763 376832 947550 -278931
40327 -278931 -1896339 -2769330 -3164230 -3740176 -4405451 -4574805 -4000727 -2919518 -1651869
40318 -1651869 -461505 261784 83546 -979983 -2235591 -2892861 -2799024 -2254774 -1256940
40309 -1256940 343753 1813391 1724590 -61521 -1494381 -651057 1549602 2405081 1058429
40300 1058429 -550325 -669975 -5054 -87806 -750627 -610785 663091 1996423 2606183
40291 2606183 2829333 3135642 3299705 2962066 2393834 2153380 2149680 1532656 -190461 -2082693
40281 -2082693 -2395063 -611678 1630483 2355620 1591222 929647 1020480 869877 -181698
40272 -181698 -1285917 -1578479 -1531413 -1855115 -2174033 -1933825 -1664650 -2049926 -2532925 -2259960
40262 -2259960 -1747658 -2016246 -2494997 -1562585 851390 2900784 3318023 2731999 2096252
40253 2096252 1352029 400889 65374 1010153 2526592 3315925 2920649 1726111 220522
40244 220522 -1023888 -1304477 -605282 -2413 -402587 -1224408 -1181707 -116240 865090
40235 865090 996643 644499 312583 -220430 -1203763 -1988489 -1674138 -582830 -217846
40226 -217846 -1326661 -2620977 -2250680 -376086 737642 -468770 -2859203 -4135824
40218 -4135824 -3615480 -2443520 -1545008 -723899 201470 739754 675610 597571 850798 849159
40208 849159 165086 -429032 112270 1576831 2704976 2684600 1765544 607875 -297757
40199 -297757 -656370 -464722 -185554 -417513 -1277643 -2285944 -2803585 -2460706 -1363567
40190 -1363567 -88823 732172 1024891 1269343 1776329 2295935 2489984 2373535 2084425
40181 2084425 1699860 1534600 2019615 2875796 3064251 2188454 1347662 1741082 2839534
40172 2839534 2963837 1568446 -60160 -555359 -55403 349060 119006 -311507 -342111
40163 -342111 16744 220837 -85844 -525874 -324276 761685 2110859 3004239 3399923
40154 3399923 3627514 3620427 2969550 1698942 567258 431566 1363560 2396949 2328428
40145 2328428 1102635 194867 911976 2362676 2184804 -329010 -2973073 -3286172 -1470802
40136 -1470802 373796 1042975 939645 653080 341509 287270 708201 1120763 1042272 1038838
40126 1038838 1815442 2680512 2473852 1651452 1561199 1875042 1069530 -353215 151174
40117 151174 2988599 4893684 3341390 290691 -714834 501274 1259461 392807 -644197
40108 -644197 -695808 -399201 -528995 -916380 -1442288 -2402945 -3450637 -3678097 -3175620 -3063474
40098 -3063474 -3513392 -3192996 -1364585 769155 1700463 1577399 1590474 2146517 2601136
40089 2601136 2405220 1754827 1263940 1422748 2210501 3039209 3311930 3039332 2522333
40080 2522333 1606088 10680 -1595862 -1818629 -219487 1934140 3010459 2544270 1161050
40071 1161050 -360788 -1555634 -2336642 -2967660 -3604320 -3805404 -3093689 -1988805 -1593090
40062 -1593090 -1985511 -2038245 -1168582 -173099 233452 544991 1252743 1573232 610887 -946286
40052 -946286 -1678783 -1619514 -2174014 -3810530 -5103215 -4551739 -2521821 -781059 -480536
40043 -480536 -1053902 -1045564 217823 1933951 2869760 2864392 2799800 3076420 2852201 1248786
40033 1248786 -1191028 -2829028 -2514867 -515336 1859874 3271724 3296796 2632862 2159698
40024 2159698 1859307 1189647 351708 172446 635023 814030 708764 1654388 3960638
40015 3960638 5568239 4534432 1849524 149514 317799 1028571 1138031 686461 -305554
40006 -305554 -2153199 -4296646 -5282657 -4438103 -2518242 -523623 1053411 1774870 1289979
39997 1289979 -23145 -1557847 -3562933 -6391509 -8767733 -8582951 -5818134 -2981836
39989 -2981836 -1980118 -2099938 -1863417 -1294947 -1210017 -1523745 -1551232 -1157543 -573798 177310
39979 177310 788768 394480 -1323601 -3435787 -4875699 -5462220 -5225221 -3838019 -1638981
39970 -1638981 -124879 -233591 -948169 -749675 279123 930855 755097 294379 18286
39961 18286 123349 853682 1979784 2510323 1913010 1007761 684147 513242 -234378 -1008280
39951 -1008280 -770222 264039 1002441 1035783 600995 -296681 -1411453 -1742545 -986938
39942 -986938 -605524 -1729320 -2997583 -2596779 -1526528 -2197164 -4297362 -5035083 -3535367
39933 -3535367 -1955248 -1701710 -1597865 -834191 -731986 -1901450 -2284795 -200863 2685298
39924 2685298 3751990 3279779 3584104 5285315 6679984 6366872 4668316 2670180 1242043
39915 1242043 766180 795408 385410 -471957 -548250 690708 1989110 2186905 1894677
39906 1894677 1916569 1393717 -631780 -2958268 -3690483 -3161335 -3120994 -3548889 -2707467
39897 -2707467 -258856 2060993 3119733 3517734 3608584 2576630 307241 -1699546 -2305668
39888 -2305668 -2164341 -2277490 -2463513 -2153085 -1504638 -857072 -143464 416439 193310
39879 193310 -514189 -260957 1454358 3047767 2956999 1888222 1641888 2446895 2894097
39870 2894097 2170742 1042634 592180 942624 1417572 1451153 1248390 1613836 2773447
39861 2773447 3426183 1899764 -1439718 -4051339 -4150584 -2666033 -1421733 -637324 437345
39852 437345 1560400 2008912 2340053 3601564 5060738 4847489 3018285 1867530 2610696
39843 2610696 3763529 3768571 3317566 3598338 3819485 2448207 28577 -1269623 -678596
39834 -678596 360012 504129 56351 -163406 -120177 -92117 81917 529992 784358 372546
39824 372546 -412556 -791427 -248983 1181349 2880353 3696350 2724641 451319 -1464869
39815 -1464869 -1963581 -1530259 -1000018 -293365 899463 1977415 2066905 1346469 686542
39806 686542 354405 170262 513718 1739208 2765874 1940399 -386512 -1773352 -838690
39797 -838690 975719 1681683 1371670 1322649 1677428 1674947 1526807 2318886 4121305 5638766
39787 5638766 5916382 5252631 4215709 2814013 1050036 -488164 -1088548 -632274 309041
39778 309041 843367 386129 -664578 -1118712 -362500 781662 1155291 781411 469815
39769 469815 382257 129530 9485 753452 1945240 2094589 753489 -613060 -497825
39760 -497825 834826 2037547 2389464 2148036 1800748 1599980 1457711 911070 -401560
39751 -401560 -1992807 -2764996 -2215229 -904352 351177 1139629 1339708 1178469 1400629
39742 1400629 2399066 3175390 2361193 332885 -1145478 -1567087 -2157202 -3191776 -3004791
39733 -3004791 -888739 1091531 1007530 41048 331473 1285900 705818 -1273833 -2264817
39724 -2264817 -1424637 -366837 -27927 655280 2211376 3280966 2947247 2302113 2364429
39715 2364429 2309339 1292490 415409 1116800 2803313 3818358 3838977 3616329 3139931
39706 3139931 1894865 450182 -43057 271799 316322 211742 1183119 3065591 3821075
39697 3821075 2399557 542891 540872 2260138 3716056 3903431 3602506 3530972 3123316
39688 3123316 1702252 14784 -261875 1505815 3933989 4894595 3691837 1754889
39680 1754889 1065862 2087776 3475652 3654563 2280918 246347 -1169514 -1032487 675962
39671 675962 2794599 3800032 3376779 2705491 2684373 2561757 1319953 -145456 225558
39662 225558 2641089 4807297 4978929 4193848 4269390 4777463 3791934 1143392 -990308
39653 -990308 -983466 327373 1218337 1280499 1194238 1194938 750019 -537910 -2260441 -3246793
39643 -3246793 -2258252 660919 3423223 3562574 1170803 -888186 -443546 1380566 2067810
39634 2067810 1145113 168323 -46558 -286155 -1039350 -1514371 -1088024 -349725 31433
39625 31433 399928 1243578 2058618 2006805 1201846 483051 191144 -45032 -400524 -462987
39615 -462987 84768 884550 1279960 1000165 184999 -1063812 -2640377 -3816079 -3320753
39606 -3320753 -822914 1878440 2176748 -464350 -3741829 -5053613 -4017409 -1990760
39598 -1990760 -197066 667966 18732 -1839123 -3044676 -2005365 262427 1256918 401455
39589 401455 -524966 -577196 -1053539 -2748821 -3890751 -2615213 -123633 752946 -439764
39580 -439764 -1233161 259177 2991008 4611103 4193706 2700704 1569193 1536646 2392463
39571 2392463 3247769 3184037 2080631 852248 622443 1535378 2511288 2398687 1341579
39562 1341579 624388 1011772 1820435 2154823 2417481 3541520 5082496 5500490 4477807
39553 4477807 3471602 3439161 3508398 2836487 2351524 3191251 4464441 4346562 2884123
39544 2884123 1897786 2173106 2480084 1711691 469088 -129558 -17927 232348 507711
39535 507711 1014910 1660561 2312753 3208502 4388072 5123995 4742367 3862398 3956243 5452585
39525 5452585 6926456 6642442 4585041 2461049 1775276 2376003 2960056 2508062 974149
39516 974149 -923195 -2103538 -1756329 -280680 664453 -147191 -1898618 -2677545 -1932327
39507 -1932327 -900435 -531744 -330581 265830 718199 473029 77239 136248 123571 -572608
39497 -572608 -1259933 -974351 -258047 -404016 -1321612 -1710509 -1229402 -969704 -1659186 -2778483
39487 -2778483 -3690041 -4343129 -4521421 -3642402 -1849301 -294868 229089 160856 242379
39478 242379 494381 552351 361831 153375 249966 1045092 2518669 3716912 3558864 2307399
39468 2307399 1323585 1147957 842452 -374429 -1841696 -2378794 -1677959 -208178 1544118
39459 1544118 3163643 4240104 4724482 4891162 4714967 3923836 2809516 2100480 1774623
39450 1774623 993064 -418017 -1482050 -1535629 -1065270 -544497 303717 1332567 1429987
39441 1429987 280997 -548781 318281 1910472 2345228 1638138 1396366 2218989 3147643
39432 3147643 3521446 3700114 3834933 3408392 2296385 1113272 278607 -251624 -335455
39423 -335455 101790 198019 -1052706 -2932881 -3388171 -1741748 357245 1303974 1474595
39414 1474595 1923784 2439546 2149459 1212179 594441 592550 657016 392825 -169004 -978902
39404 -978902 -1776217 -1831668 -827695 295128 421119 2597 519323 2132970 3168658
39395 3168658 2390314 654677 -445887 -686978 -1025189 -1932103 -2935216 -3478899 -3267897
39386 -3267897 -1988159 234276 2116941 2138297 512350 -771888 -371514 920716 1737858
39377 1737858 2112366 2780938 3364254 2815390 1470222 1066621 2372527 4055654 4486022
39368 4486022 3692940 2920511 3058513 4149115 5687303 6649634 5857973 3223158 306213
39359 306213 -1133627 -941952 -296315 39439 337099 858405 1118736 623078 -152554
39350 -152554 -88024 1209548 2669659 2764318 1311492 -189085 -378406 376617 1000704
39341 1000704 1717573 3562352 5943121 6545278 4441403 1668250 467177 324240 -645128
39332 -645128 -2450922 -3346437 -2657547 -1485890 -668518 71841 721544 526993 -485103
39323 -485103 -1072931 -584204 95901 144393 129980 827242 1728295 1811650 1103713 447395
39313 447395 171055 -64445 -342819 -264268 357608 1130699 1507583 1345230 1055165 1202201
39303 1202201 1790240 2135135 1869589 1775210 2785635 4281191 4500932 2923149 1120914
39294 1120914 689231 1311655 1636851 1254183 921940 1390135 2761286 4541382 5690909
39285 5690909 5222972 3481709 2241121 2731846 4125864 4824031 4626158 4547424 4991837
39276 4991837 5429654 5707083 6311028 7154039 7305597 6372930 5243238 4992644 5762894
39267 5762894 7098623 8693135 10319861 11599258 12354265 12792410 12924489 12265760 10657568
39258 10657568 9019837 8581565 9423181 10420196 10774531 11002276 11956116 13284189 13669764
39249 13669764 12727985 11862766 12589621 14499851 15822639 15852834 15704955 16420858 17542732
39240 17542732 18327810 19331822 21513719 24309234 26047031 26306524 26581474 28252057
39232 28252057 31009887 33935537 37243993 41948513 48083241 54211084 58988811 62793327
39224 62793327 67427178 74245759 82815112 91565441 99566000 107239703 115376598 124184094
39216 124184094 133713202 144323677 155425282 163816131 164702469 155448855 138196716 118374663
39208 118374663 100706716 86663566 75116384 64625544 54872165 46287335 38947896
39201 38947896 32372798 26409258 21701855 18793506 17118647 15512165 13541458 11687219
39193 11687219 10314090 9209841 8185010 7365036 6726965 6088462 5752762 6322997 7515849
39184 7515849 8055547 7370724 6601691 7077144 8386717 8945701 8117255 6748150 5709631
39175 5709631 4914313 3956105 2925779 2281887 2412101 3442536 4945516 5777811 4927475
39166 4927475 2837431 1304747 1660998 3474919 5367705 6557576 7051496 6788366 5501412
39157 5501412 3519811 1998549 1899356 2969480 4058629 4366287 4076420 3714814 3234376
39148 3234376 2134094 421510 -1040477 -1395379 -631590 756807 2498551 4333426
39140 4333426 5440940 5050471 3693952 2901812 3291112 3796986 3306526 2201793 1500061
39131 1500061 1215560 686160 99317 405061 1683395 2762415 2786752 2228775 1904634
39122 1904634 1787140 1371184 633546 8018 -272063 -337907 -424654 -750361 -1367660 -1878127
39112 -1878127 -1633688 -502824 884551 1901466 2583790 3298278 4153039 5003920 5646470
39103 5646470 5747789 5043520 3897022 3179565 3251905 3533529 3399677 2955172 2555967
39094 2555967 2206474 1939002 2178368 3135322 4359431 5410199 6357139 7103294 7050535
39085 7050535 6224111 5931259 7321851 9919829 12473803 14483698 15842500 15887930 14249886
39076 14249886 11949306 10129004 8302032 5487577 2459741 939913 966318 1122684
39068 1122684 1082480 1647835 2387843 1833972 320918 -54757 1014947 1250125 -430566
39059 -430566 -2032454 -1850088 -1108301 -1354000 -1565620 -132575 2191288 3637031 4098809
39050 4098809 4222217 3472087 1566169 272311 1044590 2215611 1466545 -118638 244686
39041 244686 2168773 2600302 978675 131471 1530235 3175049 3229648 2595371 2477354
39032 2477354 2177827 983208 -58545 33315 453857 285132 155741 726494 1194965
39023 1194965 928880 1085944 2838682 5124188 5867077 4660316 2812110 1403195 516901
39014 516901 -168035 -968942 -1867030 -2124040 -1171663 -173362 -1126216 -3726773 -4985674
39005 -4985674 -3177148 -404171 348242 -887326 -1969794 -2052601 -1876258 -1599582 -630816
38996 -630816 761422 1638369 1990402 2494986 3000058 2913462 2787885 3742445 5425912
38987 5425912 6304395 6017095 5711983 5776283 4950989 2436413 -373912 -1215796 487808
38978 487808 2942163 3720954 2160103 105486 -95126 1548522 2655431 1676923 -114322
38969 -114322 -695978 -32241 623206 975262 1468604 1681009 900790 -184747 -290452
38960 -290452 313723 322169 -245941 -201619 475202 561078 -113546 -420595 -157978 -294386
38950 -294386 -620316 459127 2942308 4310735 2922597 550114 84701 2019749 4472995
38941 4472995 5574245 4712508 2486039 525423 473139 2172599 3630187 3423624 2210152
38932 2210152 1347915 1290109 2004098 3528205 5136204 5292762 3554512 1343511 -168470
38923 -168470 -1602393 -3630862 -5120480 -4573962 -2380216 -156049 1213433 1553556 598572
38914 598572 -1181800 -2053401 -1110191 70281 -262020 -1085096 -231861 1840097 2571998
38905 2571998 1357330 338864 863418 1756356 1861324 1856588 2372397 2428103 1280347
38896 1280347 168676 520976 1605106 1661503 573907 -220215 -13215 524554 853292
38887 853292 1343478 2309782 3258864 3491737 2918111 2061324 1614879 2006480 2980995 3591005
38877 3591005 3045703 1703060 852395 1293975 2403886 2926234 2564125 2327863 3136984
38868 3136984 4565638 5560196 6119940 7293731 9301768 10740384 10422861 9179776 8752789
38859 8752789 9457284 10206135 10526199 11047660 11896750 12155911 11496929 11036281 11737327
38850 11737327 13017243 13858671 14368572 15153089 15941450 16150111 16321771 17537471 19470258
38841 19470258 20428041 19618539 18168654 17429926 17386678 17457954 17853074 18963646 19954188
38832 19954188 19338589 17102094 15130777 14948133 15714101 15245972 12813825 10197072 9711103
38823 9711103 11520523 13312695 12769355 10167274 8101483 8423189 9933411 9826060 7252657
38814 7252657 4419195 3766903 5075645 6224620 6032351 5078738 4113329 3197927 2648305
38805 2648305 3366064 5426092 7272576 7247190 5462592 3478213 2449763 2138229 1521208
38796 1521208 55083 -1470465 -1391219 913880 3662884 4291181 2611501 1049418 1251166
38787 1251166 2033774 1746505 1076620 1763760 3616842 4843485 4786416 4320308 3778847
38778 3778847 2517236 634514 -764840 -1328716 -1743507 -1966484 -1020103 931190 2198196
38769 2198196 2101544 2091933 3219616 4141090 3108279 679519 -1083057 -1200003 -169294
38760 -169294 1353284 2773387 3088488 1706046 -521664 -2171872 -2778059 -2598982 -1655693
38751 -1655693 -239026 425155 -369475 -1216833 -223333 2039396 3078117 2007285 586629
38742 586629 307833 376194 -462963 -1730689 -2220491 -2091939 -2420895 -3164927 -3031850 -1455769
38732 -1455769 357649 781535 -349210 -1610074 -1615673 -484527 493416 516777 130255
38723 130255 224573 796058 1357322 2100277 3603035 5432958 6127403 4927437 2783066
38714 2783066 1301141 1280048 2424075 3745832 4036590 2806458 1160735 942330 2527079
38705 2527079 4214293 4292722 2932773 1473477 684931 502537 696963 843070 219115
38696 219115 -1239690 -2338993 -2015841 -945480 -600651 -957768 -513959 1232528 2644472
38687 2644472 1969189 -346424 -2164876 -2105655 -832140 21508 -270414 -924186 -793332
38678 -793332 238596 1372604 2188763 3030206 3899037 3966822 2899967 1786892 1668917
38669 1668917 1832844 887820 -947798 -2196897 -2527149 -3018325 -3863184 -3682863 -1806850
38660 -1806850 422205 1519120 1547797 976981 -552445 -2897487 -4238193 -3042281 -322965
38651 -322965 1809108 3100752 4791542 6879236 7898873 7343663 6237241 5090741
38643 5090741 3323655 1216321 417460 1541629 2933612 2961372 2139877 1778907 1819723
38634 1819723 1467906 977420 1178684 1771838 1609962 479714 -665265 -1149180 -1156856
38625 -1156856 -948611 -533383 -143455 -89475 -56616 615437 1844858 2764140 2873731 2513968
38615 2513968 2063303 1418546 547817 -79553 -20011 564705 1173452 1580331 1960098 2507608
38605 2507608 3039501 3019650 2161355 1028838 658731 1393052 2498286 3135553 3106305
38596 3106305 2332839 503986 -1973404 -3481951 -2853272 -1117785 -400944 -1287225 -2458155
38587 -2458155 -2792906 -2497114 -2044557 -1324846 -221258 1048523 2497621 4219856 5411456
38578 5411456 4796704 2538141 494927 -106855 -86033 -580417 -1140080 -742784 240963
38569 240963 549824 32230 -187476 607930 1944878 2965820 3133927 2291520 899289
38560 899289 75516 511582 1470392 1772329 1627318 2350166 4163618 5570920 5493657
38551 5493657 4957659 5686639 7665046 9231039 9427348 9141903 9605104 10714753 11624898
38542 11624898 12373682 13745884 15550245 16331924 15394376 13967511 13276881 12355173 9386040
38533 9386040 4863773 1561726 1082307 2160681 2999064 3532336 4262025 4444506 3194549
38524 3194549 1486633 1224488 2594791 3836980 3556621 2037071 366471 -546818 -156768
38515 -156768 1329442 2669027 2729467 1971133 1835435 2716510 3593398 3612669 2844332 1460452
38505 1460452 -442325 -1920307 -1545940 603634 2491334 2498878 1371354 971355 1876097
38496 1876097 3115466 3712145 3521703 2824911 1931781 1196812 918054 1166718 1854397
38487 1854397 2746654 3318728 3045758 2102053 1382674 1547979 2360940 3138134 3459971
38478 3459971 3289857 2880999 2764246 3305658 4026128 3889396 2572673 976448 199103
38469 199103 498301 1512388 2887554 4243025 5013303 4853761 3992869 2962816 2297960
38460 2297960 2558351 4052057 6261472 8041387 8629992 8083870 6801715 5328256 4477610
38451 4477610 4514253 4151721 1836073 -1537804 -2888715 -929592 1753661 2145383 903802
38442 903802 918095 2684128 3707345 2542488 959923 1216722 3019217 4417520 4491537
38433 4491537 3903037 3535819 3721237 4400970 5115918 5052033 3880200 2469191 2120326
38424 2120326 3063147 4219983 4577102 4369962 4624995 5731562 6878637 7058101 6322859
38415 6322859 5657737 5729383 6267697 6650878 6428134 5184485 2862445 686840 671080
38406 671080 3178445 5803098 5988204 4196652 2982110 3288758 3571116 2810429 2430324
38397 2430324 4204018 7637541 10603938 11669949 10816995 8778961 6817989 6408127
38389 6408127 7822638 9423583 9527313 8659419 8774422 10489285 12442973 13443208 13864045
38380 13864045 14485020 15129740 15165618 14536962 13612611 12619566 11813101 11592374 11814271
38371 11814271 11613355 10678279 10129367 11120240 12959397 13856841 13503946 13592413 15363178
38362 15363178 17828599 19194702 19107380 18484374 17818529 16919975 16076301 16114812 17046124
38353 17046124 17722865 17374867 16732689 17049568 18528584 20279283 21489207 22137685 22747541
38344 22747541 23815073 25402631 27158553 28926186 31286675 35014825 39929707 44891416
38336 44891416 49112073 52798400 56296805 59521361 62729168 66892846 72458957 78539525
38328 78539525 84340501 90678380 98822535 108245870 116742939 122403386 124132422 120657401
38320 120657401 111063895 96925910 82378698 71075966 63757828 59101484 55744003
38313 55744003 52778574 49436647 45459890 41363135 37699213 34604371 32453253 31981246
38305 31981246 33009072 34007528 33936765 33703667 34659359 36411153 37533858 37944548 38982521
38296 38982521 41287861 44208602 47442492 51611701 56665005 61240728 64584404 67948295
38288 67948295 72983045 79629897 86822107 94576692 103936798 115129344 127267262 139932708
38280 139932708 153559263 167868043 181532419 194414009 208838334 227239965 249551442
38273 249551442 274669367 303367722 336254334 367614067 384348006 374701533 338528647
38266 338528647 287620031 236222155 192507538 158066578 131885207 112544977 98087548
38259 98087548 86399279 76385149 68014382 61157428 55015924 48814712 42663645 37531350
38251 37531350 34266809 32482134 30621759 27587982 24022334 21229327 19165140 16756842
38243 16756842 14133662 12761294 12784373 12162119 9769509 7636541 8113142 10042434 10228877
38234 10228877 8167397 6609854 7175313 8041055 7119229 5399584 5383903 7432322 9442091
38225 9442091 9666249 8424938 7129548 6668057 6848833 6793025 5812941 4223384 3121487
38216 3121487 3134362 3749949 4160596 4264587 4418754 4717831 5068079 5548248 6110054 6264210
38206 6264210 5630203 4484610 3239258 1784329 27856 -1273205 -1093357 505503
38198 505503 2316921 3296387 3337390 2861519 2391084 2544238 3611787 4871442 5056981
38189 5056981 3926123 2764594 2815268 3660695 3779028 2473131 643747 -330665 20845
38180 20845 1105035 2082561 2551392 2544022 2116580 1130065 -443024 -2039821 -2655193 -1799159
38170 -1799159 -204089 867098 1133757 1627368 3120509 4706497 4804488 3519419 2899524
38161 2899524 4265571 6223592 6440893 4849322 3593601 3770112 3907748 2525740 778190
38152 778190 1001128 3296324 5272989 5200804 3876185 2919052 2615744 2349084 2081102
38143 2081102 2102701 1847476 404959 -1703772 -2550447 -1173399 990525 1873811 1392144
38134 1392144 1248070 2290655 3279335 2787331 1396703 955046 1980545 2977802 2600111
38125 2600111 1502122 1327023 2440060 3545856 3371602 1942463 175885 -1067741
38117 -1067741 -1364950 -807202 -13071 385001 497153 974014 1887062 2441929 2150137
38108 2150137 1589684 1415836 1283029 609087 -125457 -12609 546821 103233 -1516792
38099 -1516792 -2377350 -720519 2680522 5283363 5427009 3544878 1224112 -118327
38091 -118327 61142 1138054 1740915 1167363 357680 802091 2550840 4098495 4295846
38082 4295846 3492390 2513256 1430507 -3838 -1372278 -1910838 -1605920 -1282416 -1612288
38073 -1612288 -2512583 -3484017 -4063166 -3885670 -2769656 -1003783 654649 1505789 1416816
38064 1416816 751091 -115074 -1067447 -2062277 -2872602 -3233719 -3151052 -2769193 -1988550 -714286
38054 -714286 401917 222546 -1308045 -2547000 -2069247 -755761 -737173 -2397413 -3849137
38045 -3849137 -3605615 -2244566 -794177 932278 3130838 4397542 3093226 -159666
38037 -159666 -2926377 -3812624 -3575926 -3440579 -3606959 -3656516 -3350312 -2666380 -1798448 -1302205
38027 -1302205 -1587485 -2267556 -2690701 -2903437 -3190778 -2987194 -1571200 202810 417609
38018 417609 -1247574 -2755869 -2236590 -91663 2024645 3116881 3020597 1927397 731957
38009 731957 770899 2107554 2980286 2035260 179250 -967138 -1438131 -2194341 -2875953
38000 -2875953 -2252353 -639889 110910 -713352 -1746130 -1747701 -1208087 -1015465 -874834
37991 -874834 -104150 907911 1189243 704733 403510 823245 1383827 1256124 536886
37982 536886 209888 848413 1602838 1040268 -838671 -2176439 -1514816 185789 816714
37973 816714 -58692 -1007101 -1188528 -1404494 -2307729 -3103892 -2870428 -1953224 -1071507 -57066
37963 -57066 1392494 2537067 2443510 1481695 738965 313431 -560816 -1905126 -2814509
37954 -2814509 -2907103 -2716389 -2444458 -1550750 -37044 958402 560886 -637448 -1479353
37945 -1479353 -1686484 -1655902 -1413477 -743904 -96459 -349788 -1546383 -2635324 -2756766
37936 -2756766 -2196732 -1709836 -1404470 -901106 -391269 -780571 -2423566 -4184773 -4468067
37927 -4468067 -3222378 -2198884 -2730879 -3845869 -3492353 -1406657 443806 564143 -173075
37918 -173075 -182729 366320 165769 -714278 -664096 942682 2624105 2812033 1791054 876438
37908 876438 690700 1081389 1802544 2341753 1953099 890708 689907 1975043 2957867
37899 2957867 1800493 -337200 -806781 328606 234231 -2099405 -3881525 -2542962 416433
37890 416433 1549767 -5154 -2177759 -3246987 -3380003 -3218686 -2802596 -2065802 -1122792
37881 -1122792 33862 1204595 1629997 984171 279597 546125 1065161 436083 -904689
37872 -904689 -1047915 364273 1284258 33422 -2521144 -4282124 -4240782 -2812723 -940345
37863 -940345 393609 620285 244894 418928 1453628 2467170 2722097 2370955 1641233
37854 1641233 433233 -859034 -1328301 -912435 -610647 -785952 -557483 394056 843037
37845 843037 -115522 -1539864 -2228526 -2609492 -3575473 -4503649 -4164811 -2884902 -2024951
37836 -2024951 -1730314 -940610 522590 1554230 1580867 1350184 1632112 2256776 2679136
37827 2679136 2589791 1873393 776657 35916 -1714 -142689 -1232950 -2542623 -2462736
37818 -2462736 -744890 1121608 1791245 1251204 168992 -834123 -1257479 -1135891 -1324055
37809 -1324055 -2336279 -3189098 -2682180 -1465287 -1160160 -1624109 -1097041 756651 2120966
37800 2120966 1938658 1426571 1749871 2221568 2074840 2122146 3062019 3775814 3094175 1867059
37790 1867059 1371872 910205 -837728 -3010382 -3538575 -2489189 -2021883 -2965119 -3701411
37781 -3701411 -2914037 -1434785 -595321 -393310 -197794 49183 243380 623390 986013
37772 986013 404423 -1293635 -2614559 -2094308 -388446 445360 -457362 -1896348 -2363467
37763 -2363467 -1775463 -1117940 -1004673 -1189461 -1314821 -1520089 -2019694 -2430158 -2068616
37754 -2068616 -957387 -4948 98593 -238202 -125139 600233 1204750 930089 -286059
37745 -286059 -1728295 -2266155 -1185631 926955 2533257 2847601 2696782 3066513 3452816
37736 3452816 2730258 1214889 438651 834952 1104050 345905 -516410 -306766 468071
37727 468071 426862 -536860 -1165026 -759101 -41346 169788 186802 686537 1266241 727466
37717 727466 -1076123 -2519804 -2051432 -356760 330657 -799408 -1947833 -1150290 1020156
37708 1020156 2304334 1766580 629526 231172 506200 766806 774026 487890 -260030
37699 -260030 -1178405 -1363713 -396221 1019618 2070270 2833362 3639932 4136010 3868523
37690 3868523 3374884 3730305 5070181 6257561 6075720 4378779 2176122 854581 1035168
37681 1035168 1914158 2128173 1511025 1293224 2095845 2698640 1837851 412533 343866
37672 343866 1558111 1931716 585378 -551952 482737 2698262 3469838 2181563 886439
37663 886439 1304559 2658968 3116714 2303444 1406459 1320804 1752750 2101804 2277793 2344424
37653 2344424 2101376 1541310 1197386 1408814 1589968 928776 -390346 -1414617 -1778104
37644 -1778104 -1960356 -2111210 -1636801 -414223 530161 378915 -109749 377932 1647465
37635 1647465 2060387 763015 -1086657 -1717135 -741356 713411 1479743 1444829 1294368
37626 1294368 1582066 2156366 2333446 1565660 69435 -1121096 -917629 675726 2210147
37617 2210147 2087544 437549 -869915 -575772 272941 -70067 -1300199 -1445516 -5677
37608 -5677 1077332 308702 -1128781 -1309353 -455729 -258419 -1122406 -1892345 -1982787 -2029818
37598 -2029818 -2378466 -2480168 -2051839 -1512932 -1013100 -265662 429723 310029 -419968
37589 -419968 -687946 -510084 -1298577 -3465635 -5262038 -5146918 -3985323 -3466840 -3437328
37580 -3437328 -2554073 -940690 -241061 -1019568 -1827296 -1322237 12804 924924 1113890
37571 1113890 1035185 660231 -518876 -2314949 -3518043 -3154833 -1742611 -820333 -1228116
37562 -1228116 -2265582 -2737512 -2387016 -1863883 -1679382 -1863708 -2356225 -2858464 -2497574
37553 -2497574 -773839 1127859 1331372 -53086 -699413 741803 2689348 3017720 2003571
37544 2003571 1275400 972388 59314 -1117208 -941828 671309 1762708 1237548 433186
37535 433186 840656 1820824 1812078 686256 -392454 -727302 -499458 110267 1060983 1869532
37525 1869532 1844334 1017302 278125 454574 1456715 2230791 1548184 -707876 -2922776
37516 -2922776 -3079115 -1051778 1087735 1505001 602235 -38615 113971 420282 635734
37507 635734 1249937 2224279 2576599 1679500 219352 -621572 -473585 102617 427604
37498 427604 246679 -315169 -978348 -1487896 -1713637 -1617846 -1218949 -723533 -581914 -1105725
37488 -1105725 -1952752 -2242071 -1413825 39478 883021 384947 -725790 -853169 613146
37479 613146 2298525 2275429 444679 -1255763 -1246030 -106588 558896 317244 25547
37470 25547 155996 133647 -523523 -1316955 -1443342 -824521 -83599 173416 -213583 -955169
37460 -955169 -1487519 -1369737 -731585 -206456 -287070 -831018 -1255953 -1165976 -823779 -1020290
37450 -1020290 -2231736 -3764585 -4148031 -2806914 -993763 -415527 -1146840 -1707372 -1200099
37441 -1200099 -463419 -771953 -2129276 -3319763 -3148004 -1288518 1490981 3521652 3314663
37432 3314663 1118839 -1082606 -1786444 -1668067 -2274738 -3592876 -4155273 -3386832 -2387590
37423 -2387590 -2012447 -1545537 -173367 1277820 1359441 232240 -502718 -185524 6151
37414 6151 -1015409 -2522528 -3018659 -2318181 -1541680 -1295976 -966590 -59242 714639 410503
37404 410503 -574586 -766201 505779 2149111 2544256 1347619 -309338 -1184888 -1048624
37395 -1048624 -500572 -157541 -218831 -500575 -583765 -99660 828063 1530531 1479108 932944
37385 932944 572588 595019 638780 567403 670812 891785 590060 -402137 -1130788 -722506
37375 -722506 188511 206292 -825067 -1634998 -1446124 -965880 -1029013 -1306770 -1167809 -1014030
37365 -1014030 -1679584 -2886141 -3395962 -2701942 -1651114 -1200468 -1313867 -1427977 -1403519
37356 -1403519 -1492157 -1628843 -1257476 36229 1876664 3235116 3364608 2627777 2167224
37347 2167224 2603996 3319883 3268449 2203434 738564 -519235 -1362999 -1689128 -1440196
37338 -1440196 -860678 -245028 623166 2176081 4045259 4981006 4181645 2255408 439580
37329 439580 -765751 -1686087 -2475141 -2723840 -2210926 -1536233 -1565088 -2326870 -2845692 -2251087
37319 -2251087 -837392 290049 509403 173599 -221223 -729860 -1446144 -1871546 -1490930
37310 -1490930 -683675 -294184 -376692 -122077 898278 2140041 2924549 3189287 3100730
37301 3100730 2560915 1599064 842236 1043205 2224472 3577932 4171276 3693581 2659230
37292 2659230 1862383 1437199 650563 -958507 -2489585 -2495591 -899522 749303 1190467
37283 1190467 847588 951136 2018257 3662940 5177369 5710529 4584355 2253302 489664
37274 489664 779309 2728772 4625078 5228371 4439058 2714939 739629 -600203 -880799
37265 -880799 -771031 -1162320 -1662584 -878351 1543543 3993432 4557270 3099182 1155523
37256 1155523 85003 -38671 269144 958405 2187612 3281690 2933352 989447 -690763
37247 -690763 -193065 1939932 3364353 3083779 2496844 2881228 3396322 2619121 778843
37238 778843 -913032 -2201447 -3513365 -4417551 -4025876 -2628056 -1370887 -467332 776981
37229 776981 2272014 3080834 3099625 3148444 3139211 1864072 -811911 -3106580 -3488428 -2455570
37219 -2455570 -1418638 -989912 -1124114 -1782999 -2594489 -2844954 -2549174 -2503629 -2682093
37210 -2682093 -1959801 -299558 393996 -975753 -2514308 -1767889 655575 1960134 1099507
37201 1099507 -275512 -665947 -423996 -267802 29146 701179 1129017 778768 87311
37192 87311 -262270 -244341 -196825 -277920 -569022 -1086132 -1448021 -1207723 -663842 -545474
37182 -545474 -767853 -508655 217083 262758 -764909 -1516642 -785896 570531 854735
37173 854735 44021 -355143 225924 592256 -213474 -1328779 -1310776 -252398 267097
37164 267097 -816283 -2783841 -3952962 -3359664 -1534438 109858 548940 -27466 -602939
37155 -602939 -610867 -617886 -1397217 -2553219 -2819752 -1872018 -957964 -1148168 -1755272 -1431735
37145 -1431735 -223960 699799 982532 1228696 1302360 266887 -1539244 -2220096 -1087442
37136 -1087442 1058 -554075 -1530854 -994521 311775 75648 -1716926 -2594243 -1350657
37127 -1350657 409018 1015348 863804 912868 968318 687840 769734 1737486 2604235 2081051
37117 2081051 416873 -1010908 -1300910 -406593 1254295 2642731 2408627 468276 -1387511
37108 -1387511 -1519293 -452245 167509 -86099 -382009 -355857 -419177 -607233 -531963 -461994
37098 -461994 -1149513 -2444643 -3255389 -3143964 -2940014 -3425274 -4226730 -4326789 -3060610
37089 -3060610 -556003 2079866 3057218 1413911 -1522935 -3141883 -2402326 -833535
37081 -833535 -281438 -625166 -487330 541715 1436355 1261081 269881 -619882 -843191
37072 -843191 -468802 114976 470392 226188 -740986 -2124302 -3329220 -3934946 -3935422 -3466839
37062 -3466839 -2612487 -1782310 -1837297 -3045314 -4114429 -3382593 -1190136 121401 -832959
37053 -832959 -2652310 -3138050 -2057657 -794507 -161633 45864 -25207 -349202 -466492
37044 -466492 -247020 -681809 -2404692 -4050258 -3954278 -2949632 -3163815 -4297971 -3891084
37035 -3891084 -1629484 -332452 -1472307 -2642937 -1422799 756737 1102736 -125712
37027 -125712 -566615 156157 317925 -517984 -960037 -687448 -1156560 -2777869 -3672660
37018 -3672660 -2307166 243782 1751859 1511042 684949 645889 1567672 2318078 1604689
37009 1604689 -478151 -2369331 -2969218 -2923085 -3155178 -3141256 -2072421 -784501 -560243
37000 -560243 -693311 376017 1833655 1189257 -1527177 -3200977 -2218648 -837501 -1488666
36991 -1488666 -3237724 -3840764 -3106097 -1956852 -92060 2727798 4512308 3184605
36983 3184605 205502 -854558 804219 2479662 2273761 1413553 1527502 2067590 1835555
36974 1835555 1298201 1702483 2821123 3076679 1650805 -500903 -1756778 -1512269 -734531
36965 -734531 -864315 -2092773 -3096633 -2842660 -2027552 -1927954 -2446107 -2500945 -1941414 -1612867
36955 -1612867 -1666715 -1385810 -808185 -872217 -1539522 -1420359 14072 1362908 1383535 791116
36945 791116 824620 1183920 777147 -289919 -932456 -890800 -973073 -1536623 -1792774 -847967
36935 -847967 1151993 3060982 3670473 2706424 1010717 -480304 -1780107 -3291682 -4483198
36926 -4483198 -4304835 -3020064 -2188418 -2345026 -2211380 -1009334 49729 -180589 -749113
36917 -749113 -248850 793570 1061215 894925 1397018 1887965 818234 -1039334 -1022673
36908 -1022673 1384535 3470671 3156643 1730510 1451521 2281425 2631664 2084653 1652010
36899 1652010 1936790 2407900 2260744 1180824 -408677 -1370295 -761456 809322 1591069
36890 1591069 1022599 617243 1687702 3248709 3362083 1776844 -50656 -1018587 -1188097
36881 -1188097 -904188 -376627 -13243 -98146 -208532 138627 444329 -166745 -1395035
36872 -1395035 -1852573 -802113 1028361 2454309 2922950 2565813 1877640 1395910 1140943
36863 1140943 504670 -744133 -1735969 -1633520 -1096197 -1480610 -2798152 -3761642 -3845533
36854 -3845533 -3887400 -4399554 -4728185 -4425189 -4106578 -4196476 -4040560 -3192472 -2493114 -2768062
36844 -2768062 -3328692 -2961918 -1739692 -631578 134183 1009094 1763434 1560374 374176
36835 374176 -854846 -1543591 -1834031 -1592790 -345991 1400633 2030439 777730 -1084020
36826 -1084020 -1874569 -1648942 -1758929 -2708287 -3500378 -3121325 -1809018 -572710 -18557
36817 -18557 -28466 -310568 -841173 -1660305 -2402351 -2347603 -1216820 205712 715225 96576
36807 96576 -595489 -517395 -319740 -1275588 -3313817 -4738854 -4171320 -2177053 -488345
36798 -488345 73962 294715 1119834 2076588 1737828 -204721 -1997396 -1662342 401892
36789 401892 1619424 412694 -1728021 -2187837 -534661 1359630 2147073 2337321 2523287
36780 2523287 1961864 34242 -1998172 -2145731 -199012 2078926 3071404 2649589 1608067
36771 1608067 786707 716186 1217685 1347404 532701 -413785 -390950 106868 -454343 -2134164
36761 -2134164 -3088348 -2178763 -586616 32050 -241026 -316313 -27025 -2503 -201525 155790
36751 155790 1418914 3183569 4830295 5618698 4785871 2530438 413096 -300408 -248508
36742 -248508 -759310 -1531284 -1078554 676585 2001012 1877155 1328378 1521044 1917618
36733 1917618 1348928 -22798 -952244 -876457 -503044 -755621 -1703263 -2505489 -2211579
36724 -2211579 -795575 589933 788007 44444 -305687 469544 1816047 2899974 3423633
36715 3423633 3306827 2523990 1552898 1032732 648852 -586519 -2520070 -3548118 -2834537
36706 -2834537 -1632712 -1426301 -1880725 -1857784 -1456025 -1538470 -1953675 -1876482 -1501371 -1695296
36696 -1695296 -2117002 -1462095 175795 886953 -461384 -2608280 -3741984 -3846591 -4140580
36687 -4140580 -4901008 -5033638 -3666154 -1294246 808663 1843608 1978773 1846454 1805263
36678 1805263 1826750 1989909 2597553 3471228 3600839 2214588 43700 -1247481 -954753
36669 -954753 40418 642463 737974 671727 298145 -712733 -1942803 -2319304 -1259659
36660 -1259659 605731 1995057 2181886 1617001 1368205 1964571 2885332 3209655 2574471
36651 2574471 1378402 281469 -291347 -376144 -445015 -963708 -1783410 -2215005 -1848491
36642 -1848491 -941375 105450 1059036 1433913 624700 -969854 -1794092 -937069 607593
36633 607593 1348423 1182751 808952 110591 -1371245 -2924630 -3311370 -2658552 -2073726
36624 -2073726 -1628213 -558414 646066 482221 -957643 -1747935 -1064882 -255129 -215067
36615 -215067 80405 1281745 2067796 1430555 674675 1314695 2555339 2749751 1948784
36606 1948784 1059910 -136720 -1975203 -3210021 -2783664 -2224112 -3583331 -5749073 -5749195
36597 -5749195 -3393523 -1557558 -1718988 -2295800 -2033619 -1998420 -2966751 -3502468 -2294041
36588 -2294041 -335475 857534 1429194 1993688 1952525 771630 -461484 -572124 -250444
36579 -250444 -721743 -1520873 -1429436 -725099 -519922 -506951 558195 2415938 3355860 2748426
36569 2748426 1710699 1067133 400693 -466999 -744049 -154851 261128 -206204 -590415
36560 -590415 348742 2071808 2731083 1445295 -781085 -2364926 -2648455 -1969783 -854086
36551 -854086 379043 1391639 1809026 1766040 2110013 3393531 4681079 4178502 1462602
36542 1462602 -1595673 -2767729 -1837069 -377365 312135 130400 -602943 -1647948 -2435735
36533 -2435735 -2215081 -1066661 -63691 29583 -332828 -301403 142138 336095 13810
36524 13810 -372772 -393239 -252213 -482269 -1228051 -2042636 -2375248 -2084082 -1372150 -409128
36514 -409128 699938 1676165 2226183 2491107 2875618 3290467 3097086 2087204 960073
36505 960073 377927 59439 -594156 -1394970 -1634341 -1250763 -984548 -1308484 -1739534 -1388886
36495 -1388886 -12977 1475034 1610758 -65114 -2034247 -2153383 -226027 1769607
36487 1769607 2491634 2917592 4136141 4898399 3358899 464735 -776111 580920 2260230
36478 2260230 2186254 956904 53356 -481010 -1283005 -2105503 -2461409 -2722028 -3187959
36469 -3187959 -3016410 -1523400 201373 503612 -483086 -1135686 -686324 128252 593981
36460 593981 782877 716179 93644 -826432 -1199208 -858359 -638182 -952512 -963472 129143
36450 129143 1643967 2128796 1211694 -96230 -946536 -1686712 -2915679 -4068290 -3798197
36441 -3798197 -1849187 221995 695908 -415410 -1720381 -2278847 -2276644 -2135785 -1954494
36432 -1954494 -1871839 -2043931 -2100748 -1506382 -569477 -115117 -78396 323196 809733 26982
36422 26982 -2021854 -3187770 -1996487 123818 832570 -62507 -1038395 -1295706 -1051213
36413 -1051213 -230991 1263397 2503407 2516411 1876841 1592911 986734 -1229884 -4129940
36404 -4129940 -5205793 -3928182 -2315265 -1573749 -615915 1252070 2564800 2050848 858689
36395 858689 769369 1533748 1577733 386790 -1194154 -2246760 -2213662 -870400 1030809
36386 1030809 1877962 1004750 -408380 -1195963 -1985705 -3905082 -6401229 -7780602 -7391065
36377 -7391065 -6028275 -4670500 -3952389 -4295051 -5269637 -5325948 -3500427 -1037831 -7903
36368 -7903 -641132 -1406609 -1456746 -1441766 -1881287 -2302135 -2409082 -2810799 -3937992 -5118427
36358 -5118427 -5302514 -4150072 -2111899 -20114 1203983 1097809 244648 -160653 401511
36349 401511 1272299 1537895 1105721 699826 1003037 1925364 2711339 2816374 2475621 2021142
36339 2021142 963206 -1289411 -3839152 -4790029 -3791994 -2697738 -2903195 -3517226 -3308432
36330 -3308432 -2865839 -3089872 -2942738 -1009036 1555348 2124070 312793 -1779910 -2870741
36321 -2870741 -3558794 -4055023 -3547445 -2370400 -2146712 -2826210 -2154797 592904 2845625
36312 2845625 2482155 1095321 1261127 2403201 2089749 259963 -782975 -229949 159255
36303 159255 -816452 -1939337 -1692627 -507443 164661 -112112 -651907 -870094 -709157
36294 -709157 -155785 953670 2562910 4076327 4538181 3326653 883564 -1382988 -2224895
36285 -2224895 -1606030 -564899 -212522 -966111 -2458821 -3895626 -4571089 -4180208 -2689656
36276 -2689656 -251551 2395318 3863890 3268641 1324315 -494441 -1724331 -2852921
36268 -2852921 -3690871 -3273508 -1642289 -194003 346907 829050 1744503 1940192 496581
36259 496581 -1381682 -1814814 -665817 845575 2017132 2655323 2074447 -60456 -2316025
36250 -2316025 -2698950 -1217947 235580 465825 -27763 -568398 -1229796 -1932052 -1971673
36241 -1971673 -1039799 137420 586648 -5211 -1197736 -2087066 -1916897 -991083 -535949
36232 -535949 -973864 -1097346 -24407 904645 -208552 -2832809 -4548176 -4363500 -3576913
36223 -3576913 -3280832 -3026026 -2427768 -2210530 -2816647 -3457055 -3395289 -2969710 -2621561 -2040805
36213 -2040805 -968051 155794 892765 1222974 976715 24507 -751104 -163214 1221120
36204 1221120 1442038 203618 -325623 1157818 2838346 2427607 495024 -734775 -721324
36195 -721324 -641594 -819060 -339757 866995 1539987 1050883 365806 531443 1301896 1799246
36185 1799246 1730878 1409507 1054013 563890 -122230 -703449 -749494 -408592 -568124 -1663641
36175 -1663641 -2510211 -1438737 1126074 2501835 982794 -1821464 -3004706 -1945087
36167 -1945087 -558318 -388475 -840436 -461134 1032580 2443505 2415113 854406 -897819
36158 -897819 -1430684 -726490 156052 698762 1342076 2192001 2439084 1566892 158224
36149 158224 -1048358 -1930698 -2303859 -1660189 -324270 339363 -231161 -902597 -676534
36140 -676534 -73693 313042 1007295 1936243 1282645 -1806723 -4734584 -4249884 -977257
36131 -977257 1399801 1079480 -249919 -593447 105911 1141611 2096772 2234655 919585
36122 919585 -840558 -1175038 -70978 618349 194795 -39030 570440 950413 732241
36113 732241 1273071 2900001 3466531 1500984 -1112114 -1694963 -578252 -144820 -1064867
36104 -1064867 -1731427 -1066793 81381 459276 -66849 -725822 -758590 -66814 669274
36095 669274 842880 1017079 2262965 4114467 4540306 2707301 351580 -696688 -942933
36086 -942933 -1756086 -2785933 -2677670 -1454374 -313736 304000 634526 205424 -1459013
36077 -1459013 -3152416 -3141547 -1897633 -1507432 -2241273 -2050292 -101790 1508631 843060
36068 843060 -981154 -1664397 -1150564 -1258218 -2581087 -3697185 -3482649 -2591592 -2134737
36059 -2134737 -2079163 -1751410 -1172202 -910096 -882557 -317180 910805 1817006 1720406 1314875
36049 1314875 1443820 1478642 251278 -1726013 -2649102 -2182235 -1987360 -2851893 -3238790
36040 -3238790 -1965192 -473881 -511135 -1013889 227900 2668583 3512184 1968578 285814
36031 285814 66262 101393 -1064036 -2555884 -2649292 -1340630 17650 652310 747533
36022 747533 711420 1012570 1927285 2704027 2019319 46014 -1213546 -688759 92808
36013 92808 -463049 -1265713 -388939 1366876 1333981 -864322 -2626278 -2264665 -1152378
36004 -1152378 -981937 -1063564 9230 1596142 1936166 1000446 399299 677269 618733
35995 618733 -415404 -1116506 -45513 2286895 4132363 4589973 4029814 2977607 1720783
35986 1720783 860579 1048800 1865278 1948810 812210 -278053 -10943 1021203 1157741
35977 1157741 169625 -361233 555507 1726693 1426665 -120459 -1058993 -515855 265243
35968 265243 -217205 -1631216 -2394679 -1919414 -1240799 -1245521 -1238928 -59869 1880992 2769574
35958 2769574 1717007 -41534 -764404 -234494 553789 1057834 1433307 1445407 507404
35949 507404 -923125 -1242724 247710 2069669 2292840 1005701 72740 684968 2152184
35940 2152184 3141912 3161442 2509430 1539087 497646 -352943 -947070 -1513162 -2137145
35931 -2137145 -2468318 -2141954 -1251078 -158623 839006 1410135 1254200 770756 1116404
35922 1116404 2711412 4020185 3036842 120632 -1951110 -1405456 214337 275274 -1247610
35913 -1247610 -1845347 -55756 2610486 3781613 3019313 1666511 712010 -127897 -1360303
35904 -1360303 -2589531 -2777628 -1469272 416635 1266530 518750 -494619 -49938 1656288
35895 1656288 2512606 1160485 -1083526 -1687254 53817 2171389 2303551 364146 -1389598
35886 -1389598 -980593 872055 1511717 -317322 -2717135 -3032397 -1303317 20158 -501997
35877 -501997 -1814672 -2408385 -2033028 -831506 1328411 3572910 3865797 1736234 -268162
35868 -268162 260330 2077799 2052061 -283050 -2253071 -1957089 -415337 537943 559138
35859 559138 273605 -90507 -694195 -1520343 -2261646 -2273282 -856269 1604193 3323801
35850 3323801 3202406 2644547 3632452 5509421 5866071 4424009 3390486 3551252 2918790
35841 2918790 510727 -1292975 -280651 1802397 1587929 -1030552 -2964377 -2375095
35833 -2375095 -647244 178159 -92533 -471569 -547348 -740919 -1424773 -2333389 -2740633
35824 -2740633 -2214866 -1263206 -881306 -1288245 -1602120 -1011723 301601 1633265 2439264
35815 2439264 2321976 1215577 -67063 -412615 82914 200652 -454942 -878033 -544914
35806 -544914 -371460 -945276 -1335624 -801712 -222750 -487467 -871870 -560044 -407981 -1377239
35796 -1377239 -2424867 -2014323 -794008 -618817 -1597975 -2279876 -2222239 -2143718 -1905935
35787 -1905935 -675194 1032601 1756108 1567415 1887483 2696129 2306367 349491 -1376266
35778 -1376266 -1771394 -1910925 -2667432 -2965009 -1751620 4033 780770 696041 821616
35769 821616 1277834 1321740 704867 -104245 -651437 -817704 -838024 -1274163 -2331788 -3143961
35759 -3143961 -2656525 -1228535 -177262 245647 921057 1820313 1760282 672660 152359
35750 152359 892283 1490977 959189 539124 1497806 2731510 2391082 702751 -660320
35741 -660320 -1141686 -1481082 -1967556 -2165817 -2026866 -1948692 -2074675 -2498697 -3460512 -4337343
35731 -4337343 -3509636 -641997 1957949 2020225 462368 -177667 250236 -444925 -2843661
35722 -2843661 -4669414 -4235769 -2871845 -2628371 -3315335 -3445420 -2927788 -2894553 -3232414
35713 -3232414 -2224644 739153 3453803 3211295 456742 -1280904 358903 3517478
35705 3517478 4506466 2569017 546375 756723 2087968 2052975 209607 -1806568 -2671639
35696 -2671639 -2381230 -1439326 -348065 327603 382543 303127 533749 806906 761137 590103
35686 590103 449187 7467 -695145 -895538 -468798 -536639 -1628223 -2448418 -1901981 -1142564
35676 -1142564 -1798603 -3169514 -3314010 -2255252 -1805785 -2465371 -2737726 -1594718 386736
35667 386736 2417385 4069002 4410668 2662990 -25966 -1450285 -1252662 -980771 -1154940
35658 -1154940 -712970 241792 -59266 -1764631 -2329491 -312895 2138200 2476863 1293086
35649 1293086 534451 161192 -808779 -1395612 180331 3022590 4096633 2355670 -37678
35640 -37678 -1024039 -1145457 -1987254 -3675067 -4890234 -4551101 -2817829 -872886 47508
35631 47508 -224801 -677544 -496293 -195660 -764368 -2106403 -3169925 -3349105 -2937232
35622 -2937232 -2452347 -2335280 -3004849 -4283964 -5026309 -4298320 -2749013 -1818591 -1783065
35613 -1783065 -1695516 -1153543 -840234 -1125489 -1356495 -969587 -286302 279858 876882 1502205
35603 1502205 1487426 443870 -861882 -1320282 -785001 85906 954362 1996411 3043277
35594 3043277 3294574 2237242 485595 -703741 -736367 -247358 -263320 -969971 -1533498
35585 -1533498 -1098401 289362 1783168 2497285 2098664 942768 -177664 -576996 -119182
35576 -119182 883406 2003149 2669532 2199729 612738 -726300 -297682 1502350 2517136
35567 2517136 1547894 -103329 -538046 293769 1104164 1391514 1697028 2168731 2259310
35558 2259310 1797073 1185329 521653 -394953 -1142087 -879600 338326 1486968 2019298
35549 2019298 2346072 2587605 2011817 358965 -1219528 -1415469 -443747 255932 -276305
35540 -276305 -1577228 -2264546 -1225663 1303014 3604906 3888014 2068370 -273852 -1742674
35531 -1742674 -2158082 -1653236 -22476 2231464 3335337 2127686 -5973 -499674 1180791
35522 1180791 2974111 2970150 1440301 -228262 -1331701 -1809024 -1466259 -363488 626343
35513 626343 761043 567481 934250 1369786 561679 -1228106 -1868091 -165134 2297411
35504 2297411 3178604 2274463 1152762 653247 296744 -157541 -248799 -41230 -236617
35495 -236617 -623452 77537 2029096 3274768 2080975 -611559 -2290310 -1902894 -715958
35486 -715958 -477282 -1646009 -3245463 -3766700 -2475174 -367883 621881 -88670 -948411
35477 -948411 -504642 500700 444818 -578338 -1065421 -570066 -101120 -111067 99245 609279
35467 609279 245296 -1486242 -3216530 -3457523 -2517273 -1708832 -1469235 -1290016 -954250
35458 -954250 -801591 -958150 -1096377 -960818 -682419 -609032 -1022390 -1827372 -2449370 -2427255
35448 -2427255 -2155571 -2433219 -3103102 -2905333 -1161219 1038015 1997971 1425033 632467
35439 632467 868026 1925130 2497944 1742461 378092 -3359 1073855 2117832 1468281
35430 1468281 -379980 -1267084 -169172 1619467 2370619 1832855 732038 -496873 -1600987
35421 -1600987 -2005856 -1461438 -685085 -476403 -610922 -405627 80046 303352 333076 713419
35411 713419 1403634 1795440 1795734 2020632 2699712 3074627 2267457 418325 -1317245 -1813182
35401 -1813182 -958303 333129 1072908 1045904 576616 -175285 -1049991 -1261137 -28067
35392 -28067 1911223 2562607 1130694 -748281 -1105188 -128081 528459 218525 -291873
35383 -291873 -589132 -1292279 -2720172 -4049645 -4344219 -3705698 -2906724 -2326149 -1677818
35374 -1677818 -599685 767005 1805416 2027420 1574510 864850 -164981 -1853839 -3706050
35365 -3706050 -4322539 -3033008 -970044 187434 68782 -440060 -567479 -198170 483088
35356 483088 1025168 738084 -473366 -1586251 -1520905 -398070 924181 1993565 2598427
35347 2598427 2185139 668983 -702369 -677171 151180 225408 -564645 -936701 -491486
35338 -491486 -128819 -81433 556419 1848196 2408977 1617710 808853 1208874 2085432 2132885
35328 2132885 1494594 1084707 867133 278604 -227676 452913 2258179 3666181 3458424
35319 3458424 2142826 1364758 2036041 3114768 2598331 183083 -1649057 -381603 3031223
35310 3031223 5106483 4373142 2916089 2740151 2905995 1789572 129368 -394910 -204160
35301 -204160 -985711 -2661585 -3617166 -3474232 -3245254 -2986398 -1807260 -292951 -276315
35292 -276315 -1590105 -1600749 855111 3292433 2913732 399688 -1354425 -969792 708069
35283 708069 2569765 3953335 3958836 2004841 -890424 -2883358 -3515865 -3913631 -4642104
35274 -4642104 -4670866 -2999451 -340221 1537633 1660983 536669 -699002 -1377969 -1636299
35265 -1636299 -1899313 -2143829 -1857469 -825099 407408 1205637 1613031 1893500 1678765
35256 1678765 481898 -988414 -1121117 497708 2111794 1721362 -428938 -2086903
35248 -2086903 -1600398 421287 2136461 2524942 2067926 1762533 1957474 2206260 1996273
35239 1996273 1398815 940926 922303 1047705 840848 272898 -250843 -498014 -736685 -1338296
35229 -1338296 -2215994 -2811175 -2594852 -1540948 -210690 591884 440979 -263712 -585903
35220 -585903 20052 1120470 1783671 1565261 837803 237227 51188 174339 435005
35211 435005 857139 1646948 2845721 3923575 4006696 2866841 1459310 933111 1225543
35202 1225543 1342126 1017935 1101854 1893682 2193086 979854 -740685 -1097335 -7857
35193 -7857 796831 468229 205974 1140616 2466983 2779763 2240791 2045365 2336440 2159835
35183 2159835 1325035 783095 889763 713985 -261627 -957754 -241236 1170289 1571472
35174 1571472 669300 -103291 296883 1202322 1414882 851271 372829 451546 678913 476939
35164 476939 -206343 -937005 -1192308 -687211 360724 1136252 685816 -1136256 -3159131
35155 -3159131 -3704734 -2198623 185907 1782999 2160134 2155790 2380666 2515069 2339614
35146 2339614 2521848 3554203 4476532 3704573 1044500 -1930653 -3473949 -2953791 -826458
35137 -826458 1626639 2587924 1025480 -1829516 -3367579 -2494087 -715203 141147 130758
35128 130758 273213 541558 95146 -1086825 -2128536 -2575856 -2698619 -2658080 -2382288
35119 -2382288 -2114390 -2081459 -1724903 -305052 1683867 2682225 1839691 -117944 -1853034
35110 -1853034 -2528008 -2018267 -902318 -336320 -1120843 -2718055 -3816924 -3842126 -3215589
35101 -3215589 -2307848 -1087499 201198 984454 1088416 714261 -216158 -1731549 -3009948
35092 -3009948 -3127115 -2550724 -2533707 -2982332 -2485153 -733459 751323 873265 357642
35083 357642 177141 154149 21762 327658 1167726 1447206 656030 58486 744599 1736919
35073 1736919 1567405 635733 310308 566115 286348 -703138 -1601464 -2168497 -2685325
35064 -2685325 -2787973 -1955446 -897692 -911192 -1975566 -2835221 -2787814 -2150860 -1286550
35055 -1286550 -466114 -310783 -999292 -1455901 -705585 527540 1065490 1309920 2131970
35046 2131970 2592315 1269962 -655978 -603285 1122791 1449212 -409694 -1368072 583071
35037 583071 2977963 2732983 893148 671922 2423626 3619261 3017176 1919411 1323669
35028 1323669 425920 -1397374 -3041023 -3093997 -1735300 -435912 -354390 -1449437 -2729081
35019 -2729081 -3096435 -2251644 -915404 -45755 63727 -203679 -373522 -232033 134016
35010 134016 386951 205239 -381814 -1080437 -1621960 -1687552 -947525 208979 502634 -645609
35000 -645609 -1805318 -1244685 316284 478224 -1192523 -2369280 -1472415 109593 474540
34991 474540 3827 140551 900613 1377794 1580092 1962240 1999704 998366 -304367
34982 -304367 -584805 143874 936503 1607630 2391828 2498211 902304 -1558810 -2646030
34973 -2646030 -1465769 611451 1923338 2191592 2068054 2065991 2197291 2049592 1260680
34964 1260680 253387 -96690 45566 -577536 -2064024 -2474320 -582250 1915011 2761724
34955 2761724 2394580 2613331 3231531 2806818 1850146 2115142 2980115 1946752 -911487
34946 -911487 -2392185 -976108 971326 1104837 209322 -223387 -641334 -1555106 -1612581
34937 -1612581 -95260 796379 -1010280 -3738102 -4066524 -2074493 -849776 -1717390 -2862631
34928 -2862631 -2755897 -2157601 -2080855 -2074451 -1536481 -1017735 -1119757 -1274015 -645212 444572
34918 444572 786731 -318935 -2280028 -3607560 -3162663 -1379165 -7000 -184179 -1199615
34909 -1199615 -1774149 -1876888 -2221854 -2601964 -2241502 -1575102 -1984416 -3510702 -4389174
34900 -4389174 -3405349 -1344884 535605 2049673 3131465 2773557 525756 -1775543
34892 -1775543 -1643583 796450 2834217 2704840 1497297 890346 575631 -672810 -2430434
34883 -2430434 -3019726 -2248383 -1896262 -3074845 -4718885 -5435190 -5322608 -4835022 -3275206
34874 -3275206 -107790 3223772 4784264 4943706 5616314 6896147 6756751 4492159 2182369
34865 2182369 1749184 2454785 2550171 1786024 930032 220318 -231058 219428 1407690
34856 1407690 1532550 -545811 -3109351 -3572408 -1948445 -390264 94794 247083 185053
34847 185053 -1060861 -3236690 -4339310 -3318628 -1586972 -870559 -1010450 -922626 -475251
34838 -475251 -226913 -193015 18247 454353 1065310 2049293 3102464 3037507 1270055 -740690
34828 -740690 -786999 1293895 3174442 2809388 938899 127381 1521757 3346997 3048230
34819 3048230 452630 -2073168 -2653787 -2024537 -1982645 -2708402 -2903171 -2122554 -1444442
34810 -1444442 -1675292 -2230748 -2239293 -1638008 -626540 911178 2668843 3462928 2488886
34801 2488886 587533 -566547 -304205 603459 1066608 646755 -370923 -1275413 -1328711
34792 -1328711 -295627 1323978 2669040 3046223 2225376 658429 -592571 -747359 -291674
34783 -291674 -447154 -1447417 -2114820 -1595639 -727295 -929198 -2269513 -3460563 -3497622
34774 -3497622 -2600929 -1736048 -1794368 -2995075 -4484595 -4799739 -3418033 -1630940 -1155117
34765 -1155117 -2085523 -3064576 -3327301 -3498919 -4172480 -4793949 -4580953 -3770182 -3182068
34756 -3182068 -3014997 -2828414 -2451904 -2158899 -1991817 -1577389 -722937 302111 1196441
34747 1196441 1889152 2238692 1942385 1005205 -89740 -974202 -1794185 -2666527 -3128253
34738 -3128253 -2684403 -1692013 -1088457 -1289039 -1913666 -2571021 -3250199 -3831937 -3943720
34729 -3943720 -3649685 -3666309 -4390541 -5146515 -4933382 -3676568 -2302167 -1733943 -2117584
34720 -2117584 -2859953 -3245117 -3218441 -3513159 -4467298 -4826962 -2853061 939920 3426069
34711 3426069 2365331 -644930 -2122123 -1044701 364194 70419 -1259215 -1679973
34703 -1679973 -596705 828952 1151495 -104570 -2172623 -3613955 -3547111 -2495993 -1610566
34694 -1610566 -1118429 -271304 1157437 2280451 2368694 1905309 1793720 2017888 1674341
34685 1674341 215803 -1618137 -2213548 -708451 1668698 2549207 1253114 -145671
34677 -145671 443819 2192037 2673257 1489997 567849 988130 1757900 2090252 2627974
34668 2627974 3538791 3548189 2154040 934583 1153336 1710170 1128117 87890 117704
34659 117704 988066 1388312 1223843 1225318 1051529 -131240 -1691110 -2179131 -1612402 -1210746
34649 -1210746 -1162222 -597986 402533 758870 287482 -246418 -880204 -2224714 -3516774
34640 -3516774 -3159350 -1452369 -473445 -791063 -725511 416239 1010063 248380 -24119
34631 -24119 1504734 2862576 1623578 -1181210 -2571204 -1890611 -956326 -689023 -349957
34622 -349957 50409 -682281 -2450362 -3256386 -1973052 12565 813531 251578 -797255
34613 -797255 -1866283 -2623383 -2262758 -455571 1703782 2758135 2495835 1718230 926509
34604 926509 144591 -354570 -165392 478974 852606 662633 214815 -256398 -759166 -1082462
34594 -1082462 -841509 -46624 955734 2078627 3304848 3880798 2683014 -151514 -2750546
34585 -2750546 -3307873 -1835808 388481 2409093 3804735 3989301 2603831 538062
34577 538062 -629746 -484405 -142455 -507031 -1116166 -1173064 -775770 -419728 -66768 398991
34567 398991 385457 -645290 -1872287 -1710662 83799 1796551 1721005 215615 -764246
34558 -764246 -27208 1465489 1795456 451897 -976113 -725735 941599 2130890 1757770
34549 1757770 701720 281461 522256 592646 248828 -23479 94305 531970 1234049
34540 1234049 2010770 2204264 1323972 -49753 -749503 -430770 151551 279552 15104
34531 15104 -276724 -488822 -600716 -405484 269283 1197094 1725887 1196313 -339870 -1813522
34521 -1813522 -2095799 -1446368 -1277954 -2105800 -2686148 -1962306 -878169 -1009539 -2104338
34512 -2104338 -2507166 -1696417 -823795 -747990 -1046039 -1212000 -1473347 -2024086 -2563155 -2902798
34502 -2902798 -3031812 -2501719 -976299 541187 528143 -731203 -1263400 -347340 404625
34493 404625 -287826 -1437779 -1766229 -1912902 -2932768 -3891888 -3066575 -875855 464596
34484 464596 98068 -492488 114786 1440442 2158228 1834783 1015220 301770 -155161
34475 -155161 -628591 -1465580 -2473074 -2779003 -1782651 -77999 1149971 1498792 1475644
34466 1475644 1408599 1059978 412776 15040 146936 217939 -468947 -1585387 -1926724 -832982
34456 -832982 804776 1317150 105360 -1678080 -2628371 -2806977 -3205591 -3787384 -3277116
34447 -3277116 -1216212 922174 1434971 423899 -672565 -955891 -617939 -94086 394725
34438 394725 620321 388347 -247295 -1169276 -2260471 -2967905 -2473729 -915493 268033
34429 268033 80156 -571770 -252453 666314 482297 -1048634 -1901222 -400004 2361660
34420 2361660 3634953 2138271 -724462 -2710059 -3076477 -2667513 -2124751 -985102 1094211
34411 1094211 3125817 3822434 3353213 2826050 2282361 805824 -1236253 -1945383 -680650
34402 -680650 636316 246518 -889670 -796875 451550 1145463 604256 -348719 -1055515
34393 -1055515 -1487685 -1444759 -934665 -1030902 -2664529 -4743746 -5168709 -3687986 -2103433
34384 -2103433 -1599943 -1579329 -1374136 -1383295 -1911932 -2314290 -2025342 -1423660 -1112483 -1155800
34374 -1155800 -1328413 -1345772 -785735 339215 1044871 470113 -688471 -1104426 -936669
34365 -936669 -1420041 -2445122 -2478391 -1220129 -367826 -997092 -1981217 -1989530 -1428885 -1215408
34355 -1215408 -1032324 -206440 709640 627617 -429129 -1489600 -1959203 -1888869 -1404542
34346 -1404542 -672110 -63445 231432 400752 492989 252791 -255503 -541395 -488767 -550453
34336 -550453 -900745 -1135601 -986753 -564725 116516 945315 1201988 437400 -344033 107958
34326 107958 1075776 765424 -584205 -779865 726007 1835735 1311686 709918 1398202
34317 1398202 2090457 1238384 -246666 -794428 -855560 -1488786 -1876408 -756867 872724
34308 872724 1003512 -276903 -1226425 -1256158 -1115322 -1013944 -753252 -1042501 -2493452
34299 -2493452 -3951943 -4008434 -3446664 -3885535 -4786786 -4458954 -3392539 -3606963 -4924035
34290 -4924035 -5015542 -3347790 -1984309 -1915014 -1633812 -334295 348516 -819745 -2510073
34281 -2510073 -3027585 -2647756 -2281414 -1599644 -719 1978996 3493130 4371193 4396769
34272 4396769 3124078 1294527 707779 1625732 2088357 1016341 99870 1046125 2731837
34263 2731837 3001726 1879525 991787 912814 1079526 1478699 2431269 3256122 2933121
34254 2933121 1692734 460926 -689406 -2021301 -2795345 -2223714 -1205445 -1202902 -1722663
34245 -1722663 -885369 1584121 3897232 4853687 5009255 4865200 3913136 2269343 1418260
34236 1418260 2097400 2846547 2095094 701830 824944 2729768 4310916 3929404 2433076
34227 2433076 1761670 2368170 2894112 2196241 874549 421678 1285996 2412796 2741759
34218 2741759 2516788 2610818 2910908 2207395 -37868 -2430009 -2872240 -1027085 1113034
34209 1113034 1443209 32968 -1326931 -1397914 -431869 888957 2145823 2582034 1271147
34200 1271147 -1284420 -3010058 -2864021 -2383897 -3168205 -4064993 -3018297 -857119 -490656
34191 -490656 -2362479 -3558504 -2170446 72447 759578 48236 -659347 -1263102 -2217222
34182 -2217222 -2786748 -2151001 -1166052 -1048767 -1165151 -43517 2107040 3737793 4194257
34173 4194257 3775300 2213490 -773366 -3698224 -4261123 -2302287 -15004 997545
34165 997545 1217633 1571803 2007008 2154104 1968832 1303851 132631 -606694 102929
34156 102929 1352180 902745 -1582212 -3561349 -2816386 -220736 1764290 2106744 1463343
34147 1463343 466315 -709178 -1522272 -1206313 205713 1811040 2785379 2898913 2351469
34138 2351469 1663299 1450798 1694158 1451802 -45380 -2125672 -3154715 -2358154 -645006
34129 -645006 545795 749720 483250 91215 -727497 -2024160 -2830651 -2055475 -91144
34120 -91144 1264268 796418 -801172 -1905501 -1671062 -431198 879873 1225948 165781
34111 165781 -1338084 -1614270 -442358 498512 188406 -78181 954233 1883483 657189
34102 657189 -1649053 -1833921 699926 3027439 3102301 2361251 2716368 3402378 2704259
34093 2704259 1069031 380919 1112535 2025686 2132109 1492959 525728 -323052 -700168
34084 -700168 -1024622 -2260343 -4102630 -4510039 -2390890 276371 707880 -1017420 -2378347
34075 -2378347 -2046657 -1142355 -916851 -1138217 -1209292 -1244814 -1345865 -1071267 -366839 -38609
34065 -38609 -592924 -1371921 -1496043 -1056129 -743680 -737251 -558774 134341 1011867 1336562
34055 1336562 731220 -237694 -435467 592644 1972934 2512079 2113334 1645976 1595839
34046 1595839 1513974 806759 -515922 -1971108 -3038257 -3398431 -3045454 -2146510 -691954
34037 -691954 1342052 3303102 4090698 3670663 3541234 4681359 5748400 4734601 2037337
34028 2037337 196480 439983 1147330 369468 -1520140 -2676862 -2383738 -1757003 -2205161
34019 -2205161 -3857732 -5385819 -5169893 -2945838 -261899 1209745 1568651 1976338 2337568
34010 2337568 1274710 -1252945 -3058245 -2498978 -748302 41779 -284591 -365030 19163
34001 19163 -341864 -1856974 -3348968 -3790577 -3449931 -2888840 -2024441 -792334 222734
33992 222734 574195 756028 1508971 2674181 3341683 3017924 2226241 1905175 2347005
33983 2347005 2786992 2216037 743620 -191043 565122 2303630 3161840 2341181 906481
33974 906481 315288 908705 2054691 2982026 3063453 2013270 422582 -432954 26831
33965 26831 877429 878364 111833 -302803 74939 423126 -58267 -922194 -910784 600218
33955 600218 2794036 4044579 3465465 1899449 1078365 1635357 2425668 2198742 1321500
33946 1321500 1044297 1541940 1848141 1598623 1472104 1590460 889582 -1067588 -2780657
33937 -2780657 -2510290 -574339 1321988 2573948 4042644 6014510 7337060 7105941
33929 7105941 6009783 5169625 4450392 2900126 498019 -1477050 -1926561 -1215435 -711077
33920 -711077 -1207299 -2005632 -1731939 -123596 1348377 1097650 -572481 -1809055 -1542286
33911 -1542286 -587462 -153482 -257836 -327817 -517663 -1317630 -2283275 -2387909 -1673399 -1439573
33901 -1439573 -2397332 -3475032 -3090990 -1175433 674697 932985 -386823 -2008062 -2812155
33892 -2812155 -2750267 -2399457 -1997838 -1372503 -734637 -821721 -1837881 -2810870 -2652886 -1534713
33882 -1534713 -540416 -221893 -240411 -226295 -95580 415511 1497221 2382599 1791851 -285346
33872 -285346 -2190496 -2559665 -1817298 -1026478 -189794 1210510 2626968 2756675 1320366
33863 1320366 -613283 -2115799 -3121585 -3494731 -2557139 -195930 2350402 3583668
33855 3583668 3253669 2252444 1379450 756798 186797 -494188 -1337264 -2132116 -2400024
33846 -2400024 -1860160 -805356 257941 1162640 1963747 2520512 2651253 2519646 2326179
33837 2326179 1733677 270165 -1622037 -2641365 -2067582 -654359 254962 73327 -882708
33828 -882708 -2049313 -2854466 -2706090 -1495040 -29191 675492 576551 538661 1045171
33819 1045171 1569176 1428951 739512 164407 73184 306693 579635 817438 1173741 1841449
33809 1841449 2716296 3230335 2817007 1645175 558690 127159 116363 110555 209242 660058
33799 660058 1107002 801107 -412359 -1709626 -2011416 -954629 803047 2112124 2301933
33790 2301933 1805911 1674484 2299742 2859563 2297048 627798 -1082253 -1894925 -1792827
33781 -1792827 -1400098 -1303175 -1656188 -2144498 -2271811 -1856913 -1243090 -908792 -959432 -1075295
33771 -1075295 -779714 267548 1873151 3105875 3031452 1924134 1123233 1260063 1377088
33762 1377088 509282 -669919 -893144 -344973 -195329 -423157 112649 1253128 1102468
33753 1102468 -1132375 -3493286 -3792990 -2613621 -2218496 -3188979 -3866236 -3008608 -1403621
33744 -1403621 -428278 -212688 22484 453709 280417 -1144062 -3186044 -4223763 -3270805
33735 -3270805 -1198892 148385 150191 19678 877357 2086133 2312788 1524630 802905
33726 802905 624396 617192 807751 1650439 2662190 2485101 823648 -952179 -1785041
33717 -1785041 -2257478 -3062600 -3433595 -2524503 -1474647 -2279777 -4756515 -6351019 -5410183
33708 -5410183 -3278948 -2351186 -2988237 -3396384 -2160615 56425 1410616 840223 -1132721
33699 -1132721 -3223094 -4587332 -5138442 -5007027 -4201242 -2931212 -1803936 -1295797 -1315763
33690 -1315763 -1662677 -2479774 -3589686 -3792725 -1969138 998125 2536494 1209056 -1540838
33681 -1540838 -3080046 -2387593 -567629 766839 818088 -178929 -1160839 -945351 468319
33672 468319 1592507 1204789 -4091 -485528 -87100 44575 -417461 -541261 -11770
33663 -11770 183353 -431907 -803124 -59252 1039001 1454916 1509904 1841966 1755728 274739
33653 274739 -1754630 -2362940 -1120327 450248 1132488 1196799 1154554 847686 289536
33644 289536 127365 563229 789092 190697 -660928 -873489 -482673 -263987 -725824 -1647697
33634 -1647697 -2233597 -1659339 -71729 1026720 327923 -1320833 -1705851 -231448 1270146
33625 1270146 1215892 222208 -513921 -1208166 -2433520 -3348425 -2781453 -1320915 -534115
33616 -534115 -590193 -419922 119244 160109 -156088 398995 1804561 2244414 672418 -1583060
33606 -1583060 -2625007 -2117058 -817709 688631 1804043 1705048 564317 4603 1007090
33597 1007090 2163548 1445006 -864667 -2509013 -2219941 -873470 163016 349566 -404792
33588 -404792 -1921119 -3220705 -3183449 -2145219 -1490723 -1250580 169482 2921124 4227702
33579 4227702 1799966 -2519263 -4782427 -3986301 -2652490 -2468512 -2144233 -504810 926281
33570 926281 354905 -1161371 -1435979 -873275 -1773395 -4227057 -5442275 -3764664 -1045604
33561 -1045604 162323 -33626 228576 1615346 3170993 4026304 3957088 2692068 187236
33552 187236 -2470298 -3697993 -3112963 -1724626 -513451 231900 266315 -712933 -2202933
33543 -2202933 -2906206 -2081308 -242994 1724577 3366255 4229338 3546660 1123724 -1908338
33534 -1908338 -3927175 -4236506 -3250667 -1622660 190379 1610779 1860098 549485 -1755848
33525 -1755848 -3719534 -4114941 -2750618 -661907 707966 646644 -449817 -1686898 -2460174
33516 -2460174 -2715347 -2752644 -2901814 -3195797 -3233100 -2500301 -1000646 440444 651811
33507 651811 -834197 -3019045 -3968904 -2637615 -207959 958458 -95532 -2024726
33499 -2024726 -3166001 -3556384 -4226630 -5248260 -5646032 -4919608 -3503475 -1852819 -188711
33490 -188711 941459 1101566 1036825 1952243 3430375 3516990 1526770 -597966 -691071
33481 -691071 975005 2480527 2752602 2103811 1102873 236681 168450 1069718 2074746
33472 2074746 2493930 2994878 4279047 5264304 4391986 2405411 1699376 2737115 3359642
33463 3359642 2324289 1186126 1307707 1244840 -645383 -2630592 -1588150 1995302 4069367
33454 4069367 2550590 86088 35884 1946541 2971283 2306709 1867151 3036959 4923850
33445 4923850 6079788 6235318 5728374 4552412 2832379 1362384 753348 499406 -354705
33436 -354705 -1847803 -3008023 -3063496 -2328383 -1819325 -2147797 -2856332 -2990014 -2427290
33427 -2427290 -2229754 -3137214 -4109531 -3362348 -840710 1463449 1981924 1257555 625803
33418 625803 338250 -126727 -847679 -1656538 -2816868 -4314658 -5032084 -3899109 -1509161
33409 -1509161 645952 2214225 3876618 5415100 5542193 4011454 2512308 2804069
33401 2804069 4821743 7022898 7814581 6464608 3616305 1196476 778733 1666399 1618436
33392 1618436 -167418 -1975943 -2015099 -682885 467625 925117 1243941 1610325 1542438
$$ [...]
##END NTUPLES=NMR SPECTRUM
##END=
