##TITLE=31Pdec_BAU-29P(I)
 CDCl3, 124 sc
 29.1.2020
##JCAMPDX= 6.0         $$ Bruker NMR JCAMP-DX V2.0
##DATA TYPE= NMR SPECTRUM
##DATA CLASS= NTUPLES
##ORIGIN= UXNMR, Bruker Analytische Messtechnik GmbH
##OWNER= root
$$ XWIN-NMR		Version 3.5
$$ Wed Jan 29 14:21:49 2020 Russian Standard Time (UT+4h)  she@DPX200
##.OBSERVE FREQUENCY= 81.013821
##.OBSERVE NUCLEUS= ^31P
##.ACQUISITION MODE= SIMULTANEOUS
##.ACQUISITION SCHEME= undefined
##.AVERAGES= 24
##.DIGITISER RES= 17
##SPECTROMETER/DATA SYSTEM= spect
##.PULSE SEQUENCE= zgpg30
##.SOLVENT NAME= CDCl3
##.SHIFT REFERENCE= (INTERNAL, CDCl3, 0, 182.463)
##AUDIT TRAIL= $$ (NUMBER, WHEN, WHO, WHERE, WHAT)
$$ ##TITLE= Audit trail, XWIN-NMR		Version 3.5
$$ ##JCAMPDX= 5.01
$$ ##ORIGIN= Bruker BioSpin GmbH
$$ ##OWNER= she
$$ F:/spectra/data/she/nmr/P31/1/pdata/1/auditp.txt
$$ ##AUDIT TRAIL=  $$ (NUMBER, WHEN, WHO, WHERE, WHAT)
(   1,<2020-01-29 14:20:33.76 +0400>,<she>,<DPX200>,
      <created by zg, POWCHK disabled, PULCHK disabled
       configuration hash MD5:
       00 E9 B6 7A A2 85 ED C7 34 08 36 98 17 FE 4E 26
       data hash MD5: 32K
       3F 96 96 06 75 1B 03 4A F6 A2 65 0E CD 9B E8 EB>)
(   2,<2020-01-29 14:20:45.96 +0400>,<she>,<DPX200>,
      <Start of raw data processing
       efp BC_mod = 2 LB = 1 FT_mod = 6 PKNL = 1 PHC0 = -1697.893 PHC1 = 139.0013 SI = 64K 
       data hash MD5: 64K
       3D C4 40 37 0D BA 67 1E B6 4A DA 34 91 1F 2E 16>)
(   3,<2020-01-29 14:21:15.34 +0400>,<she>,<DPX200>,
      <pk PHC0 = 67.61726 PHC1 = -141.8 
       data hash MD5: 64K
       E9 DD 0E 72 1C 36 8A 3F 17 F0 E1 4D 36 DF E0 90>)
(   4,<2020-01-29 14:21:19.67 +0400>,<she>,<DPX200>,
      <abs ABSG = 5 
       data hash MD5: 64K
       EE 21 C3 75 E4 0C 05 C3 42 18 80 95 29 47 2D C2>)
$$ ##END=
$$ 
$$ hash MD5
$$ E3 CC 8E DA 72 D4 38 82 90 4F 52 40 D0 24 40 9F
##$RELAX= 
##$RELAX= 
##$RELAX= 
##$RELAX= 
##$RELAX= 
##$RELAX= 
##$RELAX= 
##$RELAX= 
$$ Bruker specific parameters
$$ --------------------------
##$DU= <F:/spectra>
##$EXPNO= 1
##$NAME= <P31>
##$PROCNO= 1
##$TYPE= <nmr>
##$USER= <she>
##$AMP= (0..31)
100 100 100 100 100 100 100 100 100 100 100 100 100 100 100 100 100 100 
100 100 100 100 100 100 100 100 100 100 100 100 100 100 
##$AQSEQ= 0
##$AQ_mod= 1
##$AUNM= <au_zg>
##$AUTOPOS= <>
##$BF1= 81.014009
##$BF2= 200.13
##$BF3= 200.13
##$BF4= 200.13
##$BF5= 200.13
##$BF6= 200.13
##$BF7= 200.13
##$BF8= 200.13
##$BYTORDA= 1
##$CFDGTYP= 0
##$CFRGTYP= 5
##$CHEMSTR= <none>
##$CNST= (0..31)
1 1 145 1 1 1 1 1 1 1 1 1 1 1 1 1 1 1 1 1 1 1 1 1 1 1 1 1 1 1 1 1 
##$CPDPRG= <waltz16>
##$CPDPRG1= <>
##$CPDPRG2= <waltz16>
##$CPDPRG3= <>
##$CPDPRG4= <mlev>
##$CPDPRG5= <mlev>
##$CPDPRG6= <mlev>
##$CPDPRG7= <mlev>
##$CPDPRG8= <mlev>
##$CPDPRGB= <>
##$CPDPRGT= <>
##$D= (0..31)
0 1 0 0 0 0 0 0 0 0 0 0.03 2e-05 3e-06 0 0 0 0 0 0 0 0 0 0 0 0 0 0 0 0 
0 0 
##$DATE= 1580293233
##$DBL= (0..7)
120 120 120 11 120 120 24 19 
##$DBP= (0..7)
150 150 150 150 150 150 150 150 
##$DBP07= 0
##$DBPNAM0= <>
##$DBPNAM1= <>
##$DBPNAM2= <>
$$ [...]
##$SUBNAM3= <"">
##$SUBNAM4= <"">
##$SUBNAM5= <"">
##$SUBNAM6= <"">
##$SUBNAM7= <"">
##$SUBNAM8= <"">
##$SUBNAM9= <"">
##$SW= 369.568048894756
##$SWIBOX= (0..15)
0 1 3 0 0 0 0 0 0 0 0 0 0 0 0 0 
##$SW_h= 29940.119760479
##$TD= 32768
##$TD0= 1
##$TE= 0
##$TE2= 300
##$TE3= 300
##$TEG= 300
##$TL= (0..7)
0 120 53 12 22 120 120 120 
##$TP= (0..7)
150 150 150 150 150 150 150 150 
##$TP07= 0
##$TPNAME0= <>
##$TPNAME1= <>
##$TPNAME2= <>
##$TPNAME3= <>
##$TPNAME4= <>
##$TPNAME5= <>
##$TPNAME6= <>
##$TPNAME7= <>
##$TPOAL= (0..7)
0.5 0.5 0.5 0.5 0.5 0.5 0.5 0.5 
##$TPOFFS= (0..7)
0 0 0 0 0 0 0 0 
##$TUNHIN= 0
##$TUNHOUT= 0
##$TUNXOUT= 0
##$USERA1= <user>
##$USERA2= <user>
##$USERA3= <user>
##$USERA4= <user>
##$USERA5= <user>
##$V9= 5
##$VALIST= <valist>
##$VCLIST= <CCCCCCCCCCCCCCC>
##$VD= 0
##$VDLIST= <DDDDDDDDDDDDDDD>
##$VPLIST= <PPPPPPPPPPPPPPP>
##$VTLIST= <TTTTTTTTTTTTTTT>
##$WBST= 1024
##$WBSW= 4
##$XGAIN= (0..3)
0 0 0 0 
##$XL= 0
##$YL= 0
##$YMAX_a= 19148
##$YMIN_a= -19132
##$ZGOPTNS= <>
##$ZL1= 120
##$ZL2= 120
##$ZL3= 120
##$ZL4= 120
##$ABSF1= 182.463
##$ABSF2= -187.1042
##$ABSG= 5
##$ABSL= 3
##$ALPHA= 0
##$AQORDER= 0
##$ASSFAC= 0
##$ASSFACI= 0
##$ASSFACX= 0
##$ASSWID= 0
##$AUNMP= <proc_1d>
##$AZFE= 0.1
##$AZFW= 0.5
##$BCFW= 0
##$BC_mod= 2
##$BYTORDP= 0
##$COROFFS= 0
##$CY= -3
##$DATMOD= 1
##$DC= 0
##$DFILT= <>
##$DTYPP= 0
##$F1P= 0
##$F2P= 0
##$FCOR= 1
##$FTSIZE= 65536
##$FT_mod= 6
##$GAMMA= 0
##$GB= 0
##$INTBC= 1
##$INTSCL= 5.30512e-09
##$ISEN= 30
##$LB= 1
##$LEV0= 0
##$LPBIN= 0
##$MAXI= 10000
##$MC2= 0
##$MEAN= 0
##$ME_mod= 0
##$MI= 50
##$NCOEF= 0
##$NC_proc= -4
##$NLEV= 6
##$NOISF1= 182.463
##$NOISF2= 159.3651
##$NSP= 0
##$NTH_PI= 0
##$NZP= 0
##$OFFSET= 182.463
##$PC= 4
##$PHC0= -1630.276
##$PHC1= -2.798706
##$PH_mod= 1
##$PKNL= yes
##$PPARMOD= 0
##$PSCAL= 0
##$PSIGN= 0
##$REVERSE= no
##$SF= 81.0140089999434
##$SI= 65536
##$SIGF1= 159.3651
##$SIGF2= -187.1042
##$SINO= 113.3802
##$SIOLD= 16384
##$SREGLST= <1H.CDCl3>
##$SSB= 0
##$STSI= 65536
##$STSR= 0
##$SW_p= 29940.119760479
##$SYMM= 0
##$S_DEV= 0
##$TDeff= 32768
##$TDoff= 0
##$TI= <>
##$TILT= no
##$TM1= 0
##$TM2= 0
##$TOPLEV= 0
##$USERP1= <user>
##$USERP2= <user>
##$USERP3= <user>
##$USERP4= <user>
##$USERP5= <user>
##$WDW= 1
##$XDIM= 65536
##$YMAX_p= 377196822
##$YMIN_p= -2258280
$$ End of Bruker specific parameters
$$ ---------------------------------
##NTUPLES= NMR SPECTRUM
##VAR_NAME=  FREQUENCY,     SPECTRUM/REAL,   SPECTRUM/IMAG
##SYMBOL=    X,             R,               I
##VAR_TYPE=  INDEPENDENT,   DEPENDENT,       DEPENDENT
##VAR_FORM=  AFFN,          ASDF,            ASDF
##VAR_DIM=   65536,         65536,           65536
##UNITS=     HZ,            ARBITRARY UNITS, ARBITRARY UNITS
##FACTOR=    0.456856943014862, 1,           1
##FIRST=     14782.0589164792, 0,            0
##LAST=      -15158.0608439998, 0,           0
##MIN=       -15158.0608439998, -2258280,    0
##MAX=       14782.0589164792, 377196822,    0
$$ Real data points
##PAGE= N=1
##DATA TABLE= (X++(R..R)), XYDATA
$$ [...]
##PAGE= N=2
##DATA TABLE= (X++(I..I)), XYDATA
41073G31965K1605l56426l42700j21632q4749j57713p39L56573N36445L67704
41063I50333N6604j44560j64062n6325O3881Q2697J9095l19K6684l7301j70357
41052F26370j51581M4271J30068k2200j35304q577J09582l1640k01274o6338K18945
41041E12322K67532R5633J8595N9270l0152k24605k16719K2344J39525l8862k30638
41030C74245j27963J89134M13024L77630J62427l4678q2744o1871j70445m02094
41020F36665m70970k16238J21696K59061K74857L44297K98362j07674o18417o71741
41010a50102j76929L45156M69406L19151K01405J41161l7773l77499o78407o58682
41000f03113k44647K35886L36226J13443J56625O90966J035626M94227n12021
$$ plain form
41073 731965 753570 397144 54444 -67188 -151937 -309650 -310389 46184 582629 950333
41063 950333 1006937 862377 698315 641990 705871 788568 807663 807344 834028 796727 626370
41052 626370 474789 519060 649128 626928 491624 483047 592629 560989 359715 293377 512322
41041 512322 779854 875487 894082 953352 923200 698595 481876 504220 643745 604883 374245
41030 374245 246282 435416 848440 1226070 1388497 1353819 1271075 1209204 1038759 636665
41020 636665 165695 -50543 71153 330214 605071 949368 1247730 1140056 521639 -150102
41010 -150102 -327031 18125 487531 806682 1008087 1149248 1111475 733976 55569 -603113
41000 -603113 -847760 -611874 -275648 -162205 -5580 685386 1721012 2215239 1703218
40991A703218r20894n12364j10183k40394m25278j06760M64266P16132N79355
40982A147098L46074J32849o3366j17428l544J8826j90599l58940k52125q7619
40972E71226j12804j17270J65240M59598K96459k12497m77943k47654J43629L12681
40962G80665K07986l3406k31213j66010K08948N47567M27241r3412n19845n22838
40952F05683k15512J37802L63113L23553k9137m69399o42494m75718k24120q3367
40942g09596l278J01597K26941L81155N31037M52795p837n03185m53363J16891
40932A33157M77462J86359k70284k26438J74349K91669M0076m0321K53635M23755
40922A443419Q9436l70662l71100M5579L45179K64472K7526j05294j22179r0283
$$ plain form
40991 1703218 782324 269960 159777 -80617 -505895 -612655 -148389 567743 1147098
40982 1147098 1493172 1626021 1562655 1445227 1441683 1460509 1269910 910970 658845 571226
40972 571226 458422 341152 506392 965990 1262449 1049952 572009 324355 467984 780665
40962 780665 988651 955245 724032 558022 766970 1314537 1741778 1648366 1128521 605683
40952 605683 390171 527973 891086 1214639 1185502 716103 73609 -402109 -626229 -709596
40942 -709596 -712874 -611277 -384336 -3181 527856 980651 972814 469629 16266 133157
40932 133157 610619 796978 526694 300256 474605 766274 806350 766029 1019664 1443419
40922 1443419 1532855 1162193 791093 836672 1181851 1446323 1473849 1368555 1246376 1156093
40912A156093j8222N4831O2000K9416k61j21920l84787n16135k08205K95906L61996
40901G10712j30737n15766k63556K64069M06371J60564j1810m7252k58640n54744
40891b40789m26673J65674N70269L75291q587m4568J55385J83487M5721N419J1903
40880G92532j63149l83124k90575M9895J68814q9776l25491j91514J43793L30972
40870D2377L06124J95855K5093k03386l17998j64532R3972J31082r6341k79708
40860b67462j69907J30946L44408L16323P0652k68097m84953l56700R4933N15192
40850g4665N62401K91958K9574o1082o4217m0288K5349J3331k26423m91375l47067
40839c82504K03118N81863M28713J07868O9921J36910o4479l28006j93053J84398
$$ plain form
40912 1156093 1137871 1192702 1254702 1284118 1283857 1161937 777150 261015 52810 348716 710712
40901 710712 579975 64209 -199347 64722 471093 631657 619847 572595 313955 -240789
40891 -240789 -667462 -501788 68481 443772 435185 390617 546002 729489 775210 780629 792532
40880 792532 629383 246259 -44316 5579 174393 84617 -240874 -432388 -288595 42377
40870 42377 348501 544356 569449 366063 48065 -116467 -22495 108587 12246 -267462
40860 -267462 -437369 -306423 37985 354308 424960 156863 -328090 -684790 -589857 -74665
40850 -74665 487736 779694 809268 748186 683969 643681 669030 682361 455938 -35437 -382504
40839 -382504 -179386 402477 831190 939058 1008979 1145889 1081410 753404 560351 744749
40829G44749K32766m6485q1647K18894K47791k20354n25487j46568M39070M94893
40819A357622J12175q1432N0900Q4147j78147m39823m13672j34229K23130M76938
40809A057609M31720P2420k65635k32904N3920J57872p2359l30947l15631j09853
40799D46212j8102j60284l19401j94186J94300M49245L05210N6968J51078M38290
40789A349330L47387j42483l46482L6294L39642n7346o96334o96386o2794L97158
40779D67986K55249j49294l94535l82854j10352L36704N58784K21317l26816m06619
40769F9570j266K39102N0072q7769J56465L94107K01405j87271l05371j52467
40759C76577k7179K1347J33631K31197Q2292k82882n23026l73135N9594L89826
$$ plain form
40829 744749 977515 931030 849383 1068277 1316068 1095714 570227 423659 862729 1357622
40819 1357622 1469797 1388365 1439265 1523412 1345265 905442 491770 357541 580671 1057609
40809 1057609 1489329 1561749 1296114 1063210 1117130 1275002 1202643 871696 556065 446212
40799 446212 428110 267826 -51575 -245761 -51461 397784 702994 759962 911040 1349330
40789 1349330 1696717 1554234 1207752 1244046 1583688 1526342 830008 133622 70828 467986
40779 467986 723235 573941 179406 -203448 -313800 22904 581688 803005 476189 69570
40769 69570 68304 307406 357478 269709 426174 820281 1021686 834415 529044 376577
40759 376577 349398 370745 504376 735573 817865 534983 11957 -361178 -301584 88242
40749H8242L22272j9078j87429M2402L57818L54628J20591J3595J3367j98323
40739I08085n51044n64141j27964K49669J98805n704K9964K20415K45181M3132
40729F46398k23877m00189l16042J08572N36630M20401j96662n49951j82604L66342
40719B09018L68702l2281j57995J30322L57721K70741Q6409n6165k71408m85541
40709D19523l84809K6094K84131J08318j95093k11113J736Q1435q8357k74912
40699b33047k50451k8817K24813L59233L04183Q8412j64191l06448k75142j18590
40689d00045Q6990L04018M65429L98896j2441n42010o95808k63688L42534N41046
40679B24921K78061J18n534R8178Q9003J7342L1474J45976K95461L83428K26434
$$ plain form
40749 88242 410514 391436 204007 246409 604227 958855 1079446 1093041 1106408 908085
40739 908085 357041 -207100 -335064 -85395 113410 107706 137670 358085 603266 646398
40729 646398 422521 22332 -293710 -185138 351492 771893 575231 25280 -157324 209018
40719 209018 577720 545439 387444 517766 875487 1146228 1232637 1176472 905064 419523
40709 419523 34714 60808 344939 453257 258164 47051 48787 130222 41865 -233047
40699 -233047 -483498 -512315 -287502 71731 375914 464326 300135 -6313 -281455 -400045
40689 -400045 -313055 -9037 456392 855288 842847 300837 -394971 -658659 -316125 224921
40679 224921 502982 503100 497566 595744 684747 702089 733563 879539 1175000 1558428 1784862
40668A784862k53837p22285o76455j31104L10379K41951o4822j80515j08883m7472
40658A51819N3631K75373L70808R6638k81257k81624Q7651L51706K57319L0439
40648A112503q1800j49531l17474m91666m39230r6612L17664M82422K76775q3163
40638E29888k65219j67769N0260K20791K56297P1698k70683l86800L3282O24835
40628F96580O51770M2212m42276l15087l2395j56060m48031l71202n279K02059
40618a77709K32385L51863M47668K20821j50497k37623r7809q7908j00649K29148
40608F29690O47409M94935j35776l69936Q3917M24589L8534n13213m06183J60592
40598A054558L25842j34664n91772n27925j07964K43997L55022K65926L9430j98636
$$ plain form
40668 1784862 1531025 808740 132285 1181 311560 553511 488689 308174 199291 151819
40658 151819 205450 480823 851631 948269 667012 385388 473039 824745 1082064 1112503
40648 1112503 1030703 881172 563698 72032 -367198 -463810 -146146 336276 613051 529888
40638 529888 264669 96900 147160 367951 624248 695946 425263 38463 71745 696580
40628 696580 1348350 1390562 948286 633199 600804 444744 -3287 -374489 -379768 -177709
40618 -177709 54676 406539 854207 1075028 924531 686908 589099 501191 400542 629690
40608 629690 1277099 1772034 1636258 1266322 1350239 1774828 1813362 1300149 893966 1054558
40598 1054558 1380400 1245736 653964 126039 18075 262072 617094 883020 922450 723814
40588G23814k35838r055K11598Q9846k81056l63873J41750P63279P57591J16577
40578A914633l90925k95906j0233l7727j75855k9579J68284l7067m23997m02635
40568B78993m7539J6115k83436l43003K1716K18135j04662m40880k35809K98350
40558f22020O00756N21716K80550N8497m1824K5720P8481j33107m38949l62402
40548c2582J38494N51170N81288M61407L09951j15351p14771q47491l14622J48429
40538A65922n5210m46149k75125K86701N29049L48742K11426K52984K01725L3284
40528A253349p826N6127J128r5011J0316J94500J38495q6767j54079p7663j18181
40517A114388k21662j44471j8450j54241l57684j24748M65477P22428L16166l10458
$$ plain form
40588 723814 487976 478921 690519 780365 499309 135436 277186 1040465 1798056 1914633
40578 1914633 1523708 1227802 1217569 1179842 1003987 974408 1142692 1105625 681628 278993
40568 278993 231454 247569 -35867 -378870 -357154 -139019 -243681 -684561 -920370 -622020
40558 -622020 -21264 500452 781002 839499 797675 823395 901876 768769 329820 -32582
40548 -32582 105912 657082 1238370 1699777 2009728 1894377 1179606 332115 17493 165922
40538 165922 110712 -335437 -610562 -323861 205188 553930 765356 1018340 1220065 1253349
40528 1253349 1245523 1301650 1302778 1207767 1218083 1412583 1551078 1464311 1310232 1232569 1114388
40517 1114388 892726 748255 729805 575564 217880 93132 558609 1281037 1597203 1286745
40507A286745o21160n41841k37150J32862L14721J29835j47846p5518K33539K33587
40497G07774j18102k08653K28733O20000M18397j02415l61833l09859k68627k95418
40487C09997k04026j018J34751J71389J88574J60572N5696K79Q1041J39252J4281
40476A050788j59480j42952O1945K75582L91517L52909P4002l54132n66116l44938
40466F39125q583l7828l94121n57268k41502K60162N21795M81711L43227J99905
40456A206623j5316k85938m29797l19347p4994O3025L5139L4089K35759N41987
40446I91230O74873M80839O4843l26369m76409l34354r3671n3940k57832l58367
40436C10843n0152M42550N77120J87225l17636n05590l91750k29055r7497P9327
$$ plain form
40507 1286745 665585 123744 -113406 19456 334177 464012 316166 240648 474187 707774
40497 707774 589672 381019 609752 1229752 1648149 1545734 1183901 874042 605415 309997
40487 309997 105971 104953 239704 411093 599667 760239 815935 816214 897255 1036507 1050788
40476 1050788 891308 748356 810301 1085883 1477400 1830309 1904311 1550179 984063 639125
40466 639125 630542 592714 198593 -358675 -600177 -340015 181780 663491 1006718 1206623
40456 1206623 1191307 905369 475572 156225 81231 144256 179395 213484 449243 991230
40446 991230 1666103 2146942 2211785 1885416 1409007 1074653 980982 927042 669210 310843
40436 310843 260691 703241 1280361 1467586 1149950 644360 252610 23555 -73942 5385
40426E385K76620L66633L14895K02566Q2609n1784j73748k12468j42798r854J40111
40415G98167K91118M02829L79344J57103j69633l83624l69046k42389j63882r8707
40405F01280N8504J93007Q6359j72792k39861o0588K7585r4457p7963K27688L52250
40394I01012n2872m78552k40350L87433N09619j8846l91603j12156L43436L84118
40384A231239J16999o6242j24018j63605q9172J19383J79818k9566j53397P7555
40374A098994L22023J33291k99394m12967r3545K28380K11375n8514l05729l31878
40364D92036j02678J95096K76753J18037J9763J44285K50740J29579p045R4150
40354A610716K37526P9837k87412m84618m21720l09602k12720j4161K38669L47935
$$ plain form
40426 5385 282005 648638 963533 1166099 1248708 1196924 1023176 810708 667910 658056 798167
40415 798167 1089285 1492114 1871458 2028561 1858928 1475304 1106258 863869 699987 601280
40405 601280 659784 852791 939150 766358 526497 465909 493494 399037 321074 548762 901012
40394 901012 848140 369588 129238 516671 1026290 1007444 615841 503685 847121 1231239
40384 1231239 1348238 1281996 1157978 994373 905201 1024584 1204402 1174836 1021439 1098994
40374 1098994 1421017 1554308 1254914 841947 748402 976782 1188157 1129643 823914 492036
40364 492036 389358 584454 861207 979244 999007 1143292 1394032 1523611 1516566 1610716
40354 1610716 1848242 1928079 1640667 1156049 734329 424727 212007 197846 436515 784450
40344G84450K92281K03768Q3845j19833k37763n5117K80487L90449J86486o2665
40334A746388j49488j03364j1401K2065j69589n60773p54277m46648N3441K20440
40324a53206R8610J51454M03619L87336J5145j74335J16659M35625K87756j36350
40314A432313l37414k28931p5680O165J03654K45361L75401M30061K67364k18063
40304B000231p37394p35493j58362K92948P0128m11967l79689J50279M38111J37913
40294F66705k83482l25225q6042R6689J84561L00829L66614K23684l1351j33814
40284I79168j8273J21279J17898O846q3723p9645J1477J07802P7480j35488l80718
40273G24103m05107j51907J30283J69149j34r6806M1767K84077L98969L03827
$$ plain form
40344 784450 1076731 1280499 1364344 1244511 1006748 951631 1232118 1622567 1809053 1746388
40334 1746388 1596900 1493536 1482135 1504200 1334611 773838 19561 -427087 -373646 -153206
40324 -153206 -54596 96858 500477 887813 902958 728623 845282 1280907 1568663 1432313
40314 1432313 1094899 865968 790288 796453 900107 1145468 1520869 1950930 2218294 2000231
40304 2000231 1262837 527344 368982 661930 732058 320091 -59598 90681 528792 666705
40294 666705 383223 57998 -28044 68645 253206 554035 920649 1144333 1112982 979168
40284 979168 960895 1082174 1200072 1206918 1123195 1043550 1055027 1162829 1240309 1104821 724103
40273 724103 318996 167089 297372 466521 466387 369581 411348 695425 1094394 1398221
40263A398221Q8111r8409j43243o2625j7409j14149j99804o0248J66155R1269
40253A047869k82850m06858L6736N43157M29819j61293m60752j80734J74720J71343
40243I11157J5388L3863J08191r603j86987j14979J99331M75238N32325L62552
40233B326476M089m00130n76018l97738o7076J68825K96232L50707K13567j33025
40223A785909l87039l00323q4938r2319k49172k04137P7283K80373K57405J73890
40213A256932J36240N5060p2675q8229M7516J76291J86363P9365j81789n78923
40203A016151q20235n90715m4793L25457L39212K38165J38338j06805l85311k62264
40193a52800K89345O47336M09154l579o1226M8079j08176l37103j54470K81686
$$ plain form
40263 1398221 1486332 1387923 1244680 1182055 1164646 1050497 850693 790445 956600 1047869
40253 1047869 765019 358161 394897 938054 1367873 1206580 745828 565094 739814 911157
40243 911157 926545 960408 1068599 1058996 872009 757030 956361 1431599 1963924 2326476
40233 2326476 2330565 1930435 1354417 956679 889603 1058428 1354660 1705367 1918934 1785909
40223 1785909 1398870 1098547 1013609 921290 672118 467981 545264 825637 1083042 1256932
40213 1256932 1393172 1448232 1375557 1287328 1334844 1511135 1697498 1776863 1595074 1016151
40203 1016151 195916 -394799 -439592 -114135 225077 463242 601580 494775 109464 -152800
40193 -152800 136545 783881 1193035 1189456 1128230 1176309 1068133 731030 576560 858246
40183H58246L67068P3757k7309K09506K72630m3875k45899l7228J29402j26993
40173A429305l97371j92381J59969M8773l46197l00928K84227P15196N22769K44
40163A923606l74910m83569l81050q6316K39529L20724J60145M9214P2981J5599
40153A455953j33309p6700J92122K21129j72641n23994m48473k40297k63920k51239
40143b41369J61607O12977N01939L2697o7140K39689K57948k11255n11152k57153
40133E18788M3886n1555j32477K68800P17077N05076j47350l66946M8934L79670
40123A783903J05965m04449n38817k29044J69460L92068L77000J46429j53643
40114A648872k71496j20347Q6229J02650p2771k82499m01352l36233l1237L62505
$$ plain form
40183 858246 1225314 1299071 1271762 1481268 1753898 1710023 1464124 1426896 1556298 1429305
40173 1429305 1031934 839553 999522 1048295 702098 401170 685397 1400593 1923362 1923606
40163 1923606 1548696 1065127 684077 597761 837290 1158014 1318159 1367373 1440354 1455953
40153 1455953 1322644 1245944 1438066 1659195 1486554 962560 514087 273790 9870 -241369
40143 -241369 -79762 533215 1035154 1067851 1000711 1240400 1498348 1287093 775941 518788
40133 518788 562674 511119 378642 647442 1364519 1869595 1722245 1355299 1404233 1783903
40123 1783903 1889868 1485419 946602 717558 887018 1279086 1656086 1802515 1648872
40114 1648872 1377376 1257029 1343258 1445908 1373137 1090638 689286 353053 321816 684321
40104F84321M95961K12876j88807l09357j70880j26735k79238l03862L0386M36265
40094D80930M56118J04040j36589K6128L08895K73235p2403l26380k64195q8291
40084G61488o9574j72789j76697k0861J41681J85489J54030J46527J64984J22584
40074A236862k7254k06681k76826j84740j1254J42471K45043K64411J23002j50668
40064A154366l37950k93088j95184k72836l52468n8207N12139P63141M36646L0773
40054A387332O5762L19981K42861j58821l81407k25249P297Q2230Q6171O8845
40044A495002o8012k19069r3446K44255L05213j13262n58712n53344k30896j7997
40034A89732n35J8394Q5820J25753K12744M20532N30997K83219j78869m72055
$$ plain form
40104 684321 1180282 1393158 1204351 894994 724114 597379 318141 14279 44665 480930
40094 480930 937048 1041088 904499 930627 1239522 1512757 1440354 1113974 849779 761488
40084 761488 691914 519125 342428 321567 463248 648737 802767 949294 1114278 1236862
40074 1236862 1209608 1002927 726101 541361 530107 672578 917621 1182032 1305034 1154366
40064 1154366 816416 523328 328144 55308 -297160 -355367 156772 919913 1356559 1387332
40054 1387332 1453094 1773075 2015936 1857115 1475708 1250459 1257756 1339986 1426157 1495002
40044 1495002 1426990 1207921 1114475 1358730 1663943 1550681 991969 438625 207729 189732
40034 189732 189197 207591 293411 419164 631908 1052440 1583437 1866656 1687787 1215732
40024A215732m93694m03417k03099J96341N39298M05770q4287k90922K2874L18098
40014A222694J42101j49570j2259L61418L65912K122j37699J15274K25537j12010
40004B023520m09533j66829K86526K77971j82913m64942k81056k630K3623q2247
39994A021490j32387k07279l26580k29670J49925L67694Q5577k86782j25478M08673
39984G25183N49841R8614k70518o6152L03769K55258p8435k08664j41520k27267
39974I40109l93209k22141K41645M37908J65485r0579O1346L46460L46962J29240
39964A963226m5853k31615n31543o47354k62495L02460M13253M5290k04763o2039
39954G38567Q9461k3834q6707J63938L69229J34425k19851j18972K83979K83144
$$ plain form
40024 1215732 722038 318621 115522 311863 851161 1256931 1172644 881722 904596 1222694
40014 1222694 1364795 1215225 1202966 1564384 1930296 1932418 1794719 1909993 2135530 2023520
40004 2023520 1613987 1447158 1733684 2011655 1828742 1363800 1082744 1080114 1103737 1021490
39994 1021490 889103 681824 355244 125574 275499 643193 728770 441988 316510 725183
39984 725183 1275024 1373638 1103120 1036968 1340737 1595995 1517560 1308896 1167376 940109
39974 940109 546900 324759 566404 1004312 1169797 1079218 1140564 1487024 1833986 1963226
39964 1963226 1917373 1685758 1154215 506861 244366 546826 960079 1005369 800606 738567
39954 738567 828028 804194 717487 881425 1250654 1385079 1165228 1046256 1330235 1613379
39944A613379k46035n85221k49393K78861K80173j74034m23931k08654Q2974J05841
39934D73960Q731N6691J82712J68058M9712O6487K67825M11140K79034n3269l25597
39923A585484l74509k44880p7837L9124J11838J68877J77433O0575j69086l30128
39913I46891k33138M9761K04183O7882j13694j7907K45361K46476r5511k95506
39903A004798K5026N21631N40356J0743m82344n13759k90529j90189k15302j61367
39893B49064l7437J2935M4847K22695M56202M44516J15918k32193l07146j40985
39883H28416M2313J12055P9825j1081j21302j95493j98303j53772j07680p5483
39873A99495n0978l2560j3946K8632J15248K23219K65793J38574j41412l40351
$$ plain form
39944 1613379 1367344 782123 532730 811591 1091764 917730 493799 285145 368119 473960
39934 473960 482691 539382 722094 890152 939864 1006351 1274176 1685316 1964350 1911081 1585484
39923 1585484 1210975 966095 888258 927382 1039220 1208097 1385530 1446105 1277019 946891
39913 946891 713753 763514 967697 1035579 921885 903978 1149339 1395815 1300304 1004798
39903 1004798 1029824 1551455 2091811 2102554 1620210 1106451 815922 625733 410431 249064
39893 249064 211627 224562 269409 492104 948306 1392822 1508740 1276547 969401 828416
39883 828416 870729 982784 1062609 1051528 930226 734733 536430 382658 274978 199495
39873 199495 148517 115957 102011 130643 245891 469110 734903 873477 732065 391714
39863C91714j81979K86614O17092M24022j13157m13684j95236J90882K41355n0055
39853A197568k37975o1629K16247J99828j00371l18391k47508o5178m637l5287
39843E42667j5352K4798k6371j08171q2295q471l7920p0955J29150M46595M40533
39832A234208J5143l35714k16583R8108J38382k6386R251K52242L11701Q0040
39822A560392j05957n4419m957j65898l45514k61475M8313L18469L69996K02318
39812A561268n0086j69412n0961J07870L5058j91937k49745j17700j22976l26365
39802D25014l26678O0877L75475J70844k39092k09273K58080N19841K48398j43130
39792A140356j60369J09841K30374L2090k62902m05293l72909k75166j64666j4075
$$ plain form
39863 391714 209735 496349 1113441 1537463 1424306 1010622 815386 1006268 1247623 1197568
39853 1197568 959593 897964 1114211 1314039 1213668 895277 647769 582591 577954 542667
39843 542667 527315 552113 525742 417571 335276 326805 288885 217930 347080 793675 1234208
39832 1234208 1249351 913637 697054 795162 933544 907158 916409 1168651 1480352 1560392
39822 1560392 1454435 1400016 1395059 1229161 883647 622172 670485 988954 1358950 1561268
39812 1561268 1511182 1341770 1290809 1398679 1433737 1241800 992055 874355 751379 425014
39802 425014 98336 159213 534688 705532 466440 257167 515247 1035088 1283486 1140356
39792 1140356 979987 1089828 1320202 1352292 1089390 684097 311188 36022 -128644 -142719
39782a42719J69181K89982K73899J81316J25904J06447M1116m5917m0972L4429
39772I92666J4582j26061j87097n1876J14307J13615j3945j01966n7623J63193
39762H59795N38976P92938N26882k00448p20629n21016P6882L79533K33352K1161
39752A987426o8979k09726m04440l62641k8108K36852J68101p3734k41251l07363
39742F96137k86119j05966J56436K46466J24857P6403K40442L65433K48940P8883
39732A841912O5581O6590r1762k22396r6921R4054L7529j32172l9606K61287L30930
39721B115026N7277j77149j41360r1529k53349l89890k01220J52492K90085J72994
39711A533377N8250J0443j38006l57960l67704j13212O8091l1393j32465O4481
$$ plain form
39782 -142719 26462 316444 590343 771659 897563 1004010 1045126 999209 958237 992666
39772 992666 1007248 881187 694090 642214 756521 870136 856191 754225 696602 859795
39762 859795 1398771 2191709 2718591 2518143 1797514 1276498 1353380 1732913 1966265 1987426
39752 1987426 1918447 1708721 1304281 941640 913532 1150384 1318485 1244751 1003500 696137
39742 696137 410018 304052 460488 706954 831811 908214 1148656 1514089 1763029 1841912
39732 1841912 1907493 1974083 1882321 1659925 1563004 1657058 1694587 1562415 1522809 1784096 2115026
39721 2115026 2172303 1995154 1853794 1762265 1508916 1119026 917806 1070298 1360383 1533377
39711 1533377 1591627 1602070 1464064 1106104 738400 625188 693279 661886 529421 593902
39701E93902L26826K18009j79581l55415j54989M3666K2556M0533K29217K34910
39691A019634j27617l62741J06N69245O19309J86319r8904r3818k21306m92755
39681I97472l78277J61707M29329J38221o5480K48666M74203K2790n45518l81175
39671A101938K17611K95984j55768k44155K48508M90026K8548m55920k92414J47448
39661A381806J63946j61624k44400K9537K57906K36985J59229J68669J51211j9772
39651B123493k95409n02335m47847q4126L23093L76596L2870l06999l27493j61266
39641G30577n7799Q00J06562J46208K9673m8063R0252K50482J63512n3106r2243
39630A266855N1147J58850J99028K52962J86831j34957m14728k27053K62266M32975
$$ plain form
39701 593902 920728 1138737 959156 603741 448752 492418 514974 555507 784724 1019634
39691 1019634 892017 529276 529382 1098627 1717936 1904255 1805351 1711533 1490227 997472
39681 997472 619195 780902 1210231 1348452 1282972 1531638 2005841 2028631 1483113 1101938
39671 1101938 1319549 1615533 1459765 1215610 1464118 1954144 1982692 1526772 1234358 1381806
39661 1381806 1545752 1384128 1139728 1169265 1427171 1664156 1823385 1992054 2143265 2123493
39651 2123493 1828084 1325749 877902 793776 1116869 1493465 1526335 1219336 891843 730577
39641 730577 672778 673578 780140 926348 956021 907958 998210 1248692 1412204 1359098 1266855
39630 1266855 1318002 1476852 1675880 1928842 2115673 1980716 1565988 1338935 1601201 2034176
39620B034176J23642j63901j21684r2361l61252n57463k52136K55292L32335l2311
39610A164337k60457r1003J21647Q0990j2639Q9400K25730J37963m6642j8083
39600A391243J79009J90667p9580l01149k18189k9666o1069k53333k59312J7912
39590E76533K73563K41644M3556l2603Q3651K48436L45937L24604J04587k85631
39580A924277n21169k49633L59736O35352J93835m97619o50518j46119L55630
39571A403772L28577J9396m5555J25938Q9749k39015l92266q7967K79837K17665
39561A700131j13113j61550J54975L57593J65135j48487k76553k93284l20418
39552A064429k06719J28258L70357K16398j44746l30545l12855k72006j46075
$$ plain form
39620 2034176 2157818 1993917 1872233 1779872 1418620 861157 609021 864313 1196648 1164337
39610 1164337 903880 812877 934524 1015514 1002875 1092275 1318005 1455968 1409326 1391243
39600 1391243 1570252 1760919 1681339 1380190 1162001 1132335 1071266 817933 558621 576533
39590 576533 850096 1091740 1135296 1102693 1186344 1434780 1780717 2105321 2209908 1924277
39580 1924277 1403108 1153475 1513211 2148563 2342398 1844779 1194261 1048142 1403772
39571 1403772 1732349 1751745 1706190 1832128 1921877 1682862 1290596 1202629 1482466 1700131
39561 1700131 1587018 1425468 1580443 1938036 2103171 1954684 1678131 1384847 1064429
39552 1064429 857710 985968 1356325 1572723 1427977 1097432 784577 512571 366496
39543C66496J81557M27718K21154k02761k26935J98632M55317K30935m0277K9985
39533A641821J66610J4477j79813K456L97203M85452J72300j59145k45685j53943
39523B141733J0467J83102J92280o6518l31284k26630J74545L92772J83919j76972
39513B477414l16483j93244k5587K369j06291j71880j6144K62150L14578J4126
39503B241008k96692k93617j76542k91545m54389k05534L33122M97789R2469k61814
39493A184255n7428L65260M03620Q1533j17401k3927Q7600Q430j75001l07345
39483A449596l04361j14857J87058L26107J06354k60506l49211m3945L32021M16500
39473A744756J74583j41251k64671j39949M6202P4285l9327p8104M0748J42276
$$ plain form
39543 366496 548053 975771 1196925 994164 767229 965861 1421178 1652113 1611836 1641821
39533 1641821 1808431 1822908 1643095 1645551 2042754 2528206 2700506 2541361 2295676 2141733
39523 2141733 2152200 2335302 2527582 2461064 2129780 1903150 2077695 2470467 2654386 2477414
39513 2477414 2160931 1967687 1942100 1944469 1838178 1666298 1650154 1912304 2226882 2241008
39503 2241008 1944316 1650699 1474157 1182612 728223 522689 855811 1353600 1446069 1184255
39493 1184255 1126827 1492087 1895707 1977240 1859839 1835912 1923512 1931942 1756941 1449596
39483 1449596 1145235 1030378 1217436 1543543 1649897 1389391 1040180 996235 1328256 1744756
39473 1744756 1919339 1778088 1513417 1373468 1419670 1493955 1454628 1376524 1417272 1559548
39463A559548R5312L3924J10511K09980J29428q7416k22518k04665j54284j71221
39453A298599k42053k84385j65524J78174N17399M63773L5596k01630J02377M68605
39443B170931K34947l82756n22085L6643N07940K58346k98875l92589r359K31701
39433A834844O2014j60286j19676J9636j5106j47339q5997K42354N76966O04558
39423B811968K79738j26599k87239j41070O8842R3030o0779k07733k28472j29541
39413B072145M8770K30133K52109O658l34582m04942n7170M12543N80748L80024
39403C186436J23444N4242N1031j09057l37945l25202m0219J21215j41442n56721
39393B025782n93445j69316K60546L43899K29819J91280J77372K7482j12043R656
$$ plain form
39463 1559548 1654860 1688784 1799295 2009275 2138703 2051287 1828769 1624104 1469820 1298599
39453 1298599 1056546 772161 606637 784811 1302210 1765983 1801579 1599949 1702326 2170931
39443 2170931 2405878 2023122 1501037 1537680 2045620 2303966 2005091 1612502 1603143 1834844
39433 1834844 1896858 1736572 1616896 1636532 1621426 1474087 1388090 1630444 2207410 2811968
39423 2811968 3091706 2965107 2677868 2536798 2605640 2698670 2637891 2430158 2201686 2072145
39413 2072145 2120915 2351048 2603157 2609815 2275233 1870291 1813121 2225664 2806412 3186436
39403 3186436 3309880 3364122 3415153 3306096 2968151 2642949 2602730 2723945 2582503 2025782
39393 2025782 1432337 1263021 1523567 1867466 2097285 2288565 2465937 2493419 2381376 2391032
39383B391032K26769R2366m01168o76463l57378J72224L20408J11290L8608K64953
39373B182641M45842L27912N2620k14300n00082p04495n10575R5627N89319N43464
39363B307973J97721J7655j7333k20003n22567n48344k51067N4366K51555M72558
39353A742514O10895L85527m4469j57581Q4060J08374l04942o00732l54919M3068
39343A511795J15147J00578L91800O65517L62093k76378m67290o6195K80860J62805
39333B780732j21271k03078j30481m7191Q1064K28393K26022P3466l9496j06573
39323B741587k96598m99535l43659J83920N70552M38787J0944k81942l20590k25416
39313A978050o4746J38916L07621L68058K86858M2792k52931l05337j936K85129
$$ plain form
39383 2391032 2617801 2710167 2308999 1632536 1275158 1447382 1767790 1879080 1917688 2182641
39373 2182641 2628483 2956395 3009015 2794715 2294633 1590138 1079563 1175190 1764509 2307973
39363 2307973 2505694 2523349 2506016 2286013 1763446 1215102 964035 1018401 1269956 1742514
39353 1742514 2353409 2738936 2694467 2536886 2620946 2729320 2424378 1823646 1468727 1511795
39343 1511795 1626942 1727520 2119320 2784837 3146930 2870552 2403262 2337067 2617927 2780732
39333 2780732 2659461 2456383 2325902 2278711 2359775 2588168 2814190 2887656 2848160 2741587
39323 2741587 2444989 1945454 1601795 1785715 2356267 2795054 2805998 2524056 2203466 1978050
39313 1978050 1913304 2052220 2359841 2727899 3014757 3057549 2804618 2499281 2497345 2782474
39303B782474J50089k13618l10915j59098j94395m06670k93331K08217M83039
39294B045792J87204k42727l30442j66772L9323L44749O30462M66729j15080l89928
39284B469310o513L89466K05165j29022Q89K46531n6195n95048n04741J92216
39274B212058O23000M37284J48419J04009O8086o5271l1216J47086O8594k55520
39264C456529k88747R0316K80114o3947m31502k80940J20267J87641p9646k11735
39254B778350j9545K27904K70027J72839J85440M00602N52696K56218l99131p21160
39244C704240k61199M27459M45500j57466m57617o5579L41399J57930k44941k18096
39234C671630J79519M49091M46347L41707J35060k21051m49286k39785K10051
$$ plain form
39303 2782474 2932563 2718945 2408030 2248932 2054537 1647867 1354536 1562753 2045792
39294 2045792 2232996 1990269 1659827 1493055 1532378 1877127 2507589 2974318 2859238 2469310
39284 2469310 2462797 2852263 3057428 2928406 2929295 3175826 3119631 2524583 2019842 2212058
39274 2212058 2835058 3272342 3420761 3524770 3592856 3527585 3496369 3643455 3712049 3456529
39264 3456529 3167782 3258098 3538212 3474265 3042763 2761823 2882090 3069731 2990085 2778350
39254 2778350 2758805 2986709 3256736 3429575 3615015 4015617 4568313 4824531 4425400 3704240
39244 3704240 3443041 3870500 4316000 4158534 3700917 3635338 3976737 4134667 3889726 3671630
39234 3671630 3851149 4300240 4746587 5088294 5223354 5002303 4553017 4313232 4523283
39225D523283M05289K26153P526Q754J48424K44618K42530K02423K38901M30265
39215F678166O71420P25969N36435L40645L70039N80996P61916P41873M89869
39206A1897328K45081M48647J067016J017938r42382m369141o861071o358482
39198c855066l383908l78920R01843O69705N0242k98316l14337n4343L69052O66183
39188e627865O15846L69732K75979M33143N93422N23196L15535K29129K76806
39179a995077J89358j16440k81254J2316M87209O03890L38970J41127J37470j5188
39169d97619l69936m37038R010M73788N01096L35920L50546L38944j6548m18265
39159B69898l78878n9783O144j96560k31493K015K06212K78771L26640K19009
$$ plain form
39225 4523283 4928572 5154725 5162251 5171005 5319429 5564047 5806577 6009000 6247901 6678166
39215 6678166 7349586 8075555 8611990 8952635 9322674 9903670 10665586 11407459 11897328
39206 11897328 12142409 12591056 13658072 14676010 13733628 9364487 2503416 -3855066
39198 -3855066 -7238974 -7617894 -6716051 -6046346 -5996104 -6294420 -6608757 -6663100 -6294048 -5627865
39188 -5627865 -5012019 -4642287 -4366308 -3933165 -3339743 -2816547 -2501012 -2271883 -1995077
39179 -1995077 -1805719 -1922159 -2203413 -2191097 -1703888 -1099998 -761028 -619901 -482431 -497619
39169 -497619 -867555 -1304593 -1295583 -821795 -320699 15221 365767 704711 688163 269898
39159 269898 -108980 -168763 -162619 -359179 -590672 -588657 -382445 -103674 222966 441975
39149D41975j97678n50552l34776K03477L47988O4941L0433M14130N54725J36520
39139A111183k08437L7448L98095K29955j95045j90812J62722J41722m59211r97240
39129C0380q87431l19357J01238J01829n4620K1991L71421O31463M70464R159
39119D76537l14147k54692M6750L40243M81601L81579M5635k79403k85660m506
39109F33937K28679K31925J04757q3586l42404m78682k37399J83090K54937q1430
39099D13824k64082K3828L79929L83006K16756J84094J22412j78003m15251k20476
39089F46037J78065L15353K20967K09295K29084O6300n3789K09620N52634L73150
39079B946716j79640l33368M4575J64301m29322j099579j067230m85146l0349
$$ plain form
39149 441975 244297 -306255 -641031 -437554 -89566 -24625 5808 419938 974663 1111183
39139 1111183 902746 940194 1338289 1568244 1373199 1182387 1345109 1486831 1027620 30380
39129 30380 -857051 -1176408 -1075170 -973341 -1027961 -1005970 -634549 -3086 467378 476537
39119 476537 162390 -92302 -45552 294691 776292 1157871 1203506 924103 638443 633937
39109 633937 862616 1094541 1199298 1115712 773308 294626 57227 240317 495254 413824
39099 413824 149742 173570 553499 936505 1153261 1337355 1459767 1281764 866513 646037
39089 646037 824102 1139455 1360422 1569717 1798801 1865101 1811312 2020932 2573566 2946716
39079 2946716 2767076 2433708 2478283 2642584 2213262 1113683 46453 -438693 -469042
39070d69042Q9717J38620J97044J07545r2378j97904k12053k58847k07334J63163
39060g41469O39096O80338J65459l52802l23391J49829N27695M92241J66237j70060
39050A233173l37762k89567r4951Q2323J26911J05530J50131K27392J84565M2566
39040A430311L6644K48382L85079J42093l19913n21108k76609Q8464J95717N1165
39030A460225q8100q3883P878R3529J15596O4898L3064J36408K84570J98723j75612
39019B047296m60859l01179J16549L00785J38163j0956Q1861J76436j2539l41964
39009A733593m36281k05968P6269J75667J58553J99242K67604J59523j51451l40722
38999A636029q5611M30940O13644J85130l90276m61154l0693K77555O4004l81539
$$ plain form
39070 -469042 -379325 -240705 -43661 63884 -28494 -226398 -438451 -697298 -904632 -741469
39060 -741469 -102373 577965 743424 390622 67231 217060 744755 1236996 1403233 1233173
39050 1233173 895411 605844 510893 593216 720127 825657 975788 1203180 1387745 1430311
39040 1430311 1466955 1715337 2100416 2242509 1922596 1401488 1124879 1213343 1409060 1460225
39030 1460225 1372125 1288242 1296120 1389649 1505245 1570143 1603207 1739615 2024185 2222908 2047296
39019 2047296 1586437 1285258 1401807 1702592 1840755 1829799 1911660 2088096 2075557 1733593
39009 1733593 1297312 1091344 1167613 1343280 1501833 1701075 1968679 2128202 1976751 1636029
38999 1636029 1550418 1981358 2595002 2780132 2389856 1928702 1898009 2175564 2239568 1858029
38989A858029n42144k95461R0736L45310L68743J84213p2077j97934j29795l3441
38979A576179o4851j39555q9805M7116Q8019q16o1922O881J39717K49917L18863
38968B069743K95669Q1543k78924n13924l78843M1672M00874M52650K50025j9269
38958B401216k60597m46458m69319k13667J97730M13355K42262p9839j82891m6572
38948A555220K5262j01177j90500l8030J77361J57170n3435j33671K8190J86727
38938A613117J33189J3435J01966L73521M78831J72398l31358n21560j41729M78077
38928B369887P40618M29550j02329m28411n13032n19777l95552l833M21929M02692
38918B401742j10652n75212n57793k51700m7562N6789K44168L73309J91969r9997
$$ plain form
38989 1858029 1315885 1020424 1111160 1456470 1825213 2009426 1937349 1739415 1609620 1576179
38979 1576179 1511328 1371773 1281968 1329084 1417103 1416287 1354365 1361246 1500963 1750880 2069743
38968 2069743 2365412 2446955 2168031 1654107 1275264 1316936 1717810 2170460 2420485 2401216
38958 2401216 2140619 1694161 1224842 1011175 1208905 1622260 1864522 1784683 1601792 1555220
38948 1555220 1580482 1479305 1288805 1250775 1428136 1585306 1531871 1398200 1426390 1613117
38938 1613117 1746306 1759741 1861707 2235228 2714059 2886457 2555099 2033539 1891810 2369887
38928 2369887 3110505 3540055 3437726 3009315 2496283 1976506 1580954 1577121 1999050 2401742
38918 2401742 2291090 1715878 1158085 906385 858823 915612 1159780 1533089 1725058 1625061
38908A625061n6795K64413L31050J0422j67961J22734M31905K37766k16623l26797
38898B255175o3516Q9535k3379p2145Q6013J76109O6968J2129J14705O0714k94047
38887B408261n19958k29986K36858K61272j25682l08442l1933K74618K29966N2573
38877B247547J10246K98264K42879p9930l12933k46517n0442N0216N6294O3366
38867B378990O5645K4514p847L3443J10566J49747J45918J10243N869j49572k07811
38856B659705o8500J21503J15195r9419k62950j56643J65120M46939M34406O5807
38846C421163l86837m59136j4537M46874L25385k45719n18239j72949K39261J67510
38836B802776j11594j9908L24119K83349k38050n84815l17047J85612L41978J40676
$$ plain form
38908 1625061 1568266 1832679 2163729 2174151 2006190 2128924 2560829 2798595 2581972 2255175
38898 2255175 2191659 2281194 2257815 2185670 2271683 2447792 2514760 2526889 2641594 2702308 2408261
38887 2408261 1888303 1658317 1895175 2156447 2030765 1722323 1690390 1965008 2194974 2247547
38877 2247547 2357793 2656057 2898936 2819006 2506073 2259556 2209114 2259330 2315624 2378990
38867 2378990 2444635 2469149 2461302 2494745 2605311 2755058 2900976 3011219 3017088 2867516 2659705
38856 2659705 2591205 2712708 2827903 2728484 2465534 2308891 2474011 2920950 3355356 3421163
38846 3421163 3034326 2575190 2560653 3007527 3332912 3087193 2568954 2396005 2635266 2802776
38836 2802776 2691182 2671274 2995393 3278742 3040692 2455877 2138830 2324442 2666420 2807096
38826B807096m6908r5956j64763k70037k27908j1652J49805J15381M6450J39826
38816B441334K95978K52182O735j23113L2377J85622n767l62107l73793L2827
38806B382275L52897K69905J11433K33461L71819Q5988m40807o10548k90126O1441
38796B527738J09314j5662r8165q9930M3482K80346L45776K9340l20271j72268
38786B639700L02850L78507r0178l96225j09918K51064J16650k18246j44977K86103
38776C015330N60886N15975L67930J94515n5775k34251j80036p6069j68235l05144
38766C635126j95550N8143J28745K56r3273r2988o3371P9906L50098M29056J17718
38755D353866j94237o5443K32711J47068j62862n6493M17220M60157j88115p29562
$$ plain form
38826 2807096 2760188 2664232 2499469 2229432 2001524 1989872 2139677 2255058 2301508 2441334
38816 2441334 2737312 2989494 2996229 2873116 2905493 3091115 3085348 2723241 2349448 2382275
38806 2382275 2735172 3005077 3116510 3349971 3721790 3807778 3366971 2756423 2466297 2527738
38796 2527738 2637052 2621390 2523225 2433295 2476777 2757123 3102899 3132239 2811968 2639700
38786 2639700 2942550 3321057 3230879 2834654 2724736 2975800 3092450 2874204 2729227 3015330
38776 3015330 3576216 4092191 4460121 4654636 4598861 4364610 4184574 4108505 3940270 3635126
38766 3635126 3439576 3497719 3626464 3626720 3533447 3440459 3377088 3456994 3807092 4236148 4353866
38755 4353866 4159629 4094186 4326897 4473965 4311103 4254610 4671830 5131987 4943872 4214310
38745D214310m52931K62315N64976K73498r9155j48679N1567K27034K08381L7035
38735E138351o1186P6898K68470J80320j30680k06129J39424M94679M50864J99163
38725F550174J87979M17878M84974K44341L6235J67956M53524M65516J33593j30746
38715I011424K7094M11424N35981L15837J79226L90660O12465M04581j38537o35975
38705A1114180j090080j821064k780738l396020l193888k279500j154148l23083
38697d924341n5357k15757l29067q4847K70644L25063J37343P7726J62494Q4453
38687d551646j17335j5850M55997P79171N98686K26983J32720L21154M94472N04191
38677a171457L88671K13378O6278L508p7092k52969k90705O0495N04207M61751
$$ plain form
38745 4214310 3761379 4023694 4588670 4862168 4763013 4614334 4665901 4892935 5101316 5138351
38735 5138351 5077165 5154063 5422533 5602853 5472173 5266044 5405468 5900147 6351011 6550174
38725 6550174 6738153 7156031 7641005 7885346 7921581 8089537 8543061 9008577 9142170 9011424
38715 9011424 9038518 9449942 9985923 10301760 10480986 10871646 11484111 11888692 11750155 11114180
38705 11114180 10024100 8203036 5422298 2026278 -1167610 -3447110 -4601258 -4924341
38697 -4924341 -4979698 -5195455 -5524522 -5609369 -5338725 -5013662 -4876319 -4798593 -4636099 -4551646
38687 -4551646 -4668981 -4684831 -4228834 -3449663 -2850977 -2623994 -2491274 -2170120 -1675648 -1171457
38677 -1171457 -782786 -569408 -503130 -499622 -576714 -829683 -1120388 -1059893 -555686 -93935
38667i3935j3011j95855K10909N72363K84927l17948n19636k43815K3924M7372
38657b44705L7782J81011L90817M72035K76883j69705n31811l96805J58301N31824
38647G05627L48526q1070k85692k33413j07438J09904M28338N69143L30162l2079
38637A752008j71609j34158j06807r233K49820M27277L10668J26929J26801R7363
38627B669059j85315l71869n6312M09249L53538j35502l42807o2898J84856J05882
38617B567881r66L2471p0441l55999l74991L5166L44802J53636j50976p1807J70462
38606B279238J10376o2031J75400O45023N64453k45885r58599q26179j30993L29128
38596A879931K93483J16324O6594P8993J07543K12680K64265L6485k97722k55604
$$ plain form
38667 -93935 -106946 -302801 -91892 480471 765398 447450 -72186 -316001 -292077 -244705
38657 -244705 -206923 -25912 364905 836940 1113823 944118 412307 15502 173803 705627
38647 705627 1054153 973083 687391 453978 346540 456444 884782 1453925 1784087 1752008
38637 1752008 1580399 1446241 1339434 1330201 1580021 2007298 2317966 2444895 2571696 2669059
38627 2669059 2483744 2111875 2055563 2464812 2818350 2682848 2340041 2277143 2461999 2567881
38617 2567881 2566915 2599386 2528945 2172946 1797955 1833121 2177923 2331559 2180583 2108776 2279238
38606 2279238 2389614 2327583 2502983 3148006 3712459 3466574 2507975 1681796 1550803 1879931
38596 1879931 2173414 2289738 2356332 2435325 2542868 2755548 3019813 3056298 2758576 2502972
38586B502972J76046L58224p0397n66511m63804L5899K58225J17457N9093J36695
38576B543899l3140l97306l75809J76236O56303O25987L64282K16858N9512k11909
38566C624913k89659k5524J47999j15332m36661k69599K56075N49027L51117r0706
38556C701650m02159l22325J40213N50422M22183n1292j53537K48736M32912J3456
38546D580259l73923j55538J78749o6529n83777o11319j86334R2245J57814L62949
38536C394596N66786L31144j35277j88948J59134K61603p3919l53697k80325q5299
38526C595798N6462K25156L51466K80980K00286L39116L79781q8048o77702o33078
38516D030217m9684K59967Q8191K5059K68868K93581p6715k72500k530K40158
$$ plain form
38586 2502972 2679018 3037242 2966845 2400334 1936530 1972429 2230654 2348111 2407204 2543899
38576 2543899 2510759 2113453 1737644 1913880 2570183 3196170 3560452 3777310 3836822 3624913
38566 3624913 3335254 3309730 3457729 3342397 2905736 2636137 2892212 3441239 3792356 3701650
38556 3701650 3299491 2977166 3117379 3667801 4089984 4038692 3885155 4133891 4566803 4580259
38546 4580259 4206336 4050798 4229547 4163018 3579241 2967922 2781588 2873833 3031647 3394596
38536 3394596 3961382 4292526 4157249 3968301 4127435 4389038 4315119 3961422 3681097 3595798
38526 3595798 3652260 3877416 4228882 4509862 4710148 5049264 5429045 5340997 4663295 4030217
38516 4030217 3980533 4240500 4328691 4353750 4622618 4916199 4839484 4566984 4564454 4804612
38506D804612Q7809j25371j06166j20532l21705l24285M7392K85533K6728k57208
38496C996807J3808N93818P80151L77505j86257m54525l01586P1217K67775O3084
38486E221797k66568k88156o7182j7876j41369l4968L07047M20222K28461K15075
38476E576483N05977N56717R6565l47330k90501l00P7275m025l9529j38201l65660
38465E627471m22151j36035J63960J79339J08636J99742K76425J07779j46774
38456E958392k32790j90438j47400o7381N9470J27800J70819L08425L81775J40107
38446F508779j89662j46318J31470O7113k94748k74631K26273M61757R9739k27773
38436F361999m7940K33818K20048J81668K93254J55226l15055m57502K094L42049
$$ plain form
38506 4804612 4892421 4767050 4660884 4540352 4218647 3894362 3941754 4227287 4254015 3996807
38496 3996807 4010615 4604433 5384584 5762089 5575832 5121307 4819721 4890938 5158713 5221797
38486 5221797 4955229 4667073 4599891 4582015 4440646 4405678 4712725 5132947 5361408 5576483
38476 5576483 6082460 6639177 6735742 6388412 6097911 6097611 6174886 6170861 6131332 5993131 5627471
38465 5627471 5205320 5069285 5233245 5412584 5521220 5720962 5997387 6105166 5958392
38456 5958392 5725602 5535164 5387764 5320383 5379853 5507653 5678472 5986897 6368672 6508779
38446 6508779 6319117 6172799 6304269 6371382 6076634 5802003 6028276 6490033 6589772 6361999
38436 6361999 6314059 6547877 6767925 6949593 7242847 7398073 7083018 6625516 6627610 6969659
38426F969659Q1519j52219J81040M72870R8016l28721N334N98083M36541k80176
38416H081946n23373j36828J06231q8037k30705m0026K67776N69589Q40399P52252
38406I599224J28262m35793k91667J70972J01084l80792l77281K56267O59420
38397I429696L41755j70140k93047j65044j47687j94628o7796K21447M48843M45745
38387I849144K51274J11516K22622L93276K50226j19670j95666J27896L15848
38378A1206466J12005m268K79456M74240J52871k27728o6410L89078M87632J16547
38368A2919889m22908r47043j212422q25019N2773N59845L31307J09668N00108
38359A1066198R48803P53107K35598O693j11451m50015o02579k13360J27740j43392
$$ plain form
38426 6969659 7051178 6898959 7079999 7552869 7650885 7322164 7327498 7925581 8362122 8081946
38416 8081946 7558573 7421745 7527976 7439939 7209234 7169208 7436984 8006573 8846972 9599224
38406 9599224 9727486 9291693 9000026 9170998 9272082 8891290 8514009 8770276 9429696
38397 9429696 9771451 9601311 9308264 9143220 8995533 8800905 8733109 8954556 9403399 9849144
38387 9849144 10100418 10211934 10434556 10827832 11078058 10958388 10762722 10890618 11206466
38378 11206466 11318471 11314203 11593659 12067899 12220770 11993042 11926632 12315710 12803342 12919889
38368 12919889 12496981 11549938 10337516 9512497 9565270 10125115 10456422 10566090 11066198
38359 11066198 12015001 12768108 13003706 13010399 12898948 12448933 11846354 11632994 11760734 11617342
38349A1617342m67558j36778M17208M53395K43833L70528N13007J99578m5750
38340A3164805L62697P94274M36685j88128j54498K42294K51161J81668O00888
38331A5691846R16825M29719j12519K25820P04122K18946m87837o7219Q87662
38322A8407365Q56324J80106L41767J061033P45527n02800r62577k40964L57132
38313B0242913L28936M17013O40475K91726j91787K65283J159688J100235M19728
38304B4674210N54415J204177Q97757K4506K78943J342484J316060L12749K82196
38295C0887497J302313J509094P58713P79686J593382J504452P51023J239001
38287D0325161K536555K328433R99148J244814K916669L150485J938270K234779
$$ plain form
38349 11617342 11149784 11013006 11430214 11883609 12127442 12497970 13010977 13210555 13164805
38340 13164805 13527502 14321776 14758461 14570333 14415835 14658129 14909290 15090958 15691846
38331 15691846 16608671 17038390 16925871 17151691 17855813 18074759 17586922 17519703 18407365
38322 18407365 19263689 19443795 19785562 20846595 21592122 21089322 20126745 19885781 20242913
38313 20242913 20571849 20988862 21629337 21921063 21729276 21994559 23154247 24254482 24674210
38304 24674210 25228625 26432802 27330559 27355065 27634008 28976492 30292552 30605301 30887497
38295 30887497 32189810 33698904 34457617 35237303 36830685 38335137 39086160 40325161
38287 40325161 42861716 45190149 46189297 47434111 50350780 53501265 55439535 57674314
38279E7674314M060516M322485L122767L810514N907870N190842K065406J847255
38271H8001969N024563O310707N544539Q779260J5283822J6427741J2656265J5125146
38263A73154012K0059918M66009n5806517j12828248j18817984o9106167j1523552
38256a74402529J3299001J1815887J0553279J5253707J4677448P473895L330614
38249i7998698M482937M211004J167685Q89687M061595N241094L213954K520820
38241g2209922M347371M755587K636926J543884K675181L042012J656735J199733
38233e0352493K388156K513794Q64488K59368J770666K770224J733436O05825
38225c7446536Q70900J238584P54141O00282J332316J565365P62432L52965Q97408
$$ plain form
38279 57674314 61734830 66057315 69180082 72990596 78898466 84089308 86154714 88001969
38271 88001969 93026532 99337239 104881778 113661038 128944860 145372601 158028866 173154012
38263 173154012 193213930 193679939 137873422 25045174 -93772810 -162878977 -174402529
38256 -174402529 -161103528 -149287641 -138734362 -123480655 -108803207 -101329312 -97998698
38249 -97998698 -93515761 -89304757 -88137072 -87247385 -83185790 -77944696 -74730742 -72209922
38241 -72209922 -67862551 -63106964 -60470038 -58926154 -56250973 -53208961 -51552226 -50352493
38233 -50352493 -47964337 -45450543 -44586055 -44326687 -42556021 -39785797 -38052361 -37446536
38225 -37446536 -36575636 -35337052 -34582911 -33982629 -32650313 -31084948 -30322516 -29969551 -29072143
38216b9072143R93207R7364l39701L55359Q42496L86734J55461P93778J142801
38207b4644644N23073J8717L49971O08189K14252P6432O73804R44918K53139l40285
38197b1322434P1364P46294P58340M63324M65322M87722K32248J11936L02939
38188a7682945K66593r9094p2205N09382P68065L16504k9522K82079O28023M34954
38178a4678166J09804Q2680N9949j37880p7889L61932O01846L98435K66157M50862
38168a2562270N20258L24014K70925L42689o131o56027p48118j34750L24619K33703
38158a2091088J49845L07624K28095n6774J35639O22090K58564j042573j766633
38149a3255211j034971R2243M13559K64864M20992O34656L76516m4924j45130
$$ plain form
38216 -29072143 -28078936 -27981572 -28321273 -27965914 -27123418 -26736684 -26581223 -25787445 -24644644
38207 -24644644 -24121571 -24102854 -23752883 -23144694 -22930442 -22854010 -22180206 -21235288 -20982149 -21322434
38197 -21322434 -21251070 -20504776 -19746436 -19283112 -18817790 -18330068 -18097820 -17985884 -17682945
38188 -17682945 -17416352 -17515446 -17587651 -17078269 -16310204 -15993700 -16023222 -15741143 -15113120 -14678166
38178 -14678166 -14568362 -14485682 -14425733 -14563613 -14641502 -14279570 -13677724 -13279289 -13013132 -12562270
38168 -12562270 -12042012 -11717998 -11447073 -11104384 -11110515 -11766542 -12514660 -12649410 -12324791 -12091088
38158 -12091088 -11941243 -11633619 -11405524 -11462298 -11326659 -10704569 -10446005 -11488578 -13255211
38149 -13255211 -14290182 -14197939 -13784380 -13519516 -13098524 -12463868 -12087352 -12132276 -12277406
38140a2277406j23684j90059K4301N78958P53687K64483r0130J94240M12446o077
38130a0459241l83949m3351M29309K83288m6156J30144M09107J30812k72366n8759
38120i881162L99756K86528j60082j18105L19335L89066M7796q7333P4402Q4645
38110h645154p7283m3875J26331J04230L1209K06635L09652j24259p00356o25491
38100i438361n378K97613K3758k09184k363L17214L79113K35662N2398q1475k0512
38089h451515K40803L29262k3626m19680k89584K32103N49843N39213N42237N66248
38079f184696K53667l34930o27101l65623M5631J66432K0808j38704j62774j6434
38069g343724K06570K57115J7671k35553j71310R5524J96692R5422P6125K17169
$$ plain form
38140 -12277406 -12401090 -12591149 -12566848 -11987890 -11234203 -10969720 -11059850 -10865610 -10453164 -10459241
38130 -10459241 -10843190 -10886541 -10457232 -10173944 -10220100 -10089956 -9680849 -9550037 -9822403 -9881162
38120 -9881162 -9481406 -9194878 -9354960 -9473065 -9153730 -8764664 -8716868 -8804201 -8729799 -8645154
38110 -8645154 -8722437 -8766312 -8639981 -8535751 -8504542 -8297907 -7988255 -8112514 -8812870 -9438361
38100 -9438361 -9443739 -9146126 -9122368 -9331552 -9333915 -9016701 -8637588 -8401926 -8349528 -8431003 -8451515
38089 -8451515 -8210712 -7881450 -7905076 -8324756 -8614340 -8382237 -7832394 -7293181 -6750944 -6184696
38079 -6184696 -5931029 -6265959 -6893060 -7258683 -7213052 -7046620 -7025812 -7164516 -7327290 -7343724
38069 -7343724 -7137154 -6880039 -6862368 -7097921 -7269231 -7173707 -6977015 -6881593 -6805468 -6588299
38059f588299K87107J62094j7873j24759j62473j10461N7605J88803N9933k83712
38049f532035n12155l90553m0494K17383K15131J07961J64817L67027L68546J6633
38039f017739k98840j49585K55557L62725J22600k2547L7093o2823l81764m53637
38029f608960q4877K72632K61055J44295K47898M04129L26097P9085j45527l04252
38019e408425l10275l7379K90195K47503p7065j34289J47737K08747j29737l22845
38009e525833j11938j361k77759m40854j64836N5110j35832k12992K55969P19963
37999e840363N55187J15677P978L6264k05499l73632j0813M53419L66511k988
37989d898259p002J90664K1114l34151k81328N8508J28116L447J22062K78433
$$ plain form
38059 -6588299 -6301192 -6139098 -6156971 -6281730 -6444203 -6554664 -6497059 -6308256 -6248323 -6532035
38049 -6532035 -7044190 -7434743 -7475237 -7257854 -7042723 -6934762 -6769945 -6402918 -6034372 -6017739
38039 -6017739 -6316579 -6466164 -6210607 -5847882 -5725282 -5747829 -5710736 -5773559 -6155323 -6608960
38029 -6608960 -6693837 -6421205 -6160150 -6015855 -5767957 -5363828 -5037731 -4958646 -5104173 -5408425
38019 -5408425 -5718700 -5756079 -5465884 -5218381 -5295446 -5429735 -5281998 -5073251 -5202988 -5525833
38009 -5525833 -5637771 -5639132 -5916891 -6357745 -6522581 -6467471 -6603303 -6816295 -6560326 -5840363
37999 -5840363 -5285176 -5169499 -5161521 -5125257 -5330756 -5704388 -5715201 -5261782 -4895271 -4898259
37989 -4898259 -4905261 -4714597 -4693483 -5027634 -5308962 -5250454 -5122338 -5118891 -4996829 -4718396
37979d718396J55l68561j20529M96587N91722J11959j63345j8600J337k17497
37969d405168j66026J83476K17737j84262l99242j51416J05150R2351P7163J52357
37959d477880M2439j97891j64641O8103j1292l45708k78268K79599N93597K90408
37949d201534r7940q2817J20274J96800K20233K23867J1632l23043l73110j30947
37939d436585m0804j83577j48685J36425K42011O9198L2210K21179K17395m6680
37929c937913r4393J88988L05997N7707j37883q6256j13538k77437j80132J66328
37919d108532K19470p1656j06472K05599J92236k89210m39603Q7122N14820L00783
37909c495443L1970K14994K79672k92604q46593n96715M1331K19297M0422J13260
$$ plain form
37979 -4718396 -4718241 -5086802 -5207331 -4710744 -4119022 -4007063 -4170408 -4189008 -4187671 -4405168
37969 -4405168 -4571194 -4387718 -4169981 -4354243 -4753485 -4904901 -4799751 -4707400 -4630237 -4477880
37959 -4477880 -4435441 -4633332 -4797973 -4729870 -4741162 -5086870 -5365138 -5085539 -4491942 -4201534
37949 -4201534 -4299474 -4382291 -4262017 -4065217 -3844984 -3621117 -3609485 -3932528 -4305638 -4436585
37939 -4436585 -4477389 -4660966 -4809651 -4673226 -4431215 -4362017 -4329807 -4108628 -3891233 -3937913
37929 -3937913 -4032306 -3843318 -3537321 -3479614 -3617497 -3703753 -3817291 -4094728 -4274860 -4108532
37919 -4108532 -3889062 -3960718 -4067190 -3861591 -3669355 -3958565 -4398168 -4311046 -3796226 -3495443
37909 -3495443 -3463473 -3248479 -2968807 -3261411 -4108004 -4704719 -4663388 -4444091 -4403669 -4290409
37899d290409L44074K51523j3001K722J16844j08479m33322l34169J6233R0764
37889d357220r59K02858N35952M59613P5210m8531J07311O7783j91413k40248
37879c389644o2028p1455k82485k61893N5792K40918J08898o1541p9331k2792
37869c825561J02591L15153L46124k2697m17531l14456Q4689J24324k27462l46776
37859d181602k8289K03042K2954j80098m702L50291M85435L47335R9645j63038
37849c049027l31260k41344O5591K96619K57555M0015j80647k92372k00580Q0948
37839c554502L02051K20612n2441k23360k42126k38353j52971J50691M75554M49966
37829b864879J10289j17190o8874l9177k12218l24629j12552K23793K69076n4089
$$ plain form
37899 -4290409 -3946335 -3694812 -3707813 -3705091 -3588247 -3696726 -4130048 -4464217 -4447984 -4357220
37889 -4357220 -4358179 -4155321 -3619369 -3159756 -3084546 -3133077 -3025766 -2957983 -3149396 -3389644
37879 -3389644 -3451672 -3523127 -3805612 -4067505 -4011713 -3770795 -3661897 -3723438 -3802769 -3825561
37869 -3825561 -3722970 -3407817 -3061693 -3084390 -3501921 -3816377 -3731688 -3607364 -3834826 -4181602
37859 -4181602 -4209891 -4006849 -3983895 -4163993 -4168695 -3818404 -3332969 -2985634 -2885989 -3049027
37849 -3049027 -3380287 -3621631 -3556040 -3259421 -3001866 -2961851 -3142498 -3434870 -3635450 -3554502
37839 -3554502 -3252451 -3031839 -3084280 -3307640 -3549766 -3788119 -3941090 -3790399 -3314845 -2864879
37829 -2864879 -2754590 -2871780 -2940654 -2979831 -3192049 -3516678 -3629230 -3405437 -3136361 -3190450
37819c190450l94589l91460o7831K18055K07119N2306O6071K25494K19074M480
37809c051731p8110J04441K11381J2160k02353j52255p3839k20608k70089J58967
37799c562036O91922N99269j06880o42011n16804n1049K32101J96077k5650k73211
37789c458272l45653j02754K91362M89875L81811J64762K7094p97N9702J38445
37779b354425R2210r1090j93685j02115l4322j55035k21423K7566L78599M50598
37769b203122K60685N8079j47813m07163m44511l4971M30932L70385j35415m99559
37759b752473n04003l86024j87756K52789O90217O04092M4301l32512k12586J5489
37749b768466M284o6269M2210K22886L17435L40653K36673j16497n05026m80749
$$ plain form
37819 -3190450 -3585039 -3976499 -4044330 -3826275 -3619156 -3566850 -3500779 -3275285 -3056211 -3051731
37809 -3051731 -3129841 -3025400 -2814019 -2801859 -3004212 -3156467 -3230306 -3450914 -3721003 -3562036
37799 -3562036 -2870114 -2270845 -2377725 -3019736 -3536540 -3587589 -3355488 -3159411 -3185061 -3458272
37789 -3458272 -3803925 -3906679 -3615317 -3125442 -2743631 -2578869 -2551775 -2552572 -2492870 -2354425
37779 -2354425 -2262215 -2353305 -2546990 -2649105 -2683427 -2838462 -3059885 -3032319 -2653720 -2203122
37769 -2203122 -1942437 -1884358 -2032171 -2439334 -2883845 -2918816 -2487884 -2117499 -2252914 -2752473
37759 -2752473 -3256476 -3642500 -3830256 -3577467 -2887250 -2283158 -2238857 -2571369 -2783955 -2768466
37749 -2768466 -2764182 -2830451 -2788241 -2565355 -2247920 -1907267 -1670594 -1787091 -2292117 -2772866
37739b772866n1724K09238m1536m55032n27847k03217K48314N65990N60821K13617
37729b254242j62309k15224o6023j14554l34975k98342M9954K52818J30141O0945
37719b951811K30479K42927j43875m85227l25430O4732J42988o5376j11203J20996
37709c280800K99185K02738k380n6999P2765K02818J54937j9921o5045J36519
37699b356183L32549K23528r2172k82093k85044k95012l25901k12439l802Q2789
37689c213780P8803J83799L02075J58143j43575k15296m9083j2152j54723j37249
37679c203038Q9452J76895N2473L9487J84868J63961j030J12856M61638M27228
37669a495210j22491m99949l19869j13843l14917m56431m4840M90830M76940N1042
$$ plain form
37739 -2772866 -2824590 -2615352 -2656888 -3111920 -3639767 -3842984 -3594670 -3028680 -2467859 -2254242
37729 -2254242 -2416551 -2631775 -2697798 -2812352 -3147327 -3445669 -3395715 -3142897 -3012756 -2951811
37719 -2951811 -2721332 -2478405 -2622280 -3107507 -3432937 -3368205 -3225217 -3290593 -3401796 -3280800
37709 -3280800 -2981615 -2778877 -2781257 -2838256 -2765491 -2562673 -2407736 -2427657 -2492702 -2356183
37699 -2356183 -2023634 -1800106 -1892278 -2174371 -2459415 -2754427 -3080328 -3292767 -3296569 -3213780
37689 -3213780 -3134977 -2951178 -2649103 -2490960 -2634535 -2849831 -2898914 -2911066 -3065789 -3203038
37679 -3203038 -3113586 -2936691 -2884218 -2844731 -2659863 -2495902 -2496932 -2384076 -1922438 -1495210
37669 -1495210 -1617701 -2117650 -2437519 -2551362 -2866279 -3322710 -3367550 -2876720 -2399780 -2348738
37659b348738k06660k15492k34796j82837J41372M72782M07625P2984j15361r9403
37649b308524n6499M7830K52841K99765P6548k5811K26652L44427j12066o39528
37639a894365m92881O8056J52148l29206n49193r3781M68989N12306J30657k27395
37629b254665l52397k77539r6829M6422N6555J7450K9868L1991M960J15823L54268
37618b324093L44790p9289m59273l52221l2992J0640p9168J22002M39895L59773
37608b049936k3711j33813R3582J45868j39049l50733k59767o7591J52245N31523
37598b101382Q39660N91093j03844m97031k40050J64245J76369j02074l03365
37589a576379l07689j53055Q7631J70191j03883m31606l02135J75118L52800O6954
$$ plain form
37659 -2348738 -2555398 -2770890 -3005686 -3188523 -3047151 -2574369 -2166744 -2093760 -2209121 -2308524
37649 -2308524 -2365023 -2317193 -2064352 -1764587 -1688039 -1713850 -1487198 -1142771 -1254837 -1894365
37639 -1894365 -2387246 -2319190 -2167042 -2496248 -3045441 -3139222 -2670233 -2157927 -2027270 -2254665
37629 -2254665 -2607062 -2884601 -2981430 -2935008 -2878453 -2861003 -2831135 -2799144 -2794184 -2678361 -2324093
37618 -2324093 -1979303 -2058592 -2517865 -2870086 -2903078 -2892438 -2971606 -2849604 -2409709 -2049936
37608 -2049936 -2073647 -2207460 -2113878 -1968010 -2107059 -2457792 -2717559 -2785150 -2632905 -2101382
37598 -2101382 -1261722 -670629 -774473 -1271504 -1511554 -1347309 -1170940 -1273014 -1576379
37589 -1576379 -1884068 -2037123 -1949492 -1779301 -1883184 -2314790 -2616925 -2441807 -2089007 -2022053
37579b022053j21906Q7610K50932J3086k62563j50917J34015J78558K8131n3971
37569a919078o4448p2112M4993K71416K66139r3359l81564k53617L556j2043j65615
37558b375732j46999q2927k13150k97869L806M08556L53938n6034j56895K11579
37548b351727M36107J03521l55888l24237J35682M56770L56763O6182j22977j79882
37538a779686j77458j03352K7045N9066r1296k20070q4163J65271J22218k28337
37528b310762l82523n6612L25117K55009p4049j20029J10526J42944q7796j34060
37518b332235J27441K50622J9848j59271M309J55585o3697l41906j95401K24757
37508b309948L79987J67936l5374l4186j6475j17641k04233j58253o8127m5256
$$ plain form
37579 -2022053 -2143959 -2056349 -1805417 -1792331 -2054894 -2205811 -2071796 -1893238 -1865107 -1919078
37569 -1919078 -1983526 -2055638 -2010645 -1739229 -1473090 -1566449 -1948013 -2201630 -2198074 -2210117 -2375732
37558 -2375732 -2522731 -2605658 -2818808 -3116677 -3112871 -2704315 -2350377 -2406411 -2563306 -2351727
37548 -2351727 -1915620 -1812099 -2167987 -2492224 -2356542 -1899772 -1543009 -1476827 -1599804 -1779686
37538 -1779686 -1957144 -2060496 -2033451 -1974385 -2065681 -2285751 -2369914 -2204643 -2082425 -2310762
37528 -2310762 -2693285 -2749897 -2424780 -2169771 -2243820 -2363849 -2253323 -2110379 -2198175 -2332235
37518 -2332235 -2204794 -1954172 -1934324 -2093595 -2089286 -1933701 -1997398 -2339304 -2534705 -2309948
37508 -2309948 -1929961 -1762025 -1797399 -1831585 -1848060 -1965701 -2169934 -2328187 -2396314 -2441570
37498b441570m8719K8717J95853L12993K00238j29023l61746j96091K21010M16245
37488a802093K23553J909P2538K47771J70548j24505k97856k08777m2044P931
37478a751025m8197q2492j1907J17314J61415N3786p4774q7251q8961k40918l76434
37467b429444j62577L19317N58949L11977q1964k46694k30260j90135l5509K83870
37457a902470M80079K99835n7180k37107k16483j62443n8922J56181K92231J43265
37447a263014j18945j62069O844J08186O1558L8959R3648O8011j05870k65223
37437a537915k28132r208J88466J53680q9620k32345m7255K31215J84259j60029
37427a546884l81954l68322m06837m78462j52792N06000O90837O0683n10744j59364
$$ plain form
37498 -2441570 -2490289 -2461572 -2265719 -1952726 -1752488 -1881511 -2243257 -2439348 -2218338 -1802093
37488 -1802093 -1578540 -1576631 -1504093 -1256322 -1085774 -1210279 -1508135 -1716912 -1758956 -1751025
37478 -1751025 -1799222 -1881714 -1893621 -1776307 -1614892 -1561106 -1635880 -1723131 -1812092 -2053010 -2429444
37467 -2429444 -2592021 -2272704 -1713755 -1401778 -1483742 -1730436 -1960696 -2150831 -2186340 -1902470
37457 -1902470 -1422391 -1122556 -1179736 -1416843 -1633326 -1795769 -1854691 -1698510 -1406279 -1263014
37447 -1263014 -1381959 -1544028 -1537184 -1428998 -1367440 -1328481 -1234833 -1166822 -1272692 -1537915
37437 -1537915 -1766047 -1775255 -1586789 -1433109 -1522729 -1755074 -1802329 -1571114 -1386855 -1546884
37427 -1546884 -1928838 -2297160 -2703997 -3182459 -3335251 -2829251 -2138414 -2077731 -2588475 -2747839
37417b747839N88807O09530o5552l84203J048K98723K914l29796j25130K77273
37407a874225K90278J6779q1320L730o1538k89689l51689j19625J62428K36281
37397b068590J09995k4732k3208O9587R4441K8008N0378K26701K93632L7651k70541
37386a476678k06068J38720K65539L5110j67151r1254M7874L8330q224Q99p7037
37375a499940k57525k63278J2484K55009K14994Q2798Q8955J03043l1433j17295
37365a412188M3098K16366Q9401j92828k78388j82725j49345j23916J10320L86800
37355a493405L15338j9753j01613J78207L01496k0933l26953j32846K60121K25269
37345h15072j96585l78642j14487Q0240j79686n39797m74145o3123K19754K45108
$$ plain form
37417 -2747839 -2159032 -1549502 -1615054 -1999257 -1998209 -1699486 -1696572 -2026368 -2151498 -1874225
37407 -1874225 -1583947 -1567168 -1648488 -1644758 -1706296 -1995985 -2347674 -2467299 -2304871 -2068590
37397 -2068590 -1958595 -1983327 -2006535 -1936948 -1842507 -1814499 -1764121 -1537420 -1243788 -1206137 -1476678
37386 -1476678 -1682746 -1544026 -1278487 -1243377 -1410528 -1501782 -1453908 -1415578 -1423802 -1422903 -1499940
37375 -1499940 -1757465 -2020743 -2008259 -1753250 -1538256 -1455458 -1366503 -1263460 -1294893 -1412188
37365 -1412188 -1369090 -1152724 -1063323 -1256151 -1534539 -1717264 -1866609 -1990525 -1880205 -1493405
37355 -1493405 -1178067 -1197820 -1299433 -1121226 -819730 -840663 -1167616 -1300462 -1040341 -815072
37345 -815072 -1011657 -1390299 -1504786 -1424546 -1604232 -2144029 -2618174 -2681297 -2461543 -2216435
37335b216435K74660L74542K73324j27863n10065n52725k97457L6241L18971M56495
37325a970312L47681P4449j02673r2928p8365j46437j33244O371M8226m8039M1696
37314b053575L94462M98865J8292n10323l82077J67851L08445r3918l48233j16712
37304b116923J28771L7059l5555K36524M96592L13542o0982j09384J20272J57494
37294h32590j17149l50576k86952n0167J15976Q8444j14743l18482k69192N8214
37284b077217L38787K99093J05324R1347K25525J75400j33318l59674k29873Q3345
37274a481261K12281O8340j04730r4214L2744R5827Q7983J34582K05645J03963
37264g38840j75135l23137j54050P1116M0063j03190k8511J73817J45571o1356
$$ plain form
37335 -2216435 -1941775 -1567233 -1293909 -1421772 -1931837 -2484562 -2782019 -2745778 -2426807 -1970312
37325 -1970312 -1622631 -1548182 -1650855 -1743783 -1822148 -1968585 -2101829 -2095458 -2047232 -2095271 -2053575
37314 -2053575 -1659113 -1160248 -1141956 -1652279 -2034356 -1866505 -1558060 -1651978 -2000211 -2116923
37304 -2116923 -1988152 -1951093 -1986648 -1750124 -1253532 -939990 -1000972 -1110356 -990084 -832590
37294 -832590 -949739 -1300315 -1587267 -1637434 -1521458 -1433014 -1547757 -1866239 -2135431 -2077217
37284 -2077217 -1738430 -1439337 -1334013 -1242666 -1017141 -841741 -975059 -1334733 -1564606 -1481261
37274 -1481261 -1268980 -1200640 -1305370 -1399584 -1366840 -1271013 -1183030 -1048448 -842803 -738840
37264 -738840 -913975 -1237112 -1391162 -1320046 -1279983 -1383173 -1411684 -1237867 -1092296 -1153652
37254a153652k6795K75183L54834J9636k78402j92229k1272j14198k34595k3997
37244a395487L01610K88078N371j03333K9960O5736r4197j61083R37J41405K8770
37233h92233k45492m49061m44078k20484Q0185K09107J03375L8263K18833L70319
37223a231266J17719l41827m32299n9817K43544J54772J3676J80024M05268K57567
37213f92639j45473l16258j65377r5121k92184l78820M426N67366O62722J26733
37203g24625m91358o07632k56329R6528J89293J49710J41999J50093J50817K15072
37193i86432L19857K91582P4534j45854k23556k42159k65224j38890K08236M66793
37183f41113K72253k52413n79581m02516N1364L47918K98020M5807j57829k07447
$$ plain form
37254 -1153652 -1180447 -905264 -550430 -530794 -809196 -1001425 -1022697 -1136895 -1371490 -1395487
37244 -1395487 -1093877 -805799 -800428 -903761 -873801 -808065 -902262 -1063345 -1062408 -921003 -892233
37233 -892233 -1137725 -1586786 -2030864 -2251348 -2171163 -1962056 -1858681 -1820418 -1601585 -1231266
37223 -1231266 -1113547 -1455374 -1887673 -1947490 -1703946 -1549174 -1535498 -1355474 -950206 -692639
37213 -692639 -838112 -1154370 -1319747 -1414868 -1707052 -2085872 -2081446 -1514080 -851358 -724625
37203 -724625 -1215983 -1823615 -2079944 -1983416 -1794123 -1644413 -1502414 -1352321 -1201504 -986432
37193 -986432 -666575 -374993 -300459 -446313 -669869 -912028 -1177252 -1316142 -1107906 -641113
37183 -641113 -368860 -621273 -1200854 -1603370 -1552006 -1204088 -906068 -860261 -1018090 -1225537
37173a225537j90542j85007r2083J67332L60024J59303l06338n10753k79275m9424
37163b152300j33004j94351J18713M69962L45981n5644j29575J42819K26151k4265
37153a385513k00425j49796j75935k91716n7799N42004Q07075L30226l41456n45340
37143a468675m10525l59669k65321J70693O07775M59908j04347l50720r7126J21976
37133a696031L2922j0624J86086K39491j05253m53832l78739q5811j1348j31378
37123b414517j50651p9866j12986j39002R1984M25605M47900J42873r3418j07774
37113a989852j38006k29515p7678L22303M31476k9093m93266k91291L47566O25967
37103a521389L25923j2715k7546R599j73287l46892k31110m360K4331m9271Q2484
$$ plain form
37173 -1225537 -1416079 -1601086 -1693169 -1525837 -1165813 -1006510 -1312848 -1823601 -2102876 -2152300
37163 -2152300 -2285304 -2479655 -2360942 -1890980 -1544999 -1600643 -1730218 -1587399 -1361248 -1385513
37153 -1385513 -1585938 -1735734 -1911669 -2203385 -2261184 -1719180 -912105 -581879 -923335 -1468675
37143 -1468675 -1879200 -2238869 -2504190 -2333497 -1725722 -1265814 -1370161 -1720881 -1818007 -1696031
37133 -1696031 -1663109 -1673733 -1487647 -1248156 -1353409 -1807241 -2185980 -2271791 -2283139 -2414517
37123 -2414517 -2565168 -2645034 -2758020 -2897022 -2805038 -2379433 -1931533 -1788660 -1882078 -1989852
37113 -1989852 -2127858 -2357373 -2435051 -2112748 -1681272 -1710365 -2203631 -2494922 -2147356 -1521389
37103 -1521389 -1195466 -1208181 -1235727 -1226128 -1399415 -1746307 -1977417 -1981777 -1957446 -2006717 -1924233
37092a924233L89369N23615L22164j1021k03819j72055L482J69443J77067L871
37082g22117k11429l25454l16256k10270k3726J47815J55636K4734k3896J04087
37072a400876K32314K16129J39882N6969j52600m21640l45249K22523P14544M85119
37062b52885k77929p82077o61454k59877M9021K45412L24884J62519j13196j16233
37052a681815K10673M48749L53733J98427K06792J23323k68379o03063l98081
37043a409641J93395N75510N08850K69220R4613p8558l03901m33936l51674j42493
37033a078615N2095J70562J80400O5655r1385j55456r1374L1948J60390K50128
37023e05652K02258j9060k35312k22958l7890L4740j12715k64954k17881n0660
$$ plain form
37092 -1924233 -1534864 -1011249 -689085 -700106 -903925 -1075980 -1072498 -903055 -725988 -722117
37082 -722117 -933546 -1259000 -1575256 -1785526 -1809252 -1661437 -1505801 -1481067 -1504963 -1400876
37072 -1400876 -1168562 -952433 -812551 -755582 -908182 -1329822 -1675071 -1452548 -738004 -252885
37062 -252885 -530814 -1312891 -1974345 -2234222 -2185201 -1939789 -1614905 -1452386 -1565582 -1681815
37052 -1681815 -1471142 -1022393 -668660 -470233 -263441 -140118 -408497 -1011560 -1409641
37043 -1409641 -1216246 -640736 -131886 137334 231947 153389 -150512 -584448 -936122 -1078615
37033 -1078615 -1026520 -855958 -675558 -609903 -701288 -856744 -948118 -916170 -755780 -505652
37023 -505652 -303394 -322454 -557766 -780724 -818614 -783874 -896589 -1161543 -1379424 -1430084
37013a430084O0634J15027J87553J91427k2405l58579m97036k78718Q7160K78411
37003a666610J99715j1215j92091k49794j40198R2739K93695L40509K84002K30065
36993h19183J42234p5013l37021m25803k86149q7010K6403N0709k08j01699j00436
36982b013176J17271L19733J62107k01858k00103K70738N48048J58541m03681
36973a242380l78989J43464M36626K28563p9493j83692k02725k19940j15903N4176
36963a560293N6969n9187j4441J39274O9932j48215m2335M03190N79912K28135
36953c47059r2154Q9655L85058K02521l24130o25707n33746k81296O637K79284
36943a240937K94054o1559l90611k56067J45573K84693J00391k9191J4759j4164
$$ plain form
37013 -1430084 -1369450 -1254423 -1066870 -875443 -897848 -1256427 -1753463 -2032181 -1945021 -1666610
37003 -1666610 -1466895 -1478110 -1670201 -1919995 -2060193 -1967454 -1673759 -1333250 -1049248 -819183
36993 -819183 -676949 -751962 -1088983 -1514786 -1800935 -1887945 -1861542 -1810833 -1811041 -1912740 -2013176
36982 -2013176 -1895905 -1576172 -1414065 -1615923 -1816026 -1545288 -997240 -838699 -1242380
36973 -1242380 -1621369 -1477905 -1041279 -812716 -892209 -1075901 -1278626 -1498566 -1614469 -1560293
36963 -1560293 -1503324 -1562511 -1576952 -1437678 -1367746 -1515961 -1558296 -1155106 -575194 -347059
36953 -347059 -439213 -349558 35500 238021 -86109 -711816 -1245562 -1526858 -1520221 -1240937
36943 -1240937 -946883 -1008442 -1399053 -1655120 -1509547 -1224854 -1124463 -1153654 -1138895 -1153059
36933a153059j74916k10110j1371K17740L00326K30352Q532k98766m03158j07979
36923a602409K77432K73934o1501k35585r6522J9051m0186O087K72396M01043
36913g86260J35007k33855l05558j24300J4214K0707k9160j53084l56902m38427
36903b257618k05295J98885M33298L66879J55187k1983j12018j18588n5473J5638
36893a601088J8696l4924l9046Q1976K54699K99108J39213n0773l4817J24212
36883h42744Q3914k77584n91202m50059L4831M09592M74947L81918K26372n3956
36873f03971l61386m03353r7190K68773L85376K17093q9660l44592l43361n1380
36863a423651K06891N8122l66748n33653k46341Q9788J01692k4974R6981M56133
$$ plain form
36933 -1153059 -1327975 -1538085 -1549456 -1331716 -1031390 -801038 -792506 -1091272 -1494430 -1602409
36923 -1602409 -1324977 -1051043 -1112544 -1348129 -1444651 -1425600 -1465786 -1459699 -1187303 -786260
36913 -786260 -651253 -885108 -1190666 -1314966 -1300752 -1280045 -1309205 -1462289 -1819191 -2257618
36903 -2257618 -2462913 -2264028 -1830730 -1463851 -1308664 -1330647 -1442665 -1561253 -1616726 -1601088
36893 -1601088 -1582392 -1617316 -1656362 -1574386 -1319687 -1020579 -881366 -932139 -966956 -842744
36883 -842744 -758830 -1036414 -1627616 -2077675 -2042844 -1633252 -1158305 -776387 -550015 -603971
36873 -603971 -965357 -1368710 -1465900 -1197127 -811751 -594658 -684318 -1028910 -1372271 -1423651
36863 -1423651 -1216760 -1158638 -1525386 -2059039 -2305380 -2215592 -2113900 -2138874 -2041893 -1585760
36853a585760O73104M67038q4955o02915o43703j23244M40354M20947r9536l99954
36843a538624j24627K70169L12850K11956L26383M32162J21084l91655n17103
36834h97405j94602P1186M086j90546l33161m44693l89879M6507O01959O45789
36824a080759P7983m09787k70325J77324L26665J57547O6186J32576R0577j09551
36814h41564k10652j14716k1738m6140m4981P5986J84366J76323J55540K00629
36804d86947J67158q0623l88400m79273l28151j62061j09869n8190R6820K34761
36794a594775J70149p1244k65923k49458n8090J64507K94600K59669O1062j75561
36784a465064k52148q1048K13171M24436M61783L63966J69617j18108m18115n23392
$$ plain form
36853 -1585760 -912656 -445618 -530573 -1133488 -1777191 -1900435 -1460081 -1039134 -1138670 -1538624
36843 -1538624 -1663251 -1393082 -1080232 -868276 -541893 -109731 11353 -380302 -897405
36834 -897405 -1092007 -1020821 -1016735 -1207281 -1540442 -1985135 -2375014 -2328507 -1726548 -1080759
36824 -1080759 -1002776 -1412563 -1682888 -1505564 -1178899 -1021352 -955166 -822590 -732013 -841564
36814 -841564 -1052216 -1166932 -1188670 -1234810 -1279791 -1203805 -1019439 -843116 -687576 -486947
36804 -486947 -319789 -400412 -788812 -1268085 -1596236 -1758297 -1868166 -1926356 -1829536 -1594775
36794 -1594775 -1424626 -1495870 -1761793 -2011251 -2069341 -1904834 -1610234 -1350565 -1289503 -1465064
36784 -1465064 -1717212 -1798260 -1585089 -1160653 -698870 -334904 -165287 -283395 -701510 -1224902
36774a224902k72513K18933N72916M78119J9364l81821m00427j35845N4784j509
36764a072901j36904j26465J3343Q6880q691j66055j87478K4407L45031M76171
36754g52662K24994k05935l53431n0234K97259K02623k34308m56291k33143L8223
36744a522905n1958l46570m14458j70616J27958L36482M90855N10677K59913q2283
36734h62905j45156M5883N1398k41016l48165J6513L63206J43102l30608l27286
36724a635034J51968L99376J35933j35348n3073O1138r7274k25958J6406L68577
36714a013289M06930K22191J30134N4699k26076m90314l50591L5360J45115q6459
36704a172300k13028l8134J40339J12297M8772Q6563R1433p051n1188K2642N6782
$$ plain form
36774 -1224902 -1497415 -1278482 -705566 -227447 -208083 -589904 -990331 -1126176 -1071392 -1072901
36764 -1072901 -1209805 -1336270 -1322927 -1236047 -1244738 -1410793 -1598271 -1573864 -1228833 -752662
36754 -752662 -527668 -733603 -1087034 -1137268 -840009 -637386 -871694 -1327985 -1561128 -1522905
36744 -1522905 -1574863 -1921433 -2335891 -2506507 -2378549 -2042067 -1551212 -1040535 -780622 -862905
36734 -862905 -1008061 -962178 -910780 -1151796 -1499961 -1483448 -1120242 -977140 -1307748 -1635034
36724 -1635034 -1483066 -1083690 -947757 -1083105 -1136178 -1075040 -1172314 -1398272 -1381866 -1013289
36714 -1013289 -606359 -384168 -254034 -199335 -425411 -915725 -1266316 -1230956 -1085841 -1172300
36704 -1172300 -1385328 -1423462 -1283123 -1170826 -1122054 -1035491 -944058 -951109 -1002297 -979655 -922873
36693i22873j2082n7506p3669k11806m16519m13923j65254O0721J60163L06001
36683a746747M83742M09019Q1757q4363P9834K12470O4199r0201j8129K4253j62959
36672g47125k42863P2252M08097K97940j8072j8488J85702Q7662k63547l15404
36662e53846L2003K59707R4386j30294j31925r7239k15364l01802j53627J12204
36652a085797K98291L65680K72228o2046m58040n24499k06893P3858N4874K6559
36642a245785K98583O17012N07284j8651m86424n72702l57927m5223K44616L99933
36632f59284L20861O8449j48621j79681l5307J80104L22570K46014n7916l63711
36622c06522l98638j47680J38009K48317K05822J16296k4602k48476m20703l19635
$$ plain form
36693 -922873 -934955 -992461 -1066130 -1277936 -1694455 -2108378 -2273632 -2212911 -2052748 -1746747
36683 -1746747 -1263005 -853986 -772229 -856592 -776758 -564288 -500089 -590290 -608419 -584166 -747125
36672 -747125 -989988 -917736 -509639 -211699 -229771 -248259 -62557 25105 -238442 -553846
36662 -553846 -521843 -262136 -167750 -298044 -429969 -527208 -742572 -1044374 -1198001 -1085797
36652 -1085797 -787506 -421826 -149598 -211644 -669684 -1194183 -1401076 -1327218 -1272344 -1245785
36642 -1245785 -947202 -330190 177094 158443 -327981 -900683 -1258610 -1303833 -1059217 -659284
36632 -659284 -338423 -269974 -418595 -598276 -633583 -453479 -130909 115105 57189 -306522
36622 -306522 -705160 -852840 -714831 -466514 -260692 -144396 -168998 -417474 -838177 -1157812
36612a157812M1245L16065J82136k66976o14282n80576k62424P2491K56893K57272
36602a755968J17974k4930k305K06412M31054N06740M09478J74903j44316l84397
36592d65355l45916p2133J52056J92369K18038L22346K88575k1144l23360k88691
36582c43215m3443N9064j4061m6444m4477j99485m42242m73077k48811m8922j8921
36571a864034o265J00662K05027K28923K08314J30060l5775j48307o0143N7783
36561a183755p4912l31397k92375R5397M23329M56131M01026M23992L67677J34160
36551D19273q5867j68862k36729k96018j38876J86184K79640L6169j02449J20414
36541A2879K76117p9115o55994q53176n89460k13258J17509M29485N58456L52279
$$ plain form
36612 -1157812 -1116567 -800502 -618366 -885342 -1499624 -2080200 -2342624 -2270133 -2013240 -1755968
36602 -1755968 -1637994 -1662924 -1665229 -1458817 -1027763 -521023 -111545 63358 -80958 -465355
36592 -465355 -811271 -883404 -731348 -538979 -320941 1405 289980 268836 -54524 -343215
36582 -343215 -386658 -327594 -341655 -388099 -432576 -632061 -1074303 -1547380 -1796191 -1845113 -1864034
36571 -1864034 -1870299 -1769637 -1564610 -1335687 -1127373 -997313 -1033088 -1181395 -1241538 -1183755
36561 -1183755 -1258667 -1590064 -1882439 -1787042 -1363713 -907582 -506556 -82564 285113 419273
36551 419273 333406 164544 -72185 -368203 -507079 -320895 -41255 -5086 -107535 12879
36541 12879 288996 209881 -446113 -1299289 -1888749 -2102007 -1984498 -1555013 -996557 -644278
36531f44278Q7356J29212K94921J08971l76941n96778l23487L8384J16292L4601
36521a131747M6621J15296Q5601j2147l8451M6485J67647K08757Q4279j34845
36511e62504k29603j25372m5688j57543k47958o5411K12100K62874K02546L61066
36501c95493N87014L99470j36817l54396J1439L87812K39842j84426l78478l45630
36491a69663l59139l58931j41250J19475R5659j04330r3696J40961K50730J47718
36481d72466J06115J92861R6161l10871o50193n25631m0499M00461N79008N32292
36471i2762L27644K2456k48877l63494l51713l16916k73423j81294o2989M7130
36461a494238J93000L89943M99907L89588J66761N9143P0617j2038k24321k90146
$$ plain form
36531 -644278 -556922 -427710 -132789 -23818 -400759 -997537 -1321024 -1282640 -1166348 -1131747
36521 -1131747 -1085126 -969830 -884229 -896376 -934827 -888342 -720695 -511938 -427659 -562504
36511 -562504 -792107 -917479 -963167 -1120710 -1368668 -1434079 -1221979 -959105 -756559 -395493
36501 -395493 191521 590991 454174 99778 111217 499029 738871 554445 175967 -169663
36491 -169663 -528802 -887733 -1028983 -909508 -813849 -918179 -1011875 -870914 -620184 -472466
36481 -472466 -366351 -173490 -77329 -388200 -1038393 -1564024 -1604523 -1204062 -625054 -92762
36471 -92762 234882 257338 8461 -355033 -706746 -1023662 -1297085 -1478379 -1541368 -1494238
36461 -1494238 -1301238 -911295 -411388 -21800 144961 204104 274721 262683 38362 -251784
36451b51784l4264K78643K55120q4384l34507k59072o0397k3025j07253n8546
36441f79469J94110M24389L79389N1748l32645n31381m73391k78157j27299j19301
36431a492007k17867k88160j77607J51147N00482N38845J57999l04229l59486
36422a490883P6443N51144N63060J01622l59179l64150O2063M46440L68930q0482
36412a24992m30643m06031j80753K346J58578K87152J21024m11081p43784l13033
36402b041217M78744O53361O3795l77103j09396K71383J09290k09224j737M70649
36392f91455M37455o8980l05783p1761Q5157p8237j58298L0978J11036p6998j29297
36381i16183J32402K60077j0661k28375j1010K45961L7890l83334m58588k30472
$$ plain form
36451 -251784 -286048 -7405 247715 163331 -171176 -430248 -490645 -513670 -620923 -679469
36441 -679469 -485359 -60970 318419 370167 37522 -493859 -967250 -1245407 -1372706 -1492007
36431 -1492007 -1709874 -1998034 -2175641 -2024494 -1524012 -985167 -827168 -1131397 -1490883
36422 -1490883 -1414440 -863296 -300236 -198614 -557793 -921943 -859880 -413440 -44510 -124992
36412 -124992 -555635 -961666 -1142419 -1140073 -981495 -694343 -573319 -984400 -1728184 -2041217
36402 -2041217 -1562473 -909112 -845317 -1222420 -1331816 -1060433 -951143 -1160367 -1162104 -691455
36392 -691455 -254000 -322980 -628763 -700524 -615367 -693604 -851902 -820924 -709888 -786886 -916183
36381 -916183 -783781 -523704 -534365 -762740 -773750 -527789 -489899 -873233 -1331821 -1562293
36371a562293j26100j39011O8960M34729N44306L34720J35532O1718n7997j94667
36361e00103j53260p0615k54117n02250k73903L38907N39382J7573m83081k45358
36351a586825L71972N49759K20770j2273R5094J81730m318k60110l56211l16143
36341a116555j85170M8047K11090M6166l31469m71716k35396q860p9278j89781
36331b312922L180L71206N49360M59101K48790m3431l79734m88006j89874J69259
36321a613071J01100k70317l38332P4801M58170M00776J40432P6961J68306J45823
36311f55351Q690n6022l1412k8938n1118o2418j31561k58265k46954j5219J71517
36300a357051P1778j15609m7189K07891K79432P2127j36682j37690m878J10187
$$ plain form
36371 -1562293 -1688393 -1827404 -1758444 -1323715 -779409 -444689 -309157 -247439 -305436 -500103
36361 -500103 -653363 -723978 -978095 -1480345 -1754248 -1415341 -875959 -858386 -1341467 -1586825
36351 -1586825 -1214853 -665094 -444324 -456597 -361503 -179773 -184091 -444201 -800412 -1116555
36341 -1116555 -1301725 -1253678 -1042588 -996422 -1327891 -1799607 -2035003 -2043863 -2123141 -2312922
36331 -2312922 -2309742 -1938536 -1389176 -930075 -681285 -724716 -1104450 -1592456 -1782330 -1613071
36321 -1613071 -1511971 -1782288 -2120620 -2045819 -1587649 -1186873 -1046441 -969480 -801174 -655351
36311 -655351 -646661 -702683 -734095 -763033 -814151 -876569 -1008130 -1266395 -1513349 -1528568 -1357051
36300 -1357051 -1285273 -1400882 -1448071 -1240180 -960748 -888621 -1025303 -1162993 -1167871 -1057684
36290a057684J27820K8122p7271K6561L12650L88622M1829l29252k62372L1104
36280g69871L9655j41584n98L69315K88901l14414n99025q1674N48265M51782
36270b09248j25106l11731R0173M54571K85229k55234o91658o86183k26539L13796
36260a361930M48339J77044O0483L91985O51059K44728n22936q16514m26075N6714
36250a097103J56105P971j01235j40654j42177l8212J44135K39796J99986J40885
36240f30503J23116J29081J95345K82722J48991k75943n53670k69695K32732K61508
36230c56316j39883k40074J65298L87880p212m63526l48542M4464P0086j73220
36220a061045p9900L86903O12384K77959k52528n50848n76674m01342J0252N21246
$$ plain form
36290 -1057684 -929864 -901742 -979013 -952452 -639802 -251180 -209351 -538603 -800975 -769871
36280 -769871 -730216 -871800 -872398 -503083 -214182 -528596 -1127621 -1209295 -661030 -209248
36270 -209248 -334354 -646085 -555912 -101341 183888 -71346 -763004 -1449187 -1675726 -1361930
36260 -1361930 -913591 -736547 -676064 -284079 366980 611708 88772 -727742 -1153817 -1097103
36250 -1097103 -940998 -933027 -1034262 -1174916 -1317093 -1355305 -1211170 -971374 -771388 -630503
36240 -630503 -507387 -378306 -182961 99761 248752 -27191 -580861 -850556 -617824 -356316
36230 -356316 -496199 -736273 -570975 -183095 -190307 -653833 -1002375 -957911 -887825 -1061045
36220 -1061045 -1140945 -754042 -141658 136301 -116227 -667075 -1243749 -1645091 -1634839 -1113593
36210a113593P23104M02818j22697l79073k84150j27548j28858k26924k62196
36201a519117j83255l6759J32822K95880L85873L18913J06601r7537j39231m0035
36191g75845M3403K9059j6533j7252J4729M6926P6554P4257q218j35296k09241
36180h77457k20575k35024k11706l4246K16957K66944O0871o0949J75221N22032
36170c97932M91142m867n44923o95340m04555N9356L63792L28495P5927m9350
36160g78255J25617L34194J90084k60495n40801l28410J69661M96010M35968J53967
36150b460m7133l0540N8975k0761k73862m09039k29171N1422R0977p7614j18854
36139a008060O1573J84691P8117n1575P100J17865N6869r5887j02090M0455J29836
$$ plain form
36210 -1113593 -390489 12329 -110368 -489441 -773591 -901139 -1029997 -1256921 -1519117
36201 -1519117 -1702372 -1739131 -1606309 -1310429 -924556 -605643 -499042 -596579 -735810 -775845
36191 -775845 -732442 -703383 -719916 -737168 -722439 -675513 -598959 -524702 -532920 -668216 -877457
36180 -877457 -1098032 -1333056 -1544762 -1579008 -1362051 -1095107 -1034236 -1095185 -919964 -397932
36170 -397932 93210 88343 -456580 -1151920 -1556475 -1497119 -1133327 -804832 -728905 -778255
36160 -778255 -652638 -318444 -128360 -388855 -929656 -1258066 -1088405 -592395 -156427 -2460
36150 -2460 -49593 -80133 -21158 -41919 -315781 -724820 -953991 -902569 -811592 -889206 -1008060
36139 -1008060 -946487 -761796 -683679 -735254 -728154 -610289 -553420 -649307 -751397 -710942 -581106
36128e81106J08603J06161J50735R8226r9907k64236k15116O31J91395K31324
36118b73290J21921o7633k32646k54862r3691J26644J90933K2917j74971j12592
36108g47270K05914M06613J93747k14539l30074o2154J54872N751k45327j82523
36098h14990J20209K33860K3633k13845k46684j81005j64678j31477J5519J89738
36088a169720K36369J18220q9539k47587j82538J25953L81409K61605r8409k41431
36078i05668o8225K6488j52408k50256q975K15492N1465j82072J9482M27212L94828
36067d32637l3529j33386L01004N58837J09232n80839p57404l85044L6568K51692
36057a065506L34009K88772Q3602r4099n1401O6623K0368r3708l7135J09129R6644
$$ plain form
36128 -581106 -472503 -366342 -215607 -117381 -217288 -481524 -696640 -696009 -504614 -273290
36118 -273290 -151369 -219002 -451648 -706510 -800201 -673557 -482624 -459707 -634678 -747270
36108 -747270 -541356 -134743 59004 -155535 -485609 -547763 -392891 -387140 -632467 -814990
36098 -814990 -694781 -460921 -437288 -651133 -897817 -1078822 -1243500 -1374977 -1359458 -1169720
36088 -1169720 -933351 -815131 -904670 -1152257 -1334795 -1208842 -827433 -565828 -664237 -905668
36078 -905668 -973893 -947405 -1099813 -1350069 -1359044 -1143552 -1092087 -1274159 -1254677 -827465 -432637
36067 -432637 -466166 -599552 -298548 260289 369521 -211318 -968722 -1353766 -1317198 -1065506
36057 -1065506 -731497 -442725 -359123 -453222 -504623 -438000 -417632 -511340 -548475 -439346 -342702
36046c42702j2082L1174J48829L4097k65024l47633r8505J34383J01816l6546
36036f52193r8122j57743k54928k01854P4746L10697K75843J16756Q8535J65641
36026c32622J65246Q2272N9097J28270J68307M6717k67622o05824o03031n7975
36016a217165O49823Q31849L32101k36365l02824l3355P2813p7619k43360l66872
36006e90974n22846n30638j60977L28614M03062M6444j50547J58131N80229N64989
35996A25487J21193l04646m11409k56116o3588k7470j65691k47652l7421L01315
35986i65998L09224j04317m17590j97982K39067K76840q1347k29732J20317N29263
35976e22255M82101N1882l20372m05331k75358m5511J71056J94720k4618k16962
$$ plain form
36046 -342702 -354784 -323610 -174781 -140684 -405708 -753341 -851846 -717463 -615647 -652193
36036 -652193 -750315 -908058 -1162986 -1364840 -1290094 -979397 -703554 -586798 -498263 -332622
36026 -332622 -167376 -85104 -26007 102263 270570 317287 49665 -556159 -1159190 -1217165
36016 -1217165 -567342 264507 596608 360243 57419 24064 96877 19258 -224102 -590974
36006 -590974 -1113820 -1644458 -1805435 -1476821 -1073759 -1027315 -1177862 -1019731 -439502 125487
35996 125487 246680 -57966 -469375 -725491 -789079 -816549 -982240 -1229892 -1267313 -965998
35986 -965998 -656774 -761091 -1178681 -1376663 -1137596 -860756 -942103 -1171835 -1051518 -522255
35976 -522255 -40154 11728 -308644 -713975 -989333 -1034844 -863788 -669068 -693686 -910648
35966i10648q6443K44145L74395K02081L7992R1144J74408O8114j29768k28170
35956a62750k47077k36891m9110L64524O21535L14924l30521o67793n06791l04028
35946a203978l63225l64131J5649M54313M21843k488k50560r8921J02150N6512
35936a232836o4641R683K06049K53726Q2271j23305j63114J064K17862K27196
35926e86045j00761n28158n99925j54023M36561O62660M23447M2816j58063j32723
35916f94214r412Q7282R1095J4443l8717K2817J30231J06625r6963l07698l25199
35905a019710j39041R5820K30205K12119Q1267m7662n1438O2293J21992o218k16634
35894f77007k77125j33053K6952K7091r5336j82692j32627O5280L40749N21175
$$ plain form
35966 -910648 -997091 -752946 -378551 -176470 -138478 -47334 127074 195188 65420 -162750
35956 -162750 -409827 -646718 -695828 -331304 290231 605155 274634 -393159 -899950 -1203978
35946 -1203978 -1567203 -1931334 -1915685 -1461372 -1039529 -1042017 -1292577 -1391498 -1289348 -1232836
35936 -1232836 -1297477 -1287794 -1081745 -828019 -745748 -869053 -1032167 -1031103 -813241 -586045
35926 -586045 -686806 -1214964 -1814889 -1968912 -1532351 -869691 -446244 -403428 -561491 -694214
35916 -694214 -703626 -616344 -525249 -510806 -549523 -526706 -396475 -289850 -386813 -694511 -1019710
35905 -1019710 -1158751 -1062931 -832726 -620607 -539340 -587002 -638440 -576147 -454155 -460373 -677007
35894 -677007 -954132 -1087185 -1060233 -1033142 -1128478 -1311170 -1443797 -1378517 -1037768 -516593
35884e16593M30569J08773j87193k98311l30048l75049k75010Q5908M14953L09586
35874f32415j18235l19898q1917J90366J38204j3154Q9071K73727J27393k57167
35864f04025l61161o2247J71703O6167r827K84706N83248L29056k83919n16621
35854d02920j94478M7258j90261m20757j05673L84923L05369k55844m70973n4997
35844a358353L25901J42684k18516j93664L8821k9096l09902k86186J05741M17231
35834a365339M38543L85566L23724K3308m75242p08969m37484J829K14587K30693
35824a368784K29540J66544k7757j70874n4319K42617M74756M86816K28562k26947
35814a9846n64027m45230m723K27746O7735o3454J48543L93190K84032j758q9593
$$ plain form
35884 -516593 -86024 22749 -164444 -462755 -792803 -1167852 -1442862 -1356954 -942001 -632415
35874 -632415 -750650 -1070548 -1152465 -962099 -823895 -837049 -747978 -474251 -346858 -604025
35864 -604025 -965186 -1027433 -855730 -789563 -799390 -514684 68564 397620 113701 -402920
35854 -402920 -597398 -550140 -740401 -1161158 -1266831 -881908 -576539 -832383 -1303356 -1358353
35844 -1358353 -1032452 -889768 -1108284 -1301948 -1263127 -1292223 -1602125 -1888311 -1782570 -1365339
35834 -1365339 -926796 -541230 -217506 -194198 -669440 -1378409 -1815893 -1814064 -1599477 -1368784
35824 -1368784 -1139244 -972700 -1000457 -1171331 -1225650 -983033 -508277 -21461 207101 -19846
35814 -19846 -583873 -1029103 -1033826 -806080 -738345 -801799 -653256 -260066 23966 22208 -67385
35803f7385n6399j87769l54702k02688J87935L79897K53008J03291R1580N5767
35793B02535j02264k49737k94554k95310k73711j92919j02135n5318K7708J67746
35783a167959J59231r2110k73784j01543J70058J53595L4910K72759P18999P29395
35773F03551J77835l21042l45598j95558k63655m37932m16599j75401J35412L89276
35763h49711M08956R4990k40133j29828L06566M02865p0840n24008m39022r5433
35753a135598j0428j52941j77329l4999J21252L09619N36393N32488J27129l53884
35743b38298m80289k88438q8375M3238J79435K09298K5504j62137j23671k7029
35733i50762j46201l48344l05178m2724J55214K34681L29686L87413K79836J47244
$$ plain form
35803 -67385 -123784 -311553 -666255 -868943 -681008 -301111 -48103 55188 146768 202535
35793 202535 100271 -149466 -444020 -739330 -1013041 -1205960 -1308095 -1363413 -1335705 -1167959
35783 -1167959 -1008728 -1100838 -1374622 -1476165 -1306107 -1152512 -1117602 -844843 -125844 603551
35773 603551 781386 460344 114746 -80812 -344467 -782399 -1198998 -1374399 -1238987 -849711
35763 -849711 -440755 -345765 -585898 -715726 -409160 -6295 -77135 -601143 -1040165 -1135598
35753 -1135598 -1146026 -1298967 -1476296 -1511295 -1390043 -1080424 -544031 -11543 115586 -238298
35743 -238298 -718587 -1007025 -1095400 -1052162 -872727 -663429 -637925 -800062 -923733 -950762
35733 -950762 -1096963 -1445307 -1750485 -1793209 -1637995 -1403314 -1073628 -686215 -406379 -259135
35723b59135J82753K24867M2291j35567O9629M47459L96099j34767n24178m17844
35713a08393j89528k43365l88127k45133J02124K41287J9032k92494l42660p4450
35703a521707K01785J10556l09280n36785j98850L71588N46601K67998O0462J98279
35693h09353L63902K56416N3735K4408P1933k8679k15955k61012j26148L0167
35683f40586Q2061J5578r1433p7188J44269L66111K62249j34422l92540k50544
35673g16445M8909J63597J15840J17961J69132J18108j3877n8134J2080M8714
35663E885k9763j37628j65295j03591j7122L5457M6362L8354n591j38951l20679
35652g92562l82555k50492r1393o4056m8645J28812L29454K95899J22751J14726
$$ plain form
35723 -259135 -76382 148485 190776 55209 124838 572297 968396 833629 309451 -108393
35713 -108393 -297921 -541286 -929413 -1174546 -1072422 -831135 -812103 -1104597 -1447257 -1521707
35703 -1521707 -1319922 -1209366 -1518646 -2055431 -2254281 -1882693 -1336092 -1068094 -1007632 -809353
35693 -809353 -445451 -189035 -135300 -110892 -38959 -67638 -283593 -544605 -670753 -640586
35683 -640586 -558525 -542947 -634380 -711568 -567299 -201188 61061 -73361 -465901 -716445
35673 -716445 -667536 -503939 -388099 -270138 -101006 17102 3225 -54909 -42829 5885
35663 5885 -23878 -161506 -326801 -430392 -447514 -412057 -365695 -327341 -332932 -471883 -792562
35652 -792562 -1175117 -1425609 -1517002 -1581058 -1629703 -1500891 -1171437 -875538 -752787 -638061
35642f38061K03536M588m61229o37811k52221K25241K63780K033q1478J12869
35632a258753L21167L84117L08439Q6159j80513k03562P2669K33813j0553k76802
35622e23819p1219L42420K88498k27303m93359k07563J10131L1556j42753l7392
35612i30803J03970q7299l42324j12731N11842Q46456N50007J4942k57292k37854
35602E8914j66546j17968k4119P4354N8360n8182j32383q7687J7705R6284R7518
35591a83750j4571k30252m14656l65454k8971L78284N28959K77466k03346n45864
35581h02155m62304O002M61144M68581J6664m03908l12062K09828O23314N64917
35571C70021J74481k09476m22470m40138k39102Q5447K47362P6931k07735k77583
$$ plain form
35642 -638061 -434525 -429937 -891166 -1528977 -1781198 -1555957 -1292177 -1290144 -1371622 -1258753
35632 -1258753 -937586 -553469 -245030 -158871 -339384 -542946 -470277 -236464 -247017 -523819
35622 -523819 -595038 -252618 35880 -191423 -684782 -892345 -782214 -750658 -893411 -930803
35612 -930803 -826833 -914132 -1256456 -1369187 -857345 -10889 539118 554060 296768 58914
35602 58914 -107632 -225600 -249719 -175365 -117005 -175187 -307570 -395257 -377552 -281268 -183750
35591 -183750 -198321 -428573 -843229 -1208683 -1237654 -859370 -330411 -52945 -256291 -802155
35581 -802155 -1264459 -1258457 -797313 -328732 -312068 -715976 -1028038 -818210 -194896 370021
35571 370021 544502 335026 -87444 -527582 -766684 -681237 -433875 -356944 -564679 -842262
35561h42262j29275K0270J38782L06716L36206l1476m96754l58499M29737R20268
35551B93713L71590o47241r81942m35206J56093K59049K03608K78035J53206l51526
35541g00621o73267l25568K25290K39835j24545j37723K43324L41996k7820k35888
35531a174987O6843L64097J82819j29267n5436K33581K69568J00855Q8306J92207
35521A38586R9685j22129j24708M7695k4760m15959o74175m80870o9934J60213
35511a466356J35377N8520R1570J94901J72250j12390m66779m62378K4694N47267
35501a283324O12972K91062P909m7843L7808K36108N01120N44471J77574k53495
35491H24362k85306o6723j12713m29900n21706k43398J2098L4380L5525P1222
$$ plain form
35561 -842262 -971537 -951267 -812485 -505769 -169563 -201039 -697793 -1056292 -626555 293713
35551 293713 665303 18062 -963880 -1399086 -1242993 -983944 -780336 -502301 -349095 -700621
35541 -700621 -1373888 -1699456 -1474166 -1234331 -1358876 -1496599 -1253275 -911279 -939099 -1174987
35531 -1174987 -1108144 -744047 -561228 -690495 -745931 -512350 -242782 -141927 -53621 138586
35521 138586 238271 116142 -8566 39129 14369 -401590 -1075765 -1556635 -1626569 -1466356
35511 -1466356 -1330979 -1272459 -1180889 -985988 -813738 -926128 -1392907 -1855285 -1830591 -1283324
35501 -1283324 -670352 -379290 -371381 -419224 -381416 -145308 355812 900283 1077857 824362
35491 824362 539056 472333 359620 -70280 -591986 -835384 -823286 -788906 -753381 -682159
35481f82159r3347l76215l26917Q7577L14649J01261j19851l2083O4688p3203
35471a135600j46833N0152J64263m8329k05781J1762K62251J90430O3930J56700
35461f37055J41722k04465l53244R0575M90660J43756m24562k61546L61960L88749
35451b63450j90407l35051K10369M96091N1398l52856j24663J79737j3537k51739
35441e94108L2707M28447K78129j50395j67406J36927J36783j81192k35823R5299
35431b20632K83860N5686k31449k54038j69412j93863k15143p4992J10806J62046
35421g47131J23402J27074J36786L2695j42466k01442o2920J32918J83570L9186
35411c78328j67698k63459j64861P6691K68519J64469k55597n86363l50507L21137
$$ plain form
35481 -682159 -775506 -1151721 -1478638 -1391061 -1076412 -975151 -1095002 -1127085 -1062397 -1135600
35471 -1135600 -1282433 -1232281 -1068018 -1116347 -1322128 -1310366 -1048115 -857685 -793755 -637055
35461 -637055 -495333 -699798 -1053042 -962467 -471807 -328051 -752613 -1014159 -652199 -263450
35451 -263450 -453857 -788908 -578539 -82448 -31050 -383906 -508569 -328832 -342369 -594108
35441 -594108 -561401 -132954 145175 -5220 -172626 -35699 101084 -80108 -315931 -220632
35431 -220632 63228 118914 -112535 -366573 -535985 -729848 -944991 -1019983 -909177 -747131
35421 -747131 -623729 -496655 -359869 -327174 -469640 -671082 -734002 -601084 -417514 -378328
35411 -378328 -546026 -809485 -974346 -897655 -629136 -464667 -720264 -1306627 -1657134 -1335997
$$ [...]
##END NTUPLES=NMR SPECTRUM
##END=
