##TITLE=31Pdec_BAU--29N
 CDCl3, 124 sc
 29.8.2019
##JCAMPDX= 6.0         $$ Bruker NMR JCAMP-DX V2.0
##DATA TYPE= NMR SPECTRUM
##DATA CLASS= NTUPLES
##ORIGIN= UXNMR, Bruker Analytische Messtechnik GmbH
##OWNER= root
$$ XWIN-NMR		Version 3.5
$$ Thu Aug 29 14:10:14 2019 Russian Standard Time (UT+4h)  she@DPX200
##.OBSERVE FREQUENCY= 81.013821
##.OBSERVE NUCLEUS= ^31P
##.ACQUISITION MODE= SIMULTANEOUS
##.ACQUISITION SCHEME= undefined
##.AVERAGES= 124
##.DIGITISER RES= 17
##SPECTROMETER/DATA SYSTEM= spect
##.PULSE SEQUENCE= zgpg30
##.SOLVENT NAME= CDCl3
##.SHIFT REFERENCE= (INTERNAL, CDCl3, 0, 182.463)
##AUDIT TRAIL= $$ (NUMBER, WHEN, WHO, WHERE, WHAT)
$$ ##TITLE= Audit trail, XWIN-NMR		Version 3.5
$$ ##JCAMPDX= 5.01
$$ ##ORIGIN= Bruker BioSpin GmbH
$$ ##OWNER= she
$$ F:/spectra/data/she/nmr/P31/1/pdata/1/auditp.txt
$$ ##AUDIT TRAIL=  $$ (NUMBER, WHEN, WHO, WHERE, WHAT)
(   1,<2019-08-29 14:09:25.20 +0400>,<she>,<DPX200>,
      <continue with go, POWCHK disabled, PULCHK disabled
       configuration hash MD5:
       00 E9 B6 7A A2 85 ED C7 34 08 36 98 17 FE 4E 26
       data hash MD5: 32K
       B9 5B 78 63 DB F5 73 B9 2E E2 C5 77 48 5F 88 D9>)
(   2,<2019-08-29 14:09:27.26 +0400>,<she>,<DPX200>,
      <Start of raw data processing
       efp BC_mod = 2 LB = 1 FT_mod = 6 PKNL = 1 PHC0 = -466.3093 PHC1 = 255.2004 SI = 64K 
       data hash MD5: 64K
       AB 94 6D 02 95 96 A4 66 CA F8 15 D7 5B 75 B3 93>)
(   3,<2019-08-29 14:09:50.29 +0400>,<she>,<DPX200>,
      <pk PHC0 = 89.8797 PHC1 = -150 
       data hash MD5: 64K
       98 C3 44 7F B2 64 06 37 36 D8 F8 A4 B9 CC 4D EB>)
(   4,<2019-08-29 14:09:53.64 +0400>,<she>,<DPX200>,
      <abs ABSG = 5 
       data hash MD5: 64K
       69 7B 1C 57 41 84 72 EC 93 A1 FD 51 E8 FE 01 5E>)
$$ ##END=
$$ 
$$ hash MD5
$$ 2D AE 1A 08 BD 98 15 AC 55 44 EF 35 F8 1F 21 22
##$RELAX= 
##$RELAX= 
##$RELAX= 
##$RELAX= 
##$RELAX= 
##$RELAX= 
##$RELAX= 
##$RELAX= 
$$ Bruker specific parameters
$$ --------------------------
##$DU= <F:/spectra>
##$EXPNO= 1
##$NAME= <P31>
##$PROCNO= 1
##$TYPE= <nmr>
##$USER= <she>
##$AMP= (0..31)
100 100 100 100 100 100 100 100 100 100 100 100 100 100 100 100 100 100 
100 100 100 100 100 100 100 100 100 100 100 100 100 100 
##$AQSEQ= 0
##$AQ_mod= 1
##$AUNM= <au_zg>
##$AUTOPOS= <>
##$BF1= 81.014009
##$BF2= 200.13
##$BF3= 200.13
##$BF4= 200.13
##$BF5= 200.13
##$BF6= 200.13
##$BF7= 200.13
##$BF8= 200.13
##$BYTORDA= 1
##$CFDGTYP= 0
##$CFRGTYP= 5
##$CHEMSTR= <none>
##$CNST= (0..31)
1 1 145 1 1 1 1 1 1 1 1 1 1 1 1 1 1 1 1 1 1 1 1 1 1 1 1 1 1 1 1 1 
##$CPDPRG= <waltz16>
##$CPDPRG1= <>
##$CPDPRG2= <waltz16>
##$CPDPRG3= <>
##$CPDPRG4= <mlev>
##$CPDPRG5= <mlev>
##$CPDPRG6= <mlev>
##$CPDPRG7= <mlev>
##$CPDPRG8= <mlev>
##$CPDPRGB= <>
##$CPDPRGT= <>
##$D= (0..31)
0 1 0 0 0 0 0 0 0 0 0 0.03 2e-05 3e-06 0 0 0 0 0 0 0 0 0 0 0 0 0 0 0 0 
0 0 
##$DATE= 1567073178
##$DBL= (0..7)
120 120 120 11 120 120 24 19 
##$DBP= (0..7)
150 150 150 150 150 150 150 150 
##$DBP07= 0
##$DBPNAM0= <>
##$DBPNAM1= <>
##$DBPNAM2= <>
$$ [...]
##$SUBNAM3= <"">
##$SUBNAM4= <"">
##$SUBNAM5= <"">
##$SUBNAM6= <"">
##$SUBNAM7= <"">
##$SUBNAM8= <"">
##$SUBNAM9= <"">
##$SW= 369.568048894756
##$SWIBOX= (0..15)
0 1 3 0 0 0 0 0 0 0 0 0 0 0 0 0 
##$SW_h= 29940.119760479
##$TD= 32768
##$TD0= 1
##$TE= 0
##$TE2= 300
##$TE3= 300
##$TEG= 300
##$TL= (0..7)
0 120 53 12 22 120 120 120 
##$TP= (0..7)
150 150 150 150 150 150 150 150 
##$TP07= 0
##$TPNAME0= <>
##$TPNAME1= <>
##$TPNAME2= <>
##$TPNAME3= <>
##$TPNAME4= <>
##$TPNAME5= <>
##$TPNAME6= <>
##$TPNAME7= <>
##$TPOAL= (0..7)
0.5 0.5 0.5 0.5 0.5 0.5 0.5 0.5 
##$TPOFFS= (0..7)
0 0 0 0 0 0 0 0 
##$TUNHIN= 0
##$TUNHOUT= 0
##$TUNXOUT= 0
##$USERA1= <user>
##$USERA2= <user>
##$USERA3= <user>
##$USERA4= <user>
##$USERA5= <user>
##$V9= 5
##$VALIST= <valist>
##$VCLIST= <CCCCCCCCCCCCCCC>
##$VD= 0
##$VDLIST= <DDDDDDDDDDDDDDD>
##$VPLIST= <PPPPPPPPPPPPPPP>
##$VTLIST= <TTTTTTTTTTTTTTT>
##$WBST= 1024
##$WBSW= 4
##$XGAIN= (0..3)
0 0 0 0 
##$XL= 0
##$YL= 0
##$YMAX_a= 23247
##$YMIN_a= -22456
##$ZGOPTNS= <>
##$ZL1= 120
##$ZL2= 120
##$ZL3= 120
##$ZL4= 120
##$ABSF1= 182.463
##$ABSF2= -187.1042
##$ABSG= 5
##$ABSL= 3
##$ALPHA= 0
##$AQORDER= 0
##$ASSFAC= 0
##$ASSFACI= 0
##$ASSFACX= 0
##$ASSWID= 0
##$AUNMP= <proc_1d>
##$AZFE= 0.1
##$AZFW= 0.5
##$BCFW= 0
##$BC_mod= 2
##$BYTORDP= 0
##$COROFFS= 0
##$CY= -3
##$DATMOD= 1
##$DC= 0
##$DFILT= <>
##$DTYPP= 0
##$F1P= 0
##$F2P= 0
##$FCOR= 1
##$FTSIZE= 65536
##$FT_mod= 6
##$GAMMA= 0
##$GB= 0
##$INTBC= 1
##$INTSCL= 5.30512e-09
##$ISEN= 30
##$LB= 1
##$LEV0= 0
##$LPBIN= 0
##$MAXI= 10000
##$MC2= 0
##$MEAN= 0
##$ME_mod= 0
##$MI= 50
##$NCOEF= 0
##$NC_proc= -8
##$NLEV= 6
##$NOISF1= 182.463
##$NOISF2= 159.3651
##$NSP= 0
##$NTH_PI= 0
##$NZP= 0
##$OFFSET= 182.463
##$PC= 4
##$PHC0= -376.4296
##$PHC1= 105.2004
##$PH_mod= 1
##$PKNL= yes
##$PPARMOD= 0
##$PSCAL= 0
##$PSIGN= 0
##$REVERSE= no
##$SF= 81.0140089999434
##$SI= 65536
##$SIGF1= 159.3651
##$SIGF2= -187.1042
##$SINO= 113.3802
##$SIOLD= 16384
##$SREGLST= <1H.CDCl3>
##$SSB= 0
##$STSI= 65536
##$STSR= 0
##$SW_p= 29940.119760479
##$SYMM= 0
##$S_DEV= 0
##$TDeff= 32768
##$TDoff= 0
##$TI= <>
##$TILT= no
##$TM1= 0
##$TM2= 0
##$TOPLEV= 0
##$USERP1= <user>
##$USERP2= <user>
##$USERP3= <user>
##$USERP4= <user>
##$USERP5= <user>
##$WDW= 1
##$XDIM= 65536
##$YMAX_p= 584183752
##$YMIN_p= -286947856
$$ End of Bruker specific parameters
$$ ---------------------------------
##NTUPLES= NMR SPECTRUM
##VAR_NAME=  FREQUENCY,     SPECTRUM/REAL,   SPECTRUM/IMAG
##SYMBOL=    X,             R,               I
##VAR_TYPE=  INDEPENDENT,   DEPENDENT,       DEPENDENT
##VAR_FORM=  AFFN,          ASDF,            ASDF
##VAR_DIM=   65536,         65536,           65536
##UNITS=     HZ,            ARBITRARY UNITS, ARBITRARY UNITS
##FACTOR=    0.456856943014862, 1,           1
##FIRST=     14782.0589164792, 0,            0
##LAST=      -15158.0608439998, 0,           0
##MIN=       -15158.0608439998, -286947856,  0
##MAX=       14782.0589164792, 584183752,    0
$$ Real data points
##PAGE= N=1
##DATA TABLE= (X++(R..R)), XYDATA
$$ [...]
$$ plain form
4086 -8860031 -4686915 -2127334 2781712 4927600 -1305888 -8270075 -5503076 2035713
4078 2035713 2169068 -2638338 350499 8764813 3426519 -22344882 -47672594 -48237631
4070 -48237631 -25222764 -432737 10265843 8612759 3513527 -222394 -2003389 -2124270
4062 -2124270 -1787541 -3105038 -6559048 -9923163 -11154082 -11245928 -12642603 -15171816 -15381683
4053 -15381683 -10898932 -4273742 -868278 -3401761 -10052125 -16961550 -20206536 -16552983
4045 -16552983 -6746806 1527860 -696954 -12409162 -21532190 -18878421 -9542866 -6021148
4037 -6021148 -12940370 -23491190 -28825147 -25833300 -16940722 -7186876 -801188 3522171
4029 3522171 12364709 27769991 39901360 36298145 17544963 -3662263 -18553910 -28262954
$$ packed form
4086h860031M173116K559581M909046K145888o233488o964187K766999P538789
4078B035713J33355m807406K988837Q414314n338294k5771401k5327712n65037
4070d8237631K3014867K4790027J0698580j653084n099232l735921j780995j20881
4062b124270L36729j317497l454010l364115j230919r1846j396675k529213k09867
4053a5381683M482751O625190L405464k533483o650364o909425l244986L653553
4045a6552983R806177Q274666k224814j1712208r123028K653769R335555L521718
4037f021148o919222j0550820n333957K991847Q892578R753846O385688M323359
4029C522171Q842538J5405282J2131369l603215j8753182k1207226j4891647r709044
$$ plain form
4021 -28262954 -32907742 -26664154 -10022976 3309556 1980866 -6817860 -7489257 1754699
4013 1754699 8489551 6155846 1985150 3232989 7406496 10706140 15709193 23901713
4005 23901713 29067163 26233220 20786199 20106084 21171313 15719056 4232826 -4825153
3997 -4825153 -7723549 -7814086 -6270729 -649876 6880803 10377477 11294205 18144855 30802314
3988 30802314 35671204 23713472 4831178 -4615907 -2666808 -629964 -4903547 -10137737
3980 -10137737 -10381906 -8530694 -11870284 -22418419 -33613565 -35376842 -23515036 -5422868
3972 -5422868 6042306 5621249 -1335079 -9538383 -19418824 -28093725 -25032411 -7042639
3964 -7042639 9770521 6640279 -12344083 -25266044 -22366345 -16094981 -18096415 -21215114
$$ packed form
4021b8262954m644788O243588J6641178J3332532j328690q798726o71397R243956
4013A754699O734852k333705m170696J247839M173507L299644N003053Q192520
4005B3901713N165450k833943n447021o80115J065229n452257j1486230r057979
3997d825153k898396r0537J543357N620853P530679L496674R16728O850650J2657459
3988C0802314M868890j1957732j8882294r447085J949099K036844m273583n234190
3980a0137737k44169J851212l339590j0548135j1195146j763277J1861806J8092168
3972e422868J1465174m21057o956328q203304r880441q674901L061314J7989772
3964g042639J6813160l130242j8984362j2921961K899699O271364k001434l118699
$$ plain form
3956 -21215114 -13072152 3344871 13823259 12282028 6426893 6342241 14497903 25848175
3948 25848175 32581881 29497760 18264263 5899549 -2083048 -5007541 -4252078 -2661893
3940 -2661893 -7067247 -22927025 -42629801 -47739191 -29936028 -3123353 13000398 15055092
3932 15055092 12477324 8538360 -1535014 -15903292 -24697590 -25695067 -27590588 -32414929
3924 -32414929 -28227941 -8755679 11116676 12976058 1142411 -3496852 7288949 21707050
3916 21707050 29921217 35991106 42078463 37808331 18126154 -757445 -95385 13496515
3908 13496515 16796590 4298336 -5238548 283774 7199759 -2618168 -25033163 -40619104
3900 -40619104 -40368154 -32975160 -30851571 -37920400 -48352325 -51040781 -38941093 -18535479
$$ packed form
3956b1215114Q142962J6417023J0478388j541231n855135q4652Q155662J1350272
3948B5848175O733706l084121j1233497j2364714p982597k924493P55463J590185
3940b661893m405354j5859778j9702776n109390J7803163K6812675J6123751K054694
3932A5055092k577768l938964j0073374j4368278q794298r97477j895521m824341
3924c2414929M186988J9472262J9872355J859382j1833647m639263J0785801J4418101
3916B1707050Q214167O069889O087357m270132j9682177j8883599O62060J3591900
3908A3496515L300075j2498254r536884N522322O915985r817927k2414995j5585941
3900d0619104K50950P392994K123589p068829j0431925k688456J2099688K0405614
$$ plain form
3892 -18535479 -4516600 -1396501 706830 6902096 6835709 -6528888 -20011260 -17375217
3884 -17375217 -3797427 4396333 6937037 16064939 29675701 30628849 14880494 -106585
3876 -106585 -192467 9371009 17692356 21748482 21001672 14740093 10429826 18247616 31024338
3867 31024338 27250525 2548791 -19451884 -18388577 -2654417 8290365 10293727 8690929
3859 8690929 2126985 -9848831 -15597251 -6637817 5637328 6727575 3223404 10241050
3851 10241050 22076448 18096769 -4032767 -22505385 -21317483 -8328862 889954 2729270
3843 2729270 3588272 8581246 16737629 21370077 15057155 94795 -9494836 -4400456
3835 -4400456 6246985 7432386 -776862 -6767292 -6764467 -6383733 -6125612 -792412 7453355
$$ packed form
3892a8535479J4018879L120099K103331O195266o6387j3364597j3482372K636043
3884a7375217J3577790Q193760K540704R127902J3610762R53148j5748355j4987079
3876a06585q5882R563476Q321347M056126p46810o261579m310267P817790J2776722
3867C1024338l773813k4701734k2000675J063307J5734160J0944782K003362j602798
3859H690929o563944j1975816n748420Q959434J2275145J090247l504171P017646
3851A0241050J1835398l979679k2129536j8472618J187902J2988621R218816J839316
3843B729270Q59002M992974Q156383M632448o312922j4962360r589631N094380
3835d400456J0647441J185401q209248n990430K825L80734K58121N333200Q245767
$$ plain form
3826 7453355 10206377 7367614 6881342 9547253 7712027 -34414 -6084665 -6643506 -4583501
3817 -4583501 492144 11158740 21005116 19669974 10290868 6580298 11032398 12802395
3809 12802395 9886461 14458567 29469077 37979118 26172009 2886165 -13954983 -18339676
3801 -18339676 -14273365 -4578963 8084933 17980918 22656280 24869970 23095242 11070554
3793 11070554 -7177142 -14822158 -3936181 11481676 13891187 3705228 -6867273
3786 -6867273 -11292920 -9742217 -2078268 8703138 13065195 5607442 -6012182 -10856942
3778 -10856942 -7410286 384089 12211286 28410380 44050004 52770505 51360105 37883249
3770 37883249 14627776 -4846562 -5592466 6452480 7732289 -9472329 -23904783 -16941105
$$ packed form
3826G453355K753022k838763m86272K665911j835226p746441o050251n58841K060005
3817d583501N075645J0666596R846376j335142r379106l710570M452100J769997
3809A2802395k915934M572106J5010510Q510041j1807109k3285844j6841148m384693
3801a8339676M066311R694402J2663896R895985M675362K213690j774728j2024688
3793A1070554j8247696p645016J0885977J5417857K409511j0185959j0572501
3786f867273m425647J550703P663949J0781406M362057p457753j1619624m844760
3778a0856942L446656P794375J1827197J6199094J5639624Q720501j410400j3476856
3770C7883249k3255473j9474338p45904J2044946J279809j7204618j4432454O963678
$$ plain form
3762 -16941105 3399 4935712 -3267530 -10543894 -11809385 -10867972 -7183059 -1263330
3754 -1263330 -2942145 -15483816 -21890568 -7359896 14583497 20309484 10997929 5239053
3746 5239053 5224460 -2002940 -14264158 -14766775 -3333690 919961 -8526445 -17066785
3738 -17066785 -16543351 -15866009 -18979781 -18041601 -15069888 -23672576 -40208041 -40622431 -18664284
3729 -18664284 -506461 -5074296 -15265722 -8800388 5389211 5853720 -4815128 -8726942
3721 -8726942 -5123713 -7528655 -16293752 -18753543 -12808717 -8642463 -9293795 -8703819 -6848494
3712 -6848494 -8689764 -10289041 -4164156 2971905 -3465303 -21220783 -30733309 -21813428
3704 -21813428 -4333474 10670593 23894267 36347099 40460589 31188373 15341512
$$ packed form
3762a6941105J6944504M932313q203242p276364j265491R41413L684913N919729
3754a263330j678815j2541671o406752J4530672K1943393N725987r311555n758876
3746E239053j4593p227400j2261218n02617J1433085M253651r446406q540340
3738a7066785N23434O77342l113772R38180K971713q602688j6535465m14390K1958147
3729a8664284J8157823m567835j0191426O465334J4189599M64509j0668848l911814
3721h726942L603229k404942q765097k459791N944826M166254o51332N89976J855325
3712f848494j841270j599277O124885P136061o437208j7755480r512526Q919881
3704b1813428J7479954J5004067J3223674J2452832M113490r272216j5846861
$$ plain form
3697 15341512 2575182 -4679749 -7456916 -5434866 -836580 1614457 3578030 12952678
3689 12952678 29190847 38051349 29053353 11002391 1174720 3783014 7998770 4608573
3681 4608573 -3999715 -10293364 -10988156 -8183422 -5446902 -4918175 -6317690 -7304809 -5236668
3672 -5236668 767289 8771660 14598176 14996928 12088628 12883043 20983251 29972217 29739912
3663 29739912 19515530 9472420 7859793 11516062 11911095 6092807 -2459575 -10536650
3655 -10536650 -17642483 -23050315 -25320960 -25374137 -26449877 -29518556 -31009425 -27014591
3647 -27014591 -18989196 -13764359 -17290999 -28132840 -37136117 -34649911 -19880250 -3371918
3639 -3371918 1855990 -6512627 -16816213 -15534238 -1887312 12761525 19345284 19362799
$$ packed form
3697A5341512j2766330p254931k777167K022050M598286K451037J963573R374648
3689A2952678J6238169Q860502q997996j8050962r827671K608294M215756l390197
3681D608573q608288o293649o94792K804734K736520N28727j399515r87119K068141
3672e236668O003957Q004371N826516L98752k908300P94415Q100208Q988966k32305
3663B9739912j0224382j0043110j612627L656269L95033n818288q552382q077075
3655a0536650p105833n407832k270645n3177j075740l068679j490869L994834
3647b7014591Q025395N224837l526640j0841841r003277K486206J4769661J6508332
3639c371918N227908q368617j0303586J281975J3646926J4648837O583759J7515
$$ plain form
3631 19362799 17270696 12553015 6161302 8166852 26827828 51407618 59507045 45207670
3623 45207670 27185739 21939602 21901140 12163786 -2357979 -4918374 3086582 2039675
3615 2039675 -12861332 -19963744 -3881252 17701320 17906815 548146 -5603089 10234516
3607 10234516 25955911 20355190 2494284 -5102299 1339413 7849874 8015109 8866633
3599 8866633 12857957 11799496 3285856 -1713809 4429123 13617627 16147080 17213252
3591 17213252 26793321 39746679 40591973 26469809 11987650 9590095 16218693 22276828
3583 22276828 23767156 20974653 13270118 1078000 -11714960 -21287834 -26304578 -25366071
3575 -25366071 -17083526 -4299571 6707367 12093346 10643319 -19264 -18504458 -31830128
$$ packed form
3631A9362799k092103m717681o391713K005550J8660976K4579790Q099427j4299375
3623D5207670j8021931n246137l8462r737354j4521765k560395Q004956j046907
3615B039675j4901007p102412J6082492K1582572K05495j7358669o151235J5837605
3607A0234516J5721395n600721j7860906p596583O441712O510461J65235Q51524
3599H866633L991324j058461q513640m999665O142932R188504K529453J066172
3591A7213252R580069J2953358Q45294j4122164j4482159k397555O628598O058135
3583B2276828J490328k792503p704535j2192118j2792960r572874n016744R38507
3575b5366071Q282545J2783955J1006938N385979j450027j0662583j8485194j3325670
$$ plain form
3567 -31830128 -25102650 -2291512 15050183 15157060 9435507 11022921 13833651 5501417
3559 5501417 -9943112 -18159436 -16717312 -15513265 -18489432 -19714409 -15880305 -8739025
3551 -8739025 3611848 23125909 39233490 35777612 14644285 -1688572 2176631 15824938
3543 15824938 19302871 8247987 -5998911 -14254442 -17988140 -22927090 -31199221 -39106955
3535 -39106955 -39369615 -27147296 -5554639 16867755 34016422 44119060 45696586 38623371
3527 38623371 28927425 24049412 21635250 11630145 -7694840 -24812916 -30339444 -28458532
3519 -28458532 -27021478 -24721900 -16393761 -4831366 1877388 1556565 -1047414 -1786639
3511 -1786639 843772 8036587 17987547 23381576 18971927 10240580 7244981 10486901
$$ packed form
3567c1830128O727478K2811138J7341695J06877n721553J587414K810730q332234
3559E501417j5444529q216324J442124J204047k976167j224977L834104P141280
3551h739025J2350873J9514061J6107581l455878k1133327j6332857L865203J3648307
3543A5824938L477933j1054884j4246898q255531l733698m938950q272131p907734
3535c9106955k62660J2222319K1592657K2422394J7148667J0102638J577526p073215
3527C8623371r695946m878013k414162j0005105j9324985j7118076n526528J880912
3519b8458532J437054K299578Q328139J1562395O708754l20823k603979p39225
3511a786639K630411P192815R950960N394029m409649q731347k995599L241920
$$ plain form
3503 10486901 10387336 1622104 -9428166 -14698375 -16140643 -22036296 -33683831 -41254584
3495 -41254584 -35115139 -18551541 -4762815 -558283 1392881 9341248 16651715 9035494
3487 9035494 -13185173 -31702409 -33119014 -24343414 -17903460 -12360138 484434 15504638
3479 15504638 16917137 1299079 -15457951 -18405380 -10525183 -3694800 -933661 3972720
3471 3972720 13125872 19696106 17809957 11701769 10842395 16769183 18625862 5096822
3463 5096822 -20124348 -39361329 -39206963 -23463535 -5030809 9385208 19733952 22309673
3455 22309673 10445978 -12141046 -28111362 -23145459 -1770332 18081469 23076282
3448 23076282 13429802 -1582627 -11112065 -8844140 936907 4082906 -9119177 -29507274
$$ packed form
3503A0486901r9565q765232j1050270n270209j442268n895653j1647535p570753
3495d1254584O139445J6563598J3788726M204532J951164P948367P310467p616221
3487I035494k2220667j8517236j416605Q775600O439954N543322J2844572J5020204
3479A5504638J412499j5618058j6757030k947429P880197O830383K761139M906381
3471C972720R153152O570234j886149o108188q59374N926788J856679j3529040
3463E096822k5221170j9236981J54366J5743428J8432726J4416017J0348744K575721
3455B2309673j1863695k2587024j5970316M965903K1375127J9851801M994813
3448B3076282r646480j5012429r529438K267925R781047L145999j3202083k0388097
$$ plain form
3440 -29507274 -36982140 -25751912 -12470592 -12583769 -18070761 -11499735 3901404 6982236
3432 6982236 -6646430 -13123186 5083175 30035857 32368785 14057530 4844725 19080414
3424 19080414 39028238 44516112 37781538 30302002 23609760 15639431 11437907 13539471
3416 13539471 12735173 1815699 -11112204 -15711731 -15479816 -16863701 -13851828 -1293549
3408 -1293549 6788491 -5228442 -24973338 -25544592 -7393385 245894 -15546344 -31950046
3400 -31950046 -27532110 -14288625 -14675250 -25332468 -25459255 -10188898 5893101 13455222
3392 13455222 17535569 22818310 25521923 21940449 14014814 4792578 -3882687 -9716559
3384 -9716559 -12980599 -18926651 -29830083 -37913147 -34784050 -24857882 -20003489 -23342506
$$ packed form
3440b9507274p474866J1230228J3281320j13177n486992O571026J5401139L080832
3432F982236j3628666o476756J8206361K4952682K332928j8311255r212805J4235689
3424A9080414J9947824N487874o734574p479536o692242p970329m201524K101564
3416A3539471q04298j0919474j2927903m599527K31915j383885L011873J2558279
3408a293549Q082040j2016933j9744896n71254J8151207P639279j5792238j6403702
3400c1950046M417936J3243485l86625j0657218j26787J5270357J6081999P562121
3392A3455222M080347N282741K703613l581474p925635r222236q675265n833872
3384i716559l264040n946052j0903432q083064L129097R926168M854393l339017
$$ plain form
3376 -23342506 -28104604 -30236614 -31352051 -30434771 -23998546 -14669867 -8730621 -4900603
3368 -4900603 2728085 9850487 3847280 -15529471 -31001601 -30377077 -22366617 -20848901
3360 -20848901 -24148092 -22003723 -15689010 -17183503 -30433337 -45527791 -52485043 -51314954
3352 -51314954 -46123915 -37324059 -24446525 -12164660 -7820600 -12409256 -16803216 -10059422
3344 -10059422 7411800 22071485 22351205 12540860 5180260 2588378 -2704440 -8724077
3336 -8724077 -1007577 23012124 41262941 33759119 12197084 4375121 14374932 19575067
3328 19575067 7985142 -4043738 316123 12616902 15501083 10025817 8844757 11421747
3320 11421747 6106558 -5579371 -6264223 11311989 30731371 32199258 16714571 2153123
$$ packed form
3376b3342506m762098k132010j115437R17280O436225R328679N939246L830018
3368d900603P628688P122402o003207j9376751j5472130O24524Q010460J517716
3360b0848901l299191K144369O314713j494493j3249834j5094454o957252J170089
3352e1314954N191039Q799856J2877534J2281865M344060m588656m393960O743794
3344a0059422J7471222J4659685K79720r810345p360600k591882n292818o019637
3336h724077P716500K4019701J8250817p503822k1562035p821963R999811N200135
3328A9575067j1589925j2028880M359861J2300779K884181n475266j181060K576990
3320A1421747n315189j1685929o84852J7576212J9419382J467887j5484687j4561448
$$ plain form
3312 2153123 1794019 13962762 28153163 33824653 25507312 6537123 -11406596 -17065504
3304 -17065504 -9752282 847785 5376732 4161846 5807226 16814880 32293447 37991978
3296 37991978 24305058 -1304124 -19179152 -16896014 -1590066 9104783 5784373
3289 5784373 -6143046 -16123786 -19379726 -17542508 -13249402 -7905833 -3467202 -2713720
3281 -2713720 -6054201 -9249928 -6359433 4221514 17421962 26176756 28298506 27923903
3273 27923903 30091649 34468057 34864445 25689747 9866735 -702750 3967936 19362379
3265 19362379 28699370 21127167 4284664 -6105128 -5824220 -3778489 -5496676 -5156341
3257 -5156341 2771397 13019640 17020166 14529978 10873818 7736800 4409616 4026666
$$ packed form
3312B153123l59104J2168743J4190401N671490q317341j8970189j7943719n658908
3304a7065504P313222J0600067M528947j214886J645380J1007654J5478567N698531
3296C7991978j3686920k5609182j7875028K283138J5305948J0694849l320410
3289E784373j1927419r980740l255940J837218M293106N343569M438631P53482
3281b713720l340481l195727K890495J0580947J3200448Q754794K121750l74603
3273B7923903K167746M376408L96388r174698j5823012j0569485M670686J5394443
3265A9362379R336991p572203j6842503j0389792K80908K045731j718187L40335
3257e156341P927738J0248243M000526k490188l656160l137018l327184l82950
$$ plain form
3249 4026666 9439706 14940010 11589244 864129 -5876227 -2669874 4985689 11368358
3241 11368358 18441692 28000432 34490510 32568038 25441052 18293209 9185683 -4191201
3233 -4191201 -13080322 -5399784 14512163 26101030 17680982 1312578 -5666453 -5991585
3225 -5991585 -16550702 -39439043 -53737216 -41893177 -13251829 8421748 13550336
3218 13550336 10678634 6129130 -4076618 -19146722 -26353286 -18812047 -8822878 -10560349
3210 -10560349 -17796407 -14538260 -3026674 -2194462 -16663770 -26384455 -15591424 3447712
3202 3447712 8310709 -2673135 -11794743 -8027959 2775500 11244454 14214315 10299000
3194 10299000 -1966241 -17864315 -27615287 -28078979 -26472052 -28788508 -31046685 -26576570
$$ packed form
3249D026666N413040N500304l350766j0725115o740356L206353P655563O382669
3241A1368358P073334R558740O490078j922472p126986p147843r107526j3376884
3233d191201q889121P680538J9911947J1588867q420048j6368404o979031l25132
3225e991585j0559117k2888341j4298173J1844039K8641348K1673577N128588
3218A3550336k871702m549504j0205748j5070104p206564P541239R989169j737471
3210a0560349p236058L258147J1511586Q32212j4469308r720685J0793031J9039136
3202C447712M862997j0983844r121608L766784J0803459Q468954K969861l915315
3194A0299000j2265241j5898074r750972m63692J606927k316456k258177M470115
$$ plain form
3186 -26576570 -16810015 -9612889 -9730604 -14979168 -20269635 -22588086 -22892831 -24145559
3178 -24145559 -26437125 -25266597 -18041394 -10787509 -12306936 -21241685 -26033986 -20190555
3170 -20190555 -10358284 -4979393 -2297211 3279612 8930004 7657417 2526721 5647723
3162 5647723 20472259 34145951 33363113 22343138 17618682 26291208 36493002 32155703
3154 32155703 12837018 -6133211 -12069156 -7671026 -3364130 -2856918 -2466411 -1143965
3146 -1143965 -1860148 -2490439 4607407 19007854 26708012 16374608 -4127713 -16205288
3138 -16205288 -12380072 -1076550 7669195 10875174 7646036 -2402973 -12151315 -9146697
3130 -9146697 8361574 25223329 26821561 16976850 10305013 11133518 9998194 535317
$$ packed form
3186b6576570R766555P197126j17715n248564n290467k318451l04745j252728
3178b4145559k291566J170528P225203P253885j519427q934749m792301N843431
3170b0190555R832271N378891K682182N576823N650392j272587n130696L121002
3162E647723J4824536J3673692p82838j1019975m724456Q672526J0201794m337299
3154C2155703j9318685j8970229n935945M398130M306896N07212L90507J322446
3146a143965p16183o30291P097846J4400447P700158j0333404k0502321j2077575
3138a6205288L825216J1303522Q745745L205979l229138j0049009r748342L004618
3130i146697J7508271J6861755J598232r844711o671837Q28505j135324r462877
$$ plain form
3122 535317 -9530321 -7867785 6931147 22806675 25643832 12302121 -6363651 -15672228
3114 -15672228 -11424283 -2543436 1704110 3079493 8922679 19545867 28487749 33625438
3106 33625438 38994463 43992417 39919024 22730466 2889056 -4671406 2250305 11757592
3098 11757592 12396795 4451173 -2503678 241720 11824327 20608449 14358778 -4504825
3090 -4504825 -17425262 -10119969 7978495 13894582 1015938 -12315950 -9069492 2778812
3082 2778812 3955923 -5816695 -7191997 8361781 23216849 17092157 -5023100 -20617291
3074 -20617291 -19705379 -13717175 -15227296 -22339994 -27491568 -30495622 -34967601 -39333431
3066 -39333431 -39982924 -37942248 -33493950 -19074186 10811974 44278578 59513322 50042541
$$ packed form
3122E35317j0065638J662536J4798932J5875528K837157j3341711j8665772r308577
3114a5672228M247945Q880847M247546J375383N843186J0623188Q941882N137689
3106C3625438N369025M997954m073393j7188558j9841410p560462O921711R507287
3098A1757592O39203p945622o954851K745398J1582607Q784122o249671j8863603
3090d504825j2920437P305293J8098464N916087j2878644j3331888L246458J1848304
3082B778812J177111r772618j375302J5553778J4855068o124692k2115257j5594191
3074b0617291R11912N988204j510121p112698n151574l004054m471979m365830
3066c9333431o49493K040676M448298J4419764K9886160L3466604J5234744r470781
$$ plain form
3058 50042541 31218646 17599061 6254750 -9452044 -21814712 -19352273 -9174853
3051 -9174853 -11086654 -27880744 -37589851 -22962022 3240187 13818654 1771178 -12899691
3043 -12899691 -10017333 8123678 24209872 27612077 21906886 14571697 7203565 -1789712
3035 -1789712 -9449160 -8781127 1656402 12104899 10126835 -4478818 -17412027 -15989440
3027 -15989440 -4897890 -471758 -9596268 -20898463 -20064569 -8221901 963704 -857376
3019 -857376 -9264540 -16487760 -19916277 -19397185 -14401606 -8550708 -9667683 -18429289 -22965011
3010 -22965011 -13800197 -2285 760365 -12920509 -23624931 -19777430 -10407451 -8654132
3002 -8654132 -11335056 -5807991 8905380 19749389 17118932 4980861 -7334897 -15516618
$$ packed form
3058E0042541j8823895j3619585j1344311j5706794j2362668K462439J0177420
3051i174853j911801j6794090r709107J4627829K6202209J0578467j2047476j4670869
3043a2899691K882358J8141011J6086194L402205n705191p335189p368132q993277
3035a789712p659448O68033J0437529J0448497j978064j4605653j2933209J422587
3027a5989440J1091550M426132r124510j1302195Q33894J1842668R185605j821080
3019h57376q407164p223220l428517N19092M995579N850898j116975q761606m535722
3010b2965011R164814J3797912P62650j3680874j0704422L847501R369979J753319
3002h654132k680924N527065J4713371J0844009k630457j2138071j2315758q181721
$$ plain form
2994 -15516618 -20002539 -21011710 -17259161 -7763002 5740477 17116990 18890501 10126950
2986 10126950 -1223388 -7781946 -11328751 -16458186 -19325458 -11578718 4935575 16551747
2978 16551747 13496419 506476 -10665851 -13245680 -7829080 452090 3805909 -3010712
2970 -3010712 -15220621 -20824429 -14591373 -4099122 1920926 5099579 11600538 20205602
2962 20205602 23885479 20518094 14666292 9573153 3855263 -3498816 -10107339 -13268885
2954 -13268885 -12576648 -9267759 -6272302 -8599696 -19342266 -33951948 -42072068 -37894894
2946 -37894894 -27234370 -21329844 -23208177 -23323233 -12266850 3736985 7029430 -8497776
2938 -8497776 -25790483 -23980270 -4260252 14652169 23848265 31808129 42582842 43750279
$$ packed form
2994a5516618m485921j009171L752549R496159J3503479J1376513J773511q763551
2986A0126950j1350338o558558l546805n129435k867272P746740J6514293J1616172
2978A6551747l055328j2989943j1172327k579829N416600Q281170L353819o816621
2970c010712j2209909n603808O233056J0492251O020048L178653O500959Q605064
2962B0205602L679877l367385n851802n093139n717890p354079o608523l161546
2954a3268885O92237L308889K995457k327394j0742570j4609682q120120M177174
2946c7894894J0660524N904526j878333j15056J1056383J6003835L292445j5527206
2938h497776j7292707J810213J9720018J8912421R196096P959864J0774713J167437
$$ plain form
2930 43750279 26192950 2716320 -6666331 159198 9966598 14939234 16891117 16068443
2922 16068443 11240366 8609800 15304868 24411977 21583441 7398220 -2317905 -598444
2914 -598444 2959125 3262556 10419915 29538465 45988179 45118033 35043885 34086584
2906 34086584 43267348 47160187 37425550 19913674 616409 -19645029 -35358053 -36080977
2898 -36080977 -21414321 -5364285 542217 1060922 8592767 26338725 45214234 54028094
2890 54028094 49098503 36265626 25216154 19409168 11947676 -4248057 -23187048 -30094688
2882 -30094688 -20570635 -7841057 -6990332 -18281883 -30554030 -34968349 -29703298 -16767078
2874 -16767078 -1856879 5982877 2280306 -6781521 -12360971 -14475172 -18102852 -20558024
$$ packed form
2930D3750279j7557329k3476630r382651O825529R807400M972636J951883q22674
2922A6068443m828077k630566O695068R107109k828536j4185221r716125J719461
2914e98444L557569L03431P157359J9118550J6449714q70146j0074148r57301
2906C4086584R180764L892839r734637j7511876j9297265k0261438j5713024p22924
2898c6080977J4666656J6050036N906502N18705P531845J7745958J8875509Q813860
2890E4028094m929591j2832877j1049472n806986p461492j6195733j8938991o907640
2882c0094688R524053J2729578Q50725j1291551j2272147m414319N265051J2936220
2874a6767078J4910199P839756l702571r061827n579450k114201l627680k455172
$$ plain form
2866 -20558024 -13635523 519719 7092944 -2270378 -16741495 -20013532 -10081678 2911681
2858 2911681 12958178 21535325 27169031 23995093 13396458 6913536 12041900 22286025
2850 22286025 27271888 26585214 25945260 23982816 12658654 -8862677 -28986213 -35442181
2842 -35442181 -27231485 -12290608 1877326 11376331 13635614 7809668 -2721218 -12233696
2834 -12233696 -17763233 -19961305 -19431993 -16292455 -14182700 -19172212 -30042466 -33695002
2826 -33695002 -18351246 8468569 23995569 16911930 2807193 5078378 25060265
2819 25060265 41427740 38168602 21960669 9067974 5497738 6323848 6494403 4190981
2811 4190981 -1299764 -7197016 -6643715 1933973 8668083 4082928 -5681981 -5412701 7949758
$$ packed form
2866b0558024O922501J4155242O573225r363322j4471117l272037R931854J2993359
2858B911681J0046497Q577147N633706l173938j0598635o482922N128364J0244125
2850B2286025M985863o86674o39954j962444j1324162k1521331k0123536o455968
2842c5442181Q210696J4940877J4167934R499005K259283n825946j0530886r512478
2834a2233696n529537k198072N29312L139538K109755m989512j0870254l652536
2826c3695002J5343756K6819815J5527000p083639j4104737K271185J9981887
2819B5060265J6367475l259138j6207933j2892695l570236Q26110J70555k303422
2811D190981n490745n897252N53301Q577688O734110m585155r764909K69280J3362459
$$ plain form
2802 7949758 20720913 20941648 12237006 5601631 5209393 7544309 8987482 8732443 7406542
2793 7406542 7117491 10792208 18628342 26999192 32194041 32717996 27681543 17428332
2785 17428332 6923816 3031569 5489780 5504469 -2673162 -12704973 -13496028 -3427188
2777 -3427188 7181670 7466536 -2913590 -14343489 -17817177 -14492758 -13269357 -17972542
2769 -17972542 -20902185 -13876737 -2221320 437945 -9268279 -20111610 -22145927 -17934024
2761 -17934024 -14382466 -11954770 -7577818 -1706606 3182022 6319846 7070648 5122065
2753 5122065 4900675 12415749 24958010 33327350 37370906 46158020 56561693 48704257
2745 48704257 16666145 -11805808 -7411324 18494279 28151594 10242521 -7439089
$$ packed form
2802G949758J2771155K20735q704642o635375l92238K334916J443173k55039j325901
2793G406542k89051L674717P836134Q370850N194849N23955n036453j0253211
2785A7428332j0504516l892247K458211J4689q177631j0031811p91055J0068840
2777c427188J0608858K84866j0380126j1429899l473688L324419J223401m703185
2769a7972542k929643P025448J1655417K659265r706224j0843331k034317M211903
2761a7934024L551558K427696M376952N871212M888628L137824P50802j948583
2753E122065k21390P515074J2542261Q369340M043556Q787114J0403673p857436
2745D8704257l2038112k8471953M394484K5905603R657315j7909073j7681610
$$ plain form
2738 -7439089 -1311564 17132309 23971103 15749707 5465924 606365 364377 4553246
2730 4553246 10993110 11077932 753352 -9397512 -6593732 5758034 12394595 5209137
2722 5209137 -11214091 -28458721 -38509948 -33331987 -12051671 12541209 24737414
2715 24737414 22852535 17587562 16115274 17470367 21084429 27512137 30394724 20293262
2707 20293262 -287910 -16327479 -18322154 -11167158 -1968557 9434137 21985752 27027832
2699 27027832 19845486 9213637 5444678 5628293 1202649 -5788543 -6475184 -1727690
2691 -1727690 -1422717 -7312183 -9740937 -4077387 1707170 801510 -1968755 -566982 366872
2682 366872 -6748188 -18701387 -24952271 -21606137 -13462783 -4293076 6333645 16685722
$$ packed form
2738g439089O127525J8443873O838794q221396j0283783m859559k41988M188869
2730D553246O439864Q4822j0324580j0150864K803780J2351766O636561p185458
2722E209137j6423228j7244630j0051227N177961K1280316K4592880J2196205
2715B4737414j884879n264973j472288J355093L614062O427708K882587j0101462
2707B0293262k0581172j6039569j994675P154996R198601J1402694J2551615N042080
2699B7027832p182346j0631849l768959J83615m425644o991192o86641M747494
2691a727690L04973n889466k428754N663550N784557r05660k770265J401773R33854
2682C66872p115060j1953199o250884L346134Q143354R169707J0626721J0352077
$$ plain form
2674 16685722 20966125 15524731 2452619 -13102231 -25159533 -28146474 -21724866 -13386739
2666 -13386739 -10292651 -9855820 -5199837 2170779 4826190 3875352 8594733 18484056
2658 18484056 18762615 1516529 -19436365 -25139772 -15139023 -3736653 827465 1193932
2650 1193932 -347279 -3701395 -2694080 10616188 30250050 37092195 21121011 -5701919
2642 -5701919 -24270848 -29242927 -29806969 -35258639 -45529078 -52720288 -47955273 -29506014
2634 -29506014 -6924373 5963209 4352396 -4353814 -11530431 -16327947 -21354896 -24848872
2626 -24848872 -21667651 -9554550 8035546 22889893 25603481 13525594 -3350625
2619 -3350625 -10613815 -6242663 -2939865 -10654690 -24310517 -33826270 -38191040 -41575909
$$ packed form
2674A6685722M280403n441394j3072112j5554850j2057302k986941O421608Q338127
2666a3386739L094088M36831M655983P370616K655411r50838M719381R889323
2658A8484056K78559j7246086k0952894n703407J0000749J1402370M564118L66467
2650A193932j541211l354116J007315J3310268J9633862O842145j5971184k6822930
2642e701919j8568929m972079n64042n451670j0270439p191210M765015J8449259
2634b9506014K2581641J2887582j610813q706210p176617m797516n026949l493976
2626b4848872L181221J2113101J7590096J4854347K713588j2077887j6876219
2619c350625p263190M371152L302798p714825j3655827r515753m364770l384869
$$ plain form
2611 -41575909 -42005826 -34161465 -20235950 -8400376 -2046626 1073847 1113628 -2984836
2603 -2984836 -6238455 -2142746 4889763 3127348 -7455359 -11883507 -2742050 5047024
2595 5047024 -6272935 -29197094 -36413016 -15244782 14755279 24178968 7088245 -14921422
2587 -14921422 -19399332 -6410618 7013769 10183184 9176453 13307478 18787651 13256709
2579 13256709 -5441410 -23136757 -24448411 -8887076 10458333 19711366 13829707 -548125
2571 -548125 -8413023 1258095 21689560 33213061 27564580 18761998 20178528 20400899
2563 20400899 -514496 -34643289 -48405316 -26966053 3469615 9476030 -9660524
2556 -9660524 -30774241 -41658271 -47171185 -48813735 -40646890 -25096684 -13711581 -9501799
$$ packed form
2611d1575909m29917P844361J3925515J1835574O353750L120473L9781m098464
2603b984836l253619M095709P032509j762415j0582707m428148R141457P789074
2595E047024j1319959k2924159p215922K1168234L0000061R423689j7090723k2009667
2587a4921422m477910J2988714J3424387L169415j006731M131025N480173n530942
2579A3256709j8698119j7695347j311654J5561335J9345409R253033n881659j4377832
2571e48125p864898R671118K0431465J1523501n648481q802582J416530K22371
2563B0400899k0915395l4128793j3762027K1439263L0435668O006415j9136554
2556i660524k1113717j0884030n512914j642550Q166845J5550206J1385103M209782
$$ plain form
2548 -9501799 -4271518 4077101 7347356 3786891 3437135 11145349 18138429 16325572
2540 16325572 8001457 -3434339 -17941571 -28874587 -25057516 -10136653 -2777838 -8864510
2532 -8864510 -12069075 -3022525 2665443 -9319928 -27848231 -36610121 -38777951 -41382452
2524 -41382452 -36866556 -24422198 -25049776 -43746837 -44548911 -9515111 1753208 -82038740
2516 -82038740 -222060256 -286947856 -213998872 -88239254 -25390988 -34416719 -46928433
2509 -46928433 -34717764 -28938599 -44383335 -54110970 -42206654 -27929173 -26219412 -25250774
2501 -25250774 -15476263 -7542693 -9171339 -12022554 -11861952 -16374427 -23727120 -18618622
2493 -18618622 -404956 8757270 -3392253 -19419463 -18447398 -3637445 10017626 18504829
$$ packed form
2548i501799N230281Q348619L270255l560465l49756P708214O993080j812857
2540A6325572q324115j1435796j4507232j0933016L817071J4920863P358815o086672
2532h864510l204565R046550N687968j1985371j8528303q761890k167830k604501
2524d1382452M515896J2444358o27578j8697061q02074L5033800J1268319q3791948
2516h2038740j40021516o4887600P2948984J25759618O2848266r025731j2511714
2509d6928433J2210669N779165j5444736r727635J1904316J4277481J709761R68638
2501b5250774R774511P933570j628646k851215J60602m512475p352693N108498
2493a8618622J8213666R162226j2149523j6027210R72065J4809953J3655071Q487203
$$ plain form
2485 18504829 25086293 27835921 25057081 22503070 23644037 22455335 14904273 6662326
2477 6662326 1158766 -7342492 -19621905 -24583741 -18272750 -16207869 -31795672 -53083548
2469 -53083548 -57243147 -41024182 -21079736 -8804627 -471619 8879586 15714570 15052024
2461 15052024 8842448 4242555 6511842 13572017 17431193 14461760 12464482 19365083
2453 19365083 27004814 20400364 4325827 1565869 17099230 24814265 5071309 -23141274
2445 -23141274 -28996699 -14684619 -7653994 -16173176 -21498492 -14365026 -10856389 -23224106
2437 -23224106 -37870967 -36074615 -20880024 -9161426 -7419075 -8953812 -8717054 -8599931
2429 -8599931 -10038450 -10309707 -6124486 4009376 19653237 36514327 46086882 41587548
$$ packed form
2485A8504829O581464K749628k778840k554011J140967j188702p551062q241947
2477F662326n503560q501258j2279413m961836O310991K064881j5587803k1287876
2469e3083548m159599J6218965J9944446J2275109Q333008R351205O834984o62546
2461A5052024o209576m599893K269287P060175L859176k969433j997278O900601
2453A9365083P639731o604450j6074537k759958J5533361P715035j9742956k8212583
2445b3141274n855425J4312080P030625q519182n325316P133466L508637j2367717
2437b3224106j4646861J796352J5194591J1718598J742351j534737K36758J17123
2429h599931j438519k71257M185221J0133862J5643861J6861090R572555m499334
$$ plain form
2421 41587548 25369612 9187110 5783393 17987789 34870900 41415105 34305269 24526704
2413 24526704 21065962 17796030 3759029 -18049627 -32258348 -30188367 -17564335 -3296990
2405 -3296990 9062309 17087886 17570390 13340584 13051495 18679538 20660328 11241156
2397 11241156 -3771479 -12704067 -12014352 -6542148 -892638 2483872 646249 -6476970
2389 -6476970 -11882508 -8274480 686843 2595679 -7974551 -20788753 -20893590 -6502055
2381 -6502055 8045697 8688989 -1624898 -6995772 592785 11196499 12412008 8253403
2373 8253403 12223252 24619471 30727302 24186824 17322663 19665302 19638545 2536833
2365 2536833 -21514721 -26251479 -5297347 17920081 20926086 8170439 -1530923 -967689
$$ packed form
2421D1587548j6217936j6182502l403717J2204396J6883111O544205p109836r778565
2413B4526704l460742l269932j4037001k1808656j4208721K069981J2624032J4267345
2405c296990J2359299Q025577M82504m229806k89089N628043J980790r419172
2397A1241156j5012635q932588O89715N472204N649510L376510j837623p123219
2389f476970n405538L608028Q961323J908836j0570230j2814202j04837J4391535
2381f502055J4547752O43292j0313887n370874P588557J0603714J215509m158605
2373H253403L969849J2396219O107831o540478o864161K342639k6757j7101712
2365B536833k4051554m736758K0954132K3217428L006005j2755647r701362N63234
$$ plain form
2357 -967689 3395375 6722268 9829185 11395300 8322176 3502182 3139976 5936202 4449719
2348 4449719 -1778569 -4601942 -1554516 -1311603 -9188121 -16408289 -12101639 624270
2340 624270 9709945 10645879 8359517 5409088 -1360536 -12052237 -20468622 -21682458
2332 -21682458 -16429112 -6732808 6397633 19186524 25062689 21060744 10338821 -2245780
2324 -2245780 -12336666 -14437303 -5463234 8200196 13984631 6480854 -7694990 -19892979
2316 -19892979 -27762805 -31724128 -31170849 -28427461 -29200764 -33619451 -33059851 -21872461
2308 -21872461 -6703286 2459128 5658842 9850383 15862787 17094425 11109977 5259351
2300 5259351 7560188 15065194 15286763 1503103 -14791464 -13668813 6548085 20953299
$$ packed form
2357i67689M363064L326893L106917J566115l073124m819994l62206K796226j486483
2348D449719o228288k823373L047426K42913p876518p220168M306650J2725909
2340F24270R085675R35934k286362k950429o769624j0691701q416385j213836
2332b1682458N253346R696304J3130441J2788891N876165m001945j0721923j2584601
2324b245780j0090886k100637Q974069J3663430N784435p503777j4175844j2197989
2316a9892979p869826l961323N53279K743388p73303m418687N59600J1187390
2308b1872461J5169175R162414L199714M191541O012404J231638n984448n850626
2300E259351K300837P505006K21569j3783660j6294567J122651K0216898J4405214
$$ plain form
2292 20953299 8291783 -16766418 -20341036 2002881 16603353 200317 -26451664
2285 -26451664 -31174700 -17179834 -12262656 -23088816 -29197630 -20252899 -11641199 -17558801
2277 -17558801 -31186013 -40354392 -44548900 -46151165 -40117597 -24234538 -8647022 -4121293
2269 -4121293 -8570620 -13486125 -15544889 -13971492 -5538621 7617724 12575030 -192732
2261 -192732 -20882055 -29197180 -17783096 1639400 14403281 16768651 13321968 8693284
2253 8693284 5467153 5475843 8566501 11202785 9554180 4852443 3756670 11095397 22557897
2244 22557897 27387636 19246910 2026422 -15295747 -25499333 -24610761 -13693647 -2335448
2236 -2335448 -2515250 -13409919 -20188252 -14958518 -9386630 -15526983 -23685664 -15793233
$$ packed form
2292B0953299j2661516k5058201l574618K2343917J4600472j6403036k6651981
2285b6451664m723036J3994866M917178j0826160o108814Q944731Q611700n917602
2277a7558801j3627212r168379m194508j602265O033568J5883059J5587516M525729
2269d121293m449327m915505k058764J573397Q432871J3156345M957306j2767762
2261a92732k0689323q315125J1414084J9422496J2763881K365370l446683m628684
2253H693284l226131Q690L090658K636284j648605m701737j095773P338727J1462500
2244B2557897M829739q140726j7220488j7322169j0203586Q88572J0917114J1358199
2236b335448j79802j0894669o778333N229734N571888o140353q158681P892431
$$ plain form
2228 -15793233 4808488 16110752 9275645 -1185843 -1816207 3257263 5505362 4707295
2220 4707295 978366 -10299457 -26280424 -32963993 -23466745 -8022642 2970455 12477692
2212 12477692 23049505 24230416 9079100 -7821255 -6462988 10390302 20908218
2205 20908218 12666131 -6199017 -21447401 -25766375 -19571964 -10303881 -8995552 -17468024
2197 -17468024 -22302147 -12205818 3264308 5790998 -4200274 -8256340 1277321 9912699
2189 9912699 4316892 -7287682 -8263946 1720809 7055067 -826962 -10746955 -5805611
2181 -5805611 14368090 31337598 29246210 13605042 3404168 7838504 19622913 30366581
2173 30366581 40428195 49889793 52271230 45000983 35801315 30041791 21879764 7678549
$$ packed form
2228a5793233K0601721J1302264o835107j0461488o30364N073470K248099p98067
2220D707295l728929j1277823j5980967o683569R497248J5444103J0993097R507237
2212A2477692J0571813J180911j5151316j6900355J358267J6853290J0517916
2205B0908218q242087j8865148j5248384m318974O194411R268083J308329q472472
2197a7468024m834123J0096329J5470126K526690r991272m056066R533661Q635378
2189I912699n595807j1604574r76264R984755N334258p882029r919993M941344
2181e805611K0173701J6969508k091388j5641168j0200874M434336J1784409J0743668
2173C0366581J0061614R461598K381437p270247r199668n759524q162027j4201215
$$ plain form
2165 7678549 -2871347 -1790665 1484742 -4868993 -13222579 -8219175 5832246 9956441
2157 9956441 534419 -6626479 -3013637 2405006 3099976 4946428 10181538 10327345 3346210
2148 3346210 405835 6051844 8473917 769798 -4674508 2585535 10517775 3599372
2140 3599372 -8587062 -2703990 22761478 42864953 38065865 15272537 -5370404 -11730971
2132 -11730971 -4051994 10778984 23145695 25288023 17383204 7011225 1419628 2434548
2124 2434548 7554391 12237891 12682078 10272458 10786652 14908198 14108736 3350550 -6430085
2115 -6430085 343895 20750762 33496318 25122390 5384980 -8246064 -10805133 -6885739
2107 -6885739 2664796 18732506 33433362 35192897 24912709 15853203 14915424 14682630
$$ packed form
2165G678549j0549896J080682L275407o353735q353586N003404J4051421M124195
2157I956441r422022p160898L612842N418643O94970J846452N235110J45807o981135
2148C346210k940375N646009K422073p704119n444306P260043P932240o918403
2140C599372j2186434N883072K5465468K0103475m799088k2793328k0642941o360567
2132a1730971P678977J4830978J2366711K142328p904819j0371979n591597J014920
2124B434548N119843M683500M44187k409620N14194M121546p99462j0758186r780635
2115f430085O773980K0406867J2745556q373928j9737410j3631044k559069L919394
2107f885739R550535J6067710J4700856J759535j0280188r059506r37779k32794
$$ plain form
2099 14682630 9167587 7214650 20100186 40905108 47786083 29127279 -2002252 -21342996
2091 -21342996 -17464157 -513650 10314937 6405111 -2849251 -2885389 6823749 11833089
2083 11833089 2950555 -10377613 -13214830 -4252337 7640710 18869448 29786750 33480328
2075 33480328 23612437 11888088 17252586 34531619 35750289 10914989 -14847458 -18399861
2067 -18399861 -10943392 -13517879 -19878158 -11004190 6330832 7042040 -10131970 -18580790
2059 -18580790 -4854197 13602883 18360640 12659995 4471884 -9932242 -31453171 -45580455
2051 -45580455 -39990110 -22075403 -6453344 2916463 7207768 3444370 -5584216 -5245103
2043 -5245103 10869893 25295960 18573550 -1114513 -8501930 3510420 17795519 20433328
$$ packed form
2099A4682630n515043j952937J2885536K0804922O880975j8658804l1129531j9340744
2091b1342996L878839J6950507J0828587l909826r254362l6138R709138N009340
2083A1833089q882534j3328168k837217Q962493J1893047J1228738J0917302L693578
2075C3480328r867891j1724349N364498J7279033J218670k4835300k5762447l552403
2067a8399861P456469k574487o360279Q873968J7335022P11208j7174010q448820
2059a8580790J3726593J8457080M757757n700645q188111j4404126k1520929j4127284
2051d5580455N590345J7914707J5622059R369807M291305l763398r028586L39113
2043e245103J6114996J4426067o722410j9688063p387417J2012350J4285099K637809
$$ plain form
2035 20433328 15657914 11002266 4187025 -8517357 -22437680 -30242912 -30684046 -27082560
2027 -27082560 -22936338 -22125745 -27645705 -36869294 -42701296 -41825857 -37588476 -33289354
2019 -33289354 -27909314 -21136626 -17732451 -22398645 -32297770 -38482795 -35102727 -25570701
2011 -25570701 -18716292 -18887954 -21165799 -18078534 -9750538 -3483860 -3388721 -5974672 -7852634
2002 -7852634 -11364189 -18158638 -23129991 -21355431 -16598505 -15003958 -13341210 -2855286
1994 -2855286 15529022 29216485 29432441 20704526 11369684 2286814 -8900615 -17980725
1986 -17980725 -17100359 -5932728 7556984 18092625 27981523 38520706 43062499 34588906
1978 34588906 16892015 1492657 -6053922 -10676726 -17711910 -24206018 -23264605 -13226109
$$ packed form
2035B0433328m775414m655648o815241j2704382j3920323p805232m41134L601486
2027b7082560M146222Q10593n519960r223589n832002Q75439M237381M299122
2019c3289354N380040O772688L404175m666194r899125o185025L380068R532026
2011b5570701O854409j71662k277845L087265Q327996O266678R5139k585951j877962
2002g852634l511555o794449m971353J774560M756926J594547J662748J0485924
1994b855286J8384308J3687463K15956q727915r334842r082870j1187429r080110
1986a7980725Q80366J1167631J3489712J0535641R888898J0539183M541793q473593
1978C4588906j7696891j5399358p546579m622804p035184o494108R41413J0038496
$$ plain form
1970 -13226109 381922 9723322 10530484 6279706 6288926 14766387 22895772 20157977 13228584
1961 13228584 20552695 43514353 58145445 47016151 26588915 26240420 47975927 65499840
1953 65499840 60278675 40612637 24520480 20050690 25130988 32628980 31989241 17733740
1945 17733740 -953736 -9353008 -5946032 -923896 1504326 4282721 2839267 -11999769
1937 -11999769 -34487857 -46083926 -40942207 -31091267 -22690128 -8117480 11913325 20891372
1929 20891372 12035271 687041 -1428767 -4570876 -18991380 -33307358 -31961587 -18717360
1921 -18717360 -6271284 2730098 8134900 1448354 -19049794 -36077613 -34580358 -22765913
1913 -22765913 -15666841 -12927124 -10661517 -17464184 -36279349 -47689175 -37114053 -22462993
$$ packed form
1970a3226109J3608031R341400Q07162m250778R220Q477461Q129385k737795o929393
1961A3228584P324111K2961658J4631092j1129294k0427236l48495K1735507J7523913
1953F5499840n221165j9666038j6092157m469790N080298P497992o39739j4255501
1945A7733740j8687476q399272L406976N022136K428222K778395j443454j4839036
1937a1999769k2488088j1596069N141719R850940Q401139J4572648K0030805Q978047
1929B0891372q856101j1348230k115808l142109j4420504j4315978J345771J3244227
1921a8717360J2446076R001382N404802o686546k0498148j7027819J497255J1814445
1913b2765913P099072K739717K265607o802667j8815165j1409826J0575122J4651060
$$ plain form
1905 -22462993 -25699395 -32454965 -14453593 19459987 33625198 21819865 13302721 21912511
1897 21912511 29065342 24118044 22802109 32489850 34296015 17424262 1338398 3925565
1889 3925565 12665899 7664721 -7873388 -19928021 -27866454 -36726720 -40737037 -33293129
1881 -33293129 -21135642 -12815414 -5020565 5704253 10944908 4804065 -2661835 -1588722
1873 -1588722 439269 -6889684 -16076556 -12913280 911557 12458147 17029825 17682957
1865 17682957 12652488 -663412 -14277081 -17414662 -12834069 -12525618 -19763720 -26855560
1857 -26855560 -28490391 -27215772 -27125866 -29559724 -32696649 -30462602 -17083809 2411014
1849 2411014 13670567 10769723 3918974 3022945 3623378 -2388834 -12265958 -18695286
$$ packed form
1905b2462993l236402o755570J8001372L3913580J4165211j1805333q517144Q609790
1897B1912511P152831m947298j315935R687741J806165j6871753j6085864K587167
1889C925565Q740334n001178j5538109j2054633p938433q860266m010317P443908
1881c3293129J2157487Q320228P794849J0724818N240655o140843p465900J073113
1873a588722K027991p328953r186872L163276J3824837J1546590M571678O53132
1865A7682957n030469j3315900j3613669l137581M580593L08451p238102p091840
1857b6855560j634831J274619Q9906k433858l136925K234047J3378793J9494823
1849B411014J1259553k900844o850749q96029O00433o012212r877124o429328
$$ plain form
1841 -18695286 -21216909 -20713096 -11794371 7316009 25394545 30964893 27161604 22155152
1833 22155152 13358043 -4442163 -22498516 -26531910 -18427026 -13486456 -16903496 -18037836
1825 -18037836 -9708125 347701 1755519 -4417108 -9154608 -7721760 -4222788 -5298527
1817 -5298527 -10428090 -9977175 3243862 21287330 27336766 16099139 -559447 -10532521
1809 -10532521 -13762762 -14286837 -12386682 -10804407 -16200170 -26268888 -27611000 -15560347
1801 -15560347 -3454050 -1581039 -348165 12171571 28467405 33188574 26327036 18746445
1793 18746445 13697691 9207284 10113423 19953286 28136347 23171743 12094669 8594624
1785 8594624 9064400 1228121 -9402788 -5613940 10897862 19323615 12077755 4073777
$$ packed form
1841a8695286k521623N03813Q918725J9110380J8078536N570348l803289n006452
1833B2155152q797109j7800206j8056353m033394Q104884M940570l417040j134340
1825a8037836Q329711J0055826J407818o172627m737500J432848L498972j075739
1817e298527n129563M50915J3221037J8043468O049436j1237627j6658586r973074
1809a0532521l230241n24075J900155J582275n395763j0068718j342112J2050653
1801a5560347J2106297J873011J232874J2519736J6295834M721169o861538p580591
1793A8746445n048754m490407R06139R839863Q183061m964604j1077074l500045
1785H594624M69776p836279j0630909L788848J6511802Q425753p245860q003978
$$ plain form
1777 4073777 5094047 5483812 -2539494 -10009882 -9017780 -8111701 -16308464 -24674280 -18460956
1768 -18460956 17302 13531168 11472193 -207697 -8957091 -8898366 -4270758 -2943049
1760 -2943049 -7191461 -12074095 -14218336 -18011404 -28031750 -39384536 -43004850 -38095141
1752 -38095141 -31831569 -28986635 -29280021 -32077935 -35175291 -31724155 -18141649 -3540481
1744 -3540481 -1548162 -13105521 -25840092 -29559816 -24021982 -12839843 894703 12799941
1736 12799941 19163427 21396775 22839073 22417449 17040854 8145083 765302 -1191360
1728 -1191360 4324198 15503581 22425820 14835885 -169256 -516308 21669006 45877148
1720 45877148 49940520 38251037 28735205 23763860 12317718 -6822382 -22178453 -25598109
$$ packed form
1777D073777J020270L89765q023306p470388R92102R06079q196763q365816O213324
1768a8460956J8478258J3513866k058975j1679890q749394N8725M627608J327709
1760b943049m248412m882634k144241l793068j0020346j1352786l620314M909709
1752c8095141O263572K844934k93386k797914l097356L451136J3582506J4601168
1744c540481J992319j1557359j2734571l719724N537834J1182139J3734546J1905238
1736A2799941O363486K233348J442298m21624n376595q895771p379781j956662
1728a191360N515558J1179383O922239p589935j5005141l47052K2185314K4208142
1720D5877148M063372j1689483r515832m971345j1446142j9140100j5356071l419656
$$ plain form
1712 -25598109 -17199596 295411 20322974 32816233 35931100 37747743 39025071 30937727
1704 30937727 18604017 22439519 41353967 43701390 16909729 -5563871 3756526 21064895
1696 21064895 16168265 8463812 28890827 56499469 51600914 27821746 26796961 42419627
1688 42419627 42339385 45095991 90140581 145365611 149810600 149776345 264106449 474874224
1680 474874224 584183752 462760484 234837539 109881899 114580294 116528918 55163352
1673 55163352 3815731 14773304 40114985 33546196 22432816 36241529 46601599
1666 46601599 25224837 -1889872 -3066893 5390749 -4739469 -23167787 -24513591 -11533673
1658 -11533673 -1940054 3621878 12819973 21473840 24697814 29547777 38509893 38980854
$$ packed form
1712b5598109Q398513J7495007K0027563J2493259L114867J816643J277328q087344
1704C0937727j2333710L835502J8914448K347423k6791661k2473600R320397J7308369
1696B1064895m896630p704453K0427015K7608642m898555k3779168j024785J5622666
1688D2419627q0242K756606M5044590N5225030M444989l4255J14330104K10767775
1680D74874224J09309528j21423268k27922945j24955640M698395J948624o1365566
1673E5163352n1347621J0957573K5341681o568789j1113380J3808713J0360070
1666D6601599k1376762k7114709j177021Q457642j0130218j8428318j345804J2979918
1658a1533673R593619N561932R198095Q653867L223974M849963Q962116M70961
$$ plain form
1650 38980854 24573337 8284238 1110934 -3561816 -12526577 -19454321 -20329422 -22422063
1642 -22422063 -27125699 -23826832 -11282736 -4681653 -10739712 -16178050 -11538805 -5725936
1634 -5725936 -5303853 -811927 12822539 22092332 15873430 3589613 -1138984 767948
1626 767948 3761414 10356406 20965901 25222214 15885310 -155028 -13623751 -23229911
1618 -23229911 -27892838 -23488346 -14123876 -11181612 -14636395 -11372828 2217349 13582398
1610 13582398 15618700 15865028 18019363 14841003 6752760 6233492 15450073 20936750
1602 20936750 18262364 18507523 22092736 13253200 -7877625 -16688529 -3748486 5518103
1594 5518103 -9012155 -29411703 -30750994 -19876918 -16019152 -14198318 1900751 26096303
$$ packed form
1650C8980854j4407517j6289099p173304m672750q964761o927744q75101k092641
1642b2422063m703636L298867J2544096O601083o058059n438338M639245N812869
1634e725936M22083M491926J3634466R269793o218902j2283817m728597J906932
1626G67948K993466O594992J0609495M256313r336904j6040338j3468723r606160
1618b3229911m662927M404492R364470K942264l454783L263567J3590177J1365049
1610A3582398K036302K46328K154335l178360q088243n19268R216581N486677
1602B0936750k674386K45159L585213q839536k1130825q810904J2940043R266589
1594E518103j4530258k0399548j339291J0874076L857766J820834J6099069K4195552
$$ plain form
1586 26096303 37867069 33509218 24157292 13245218 -1071076 -11991898 -14578608 -18589699
1578 -18589699 -29888446 -33200717 -16495277 2564521 946565 -12689559 -13832759 -3011717
1570 -3011717 -83877 -6958222 -8442089 -4856921 -11435981 -26907475 -33281034 -27387598
1562 -27387598 -24095682 -27219844 -25140178 -16975711 -15225437 -19445318 -15011329 -2473540
1554 -2473540 -456061 -12675583 -18964678 -8437489 3034471 -648633 -13353517 -21229779
1546 -21229779 -20043733 -8766585 14166901 37932078 41808736 22134097 224235
1539 224235 -6516624 -4453714 -4936780 -4183146 4660175 15066706 17597119 15201137 15013315
1530 15013315 14724229 8728687 -526168 -6895856 -8559851 -5038463 4427587 13918771
$$ packed form
1586B6096303J1770766m357851r351926j0912074j4316294j0920822k586710m011091
1578a8589699j1298747l312271J6705440J9059798j617956j3636124j143200J0821042
1570c011717K927840o874345j483867L585168o579060j5471494o373559N893436
1562b7387598L291916l124162K079666Q164467J750274m219881M433989J2537789
1554b473540K017479j2219522o289095J0527189J1471960l683104j2704884p876262
1546b1229779J186046J1277148K2933486K3765177L876658j9674639k1909862
1539B24235o740859K062910m83066P53634Q843321J0406531K530413k395982j87822
1530A5013315k89086n995542r254855o369688j663995L521388R466050R491184
$$ plain form
1522 13918771 13688586 6106722 6022127 17931993 26377463 18458926 3093564 -2933171
1514 -2933171 3052543 12119653 17601198 15958614 4282243 -11933006 -18298488 -10132086
1506 -10132086 -2077725 -7411383 -17403826 -15171050 -2249613 4220485 -3131512 -13892649
1498 -13892649 -16531649 -11532053 -7107094 -9713684 -18857658 -26265458 -22772528 -10819125
1490 -10819125 -5700616 -18429987 -41416184 -56805326 -54819014 -38872528 -18139920
1483 -18139920 -1392024 6330908 6757064 4736669 -727988 -14614589 -32332121 -38995919
1475 -38995919 -29074119 -16284593 -14787319 -19990161 -18547564 -8715121 1270821 7746321
1467 7746321 11593374 9514613 -1054657 -12087244 -13039101 -6389567 -3447742 -7344722
$$ packed form
1522A3918771k30185p581864q4595J1909866Q445470p918537j5365362o026735
1514b933171N985714R067110N481545j642584j1676371j6215249o365482Q166402
1506a0132086Q054361n333658r992443K232776J2921437O470098p351997j0761137
1498a3892649k639000M999596M424959k606590r143974p407800L492930J1953403
1490a0819125N118509j2729371k2986197j5389142J986312J5946486K0732608
1483a8139920J6747896P722932M26156k020395n464657j3886601j7717532o663798
1475c8995919R921800J2789526J497274n202842J442597R832443R985942O475500
1467G746321L847053k078761j0569270j1032587r51857O649534K941825l896980
$$ plain form
1459 -7344722 -11782932 -13704241 -14807756 -13054655 -5741725 1020515 -413911 -4475469
1451 -4475469 -323615 6756137 547512 -17147963 -23338276 -7750379 9380240 6640488
1443 6640488 -7585900 -10679007 -625469 4545967 -4025737 -17617867 -29146521 -40676619
1435 -40676619 -48543857 -40324568 -15548100 6061238 8930285 2437882 4147281 12160051
1427 12160051 10715714 -2475300 -13171188 -14215188 -13694711 -16148302 -14120026 -6423909
1419 -6423909 -7248563 -23695077 -38200109 -30287658 -6739807 7702731 4224508 -3403173
1411 -3403173 -3275159 1682811 5541656 6991897 2861847 -9794211 -21949062 -19297734
1403 -19297734 -5264908 -421136 -12153973 -22325322 -15565753 -3635892 -7245615 -25875009
$$ packed form
1459g344722m438210j921309j103515J753101P312930O762240j434426m061558
1451d475469M151854P079752o208625j7695475o190313J5587897J7130619k739752
1443F640488j4226388l093107J0053538N171436q571704j3592130j1528654j1530098
1435d0676619p867238Q219289K4776468K1609338K869047o492403J709399Q012770
1427A2160051j444337j3191014j0695888j044000N20477k453591K028276P696117
1419f423909q24654j6446514j4505032P912451K3547851J4442538l478223p627681
1411c403173J28014M957970L858845J450241m130050j2656058j2154851K651328
1403a9297734J4032826M843772j1732837j0171349O759569J1929861l609723j8629394
$$ plain form
1395 -25875009 -41171157 -41797648 -30332772 -12462438 6007922 16179603 13948953 7939513
1387 7939513 8095921 10524399 5703117 -2827925 -2361620 8400168 17277346 17873351 17420135
1378 17420135 22423710 28125669 27165477 20497631 15054806 15633052 21199163 24850959
1370 24850959 17604165 -2147724 -23231267 -31691888 -26183080 -18174643 -17768695 -24674512
1362 -24674512 -31591578 -30596052 -18153869 -283404 9348604 3359360 -9326176 -13924795
1354 -13924795 -7013592 4095547 14323984 22555254 24233624 15523852 4082174 2285469
1346 2285469 8654448 9394504 845366 -3785062 4641999 16969833 20515132 16736169
1338 16736169 14185616 12516538 5001040 -7538173 -15982086 -15566748 -12224754 -15430560
$$ packed form
1395b5875009j5296148o26491J1464876J7870334J8470360J0171681k230650o009440
1387G939513J56408K428478m821282q531042M66305J0761788Q877178N96005m53216
1378A7420135N003575N701959r60192o667846n442825N78246N566111L651796
1370B4850959p246794j9751889k1083543q460621N508808Q008437M05948o905817
1362b4674512o917066R95526J2442183J7870465R632008n989244j2685536m598619
1354a3924795O911203J1109139J0228437Q231270J678370q709772j1441678j796705
1346B285469O368979P40056q549138m630428Q427061J2327834L545299l778963
1338A6736169k550553j669078p515498j2539213q443913M15338L341994l205806
$$ plain form
1330 -15430560 -27631710 -40264638 -40042398 -22588951 353623 12854519 13655476 14699426
1322 14699426 19789529 16891483 -1591087 -22200598 -25840869 -13023801 -810625 2050231
1314 2050231 3185682 9240492 14041066 9915205 941435 -3658877 -3873151 -7477141
1306 -7477141 -15900518 -20347591 -14243975 -2665529 5276550 8561604 12262808 16185083
1298 16185083 13884693 3811286 -6774912 -12437992 -16807982 -23993160 -29160897 -24508304
1290 -24508304 -9998825 8261863 25324589 36152626 33807653 19524812 9483360
1283 9483360 18323173 38133086 47482516 40449205 31496724 30285449 28817500 19441446
1275 19441446 9468089 8357912 13498892 18751512 24824046 30228450 24803749 6600002
$$ packed form
1330a5430560j2201150j2632928K22240J7453447K2942574J2500896Q00957J043950
1322A4699426N090103k898046j8482570k0609511l640271J2817068J2213176K860856
1314B050231J135451O054810M800574m125861q973770m600312k14274l603990
1306g477141q423377m447073O103616J1578446P942079L285054L701204L922275
1298A6185083k300390j0073407j0586198n663080m369990p185178n167737M652593
1290b4508304J4509479J8260688J7062726J0828037k344973j4282841j0041452
1283I483360Q839813J9809913R349430p033311q952481j211275j467949r376054
1275A9441446r973357j110177N140980N252620O072534N404404n424701j8203747
$$ plain form
1267 6600002 -6093517 2787873 20726250 22455368 7514307 315053 12483316 27376352
1259 27376352 28183624 21008280 18767559 18986093 12727239 3708437 1609179 3380131
1251 3380131 -1607742 -10732361 -9577618 4322512 15036831 11017300 938796 -1596088
1243 -1596088 1705844 -52943 -8141647 -14350371 -16296873 -19226816 -22598464 -18177017
1235 -18177017 -5310227 3784473 1008775 -4714202 -394631 12005219 19385037 15860061
1227 15860061 7007864 -1778737 -10458842 -17646206 -18643190 -12745072 -5074742 1247277
1219 1247277 8164709 15827506 19631073 17493146 14190945 14501200 16653920 16463261 14291627
1210 14291627 14174112 18283056 24671466 28647315 25431417 13996100 -1039074 -13418080
$$ packed form
1267F600002j2693519Q881390J7938377J729118j4941061p199254J2168263J4893036
1259B7376352Q07272p175344k240721K18534o258854r018802k099258J770952
1251C380131m987873r124619J154743J3900130J0714319m019531j0078504k534884
1243a596088L301932j758787q088704o208724j946502k929943l371648M421447
1235a8177017J2866790R094700k775698n722977M319571J2399850P379818l524976
1227A5860061q852197q786601q680105p187364r96984N898118P670330O322019
1219A247277O917432P662797L803567k137927l302201L10255K152720j90659k171634
1210A4291627j17515M108944O388410L975849l215898j1435317j5035174j2379006
$$ plain form
1202 -13418080 -20294420 -20953218 -14276920 -3479830 381707 -10492197 -26753565 -30127462
1194 -30127462 -17523268 -5942630 -9193909 -20523559 -25107043 -20351110 -14862141 -13867250
1186 -13867250 -15074306 -15429405 -14013816 -10050758 -3869932 1468634 3115497 1094118
1178 1094118 -3419940 -8584047 -10220773 -6178040 -3164500 -10278307 -23467736 -27465999
1170 -27465999 -18184803 -11557791 -22096778 -42915279 -56321335 -55082547 -43612637 -27412525
1162 -27412525 -12468813 -6947565 -11966994 -17661739 -18005764 -19704685 -25579947 -22704352
1154 -22704352 -3709234 12985103 6149930 -14601940 -23160068 -18275632 -21743732 -36996426
1146 -36996426 -41619263 -27416218 -16694795 -25165168 -36123955 -29959566 -16267438 -14652765
$$ packed form
1202a3418080o876340o58798O676298J0797090L861537j0873904j6261368l373897
1194c0127462J2604194J1580638l251279j1329650m583484M755933N488969R94891
1186a3867250j207056l55099J415589L963058O180826N338566J646863k021379
1178A094118m514058n164107j636726M042733L013540p113807j3189429l998263
1170b7465999R281196O627012j0538987k0818501j3406056J238788J1469910J6200112
1162b7412525J4943712N521248n019429n694745l44025j698921n875262K875595
1154b2704352J8995118J6694337o835173k0751870q558128M884436l468100j5252694
1146c6996426m622837J4203045J0721423q470373j0958787O164389J3692128J614673
$$ plain form
1138 -14652765 -21538991 -19940762 -9498802 -2690779 252684 8524173 17456002 12014824
1130 12014824 -6015153 -16032598 -8137530 3639491 4082008 -2868390 -5329234 -2862100
1122 -2862100 -3765049 -9996714 -15307938 -16379822 -17912625 -25108099 -34976127 -38045501
1114 -38045501 -29146289 -14514790 -4929257 -2367596 992592 9151267 15244195 13005560
1106 13005560 7857582 8397554 12404955 11549061 6747440 7100933 13438432 14630701 4312026
1097 4312026 -7784357 -7378066 6577240 21128912 23710508 13265176 -1568375 -12158199
1089 -12158199 -17277285 -21578580 -27592002 -31316383 -26767407 -12526004 7564899 26734858
1081 26734858 36402865 30629428 14831400 5561555 14289688 33621129 46326711 45613716
$$ packed form
1138a4652765o886226J598229J0441960O808023K943463Q271489Q931829n441178
1130A2014824j8029977j0017445P895068J1777021M42517o950398k460844K467134
1122b862100r02949o231665n311224j071884j532803p195474r868028l069374
1114c8045501Q899212J4631499R585533K561661L360188Q158675O092928k238635
1106A3005560n147978N39972M007401q55894m801621L53493O337499J192269j0318675
1097D312026j2096383M06291J3955306J4551672K581596j0445332j4833551j0589824
1089a2158199n119086m301295o013422l724381M548976J4241403K0090903J9169959
1081B6734858R668007n773437j5798028r269845Q728133J9331441J2705582p12995
$$ plain form
1073 45613716 38635800 32085856 24743668 15768969 10452352 12816289 18740907 20816652
1065 20816652 15815725 5053873 -7310117 -13649498 -6681139 11260518 26807632 28110084
1057 28110084 16348470 1612914 -9231007 -16326309 -21204349 -22971459 -20876818 -17741039
1049 -17741039 -19181979 -28997959 -44392584 -56085976 -55394411 -42314920 -25677921 -15138923
1041 -15138923 -13633656 -16267592 -14614157 -3637502 12761126 24197550 24422340 17658129
1033 17658129 11626290 8014517 4996352 4973174 11171469 18299011 16434261 5079971
1025 5079971 -5727021 -9667705 -10067853 -9957488 -7496698 -5197587 -11332211 -24883537
1017 -24883537 -30927927 -21418358 -10193892 -14020764 -26935593 -29721370 -20245808 -15589554
$$ packed form
1073D5613716o977916o549944p342188q974699n316617K363937N924618K075745
1065B0816652n000927j0761852j2363990o339381O968359J7941657J5547114J302452
1057B8110084j1761614j4735556j0843921p095302m878040j767110K094641L135779
1049a7741039j440940r815980j5394625j1693392O91565J3079491J6636999J0538998
1041a5138923J505267k633936J653435J0976655J6398628J1436424K24790o764211
1033A7658129o031839l611773l018165k3178O198295P127542j864750j1354290
1025E079971j0806992l940684m00148J10365K460790K299111o134624j3551326
1017b4883537o044390R509569J1224466l826872j2914829k785777R475562M656254
$$ plain form
1009 -15589554 -22885336 -26884669 -14547549 2745534 4268782 -10621553 -21264846 -12430336
1001 -12430336 7819150 19167392 11918488 -4355886 -12418410 -4774780 10543651 19890878
993 19890878 17455489 8069494 -481315 -3983922 -1318430 7370771 18905673 25752491
985 25752491 20544240 3687742 -14644370 -22786621 -19468845 -15375788 -19801974 -28251840
977 -28251840 -29420922 -22949560 -20060274 -23931435 -21727411 -4862580 13428797 14124546
969 14124546 -1002399 -14444479 -20396131 -28637147 -40546967 -41563465 -25344769 -8492223
961 -8492223 -9052957 -22004475 -28464656 -20867620 -7429560 1660472 1580684 -7710278 -18972941
952 -18972941 -19941962 -7866820 4038273 4371737 43441 2799535 7806720 2564175
$$ packed form
1009a5589554p295782l999333J2337120J7293083J523248j4890335j0643293Q834510
1001a2430336K0249486J1348242p248904j6274374q062524P643630J5318431R347227
993A9890878k435389r385995q550809l502607K665492Q689201J1534902O846818
985B5752491n208251j6856498j8332112q142251L317776M093057m426186q449866
977b8251840j169082O471362K889286l871161K204024J6864831J8291377O95749
969A4124546j5126945j3442080n951652q241016j1909820j016498J6218696J6852546
961h492223n60734j2951518o460181P597036J3438060R090032p9788r290962j1262663
952a8972941r69021J2075142J1905093L33464m328296K756094N007185n242545
$$ plain form
944 2564175 -8729578 -10156962 -2196201 -3100924 -18199665 -28822169 -20647051 -4707925
936 -4707925 1769834 -78976 518558 3344786 1293614 -3543857 -3813546 -1479603 -3899605
927 -3899605 -9344004 -10166124 -6884643 -5109681 -1638593 10363508 23001309 17947573
919 17947573 -6918438 -30623536 -35254734 -25588263 -15249623 -6931019 2294389 7339251
911 7339251 2544183 -2450700 9241632 36191042 54266918 43858057 13792790 -8485061
903 -8485061 -6930296 8609313 16768956 8384071 -6512739 -13129010 -8898497 -3425487
895 -3425487 -4027422 -7099515 -5546930 491306 5171568 6195360 6286926 5720332 654
886 654 -11743885 -20579424 -15493136 3252560 22707420 30211564 24978724 15821273 10858748
$$ packed form
944B564175j1293753j427384P960761r04723j5098741j0622504Q175118J5939126
936d707925O477759j848810N97534K826228k051172m837471k69689K333943k420002
927c899605n444399q22120L281481J774962L471088J2002101J2637801n053736
919A7947573k4866011k3705098m631198R666471J0338640Q318604R225408N044862
911G339251m795068m994883J1692332K6949410J8075876j0408861l0065267k2277851
903h485061J554765J5539609Q159643q384885j4896810o616271M230513N473010
895c425487o01935l072093J552585O038236M680262J023792R1566n66594n719678
886F54j1744539q835539N086288J8745696J9454860P504144n232840r157451m962525
$$ plain form
877 10858748 12165739 17475228 22303718 21396287 13287357 3818207 92978 537728 -2442046
868 -2442046 -8466294 -7076519 4849924 13066349 3797928 -14884892 -22588103 -14185245
860 -14185245 -3498648 -95088 1397904 5560400 6715312 3164077 5145660 16496464
852 16496464 21815164 7374611 -15519403 -25643455 -22599443 -22544183 -28009885 -25276907
844 -25276907 -12807718 -7708064 -15946099 -19073788 -4440414 11406597 8867420 -645077
836 -645077 8811125 35308037 49782109 39423084 24892923 26458663 34848643 29993263
828 29993263 12885998 830509 -454546 -1646839 -8846294 -14126044 -10164829 -2004744
820 -2004744 1474517 -353262 -2233050 -2156674 -2510361 -5100820 -9307029 -13045861 -12546865
$$ packed form
877A0858748J306991N309489M828490r07431q108930r469150l725229M44750k979774
868b442046o024248J389775J1926443Q216425r268421j8682820p703211Q402858
860a4185245J0686597L403560J492992M162496J154912l551235J981583J1350804
852A6496464N318700j4440553k2894014j0124052L044012N5260n465702K732978
844b5276907J2469189N099654q238035l127689J4633374J5847011k539177r512497
836f45077R456202K6496912J4474072j0359025j4530161J565740Q389980m855380
828B9993263j7107265j2055489j285055j192293p199455n279750L961215Q160085
820b004744L479261j827779j879788P6376l53687k590459m206209l738832M98996
$$ plain form
811 -12546865 -4143270 9655963 18390883 13568864 359170 -5981956 2085242 13599213
803 13599213 10077666 -13319324 -41034468 -52869110 -44204619 -27921083 -17568632 -13542366
795 -13542366 -8261513 -425259 2519888 -3989291 -13854631 -17060715 -10045025 3661756
787 3661756 18918131 30392968 31624058 19198124 -1562506 -19170069 -24955475 -17601002
779 -17601002 -1222307 16278117 24988202 20392991 9742260 4291918 4136503 -976834
771 -976834 -12908326 -17730266 -5376837 11654027 11704728 -7691234 -28457370 -38747231
763 -38747231 -45871206 -57056304 -61992560 -47508640 -21403262 -5982895 -8977978 -15129941
755 -15129941 -10131770 -348733 -782273 -12517342 -23422299 -27379254 -30689434 -37705565
$$ packed form
811a2546865Q403595J3799233Q734920m822019j3209694o341126Q067198J1513971
803A3599213l521547k3396990k7715144j1834642Q664491J6283536J0352451M026266
795a3542366N280853P836254K945147o509179r865340l206084P015690J3706781
787C661756J5256375J1474837J231090j2425934k0760630j7607563n785406P354473
779a7601002J6378695J7500424Q710085m595211j0650731n450342j55415n113337
771i76834j1931492m821940J2353429J7030864N0701j9395962k0766136j0289861
763c8747231p123975j1185098m936256J4483920K6105378J5420367k995083o151963
755a5129941M998171R783037m33540j1735069j0904957l956955l310180p016131
$$ plain form
747 -37705565 -40336358 -28243989 -4551006 15161572 18725646 8576739 -2422980 -3899989
739 -3899989 2796731 6743807 -448840 -14579579 -23874647 -24734741 -26923507 -38958016
731 -38958016 -53760300 -56427485 -43351915 -24659613 -8645431 5365541 16095262
724 16095262 13916204 -6242637 -32575243 -46377082 -41284549 -25399808 -8082491 6309045
716 6309045 13567982 9393825 -3283506 -14493395 -18553075 -20071291 -25592953 -33556499
708 -33556499 -35531177 -24660850 -1953532 21988848 31538608 18956568 -4618884 -17198144
700 -17198144 -8866660 8445745 17606295 15799078 11115794 6505799 -1947240 -12765981
692 -12765981 -16818093 -10751431 -4502254 -9977094 -26543688 -42121511 -45825663 -36069803
$$ packed form
747c7705565k630793J2092369K3692983J9712578L564074j0148907j0999719j477009
739c899989O696720L947076p192647j4130739r295068q60094k188766j2034509
731c8958016j4802284k667185J3075570J8692302J6014182J4010972J0729721
724A6095262k179058k0158841k6332606j3801839N092533J5884741J7317317J4391536
716F309045P258937m174157j2677331j1209889m059680j518216n521662p963546
708c3556499j974678J0870327K2707318K3942380R549760j2582040k3575452j2579260
700a7198144Q331484J7312405R160550j807217m683284m609995q453039j0818741
692a2765981m052112O066662O249177n474840j6566594j5577823l704152R755860
$$ plain form
684 -36069803 -18981824 -3409774 3101286 -2338768 -16098665 -29822564 -35484043 -30421098
676 -30421098 -18557718 -6200437 3683772 11418128 14850428 8568447 -7052450 -20603514
668 -20603514 -21171720 -13172584 -10328257 -14552497 -12215073 4134940 21888663 25337492
660 25337492 17436822 12598561 14199042 14005990 11264886 15526630 27686539 34124315
652 34124315 27056965 17354241 16933003 19448259 11531990 -4343442 -13214259 -10919509
644 -10919509 -9548746 -18554286 -32818073 -42821179 -46363684 -45569964 -40754298 -33030336
636 -33030336 -27114737 -26112163 -27116658 -25231830 -18251327 -5849803 9876804 20434807
628 20434807 14873040 -6474455 -27231509 -30181658 -14323733 7436588 23130967 28791170
$$ packed form
684c6069803J7087979J5572050O511060n440054j3759897j3723899n661479N062945
676c0421098J1863380J2357281R884209P734356L432300o281981j5620897j3551064
668b0603514n68206P999136K844327m224240K337424J6350013J7753723L448829
660B5337492p900670m838261J600481j93052k741104M261744J2159909O437776
652C4124315p067350r702724m21238K515256p916269j5875432q870817K294750
644a0919509J370763r005540j4263787j0003106l542505P93720M815666P723962
636c3030336N915599J002574j004495J884828O980503J2401524J5726607J0558003
628B0434807n561767k1347495k0757054k950149J5857925K1760321J5694379N660203
$$ plain form
620 28791170 25332200 16434457 8341319 5105045 3716576 -1750824 -11850198 -21215756
612 -21215756 -24514331 -19295836 -5989039 9945549 19101084 17665832 13153527 13741094
604 13741094 15209406 7963566 -4812669 -7976876 4525078 20633034 26704621 23146467
596 23146467 17737681 12899985 7691485 4521741 4237653 631590 -9622278 -16371210
588 -16371210 -7382056 12302809 25532035 27228264 28941511 36296007 37799238 25096317
580 25096317 10466113 9720051 16869708 13434480 -865577 -6275329 5325898 15771233
572 15771233 7355881 -10319043 -14153374 753939 17894620 23013791 16658574 5105167
564 5105167 -7133885 -14874118 -15045236 -14145409 -21427995 -32663168 -33343219 -21249224
$$ packed form
620B8791170l458970q897743q093138l236274j388469n467400j0099374r365558
612b1215756l298575N218495J3306797J5934588R155535j435252m512305N87567
604A3741094J468312p245840j2776235l164207J2501954J6107956O071587l558154
596B3146467n408786m837696n208500l169744k84088l606063j0253868o748932
588a6371210Q989154J9684865J3229226J696229J713247P354496J503231j2702921
580B5096317j4630204p46062P149657l435228j4300057n409752J1601227J0445335
572A5771233q415352j7674924l834331J4907313J7140681N119171o355217j1553407
564E105167j2239052p740233j71118Q99827p282586j1235173o80051J2093995
$$ plain form
556 -21249224 -11401860 -12166080 -11448867 2524033 19925775 23231949 12774218 2690582
548 2690582 -1845175 -6578824 -11149022 -7495641 4308047 13631130 14622306 11400175
540 11400175 7084561 864104 -2786393 3482409 14835442 15880554 2589401 -10865816
532 -10865816 -13439191 -11906841 -16003241 -21704399 -20325116 -14220060 -11569217 -12805508
524 -12805508 -13213334 -12683685 -11950255 -4889198 13098572 31943927 34099434 15497644
516 15497644 -8928620 -21288256 -16505918 -2672943 9036887 14466584 18475960 25348707
508 25348707 28772821 19227582 1818447 -5630514 2474526 10062147 4421687 -3275658
500 -3275658 2855254 15799315 16849259 7018901 4991348 15457350 21767188 13415951
$$ packed form
556b1249224R847364p64220P17213J3972900J7401742L306174j0457731j0083636
548B690582m535757m733649m570198L653381J1803688R323083R91176l222131
540A1400175m315614o220457l650497O268802J1353033J045112j3291153j3455217
532a0865816k573375J532350m096400n701158J379283O105056K650843j236291
524a2805508m07826N29649P33430P061057J7987770J8845355K155507j8601790
516A5497644k4426264j2359636M782338J3832975J1709830N429697M009376O872747
508B5348707L424114r545239j7409135p448961Q105040P587621n640460p697345
500c275658O130912J2944061J049944r830358k027553J0466002O309838q351237
$$ plain form
492 13415951 348142 -7040439 -13824613 -26332352 -36970339 -35513189 -25273612 -16859064
484 -16859064 -13653125 -13167812 -15465642 -20415708 -22703216 -19178930 -16009283 -19052815
476 -19052815 -21806147 -13584432 2565677 10684214 1509473 -16556518 -27604204 -23499885
468 -23499885 -7896104 9591917 20948822 25047663 27699396 34844611 44669901 47864172
460 47864172 36809697 14258946 -7718758 -18123056 -16657555 -12202194 -11889645 -14641397
452 -14641397 -16617256 -17852653 -18626009 -13920971 163023 16137975 20390967 9842027
444 9842027 -4508925 -12124478 -12996988 -11183918 -7303414 -1936188 1117004 288624 -1100939
435 -1100939 -1962317 -6336049 -14189287 -17106461 -10693228 -4770608 -11666071 -27980714
$$ packed form
492A3415951j3067809p388581o784174j2507739j0637987J457150J0239577Q414548
484a6859064L205939M85313k297830m950066k287508L524286L169647l043532
476a9052815k753332Q221715J6150109Q118537r174741j8065991j1047686M104319
468b3499885J5603781J7488021J1356905M098841K651733P145215R825290L194271
460D7864172j1054475k2550751k1977704j0404298J465501M455361L12549k751752
452a4641397j975859j235397p73356M705038J4083994J5974952M252992j0548940
444I842027j4350952p615553q72510J813070L880504N367226L053192q28380j389563
435a100939q61378m373732p853238k917174O413233N922620o895463j6314643
$$ plain form
427 -27980714 -37664354 -32302057 -19918422 -12858309 -14109773 -18272520 -21048795 -23273723
419 -23273723 -25944900 -24477914 -12107201 8885447 23757111 20010139 4074198 -5111781
411 -5111781 327572 9724690 12238339 11058468 12826587 13839626 7273020 -3206843
403 -3206843 -8289521 -6938833 -5155075 -4606948 -3097633 -3801034 -12888596 -27897356 -37799225
394 -37799225 -35653965 -24184720 -9257475 4868949 14322350 17078265 15773787 13201757
386 13201757 6829302 -5213469 -15446858 -13898538 -2894060 4749761 2994448 -1136164
378 -1136164 266919 6630912 13655403 18629541 18376795 10366612 -606283 -4394773
370 -4394773 1942838 9800380 10314469 3834018 -4423651 -11271276 -14818454 -13495402 -9600171
$$ packed form
427b7980714r683640N362297J2383635P060113j251464m162747k776275k224928
419b3273723k671177J466986J2370713K0992648J4871664l746972j5935941r185979
411e111781N439353R397118K513649j179871J768119J013039o566606j0479863
403c206843n082678J350688J783758N48127J509315p03401r087562j5008760r901869
394c7799225K145260J1469245J4927245J4126424R453401K755915j304478k572030
386A3201757o372455j2042771j0233389J548320J1004478P643821j755313m130612
378a136164J403083O363993P024491M974138k52746q010183j0972895l788490
370d394773O337611P857542N14089o480451q257669o847625l547178J323052L895231
$$ plain form
361 -9600171 -7913836 -7479260 -1150621 12747233 24620770 24286332 12355282 -3318840
353 -3318840 -17336246 -28024430 -33501006 -31912052 -23621796 -10577574 3634438 12292765
345 12292765 9812310 -18937 -5886696 -2193165 5014587 8008210 6564790 3592205
337 3592205 -995797 -6626765 -8907906 -6317216 -4469294 -7801288 -12715338 -15047291
329 -15047291 -17860209 -24187405 -28162288 -22662887 -11344680 -3717741 -1989156 -2323285
321 -2323285 -5345540 -14020448 -23159187 -23420685 -16162554 -12328457 -14673259 -13367847 -3478151
312 -3478151 5474574 5216479 3798984 13835939 31319002 38263912 26115456 6730025
304 6730025 -2681742 1205144 7731748 7340766 1687932 -1013604 3030536 9399413 11974151
$$ packed form
361i600171J686335M34576O328639J3897854J1873537l34438j1931050j5674122
353c318840j4017406j0688184n476576J588954Q290256J3044222J4212012Q658327
345A2292765k480455r831247n867759L693531P207752K993623j443420k972585
337C592205m588002n630968k281141K590690J847922l331994m914050k331953
329a5047291k812918o327196l974883N499401J1318207P626939J728585l34129
321b323285l022255q674908r138739k61498P258131L834097k344802J305412R889696
312c478151Q952725k58095j417495J0036955J7483063O944910j2148456j9385431
304F730025r411767L886886O526604l90982n652834k701536M044140O368877K574738
$$ plain form
295 11974151 10405806 8890441 8734245 5886565 -2472880 -11743660 -14028924 -8096550
287 -8096550 -1390561 -410134 -2532138 -1460341 1219232 -3345325 -16978455 -27115473
279 -27115473 -19787908 2770885 23491118 28205924 16479420 -3827997 -25227840 -42362165
271 -42362165 -51589046 -52123791 -44819926 -30304891 -12651381 -1838882 -3476205 -7569371
263 -7569371 -60270 13104033 9156734 -17554549 -41232794 -37300773 -15861223 -5018749
255 -5018749 -10531113 -13439195 -4147281 4019383 -963715 -11556648 -14724459 -9709130
247 -9709130 -3054444 2549462 5832517 2975330 -5374895 -10850388 -8778885 -5860125
239 -5860125 -9397541 -15871082 -17672734 -14803923 -12196017 -11084055 -10608562 -12592933 -16924417
$$ packed form
295A1974151j568345j515365j56196k847680q359445r270780k285264N932374
287h096550O705989R80427k122004J071797K679573m564557j3633130j0137018
279b7115473P327565K2558793K0720233M714806j1726504k0307417k1399843j7134325
271d2362165r226881n34745P303865J4515035J7653510J0812499j637323m093166
263g569371P509101J3164303l947299k6711283k3678245L932021K1439550J0842474
255e018749n512364k908082R291914Q166664m983098j0592933l167811N015329
247i709130O654686N603906L283055k857187q350225n475493K071503K918760
239e860125l537416o473541j801652K868811K607906J111962M75493j984371m331484
$$ plain form
230 -16924417 -17162071 -8906736 1617448 5267734 2437762 178554 1129830 3744681
222 3744681 9332777 18934416 25954843 22536004 12384393 7185527 10130629 12608836
214 12608836 8013483 -694276 -8748513 -15445882 -19581408 -18013008 -12631311 -10838938
206 -10838938 -14837159 -17738299 -14869859 -11535599 -13506279 -16290047 -11626009 -760280
198 -760280 6501013 4551660 -2503651 -7753654 -8776939 -7534135 -6842692 -8246714 -11366236
189 -11366236 -13983682 -12665053 -3891272 12751916 30030645 34931969 21335694 80711
181 80711 -10946316 -7656608 -2540514 -4576133 -6777722 67534 11240925 15810023
173 15810023 13215332 10015203 4980004 -8232318 -24571478 -28864394 -17316344 -4772194
$$ packed form
230a6924417k37654Q255335J0524184L650286k829972k259208R51276K614851
222C744681N588096R601639P020427l418839j0151611n198866K945102K478207
214A2608836m595353q707759q054237o697369m135526J568400N381697J792373
206a0838938l998221k901140K868440L334260j970680k783768M664038J0865729
198g60280P261293j949353p055311n250003j023285J242804O91443j404022l119522
189a1366236k617446J318629Q773781J6643188J7278729M901324j3596275k1254983
181H0711j1027027L289708N116094k035619k201589O845256J1173391M569098
173A5810023k594691l200129n035199j3212322j6339160m292916J1548050J2544150
$$ plain form
165 -4772194 -4013296 -8549146 -4665180 7517874 15297081 11292190 330413 -9928273
157 -9928273 -16615946 -19320676 -17002107 -9780632 -640435 5778555 4905214 -5127750
149 -5127750 -19356015 -26781678 -20363744 -5891722 3502241 1863937 -4485754 -6494013
141 -6494013 -2487589 2772354 5292153 5331253 5589143 8294105 13558256 19314895 22982144
132 22982144 23658132 22686493 22077662 22027882 19423373 9989040 -5700329 -19261708 -21888835
123 -21888835 -15396576 -10788496 -13896774 -18655580 -18488490 -17023479 -19944573 -22482177
115 -22482177 -16203266 -5421450 -4012040 -14440624 -21964952 -14412165 2007488 12546692
107 12546692 11452878 3021833 -7774095 -17533338 -21810157 -18389681 -11488508 -7109855
$$ packed form
165d772194P58898m535850L883966J2183054P779207m004891j0961777j0258686
157i928273o687673k704730K318569P221475R140197O418990q73341j0032964
149e127750j4228265p425663O417934J4472022R393963j638304o349691k008259
141f494013M006424N259943K519799L9100K57890K704962N264151N756639L667249
132B2982144O75988r71639o08831m9780k604509r434333j5689369j3561379k627127
123b1888835O492259M608080l108278m758806J67090J465011k921094k537604
115b2482177O278911J0781816J409410j0428584p524328P552787J6419653J0539204
107A2546692j093814q431045j0795928r759243m276819L420476O901173M378653
$$ plain form
99 -7109855 -6009750 -5323482 -4030499 -2469578 -37227 2075394 89514 -5246746 -5713502
90 -5713502 3411598 13927840 14237622 4606403 -5675116 -12590872 -18211138 -19847009
82 -19847009 -11765644 924084 3459203 -8408687 -20644582 -20075159 -11516608 -7426026
74 -7426026 -9021292 -8687038 -5766552 -7438220 -14724115 -18920032 -14454915 -6582568 -2480511
65 -2480511 -1763989 -881188 -1327041 -6709187 -14603338 -18804709 -19558341 -24243430 -35295961
56 -35295961 -43913363 -40998831 -29871359 -21406832 -19286890 -17894354 -13669497 -9146861
48 -9146861 -4215118 6574320 23317922 36390826 39170187 36899969 35364393 29623962
40 29623962 14694594 -588890 -4573332 -2413332 -8349204 -20598296 -22371223 -10128167
$$ packed form
99g109855J100105O86268J292983J560921K432351K112621j985880n336260m66756
90e713502R125100J0516242L09782r631219j0281519o915756n620266j635871
82a9847009Q081365J2689728K535119j1867890j2235895N69423Q558551M090582
74g426026j595266L34254K920486j671668p285895m195917M465117P872347M102057
65b480511P16522Q82801m45853n382146p894151m201371p53632m685089j1052531
56c5295961q617402K914532J1127472Q464527K119942J392536M224857M522636
48i146861M931743J0789438J6743602J3072904K779361k270218j535576n740431
40B9623962j4929368j5283484l984442K160000n935872j2249092j772927J2243056
$$ plain form
32 -10128167 -1744941 -8958029 -18718487 -13665631 2394260 13300889 14511557 12895207
24 12895207 9317015 -2050574 -18629529 -28264117 -25319532 -17309287 -12739577 -10510226
16 -10510226 -4334746 8090070 22643703 31907900 30513545 20708568 11593423 9593197
8 9593197 11836438 12097968 9160237 4643332 -2258298 -11041620 -15846787 -13664343
0 -13664343
$$ packed form
32a0128167Q383226p213088r760458N052856J6059891J0906629J210668j616350
24A2895207l578192j1367589j6578955r634588K944585Q010245M569710K229351
16a0510226O175480J2424816J4553633R264197j394355r804977r115145k000226
8I593197K243241K61530k937731m516905o901630q783322m805167K182444
0a3664343
$$ Imaginary data points
##PAGE= N=2
##DATA TABLE= (X++(I..I)), XYDATA
$$ plain form
65535 -9575190 -14714102 -11113976 5104112 21010229 24990398 21951299 22363946 25816149
65527 25816149 25849572 23569028 24417748 25999146 21214454 11568475 6141995 7495565
65519 7495565 8660883 4904000 -1013837 -6912171 -14878306 -23104745 -22770104 -9619031
65511 -9619031 6843094 12824864 6361463 -2258432 -4855847 -3339926 -1962770 1511947
65503 1511947 10914146 21191203 21247513 9236707 -2358326 -2351756 3998639 3192802 -6948341
65494 -6948341 -15955704 -17953989 -18725879 -22869084 -25165666 -20926569 -15691586 -16645318
65486 -16645318 -21344886 -23119622 -21669838 -19922518 -16221345 -9212134 -5103577 -8731230
65478 -8731230 -11581310 -2220478 12886548 14150885 -2719493 -17594751 -12457252 4494603
$$ packed form
65535i575190n138912L600126J6218088J5906117L980169l039099M12647L452203
65527B5816149L3423k280544Q48720J581398m784692r645979n426480J353570
65519G495565J165318l756883n917837n898334p966135q226439L34641J3151073
65511i619031J6462125N981770o463401q619895k597415J515921J377156L474717
65503A511947R402199J0277057N6310j2010806j1595033O570O350395q05837j0141143
65494f948341r007363j998285p71890m143205k296582M239097N234983r53732
65486a6645318m699568j774736J449784J747320L701173P009211M108557l627653
65478h731230k850080R360832J5107026J264337j6870378j4875258N137499J6951855
$$ plain form
65470 4494603 11343492 1500215 -11009922 -12344864 -4577743 640228 -2964193 -11135193
65462 -11135193 -16005881 -15130344 -12935466 -13606231 -14741231 -11168875 -4166218 -1634272
65454 -1634272 -7080886 -13383644 -12052896 -5701271 -5345184 -15173955 -25409001 -23508483
65446 -23508483 -9742328 2804868 3980116 -2017059 -3992184 718047 3908854 -764392
65438 -764392 -9724415 -16778692 -21748070 -26453056 -27632116 -21553135 -12746077 -10105440
65430 -10105440 -15257698 -22012598 -26422355 -29212231 -28179127 -17877121 -354906 11914173
65422 11914173 9391156 -3212408 -13550079 -15502745 -12279524 -9162844 -7528092 -4647334
65414 -4647334 2705936 13148937 19711330 17623876 11772752 9896218 8977832 -1946961
$$ packed form
65470D494603O848889r843277j2510137j334942P767121N217971l604421q171000
65462a1135193m870688Q75537K194878o70765j135000L572356P002657K531946
65454a634272n446614o302758J330748O351625L56087r828771j0235046J900518
65446b3508483J3766155J2547196J175248n997175j975125M710231L190807m673246
65438g64392q960023p054277m969378m704986j179060O078981Q807058K640637
65430a0105440n152258o754900m409757k789876J033104J0302006J7522215J2269079
65422A1914173k523017j2603564j0337671j952666L223221L116680J634752K880758
65414d647334P353270J0443001O562393k087454n851124j876534r18386j0924793
$$ plain form
65406 -1946961 -22874484 -37528816 -33568580 -18948053 -9427550 -7572892 -5064805 -187081
65398 -187081 51635 -6276832 -12174168 -12889705 -11117223 -9513924 -7228488 -5876845 -9669764
65389 -9669764 -16214440 -16118046 -6824591 925616 -3062566 -14106185 -19332064 -14661717
65381 -14661717 -7744715 -5819860 -7345049 -5949300 1662105 12066188 17092814 11056644
65373 11056644 -1460378 -8060530 -2690743 6023133 6221809 -674741 -3151994 2044580
65365 2044580 5303382 549738 -4388109 -680171 6884685 8203471 5143204 8252618
65357 8252618 17800208 21038221 11292028 -1487693 -5015778 -511450 2989887 2959335
65349 2959335 3451427 5723018 7365253 7571854 5414654 -3675842 -20708278 -35181419
$$ packed form
65406a946961k0927523j4654332L960236J4620527R520503J854658K508087M877724
65398a87081K38716o328467n897336p15537J772482J603299K285436J351643l792919
65389i669764o544676R6394R293455P750207l988182j1043619n225879M670347
65381a4661717O917002J924855j525189J395749P611405J0404083N026626o036170
65373A1056644j2517022o600152N369787Q713876J98676o896550k477253N196574
65365B044580L258802m753644m937847L707938P564856J318786l060267L109414
65357H252618R547590L238013r746193j2779721l528085M504328L501337l0552
65349B959335M92092K271591J642235K06601k157200r090496j7032436j4473141
$$ plain form
65341 -35181419 -34954274 -23560947 -16982445 -21999128 -28425248 -25612152 -16039183 -7730375
65333 -7730375 -2834842 -147131 -1025807 -5877763 -10994404 -14813214 -20863909 -28800263
65325 -28800263 -30324986 -21754332 -13248678 -15969175 -25803174 -29873924 -24273470 -14625629
65317 -14625629 -3560023 9657603 19157530 15697611 1235392 -11149716 -14029453
65310 -14029453 -12111225 -10045556 -4812195 5530454 15179625 18260943 16088048 12371183
65302 12371183 7834492 3400358 1910020 2836245 1989708 -163639 2335252 9507189
65294 9507189 12078301 5444675 -1889917 -1663677 831695 -2824464 -7322448 -555638
65286 -555638 15097899 22133994 10851041 -8007535 -18042189 -16238833 -11215212 -8333310
$$ packed form
65341c5181419K27145J1393327O578502n016683o426120K813096R572969Q308808
65333g730375M895533K687711q78676m851956n116641l818810o050695p936354
65325b8800263j524723Q570654Q505654k720497r833999m070750N600454R647841
65317a4625629J1065606J3217626R499927l459919j4462219j2385108k879737
65310a4029453J918228K065669N233361J0342649R649171L081318k172895l716865
65302A2371183m536691m434134j490338R26225q46537k153347K498891P171937
65294I507189K571112o633626p334592K26240K495372l656159m497984O766810
65286e55638J5653537P036095j1282953j8858576j0034654J803356N023621K881902
$$ plain form
65278 -8333310 -4448339 3579103 11915698 14597413 12619658 13560825 20770952 26691878
65270 26691878 21393805 6408565 -5535408 -5627974 1243379 3979966 -1944550 -11851355
65262 -11851355 -18133219 -16689729 -10745576 -9751724 -19456604 -31627538 -30940071 -15348881
65254 -15348881 -831454 254116 -3641225 2547647 16763842 23478166 17345605 9146673
65246 9146673 8006519 10794013 11991040 12442096 13461485 11807292 6344536 2381832
65238 2381832 3782250 6614526 5510373 955384 -4147772 -9520063 -14014331 -12286155
65230 -12286155 -1079707 14443968 25970307 31088506 32686081 32134940 28086160 20571525
65222 20571525 12137163 5506509 2432927 3170713 5012741 3741568 -1118157 -4861770
$$ packed form
65278h333310L884971Q027442Q336595K681715j977755R41167P210127N920926
65270B6691878n298073j4985240j1943973r2566O871353K736587n924516r906805
65262a1851355o281864J443490N944153R93852r704880j2170934O87467J5591190
65254a5348881J4517427J085570l895341O188872J4216195O714324o132561q198932
65246I146673j140154K787494J197027M51056J019389j654193n462756l962704
65238B381832J400418K832276j104153m554989n103156n372291m494268J728176
65230a2286155J1206448J5523675J1526339N118199J597575n51141m048780p514635
65222B0571525q434362o630654l073582P37786J842028j271173m859725l743613
$$ plain form
65214 -4861770 -3565733 991881 4156367 3283508 -1509315 -7593354 -9408589 -2901906
65206 -2901906 7329568 11282573 7367319 6373904 16575433 31642746 40327012 41660728
65198 41660728 41298496 38171426 26918346 11785327 5358028 11212051 18364110 16746860
65190 16746860 9274086 3892884 1692414 -660140 -2318813 764363 8685686 16791704
65182 16791704 21023317 20738360 17542153 14148845 13604694 17686130 25938779 35512892
65174 35512892 40475339 33948534 16143254 -686633 -2154111 11912962 27125614
65167 27125614 31987521 28368432 22032460 12251464 -2035251 -13373304 -13339871 -5323942
65159 -5323942 83780 800659 4420616 13353065 19005234 14574735 5576337 1834640
$$ packed form
65214d861770J296037M557614L164486q72859m792823o084039j815235O506683
65206b901906J0231474L953005l915254r93415J0201529J5067313Q684266J333716
65198D1660728l62232l127070j1253080j5133019o427299N854023P152059j617250
65190A6746860p472774n381202k200470k352554j658673L083176P921323Q106018
65182A6791704M231613k84957l196207l393308n44151M081436Q252649R574113
65174C5512892M962447o526805j7805280j6829887j467478J4067073J5212652
65167B7125614M861907l619089o335972r780996j4286715j1338053L3433Q015929
65159e323942N407722P16879L619957Q932449N652169m430499q998398l741697
$$ plain form
65151 1834640 4296183 6313714 5298162 6180176 12518510 19408205 18673194 9209459
65143 9209459 -1435829 -6118021 -5344636 -3352239 -335676 6389734 14988200 19745628
65135 19745628 20291159 22916382 29307856 31410271 23491381 12674724 9203895 11285011
65127 11285011 9335298 1768021 -4471264 -7206218 -10562014 -13003946 -7375368 3751086
65119 3751086 6501230 -3378047 -10157389 1082010 22466123 33809728 28853071 19065339
65111 19065339 15130406 16734814 19575855 21359570 19830831 13861819 7858749 7657173
65103 7657173 11511423 12512849 9844892 9097790 10854422 8825255 2038419 -1104343
65095 -1104343 3713670 7777617 1293927 -11622550 -18024714 -13108726 -4757385 -2146220
$$ packed form
65151A834640K461543K017531j015552Q82014O338334O889695p35011r463735
65143I209459j0645288m682192P73385J992397L016563O725410Q598466M757428
65135A9745628N45531K625223O391474K102415p918890j0816657l470829K081116
65127A1285011j949713p567277o239285k734954l355796k441932N628578J1126454
65119C751086K750144r879277o779342J1239399K1384113J1343605m956657r787732
65111A9065339l934933J604408K841041J783715j528739n969012o003070k01576
65103G657173L854250J001426k667957p47102J756632k029167o786836l142762
65095a104343M818013M063947o483690j2916477o402164M915988Q351341K611165
$$ plain form
65087 -2146220 -5824257 -9537519 -7668531 175273 9620544 15668912 16864447 15040481
65079 15040481 11592380 6245577 -649518 -7689726 -14580649 -21314263 -24951615 -21540753
65071 -21540753 -12123524 -2304090 5017290 11093919 14679049 11504382 3564642 556138
65063 556138 5751802 7666234 -5379362 -27070736 -39148442 -33419868 -18413132 -5009131
65055 -5009131 4420320 10424073 9469753 -1194159 -16021099 -24411485 -21304094 -11935178
65047 -11935178 -5493236 -4767837 -3483033 4554670 15705701 21196749 21219549 25566370
65039 25566370 36443415 40911108 29629687 14435908 13398264 23137397 22573817 4563939
65031 4563939 -12965205 -12586121 667786 10971433 12760816 9882591 4146177 -2882744
$$ packed form
65087b146220l678037l713262J868988P843804R445271O048368J195535j823966
65079A5040481l448101n346803o895095p040208o890923o733614l637352L410862
65071b1540753R417229R819434P321380O076629L585130l174667p939740l008504
65063E56138N195664J914432j3045596k1691374j2077706N728574J5006736J3404001
65055e009131R429451O003753r54320j0663912j4826940q390386L107391R368916
65047a1935178O441942P25399J284804Q037703J1151031N491048K2800M346821
65039B5566370J0877045M467693j1281421j5193779j037644R739133n63580j8009878
65031D563939j7529144L79084J3253907J0303647J789383k878225n736414p028921
$$ plain form
65023 -2882744 -3958063 4729262 12844003 7573906 -6056655 -10250229 -713122 6129069
65015 6129069 -2292048 -14739885 -10820444 10966160 31217090 34702181 27191419 23526864
65007 23526864 26652675 26697141 18591112 10977198 13516881 21997968 23401485 12954712
64999 12954712 -1438010 -10772380 -12841143 -7989739 3784721 17659944 23955639 19194804
64991 19194804 11381845 8483002 7149074 -454832 -13331974 -22719045 -23371151 -16985338
64983 -16985338 -7500049 84907 -161885 -7595183 -10317333 2101552 22068404 30350309
64975 30350309 19877970 3081736 -6540820 -9117626 -9686568 -5699606 6880146 21166874
64967 21166874 24381395 14772221 4758742 5190144 13067006 18742619 20407348 24396265
$$ packed form
65023b882744j075319Q687325Q114741n270097j3630561m193574R537107O842191
65015F129069q421117j2447837L919441K1786604K0250930L485091p510762l664555
65007B3526864L125811M4466q106029p613914K539683Q481087J403517j0446773
64999A2954712j4392722r334370k068763M851404J1774460J3875223O295695m760835
64991A9194804p812959k898843j333928p603906j2877142r387071o52106O385813
64983a6985338R485289P584956k46792p433298k722150J2418885J9966852Q281905
64975C0350309j0472339j6796234r622556k576806n68942L986962J2579752J4286728
64967B1166874L214521r609174j0013479M31402P876862N675613J664729L988917
$$ plain form
64959 24396265 31316220 29993903 11815089 -12959927 -23198824 -12366642 4228171
64952 4228171 12228936 17069751 30058075 45373715 47016477 35028059 27007676 31222939
64944 31222939 34886875 26021841 12675190 9885552 17612032 23048611 18681399 7828879
64936 7828879 -3654819 -12422830 -17218824 -19850362 -23027750 -22737085 -9892011 13637894
64928 13637894 29440863 23825833 7455703 525568 4035432 2138088 -9256043 -15325671
64920 -15325671 -7828800 -15349 -6232587 -19519021 -21660081 -7679033 11245573 24174542
64912 24174542 28486979 24304910 12264156 -1695456 -7844798 -2576864 7576809 13906552
64904 13906552 14062921 11247957 8517755 6635989 5811335 6689183 9187916 11656843
$$ packed form
64959B4396265O919955j322317j8178814k4775016j0238897J0832182J6594813
64952D228171Q000765M840815J2988324J5315640J642762j1988418q020383M215263
64944C1222939L663936q865034j3346651k789638P726480N436579m367212j0852520
64936G828879j1483698q768011m795994k631538l177388K90665J2845074K3529905
64928A3637894J5802969n615030j6370130o930135L509864j897344j1394131o069628
64920a5325671P496871P813451o217238j3286434k141060J3981048J8924606J2928969
64912B4174542M312437m182069j2040754j3959612o149342N267934J0153673O329743
64904A3906552J56369k814964k730202j881766q24654Q77848K498733K468927
$$ plain form
64896 11656843 12167548 10414907 7398320 3378096 -1829132 -5678177 -3117279 6773238
64888 6773238 16575139 17629402 10506449 3429486 738976 -699366 -2623531 -714653
64880 -714653 6929285 13405805 11841363 6171160 5436928 9907529 11395478 7176777
64872 7176777 4730809 9736001 17047758 19276106 18992104 24598525 35666588 40668095
64864 40668095 32110874 17738947 10795837 12086902 9393340 -3969806 -17560857 -16577384
64856 -16577384 -1563279 12870522 17617428 17743640 19305575 17856423 7948354 -3218960
64848 -3218960 -3261589 6367020 10731190 2820406 -6592829 -6153584 -1050008 -3211659 -11173803
64839 -11173803 -12838725 -6652623 -5447920 -14444409 -18422410 -1672569 27159600 43807852
$$ packed form
64896A1656843N10705j752641l016587m020224n207228l849045K560898R890517
64888F773238R801901J054263p122953p076963k690510j438342j924165J908878
64880g14653P643938O476520j564442n670203p34232M470601J487949m218701
64872G176777k445968N005192P311757K228348k84002N606421J1068063N001507
64864D0668095q557221j4371927o943110J291065k693562j3363146j3591051R83473
64856a6577384J5014105J4433801M746906J26212J561935j449152r908069j1167314
64848c218960m2629R628609M364170p910784r413235M39245N103576k161651p962144
64839a1173803j664922O186102J204703q996489l978001J6749841K8832169J6648252
$$ plain form
64831 43807852 39502113 29224030 26741522 25736960 13974585 -5131593 -17913510
$$ packed form
64831D3807852m305739j0278083k482508j004562j1762375j9106178j2781917
$$ [...]
##END NTUPLES=NMR SPECTRUM
##END=
