##TITLE=31Pdec_BAU-2908M
 CDCl3, 72 sc
 29.8.2019
##JCAMPDX= 6.0         $$ Bruker NMR JCAMP-DX V2.0
##DATA TYPE= NMR SPECTRUM
##DATA CLASS= NTUPLES
##ORIGIN= UXNMR, Bruker Analytische Messtechnik GmbH
##OWNER= root
$$ XWIN-NMR		Version 3.5
$$ Thu Aug 29 14:19:34 2019 Russian Standard Time (UT+4h)  she@DPX200
##.OBSERVE FREQUENCY= 81.013821
##.OBSERVE NUCLEUS= ^31P
##.ACQUISITION MODE= SIMULTANEOUS
##.ACQUISITION SCHEME= undefined
##.AVERAGES= 72
##.DIGITISER RES= 17
##SPECTROMETER/DATA SYSTEM= spect
##.PULSE SEQUENCE= zgpg30
##.SOLVENT NAME= CDCl3
##.SHIFT REFERENCE= (INTERNAL, CDCl3, 0, 182.463)
##AUDIT TRAIL= $$ (NUMBER, WHEN, WHO, WHERE, WHAT)
$$ ##TITLE= Audit trail, XWIN-NMR		Version 3.5
$$ ##JCAMPDX= 5.01
$$ ##ORIGIN= Bruker BioSpin GmbH
$$ ##OWNER= she
$$ F:/spectra/data/she/nmr/P31/1/pdata/1/auditp.txt
$$ ##AUDIT TRAIL=  $$ (NUMBER, WHEN, WHO, WHERE, WHAT)
(   1,<2019-08-29 14:18:07.98 +0400>,<she>,<DPX200>,
      <continue with go, POWCHK disabled, PULCHK disabled
       configuration hash MD5:
       00 E9 B6 7A A2 85 ED C7 34 08 36 98 17 FE 4E 26
       data hash MD5: 32K
       69 72 D5 12 D3 E5 87 B4 99 24 D3 ED 89 CC D6 18>)
(   2,<2019-08-29 14:18:34.62 +0400>,<she>,<DPX200>,
      <Start of raw data processing
       efp BC_mod = 2 LB = 1 FT_mod = 6 PKNL = 1 PHC0 = -376.4296 PHC1 = 105.2003 SI = 64K 
       data hash MD5: 64K
       1B E2 64 3B A4 9F D8 FC CD F2 AB CE A1 BC DD 14>)
(   3,<2019-08-29 14:19:02.62 +0400>,<she>,<DPX200>,
      <pk PHC0 = -120.0058 PHC1 = 263 
       data hash MD5: 64K
       DD DD C3 B0 0A EC 5E A7 87 56 F6 58 35 CC A0 E8>)
(   4,<2019-08-29 14:19:06.68 +0400>,<she>,<DPX200>,
      <abs ABSG = 5 
       data hash MD5: 64K
       B7 56 4F 0A 25 BE C8 09 B8 4B A0 2F EA 41 1C 18>)
$$ ##END=
$$ 
$$ hash MD5
$$ DC 3B 21 F9 28 F1 A2 59 FE 63 AC EE 89 5C BE 2C
##$RELAX= 
##$RELAX= 
##$RELAX= 
##$RELAX= 
##$RELAX= 
##$RELAX= 
##$RELAX= 
##$RELAX= 
$$ Bruker specific parameters
$$ --------------------------
##$DU= <F:/spectra>
##$EXPNO= 1
##$NAME= <P31>
##$PROCNO= 1
##$TYPE= <nmr>
##$USER= <she>
##$AMP= (0..31)
100 100 100 100 100 100 100 100 100 100 100 100 100 100 100 100 100 100 
100 100 100 100 100 100 100 100 100 100 100 100 100 100 
##$AQSEQ= 0
##$AQ_mod= 1
##$AUNM= <au_zg>
##$AUTOPOS= <>
##$BF1= 81.014009
##$BF2= 200.13
##$BF3= 200.13
##$BF4= 200.13
##$BF5= 200.13
##$BF6= 200.13
##$BF7= 200.13
##$BF8= 200.13
##$BYTORDA= 1
##$CFDGTYP= 0
##$CFRGTYP= 5
##$CHEMSTR= <none>
##$CNST= (0..31)
1 1 145 1 1 1 1 1 1 1 1 1 1 1 1 1 1 1 1 1 1 1 1 1 1 1 1 1 1 1 1 1 
##$CPDPRG= <waltz16>
##$CPDPRG1= <>
##$CPDPRG2= <waltz16>
##$CPDPRG3= <>
##$CPDPRG4= <mlev>
##$CPDPRG5= <mlev>
##$CPDPRG6= <mlev>
##$CPDPRG7= <mlev>
##$CPDPRG8= <mlev>
##$CPDPRGB= <>
##$CPDPRGT= <>
##$D= (0..31)
0 1 0 0 0 0 0 0 0 0 0 0.03 2e-05 3e-06 0 0 0 0 0 0 0 0 0 0 0 0 0 0 0 0 
0 0 
##$DATE= 1567073786
##$DBL= (0..7)
120 120 120 11 120 120 24 19 
##$DBP= (0..7)
150 150 150 150 150 150 150 150 
##$DBP07= 0
##$DBPNAM0= <>
##$DBPNAM1= <>
##$DBPNAM2= <>
$$ [...]
##$SUBNAM3= <"">
##$SUBNAM4= <"">
##$SUBNAM5= <"">
##$SUBNAM6= <"">
##$SUBNAM7= <"">
##$SUBNAM8= <"">
##$SUBNAM9= <"">
##$SW= 369.568048894756
##$SWIBOX= (0..15)
0 1 3 0 0 0 0 0 0 0 0 0 0 0 0 0 
##$SW_h= 29940.119760479
##$TD= 32768
##$TD0= 1
##$TE= 0
##$TE2= 300
##$TE3= 300
##$TEG= 300
##$TL= (0..7)
0 120 53 12 22 120 120 120 
##$TP= (0..7)
150 150 150 150 150 150 150 150 
##$TP07= 0
##$TPNAME0= <>
##$TPNAME1= <>
##$TPNAME2= <>
##$TPNAME3= <>
##$TPNAME4= <>
##$TPNAME5= <>
##$TPNAME6= <>
##$TPNAME7= <>
##$TPOAL= (0..7)
0.5 0.5 0.5 0.5 0.5 0.5 0.5 0.5 
##$TPOFFS= (0..7)
0 0 0 0 0 0 0 0 
##$TUNHIN= 0
##$TUNHOUT= 0
##$TUNXOUT= 0
##$USERA1= <user>
##$USERA2= <user>
##$USERA3= <user>
##$USERA4= <user>
##$USERA5= <user>
##$V9= 5
##$VALIST= <valist>
##$VCLIST= <CCCCCCCCCCCCCCC>
##$VD= 0
##$VDLIST= <DDDDDDDDDDDDDDD>
##$VPLIST= <PPPPPPPPPPPPPPP>
##$VTLIST= <TTTTTTTTTTTTTTT>
##$WBST= 1024
##$WBSW= 4
##$XGAIN= (0..3)
0 0 0 0 
##$XL= 0
##$YL= 0
##$YMAX_a= 7566
##$YMIN_a= -14697
##$ZGOPTNS= <>
##$ZL1= 120
##$ZL2= 120
##$ZL3= 120
##$ZL4= 120
##$ABSF1= 182.463
##$ABSF2= -187.1042
##$ABSG= 5
##$ABSL= 3
##$ALPHA= 0
##$AQORDER= 0
##$ASSFAC= 0
##$ASSFACI= 0
##$ASSFACX= 0
##$ASSWID= 0
##$AUNMP= <proc_1d>
##$AZFE= 0.1
##$AZFW= 0.5
##$BCFW= 0
##$BC_mod= 2
##$BYTORDP= 0
##$COROFFS= 0
##$CY= -3
##$DATMOD= 1
##$DC= 0
##$DFILT= <>
##$DTYPP= 0
##$F1P= 0
##$F2P= 0
##$FCOR= 1
##$FTSIZE= 65536
##$FT_mod= 6
##$GAMMA= 0
##$GB= 0
##$INTBC= 1
##$INTSCL= 5.30512e-09
##$ISEN= 30
##$LB= 1
##$LEV0= 0
##$LPBIN= 0
##$MAXI= 10000
##$MC2= 0
##$MEAN= 0
##$ME_mod= 0
##$MI= 50
##$NCOEF= 0
##$NC_proc= -7
##$NLEV= 6
##$NOISF1= 182.463
##$NOISF2= 159.3651
##$NSP= 0
##$NTH_PI= 0
##$NZP= 0
##$OFFSET= 182.463
##$PC= 4
##$PHC0= -496.4354
##$PHC1= 368.2003
##$PH_mod= 1
##$PKNL= yes
##$PPARMOD= 0
##$PSCAL= 0
##$PSIGN= 0
##$REVERSE= no
##$SF= 81.0140089999434
##$SI= 65536
##$SIGF1= 159.3651
##$SIGF2= -187.1042
##$SINO= 113.3802
##$SIOLD= 16384
##$SREGLST= <1H.CDCl3>
##$SSB= 0
##$STSI= 65536
##$STSR= 0
##$SW_p= 29940.119760479
##$SYMM= 0
##$S_DEV= 0
##$TDeff= 32768
##$TDoff= 0
##$TI= <>
##$TILT= no
##$TM1= 0
##$TM2= 0
##$TOPLEV= 0
##$USERP1= <user>
##$USERP2= <user>
##$USERP3= <user>
##$USERP4= <user>
##$USERP5= <user>
##$WDW= 1
##$XDIM= 65536
##$YMAX_p= 493325634
##$YMIN_p= -32509393
$$ End of Bruker specific parameters
$$ ---------------------------------
##NTUPLES= NMR SPECTRUM
##VAR_NAME=  FREQUENCY,     SPECTRUM/REAL,   SPECTRUM/IMAG
##SYMBOL=    X,             R,               I
##VAR_TYPE=  INDEPENDENT,   DEPENDENT,       DEPENDENT
##VAR_FORM=  AFFN,          ASDF,            ASDF
##VAR_DIM=   65536,         65536,           65536
##UNITS=     HZ,            ARBITRARY UNITS, ARBITRARY UNITS
##FACTOR=    0.456856943014862, 1,           1
##FIRST=     14782.0589164792, 0,            0
##LAST=      -15158.0608439998, 0,           0
##MIN=       -15158.0608439998, -32509393,   0
##MAX=       14782.0589164792, 493325634,    0
$$ Real data points
##PAGE= N=1
##DATA TABLE= (X++(R..R)), XYDATA
$$ [...]
40743h616913N30142r7459l23653l51593J40503J607668L341105L756445K329304
40734B315549J26272j960168l816043m160054n76518O154036J0075370O250648
40726A4409092j993954o119589k799140K588104L610613J51308l340139l671290
40718B835005j035976K234922L317236J167829j797932k272923o72298l91077
40710C384786k065697k309917N61371L419648K952261m0605l001873m774943m414959
40701f289928q73276L624244M228326N75016j457782J079513K595697k015117
40693A466693p868685p001487r22189K348327J344681J682351M257350L362698
40685a330261j645026l075712K394886O813201K979992l950948m537148O09416
$$ plain form
40743 -8616913 -8086771 -8184230 -8507883 -8859476 -8718973 -7111305 -3770200 -13755 2315549
40734 2315549 2441821 481653 -3334390 -7494444 -8070962 -1916926 8158444 14409092
40726 14409092 12415138 6295549 3496409 6084513 9695126 9846434 6506295 2835005
40718 2835005 1799029 4033951 7351187 8519016 6721084 4448161 3775863 3384786
40710 3384786 1319089 -990828 -429457 2990191 5942452 5901847 2899974 -1874969 -6289928
40701 -6289928 -7163204 -3538960 689366 1264382 -193400 886113 3481810 1466693
40693 1466693 -6401992 -13403479 -14325668 -11977341 -10632660 -8950309 -4692959 -1330261
40685 -1330261 -2975287 -6050999 -3656113 3157088 6137080 2186132 -2351016 -1741600
40677a741600L047143J12834k331476l07562K860296L093793J403498M75024j77992
40668F433958k362550n098909n501250k771335R58096L499806M637562M958184
40660D753562L985578Q90505k953487l931074m02727L994093L833016j176457
40652H993009n480048m820564j304716M71608k02047n04039P39387J567045N56576
40643A6211o84305K48896L020052M277686J183510m757773q283476o085220j141058
40634a2205477R75907m34747r61600J381741L025779J287116q30187j3172J377935
40625f396705j68234k081197O12989O066301P019915J554905m209098n477831
40617c078955m459428m152585k583024K380704P039664O155475Q92896k560388
$$ plain form
40677 -1741600 1305543 1418377 -913099 -1220661 1639635 4733428 6136926 6611950 6433958
40668 6433958 4071408 -1027501 -6528751 -9300086 -8341990 -4842184 -204622 4753562
40660 4753562 8739140 9629645 6676158 2745084 2342357 6336450 10169466 8993009
40652 8993009 3512961 -1307603 -2612319 -2140711 -2342758 -2846797 -2107410 -540365 16211
40643 16211 -668094 -419198 2600854 6878540 8062050 3304277 -4979199 -11064419 -12205477
40634 -12205477 -11229570 -11664317 -12625917 -11244176 -8218397 -6931281 -7761468 -7774640 -6396705
40625 -6396705 -6564939 -8646136 -8033147 -1966846 5053069 6607974 2398876 -3078955
40617 -3078955 -7538383 -11690968 -14273992 -11893288 -4853624 1301851 2194747 -365641
40609c65641j390703J163171J510164L25804M19803K489195M468774M092860J177622
40600A3891049k374181m464857m523227l292520j649594m92391q40082k307064
40592f052867k356543L75374K767723R40134k756988j448631N851825J0834613
40584H154640O727593j871854n320355k032288J044333l23395k750047k362184
40576A266443o21024l76240o93022R28578L884804N083281K805206j958177o646487
40567C673362q317605n481252j85473L351798L409296K297833K228747K126391
40559C103097L65880j744674j874695m15544M39045K60236L77954J071545J330677
40550B913521R05774J59562j592067m860201p342445n615733j17437M329234M126776
$$ plain form
40609 -365641 -1756344 -593173 916991 1242795 1662598 4151793 8620567 12713427 13891049
40600 13891049 11516868 7052011 2528784 -763736 -2413330 -2905721 -3745803 -6052867
40592 -6052867 -8409410 -8034036 -5266313 -4326179 -7083167 -8531798 -2679973 8154640
40584 8154640 14882233 13010379 7690024 5657736 6702069 6378674 3628627 1266443
40576 1266443 645419 269179 -423843 504735 4389539 9472820 12278026 10319849 3673362
40567 3673362 -4644243 -10125495 -10310968 -6959170 -3549874 -1252041 976706 3103097
40559 3103097 3468977 1724303 -150392 -565936 -126891 133345 511299 1582844 2913521
40550 2913521 3819295 3978857 2386790 -2473411 -9815856 -15431589 -15549026 -11219792 -7093016
40541g093016P81756k033610l015147l020526k224565j4850K889252M370743L213467
40532f146496L51434k149627k592891n62816K629875M631972M100674J982010
40524B244135J66871o18440p85808m83970M22433J316351J256447M57945k6259
40515C949705j66419r25196j994683j327170J944749N356105N351160J301369
40507A3489620l701976n949179m578214k250912k435987n359331o937583l255508
40499b0979070L874490Q094234O088544J479422m83544N92977J781044K322704
40491B770801L518016M489862K738220j029400k963901j740115k36285n90432
40483F956766j493909j625675j713508j633523K07827K654190J790540k139498
$$ plain form
40541 -7093016 -6311260 -8344870 -11360017 -14380543 -16605108 -16619958 -13730706 -9359963 -6146496
40532 -6146496 -5795062 -7944689 -10537580 -11100396 -8470521 -3838549 262125 2244135
40524 2244135 2411006 1792566 1006758 522788 945221 2261572 3518019 3975964 3949705
40515 3949705 3783286 2858090 863407 -463763 1480986 6837091 12188251 13489620
40507 13489620 9787644 3838465 -739749 -2990661 -5426648 -10785979 -17723562 -20979070
40499 -20979070 -17104580 -9010346 -2921802 -1442380 -1925924 -1332947 448097 2770801
40491 2770801 6288817 10778679 13516899 12487499 9523598 7783483 7547198 6956766
40483 6956766 5462857 3837182 2123674 490151 697978 3352168 5142708 3003210
40475C003210l153441J142117M221788M22719n058465l715155K410259L765945
40467C038977j278835m125289j94635M247511L056026l64707K16240M090081O239960
40458A4925329N127524K599783l50123l050079l605638k022562j506903k837964
40450I279367j719729L518155O351586R07013p290377p596721K74152N552602
40442I276048J837653m696508n218806j997L852559K443813j448268l284194j985661
40433G74639j07961O1170j70025K200969O369741P161405K310411k873136k160607
40424A3566606K775561N237606L383487J329053J206744O41470j283407j910278
40416B4946842n47698l74214k483273l149561K23021M747312O243765M017225
$$ plain form
40475 3003210 -150231 991886 5213674 5636393 577928 -3137227 -726968 3038977
40467 3038977 1760142 -2365147 -2559782 1687729 4743755 4379048 4595288 8685369 14925329
40458 14925329 20052853 22652636 22302513 19252434 15646796 13624234 12117331 9279367
40450 9279367 7559638 11077793 17429379 18336392 11046015 3449294 3723446 9276048
40442 9276048 11113701 6417193 1198387 1196390 5048949 7492762 6044494 2760300 774639
40433 774639 666678 727848 557823 2758792 9128533 16289938 18600349 15727213 13566606
40424 13566606 16342167 21579773 24963260 26292313 27499057 28140527 26857120 24946842
40416 24946842 24399144 24024930 21541657 18392096 18615117 23362429 29606194 33623419
40408C3623419n07379n766171q744950o380786q74431R53197l381313q018521
40400I03065o886305j578548K425018L351727K999942K496056K108199K422766
40392H241920K526979J56549l722447m583879j459629N76199j386677l040197
40384b691182o70451J959192N63715j655256k79003J475370j169846m293672j074533
40375g835666N516008O611383J994178n95412K33646j842282p038016p076528
40367a0032689K8005N011826K487708k23620L683341Q597098O386297j67468l308216
40358A2462282l077365m263584n699521k970629J459706J142151k850985l035418
40350f833363K046831N607859L830446Q70336N22545N43883j363901k384954J39197
$$ plain form
40408 33623419 33116040 27349869 18604919 12224133 11349702 12302899 8921586 903065
40400 903065 -5983240 -7561788 -5136770 -1785043 1214899 3710955 5819154 8241920
40392 8241920 10768899 10925448 7203001 2619122 1159493 1735692 349015 -2691182
40384 -2691182 -3361633 -1402441 -838726 -2493982 -2772985 -1297615 -2467461 -6761133 -7835666
40375 -7835666 -2319658 4291725 6285903 5690491 5924137 4081855 -2956161 -10032689
40367 -10032689 -10004684 -4992858 -2505150 -2728770 954571 9551669 15937966 15770498 12462282
40358 12462282 9384917 5121333 -578188 -3548817 -2089111 -946960 -3797945 -6833363
40350 -6833363 -4786532 821327 4651773 5522109 6044654 6588537 5224636 2839682 2978879
40341B978879K913037J023708m441297p309984l969283K738757P026844N969114
40333F929775J882234n64257J61298N21582l155408q684069r731480l908116L661971
40324a2886470O389906L769052P12093N08463J236522j80257k747797k812278
40316f010766q7168J230277r90134k539162R49164N859497M540728k707939o396427
40307f151930j198331N751519M870672k279065n922646k175599K725276K469644
40299a910460j001044j545596K356425N879990M347864m45735k126123J400421
40291F955742L734552j394871r320200r346280q33905M725685J238248k442798
40283f683827K173113P926915L484654o813723q744938o54149M824702J599622
$$ plain form
40341 2978879 5891916 6915624 2474327 -4835657 -8804940 -6066183 960661 6929775
40333 6929775 8812009 8247752 8409050 8930632 5775224 -2908845 -12640325 -16548441 -12886470
40324 -12886470 -6496564 -2727512 -2015419 -1506956 -270434 -450691 -3198488 -6010766
40316 -6010766 -6097934 -4867657 -5857791 -8396953 -7447789 -1588292 2952436 244497 -6151930
40307 -6151930 -7350261 -1598742 3271930 992865 -4929781 -7105380 -4380104 -1910460
40299 -1910460 -2911504 -4457100 -2100675 3779315 8127179 7681444 5555321 6955742
40291 6955742 10690294 9295423 -24777 -9371057 -10204962 -5479277 -4241029 -6683827
40283 -6683827 -4510714 3416201 6900855 87132 -8657806 -9311955 -4487253 -2887631
40275b887631k115609J53992L320012K423780J615885M157466M291324k349018
40267H610201r137468q238830k706148p5928m09742M50474J643666N02833j33594
40258i494536K877323N032912R34707n079834m907123J92131K571042J256849
40250f616529J272254K303925k86439m206613k147178M494717N796224q14795
40242b04434o305712m600352m55592Q73681J177871K039090L95836l361146k818496
40233a3259254L072570N914095J724277j352940K722975O247492P98847p179611
40225a311549o330354J039112L965299J530867J970452N527006L431124n154807
40217D667150r506218m216577K659156L291216J128902K207991M629922L863592
$$ plain form
40275 -2887631 -5003240 -4849248 -1529236 894544 2510429 6667895 10959219 8610201
40267 8610201 -527267 -8766097 -11472245 -11548173 -11957915 -11507441 -9863775 -9360942 -9494536
40258 -9494536 -6617213 -1584301 -649594 -5729428 -10636551 -10444420 -7873378 -6616529
40250 -6616529 -5344275 -3040350 -3326789 -7533402 -9680580 -5185863 610361 -204434
40242 -204434 -6510146 -11110498 -11566090 -10692409 -9514538 -7475448 -7079612 -10440758 -13259254
40233 -13259254 -10186684 -4272589 -2548312 -3901252 -1178277 5069215 5868062 -1311549
40225 -1311549 -7641903 -6602791 -2637492 -1106625 863827 6390833 9821957 4667150
40217 4667150 -4839068 -9055645 -6396489 -3105273 -1976371 231620 4861542 8725134
40209H725134J449133J064512J100304j853328n780448n885411k170386Q69548
40201b480942N85813j715932l478219k742188Q56556M625529M654980R94403j953987
40192f53987j862539j398886k660050l354098j546514N42575J120692K251889
40184g560918M353269K654126m833605j0580921o388504M005570R039941M567748
40176d743294k490461n000289k760683J324865N118262O202677L187338o66372
40168A72043n94965K184119J927754k104162m183952j576609J477542J664500
40160a033730J594604L406820L878882N37931k853930k079702P04245J069019
40152E224139m89231n60253J047039K002821J617363K5854l742556q450986q842104
$$ plain form
40209 8725134 10174267 11238779 12339083 10485755 4705307 -1180104 -3350490 -2480942
40201 -2480942 -1895129 -3611061 -7089280 -9831468 -8974912 -4349383 305597 1300000 -653987
40192 -653987 -2516526 -3915412 -6575462 -9929560 -11476074 -10933499 -9812807 -7560918
40184 -7560918 -3207649 -553523 -5387128 -15968049 -22356553 -18350983 -9311042 -4743294
40176 -4743294 -7233755 -12234044 -14994727 -13669862 -8551600 -2348923 838415 172043
40168 172043 -422922 1761197 3688951 1584789 -2599163 -4175772 -2698230 -1033730
40160 -1033730 560874 3967694 7846576 8384507 5530577 3450875 4155120 5224139
40152 5224139 4734908 4174655 5221694 7224515 8841878 8867732 5125176 -3325810 -12167914
40143a2167914k430367M892698N790897J454092j394370r50471p15899j090197
40135f611531J305126N619216O019277R92943l395124k454715O64315Q44877j478058
40126A506326k513404j246125M28852J377824J887690K110150J943336J333228
40118F827877j27409k218371k747412N45L485829L304532k18771k109489l17582
40109E879749J582889Q59089l52567R1162O43612L46225J443630L742620J975311
40100A6211720n691459j1654963q433639k75591K848499J20742m33867L790848
40092c517710O095929K733578n18161J429738M088443J091574m873586o136639
40084C93166j816564J705401Q40330j393988j935178j934362k556709j636925
$$ plain form
40143 -12167914 -14598281 -9705583 -3914686 -2460594 -3854964 -4805435 -5521334 -6611531
40135 -6611531 -5306405 312811 6332088 7325031 3929907 1475192 2139507 2984384 1506326
40126 1506326 -1007078 -2253203 -1824351 -446527 1441163 3551313 5494649 6827877
40118 6827877 6700468 4482097 1734685 1735230 5221059 8525591 8306820 6197331 5879749
40109 5879749 7462638 8321727 7969160 8060322 8703934 9050159 10493789 14236409 16211720
40100 16211720 10520261 -1134702 -9568341 -9843932 -6995433 -6874691 -7308558 -3517710
40092 -3517710 2578219 5311797 4793636 6223374 10311817 11403391 6529805 393166
40084 393166 -1423398 282003 1122333 -271655 -2206833 -4141195 -6697904 -8334829
40076h334829K152642N329721L913706j20039j078149J971912L390819o79183
40068F546600n948206n560720J09609L929553K154374p73745M83652M224834M648999
40059I814950J95833n015158o828312m558754K18690M757369N666285K232646
40051F483549j049154O10772M880354M623435j578205o704770n368728j139933
40043G57320K3994j256980p79908J021939N20770j331418J87981M892205O628811
40034A0664714K653662j942328k073995K33372M28615j122412j074877L81868
40026H148619J80928j791241k487993j090326j19338o90785p36818R50123K514043
40017D877212K394110J738101J715896J297601k73762j437992j041692o62304
$$ plain form
40076 -8334829 -6182187 -852466 3061240 2941201 1863052 3834964 7225783 6546600
40068 6546600 598394 -4962326 -4852717 -923164 1231210 457465 941117 5165951 9814950
40059 9814950 10010783 4995625 -1832687 -6391441 -6172751 -1415382 4250903 6483549
40051 6483549 5434395 6045167 10925521 15548956 13970751 7265981 1897253 757320
40043 757320 781314 -475666 -1255574 -233635 287135 -1044283 -856302 4035903 10664714
40034 10664714 13318376 11376048 9302053 9535425 9964040 8841628 7766751 8148619
40026 8148619 8329547 6538306 4050313 2959987 2840649 2149864 1413046 2363169 4877212
40017 4877212 7271322 9009423 10725319 12022920 11749158 10311166 9269474 8607170
40009H607170j641723k209493p25648M25975j763320n091010m424516M62602M183410
40000b176553L670215K030452K511332L089771N00579l587069m675994k190486
39992h27753n9293p52526k187485j477408O08233N23806l354126p926440p887441
39983b3340433j511946O603312R990063P365241L279628J592411J200662m25705
39975D753233k541617k704472r97864M34581R75169J813523L254523M154492L606498
39966A2748066J384223k325333n849210o282496l176877k47964n22778j601291
39958e873660O24313N103875O879972M385594Q99535j007159j780496j591434
39950G640540K21611J749980k56472m449397n348352j560540J743580R89269o43301
$$ plain form
40009 8607170 6965447 4755954 4030306 4456281 2692961 -2398049 -6822565 -6359963 -2176553
40000 -2176553 1493662 3524114 6035446 9125217 9625796 6038727 1362733 -827753
39992 -827753 -887046 -1639572 -3827057 -5304465 -4696232 -4172426 -7526552 -15452992 -23340433
39983 -23340433 -24852379 -18249067 -8259004 -893763 2385865 3978276 5178938 4753233
39975 4753233 2211616 -492856 -1490720 -1056139 -80970 1732553 4987076 9141568 12748066
39966 12748066 14132289 11806956 5957746 -324750 -3501627 -3749591 -4272369 -5873660
39958 -5873660 -5249347 -145472 6734500 11120094 12019629 11012470 9231974 7640540
39950 7640540 7862151 9612131 9355659 4906262 -442090 -2002630 -259050 730219 86918
39941H6918L80210J753842J68294k257669j865210j50222n86298j469626J499564
39932b440197O791375P792770K303517m286311o348129l948593k70462K714357
39924B308327M229852L532646P58857k644156n074530n236846k254715K591660
39916a788905N445962M140037J761515K439388M689761L509822j267935m016144
39908A4913501j771526J366405N40312l211227n301208l624258J68642L082751
39900F163392K643538j351726n488162n585830k118659M404j700341l876430k463953
39891a3773767J898808N520803N822193K353510k980241n357274j095127N699676
39883a911419N806766k426741q735702m408152N104744P935905K196481l510611
$$ plain form
39941 86918 467128 2220970 2389264 131595 -1733615 -1883837 -2470135 -3939761 -2440197
39932 -2440197 4351178 12143948 14447465 10161154 3813025 -135568 -406030 2308327
39924 2308327 6538179 10070825 10829682 8185526 3110996 -2125850 -4380565 -1788905
39916 -1788905 3657057 7797094 9558609 11997997 16687758 20197580 18929645 14913501
39908 14913501 13141975 14508380 15048692 11837465 6536257 2911999 3080641 6163392
39900 6163392 8806930 7455204 1967042 -3618788 -5737447 -5733043 -7433384 -11309814 -13773767
39891 -13773767 -11874959 -6354156 -531963 1821547 -1158694 -6515968 -7611095 -1911419
39883 -1911419 3895347 1468606 -7267096 -11675248 -6570504 1365401 3561882 51271
39875E1271l691717j243841N55531K496732M162090K193422k938071n043950j007958
39866d466491L886664L448146j097392m302342m104762k110578L83031K440846
39858e922878K257039j72227j512061J07659J337039j259642m781810l591499
39850a3538380K123761O346849N326542J231056k219198l573243k724326p4811
39842g101750K381802K216108k34343k156520k087263j073743p4960J012999J712125
39833e405545J360047J289457L293348N539025L811240k001590o463682n610422
39825d188122j965659N1718N83239K555127N510834N614197J745446k167565k328503
39816E410712j24003K02644k130049l179085k06074L531059K833231j519238l168950
$$ plain form
39875 51271 -3640446 -4884287 -4328756 -1832024 2330066 4523488 1585417 -3458533 -4466491
39866 -4466491 -579827 2868319 1770927 -2531415 -6636177 -8746755 -8363724 -5922878
39858 -5922878 -3665839 -3838066 -5350127 -5242468 -3905429 -5165071 -9946881 -13538380
39850 -13538380 -11414619 -5067770 258772 1489828 -729370 -4302613 -7026939 -7101750
39842 -7101750 -4719948 -2503840 -2738183 -4894703 -6981966 -8055709 -8130669 -7117670 -5405545
39833 -5405545 -4045498 -2756041 537307 6076332 9887572 7885982 1422300 -4188122
39825 -4188122 -6153781 -6102063 -5518824 -2963697 2547137 8161334 9906780 7739215 5410712
39816 5410712 5286709 5489353 3359304 180219 -25855 3505204 6338435 4819197 1650247
39807A650247L04441K999344n30640o102681n294940K075529P521542N777607
39799H400449N89740k508767k903512k153153l97019J355825M12815k749532l411589
39790c364743L23629M103701M365415L498224L773828J946257m203662r177879
39782A264770o870364m27366K613712J802666K212409L931499K234335k648536
39774D113125m950654k948208q05360j85191J627431M105252K699070k153677
39766A501788l726067L48838M238789L980076L056898L930734K652551k643782
39758A3339825o072694l414179K06774p20105k582771m71189J184040l898414
39750b428713j0521650p688096M274334J3074790J1040493K953473l391294n661787
$$ plain form
39807 1650247 1954688 4954032 4423392 -1679289 -6974229 -4898700 2622842 8400449
39799 8400449 8990189 6481422 3577910 1424757 1027738 2383563 2796378 46846 -3364743
39790 -3364743 -3041114 1062587 5428002 8926226 12700054 14646311 10442649 1264770
39782 1264770 -5605594 -6032960 -3419248 -1616582 595827 4527326 6761661 4113125
39774 4113125 -837529 -3785737 -4591097 -4776288 -3148857 956395 3655465 1501788
39766 1501788 -2224279 -1875441 2363348 6343424 9400322 13331056 15983607 13339825
39758 13339825 7267131 3852952 4059726 3339621 756850 285661 1469701 -2428713
39750 -2428713 -12950363 -20638459 -16364125 -3289335 7751158 10704631 7313337 1651550
39742A651550m427801k20116M072133M118552M05l602244m074340k719792k9671
39733e231324M442906P110395K926130n177364p245668j28025O918593N093491
39725H709134j927950m603479r53276L246953M243092L374881J769516j765035
39717A2093836o891537j0089493q305918k403185L506936N513896L495151J618326
39709a461988L514951O785903N413194j455661p187422o461517k364897j016093
39701d233530k492462k035976J598089M367072L486846J171407O38868J720564
39693D220878K157207J148404j87957r49029j552349k605937l417048k432724
39685c618555N12185L197649L329114J324965m85913q72175l05021P16779J809168
$$ plain form
39742 1651550 -2776251 -2996367 1075766 5194318 5194723 1592479 -2481861 -5201653 -5231324
39733 -5231324 -788418 6321977 9248107 4070743 -3174925 -3302950 3615643 8709134
39725 8709134 6781184 2177705 1224429 4471382 8714474 12089355 13858871 12093836
39717 12093836 5202299 -4887194 -13193112 -15596297 -12089361 -6575465 -3080314 -1461988
39709 -1461988 2052963 8838866 14252060 12796399 5608977 -852540 -3217437 -4233530
39701 -4233530 -6725992 -8761968 -7163879 -2796807 690039 1861446 2500314 4220878
39693 4220878 6378085 7526489 7338532 6389503 4837154 2231217 -1185831 -3618555
39685 -3618555 -3106370 91279 3420393 4745358 4259445 3387270 3082249 3799028 5608196
39676E608196J805559K41439q80029K70488J707099L15276k530294k776676r28099
39667B832959j577854m704151m163967K176951P268945M534692k453550n316082
39659a402057j959090K906582M971167L009715k301370p042678m971911M401615
39651b388027J1899790R206411K66472m885389m559698m864175o680923l873082
39643e878621M294144R224459N406762j459321l478974r82312J009133R73640
39635I108910L71614l10552j59642K972519P107578N066611n158151j3685389
39627E313498j0194024J010886O098804O48526n754397m787009R3327K028085
39619e542304J275502J200440J71522m526144q528095n108497L057025N926966
$$ plain form
39676 5608196 7413755 7655194 6775165 7045653 8752752 9068028 6537734 3761058 2832959
39667 2832959 1255105 -3449046 -7613013 -5436062 1832883 6367575 3914025 -1402057
39659 -1402057 -3361147 -454565 4516602 7526317 5224947 -1817731 -6789642 -2388027
39651 -2388027 9511763 18718174 18984646 14099257 9539559 4675384 -2005539 -5878621
39643 -5878621 -1584477 7639982 13046744 11587423 8108449 7126137 8135270 9108910
39635 9108910 9480524 9169972 9010330 11982849 19090427 24157038 18998887 5313498
39627 5313498 -4880526 -3869640 2229164 2877690 -2876707 -7663716 -7570389 -5542304
39619 -5542304 -4266802 -3066362 -2894840 -7420984 -15949079 -21057576 -18000551 -12073585
39611a2073585J190112j645710L858937J0496664Q510693O08341l216790j542384
39603F186278j407743m014517k681019L068915L716782m322723j0027790l761971
39595a3243788O917107Q379521J445347j853213J532550K621343k244659m714248
39587a160040P57536O916204N175550j437243m258348j996569l90944k525493
39579A080653n946437p363298n340702j27463N380008O629706K760836j401888
39571d328585j759134l51755r03729k319256j209868J642144K378363K41681j855781
39562h465920k061282r10526J206363M003488N283707K765854j989188m505883
39554d673387k473181K109561N365147M476290m25667n411627n701230j618927
$$ plain form
39611 -12073585 -10883473 -12529183 -8670246 1826418 10337111 10945452 7728662 6186278
39603 6186278 4778535 764018 -1917001 1151914 4868696 545973 -9481817 -13243788
39595 -13243788 -6326681 2052840 3498187 1644974 3177524 5798867 3554208 -1160040
39587 -1160040 -402504 6513700 11689250 10252007 5993659 3997090 3606146 1080653
39579 1080653 -4865784 -12229082 -17569784 -17697247 -12317239 -5687533 -2926697 -4328585
39571 -4328585 -6087719 -6439474 -7343203 -9662459 -10872327 -9230183 -6851820 -6610139 -8465920
39562 -8465920 -10527202 -11437728 -10231365 -6227877 -944170 1821684 -167504 -4673387
39554 -4673387 -7146568 -5037007 328140 4804430 4378763 -1032864 -6734094 -8353021
39546h353021R40523j296420l755370j285937K792185J442085m038595m570573
39538a8125123L060447J0486239R115964J550277l088625j536320J249438O23990
39530C336287j989506k741983j053001O80430J314342K001557K852999J440983
39522E842108l193302o990537m997636J372919N416300M255628K265134L345302
39514G315916M758927K485165j677787l488206l286349l796447l694324j67091
39506a550196L844954K569718k661107m158906K76874L912905K036778q93852
39498C377168Q45227N229933O408645L242256r89004m115681n838599n602378
39490B557567l636249j858907p91340J429465M297941L695216o78013j912423
$$ plain form
39546 -8353021 -7412498 -8708918 -12464288 -13750225 -10958040 -9515955 -13554550 -18125123
39538 -18125123 -15064676 -4578437 4537527 6087804 2999179 1462859 2712297 3336287
39530 3336287 1346781 -1395202 -2448203 -1767773 -453431 1548126 4401125 5842108
39522 5842108 2648806 -4341731 -9339367 -7966448 -2550148 1705480 3970614 7315916
39514 7315916 12074843 14560008 12882221 9394015 6107666 2311219 -1383105 -1550196
39506 -1550196 2294758 4864476 2203369 -1955537 -1678663 2234242 4271020 3377168
39498 3377168 4222395 9452328 15860973 19103229 18114225 13998544 8159945 2557567
39490 2557567 -1078682 -2937589 -3728929 -2299464 1998477 5693693 5015680 3103257
39482C103257L923473R007370L680255p763502j1358340l497827L899183J308029
39474B301898n223141m974017J265955M512313K335355O59915K145778K148320
39466E172376j802893m403506r17970M373666L947037j596126m272218o26977
39458a26611L135639M62915n620560o560102l75633N643384N198921J026436n49722
39449B234667O26160k99339l571556l157609L102948P747168L330049n965828
39441D046660r186649l839014J203651n75357m107576j669935M675544O256550
39433c196126P08683n147638n174840r08349K427922K370096O4497j942744j313681
39424a2112180K069019M936938M126661J432405J633947N299232P425366M275865
$$ plain form
39482 3103257 7026730 16034100 19714355 11950853 592513 -2905314 993869 2301898
39474 2301898 -2921243 -7895260 -6629305 -2116992 218363 878278 3024056 5172376
39466 5172376 3369483 -1034023 -1951993 2421673 6368710 4772584 500366 -126611
39458 -126611 3009028 3471943 -2148617 -8708719 -9084352 -3440968 1757953 2784389 2234667
39449 2234667 2860827 2561488 -1010068 -4167677 -1064729 6682439 10012488 4046660
39441 4046660 -5139989 -8979003 -7775352 -8350709 -12458285 -14128220 -9452676 -3196126
39433 -3196126 -2487443 -7635081 -12809921 -13718270 -11290348 -8920252 -8855755 -10798499 -12112180
39424 -12112180 -10043161 -5106223 -979562 452843 2086790 7386022 14811388 19087253
39416A9087253k150499p563021r448546o705787K39698P207616Q636547M274928
39408A3578189o77553l402289n835893p587753m095517M135805Q332748L757064
39400H204801j916897k60205M469365L116198k521481l003884K593356N675352
39392A6356605K539364j412516k421998k826413l541417k157397r4667j651996
39384D789565m199369q043R518602J2707713M825388m605532o853213n366632
39376A0808479n792202n633571k067767J1574k717653l616771K661589Q615488
39368B269166N062848k946012l848114J896979L944147m64760l998801k844489
39360i29036q32829j01304J518291L387338K161727o77343n77795J041960j042837
$$ plain form
39416 19087253 16936754 9373733 -74813 -6780600 -6540902 666714 9303261 13578189
39408 13578189 12900636 9498347 3662454 -3925299 -8020816 -3885011 4447737 8204801
39400 8204801 6287904 6027699 10497064 13613262 11091781 8087897 10681253 16356605
39392 16356605 18895969 17483453 15061455 12235042 8693625 6536228 6441561 4789565
39384 4789565 590196 582153 10100755 22808468 27633856 23028324 16175111 10808479
39376 10808479 5016277 -617294 -2685061 -2673487 -5391140 -9007911 -6346322 2269166
39368 2269166 7332014 4386002 537888 2434867 6379014 5914254 1915453 -929036
39360 -929036 -1761865 -1863169 -344878 3042460 5204187 4526844 3949049 4991009 3948172
39351C948172n107335m108668J822327N161502L926659L710818N438290L009583
39343A7801348l919588o814335k500323Q21323k434522n939107l131120J560422
39335d555902J298162j634485j503656M96909J81428r01595Q87890L401725K399903
39326G0379n30789r63830P05759J096422J80118j30656m13125j309520m97937
39317a793179K589765L508782o7215k982364p33980K370516N33203l327816l051214
39308b953502o5576M83789J30785L430652P299474M945284j614980l935742q55573
39299F864611J030724k12604l06546N89162k263269o695323m539369L598653P104631
39290E170670K549375p30600K566599M488987r78986o031698k576827K976402
$$ plain form
39351 3948172 -1159163 -5267831 -3445504 1715998 5642657 9353475 14791765 17801348
39343 17801348 13881760 7067425 4567102 5388425 2953903 -2985204 -6116324 -4555902
39335 -4555902 -3257740 -4892225 -6395881 -5898972 -5717544 -6619139 -5731249 -2329524 70379
39326 70379 -460410 -1424240 -718481 377941 558059 427403 14278 -1295242 -1793179
39317 -1793179 796586 4305368 4238153 1255789 521809 2892325 3425528 97712 -2953502
39308 -2953502 -3019078 -2535289 -2404504 1026148 8325622 13270906 11655926 7720184 6864611
39299 6864611 7895335 7682731 7376185 7965347 5702078 -993245 -5532614 -1933961 5170670
39290 5170670 7720045 6989445 9556044 14045031 13066045 7034347 4457520 7433922
39282G433922M92635o585896p676780k833866o45672k093400j78571N559480P374253
39273H46105L298491P59120L267804M235246j280471p540787o715516j50715M661064
39264A380341L956758k83873m703353o678649m785326p30128J416769N79014N37505
39255i310942L744853O445946L702294l036613p483111o421778k339012J191349
39247a3507014L095985L615189K810680J334125M88681M90848L30721J46588J767168
39238E72971N307939O937868K887887m486475p816847l537830K863316L334920
39230F063749k406026o867509n011268o7837K405651J868783R42991j17373k391709
39221e580548l954879j915014J921412K661844o9325j198055J894496N305191
$$ plain form
39282 7433922 7926557 1340661 -6336119 -9169985 -9815657 -11909057 -12087628 -6528148 846105
39273 846105 4144596 4903716 8171520 12406766 11126295 3585508 -3130008 -3280723 1380341
39264 1380341 5337099 5053226 349873 -6328776 -11114102 -11844230 -10427461 -9848447 -9310942
39255 -9310942 -5566089 879857 4582151 1545538 -5937573 -12359351 -14698363 -13507014
39247 -13507014 -10411029 -6795840 -3985160 -2651035 -2162354 -1671506 -1340785 -1194197 572971
39238 572971 5880910 12818778 15706665 11220190 3403343 -134487 2728829 6063749
39230 6063749 3657723 -3209786 -8221054 -8288891 -5883240 -4014457 -3071466 -3188839 -5580548
39221 -5580548 -9535427 -11450441 -9529029 -6867185 -6936510 -8134565 -6240069 -934878
39213i34878M608593Q60835k013677k466995j284534O73255J942787N27981k639210
39204g25843l166443O75872M171902K337673k662481m671165k055534J713412
39196d382607M292920N821787N048837K75216n490747o365911j926426J847216
39188h79715J515310J72945K99146p78873m322394n447958p61499M407687L292073
39179b503278j634664k797215L99791J878962q2541q49057J314464K612752J839524
39170A78738K604553M889736L095424l428920o638596k493641R31730l848564
39162d709540j0152829o741964L865865Q727022M265542K55958K796696N411582
39154C718332J654889l721909l231271J116489J975473j469179l393090q07298
$$ plain form
39213 -934878 3673715 4534550 2520873 53878 -1230656 -557401 1385386 1913367 -725843
39204 -725843 -3892286 -3216414 955488 3293161 630680 -4040485 -6096019 -4382607
39196 -4382607 -89687 5732100 10780937 11056153 5565406 -800505 -2726931 -879715
39188 -879715 635595 808540 1107686 328813 -3993581 -9441539 -10203038 -5795351 -2503278
39179 -2503278 -4137942 -6935157 -6535366 -4656404 -4738945 -5588002 -4273538 -1660786 178738
39170 178738 2783291 7673027 10768451 7339531 700935 -1792706 -860976 -4709540
39162 -4709540 -14862369 -21604333 -17738468 -9011446 -4745904 -4489946 -1693250 3718332
39154 3718332 5373221 1651312 -1579959 -463470 1512003 42824 -3350266 -4157564
39146d157564L292124N214874L911271j87842n187096p152113l661716K130842
39138e797220M406527J598028k538104m446609m197583l181477j434374J466751
39130a4124061M480631N361665K871001j183969k668120N41854N063442N305563
39122E648006O01562m057550n103664m118203k961210k87038L825963M987621
39114a464513J243412j864760P49236M607816K142338m547430o388379j766163
39106g288443J522351q4098l09459N084817R826610O807519l84329k870224O58903
39097A2963647L496094J242281l504061o098432m885782j512952O43474r23632
39089A420637m476989m887961k89987M451068M081465M12979o00577K395375M806198
$$ plain form
39146 -4157564 -865440 4349434 8260705 8072863 2885767 -4266346 -7928062 -5797220
39138 -5797220 -1390693 207335 -2330769 -6777378 -10974961 -14156438 -15590812 -14124061
39130 -14124061 -9643430 -4281765 -1410764 -2594733 -5262853 -4720999 342443 5648006
39122 5648006 6249568 2192018 -2911646 -7029849 -9991059 -10278097 -6452134 -1464513
39114 -1464513 -221101 -2085861 -1336625 3271191 5413529 866099 -5522280 -7288443
39106 -7288443 -5766092 -5850190 -6159649 -1074832 8751778 15559297 15174968 12304744 12963647
39097 12963647 16459741 17702022 14197961 8099529 3213747 1700795 2344269 1420637
39089 1420637 -3056352 -7944313 -8234300 -3783232 298233 711212 110635 2506010 7312208
39080G312208L059109j034027l335614k048906R99123J989252j382621o430176
39072h71652p076418j232765N288875N427004p3597m005040k208362K299400M667549
39063B214994L770533J548417j02101m96550k06429p40559k814720m917699n013310
39054f757424l223133j240393J53875J177082J604706J278261J079976J432432
39046d494618J150210j76164o25448O25023Q19790j826888l753034j070947L253472
39037f098604L264289k66121r52801K377265L567139l32087l716746j213785M247455
39028H76004O518921M551108J115319k625167o332549p432792l898178J694603
39020e532731M966022N070105L940188K245637k85679k286961k198087j063869
$$ plain form
39080 7312208 10371317 9337290 6001676 3952770 4951893 6941145 5558524 -871652
39072 -871652 -7948070 -9180835 -3891960 1535044 1461447 -2543593 -4751955 -2452555 2214994
39063 2214994 5985527 7533944 7431843 6935293 6728864 5988305 3173585 -1744114 -6757424
39054 -6757424 -9980557 -11220950 -11067075 -9889993 -8285287 -7007026 -5927050 -4494618
39046 -4494618 -3344408 -3520572 -4146020 -3520997 -2701207 -4528095 -8281129 -9352076 -6098604
39037 -6098604 -2834315 -3100436 -4053237 -1675972 1891167 1559080 -2157666 -3371451 876004
39028 876004 7394925 11946033 13061352 10436185 4103636 -3329156 -7227334 -5532731
39020 -5532731 -566709 4503396 8443584 10689221 10403542 8116581 5918494 4854625
39012D854625p74544r28923l50228P8791p46255j412598n47102q5331k011387
39003a922952l770195j673518K459097L395464P85329l51694J781094K490951
38995C193576j492987n705102l762259L201703P520665N044408L66468M60581
38987H827053N376552Q202333M340768k365878n240424m051263l997563o143319
38979D948259n322819K28194L878057M18155m662517l147131K432187K527457
38971A299842l462339n360493J440215P766807M478371l373165m351510K129327
38963E67055N733103J295223m023771k212042L946223N778534J354901k930150
38955I509076k673397j328343l352853o130327l710367L317869P543847M940597
$$ plain form
39012 4854625 4080081 3151158 2800930 2879721 2133466 720868 173766 88435 -1922952
39003 -1922952 -5693147 -7366665 -4907568 -1512104 -726775 -1078469 702625 3193576
38995 3193576 1700589 -4004513 -7766772 -4565069 2955596 8000004 8366472 8827053
38987 8827053 14203605 22405938 26746706 24380828 19140404 15089141 11091578 4948259
38979 4948259 -374560 -146366 3731691 4149846 -512671 -3659802 -1227615 1299842
38971 1299842 -2162497 -7522990 -6082775 1684032 6162403 2789238 -1562272 567055
38963 567055 6300158 7595381 3571610 1359568 5305791 11084325 12439226 9509076
38955 9509076 6835679 5507336 2154483 -3975844 -7686211 -4368342 3175505 8116102
38947H116102j63422k484926k762486l538673l124123L47330K735898p77685o254104
38938g906089n137553K371262O676894L231940r18289J105187N355187M036847
38930H815386k391785o621704m631670J251688O838131Q625888M491331l088494
38922A3288771o883449l116396K546526K704863o76363J41256N504830P131883
38914B0641921J026128o282577p433013l589150r0114J698914L132096L066420
38906A2170625k01527l957960l693341j14090J376587j433935m489118l472186
38898c814945O68174M069478N042310M346285K276929j453203n321756o357132
38890e43860l876741r64937o70345j864961r15481K741393N077916K796141j555017
$$ plain form
38947 8116102 7952680 5467754 2705268 -833405 -3957528 -3610198 -874300 -1651985 -7906089
38938 -7906089 -13043642 -10672380 -3995486 -763546 -1681835 -576648 4778539 8815386
38930 8815386 6423601 -198103 -4829773 -3578085 3260046 11885934 16377265 13288771
38922 13288771 6405322 3288926 5835452 8540315 7863952 8005208 13510038 20641921
38914 20641921 21668049 15385472 7952459 4363309 4273195 5972109 9104205 12170625
38906 12170625 11969098 8011138 4317797 4203707 5580294 4146359 -342759 -3814945
38898 -3814945 -3146771 922707 5965017 10311302 12588231 11135028 5813272 -543860
38890 -543860 -4420601 -5385538 -6055883 -7920844 -8836325 -6094932 -1017016 1779125 224108
38881B24108k229235K156059O275930M611196j493865n500330l703527R47602
38873A287938L381646K095066j134009m702959p503949p340644k841284L073603
38865a3684592N372750L454634J917737L373359M485258J868850j926525k499276
38857B362195p58813r18699l014662k978386J71123K670932K322733J487487K216133
38848C560043K715965Q06783k426833m415625m010420j478075J788258L031150
38840d28754O98956k518264k820549j218955j531544k675393M42559P110766R497009
38831F555831M389460j220394j062696J091083o76287l855928k861996K83183
38823B642256k42942l080714k079302K264961L395534K33233j321418P53926J396266
$$ plain form
38881 224108 -2005127 150932 6426862 11038058 9544193 4043863 340336 1287938
38873 1287938 4669584 6764650 5630641 927682 -6576267 -13916911 -16758195 -13684592
38865 -13684592 -8311842 -4857208 -2939471 433888 4919146 6787996 4861471 2362195
38857 2362195 1603382 684683 -2329979 -5308365 -5137242 -2466310 -143577 1343910 3560043
38848 3560043 6276008 7082791 4655958 240333 -3770087 -5248162 -3459904 -428754
38840 -428754 270202 -2248062 -5068611 -6287566 -7819110 -10494503 -10051944 -2941178 6555831
38831 6555831 10945291 9724897 8662201 9753284 9076997 5221069 2359073 2642256
38823 2642256 2399314 -681400 -2760702 -495741 2899793 3133026 1811608 2565534 3961800
38814C961800j649285l192201M92186N164537N373959K187043j42375q23988j650301
38805I721375k684010k492398o45947K188606M566854L864759j136287o503794
38797F879158o306348r58936K324046k83105l490641r85493M939438O727077K201020
38788A1046216l094069l886800j522402q92598l092593l703763O03210N706037
38780A163238M229399l440234p807978l226137L620859M172496J265706K751226
38772B728575O017912J331144r898446j3814455m696246N623795N276563j399576
38764h830734l216913J023532M269648L421490Q39432j697587k749917O37124
38756f303925P318979R372060K530139n595647n725921l28699K096746J211493
$$ plain form
38814 3961800 2312515 -879686 -387500 4777037 10150996 12338039 12195664 11371676 9721375
38805 9721375 7037365 4544967 3899020 6087626 10654480 14519239 13382952 6879158
38797 6879158 572810 -386126 1937920 1654815 -1835826 -2821319 2118119 8845196 11046216
38788 11046216 7952147 4065347 2542945 1650347 -1442246 -5146009 -4542799 1163238
38780 1163238 5392637 1952403 -5855575 -9081712 -5460853 -1288357 -22651 2728575
38772 2728575 8746487 10077631 179185 -13635270 -18331516 -12707721 -7431158 -8830734
38764 -8830734 -12047647 -11024115 -6754467 -3332977 -2493545 -4191132 -6941049 -6303925
38756 -6303925 1015054 10387114 12917253 7321606 1595685 1266986 3363732 4575225
38748D575225K715525N652651L673877k284357m170405k29840K357178j94232
38740A2095622l069455k294391n28866n99489j002244n82842p17051o70997K183292
38731D813579N648188L761296l090735o901698l916408n4616o89029k482160k50303
38722c161886M417366O519307M508271m31155o846772j0950676p786251J138465
38714a2593331O889367M446717l62011j29567L519877M349361J454490j682427
38706E892476l982405o090262o246897l108476K29399Q42326J327872M454046
38698f681921O264284K089330l637657k528718M058495N874850p75238p311512
38690b648087n405883K264786P707024P965304N183198J077936l299196n107157
$$ plain form
38748 4575225 7290750 12943401 16617278 14332921 10162516 9932676 12289854 12095622
38740 12095622 9026167 6731776 6202910 5603421 4601177 4018335 3301284 2630287 4813579
38731 4813579 10461767 14223063 11132328 4230630 314222 259606 -429423 -2911583 -3161886
38722 -3161886 1255480 7774787 12283058 11851903 5005131 -5945545 -13731796 -12593331
38714 -12593331 -5703964 -1257247 -1619258 -1748825 1771052 6120413 7574903 5892476
38706 5892476 1910071 -4180191 -10427088 -13535564 -13306165 -12463839 -11135967 -6681921
38698 -6681921 -417637 1671693 -1965964 -4494682 -436187 5438663 4663425 -2648087
38690 -2648087 -8053970 -5789184 1917840 9883144 15066342 16144278 12845082 7737925
38682G737925k291602K279695L492980Q51802q38697J493124M494793K955782
38674B0175802k639008o329326m696972j358361j278516l321686k441860J962315
38666G2388M858954L289440L36263m45782Q724l86477p51750M8975J89089j722313
38656E497511l158760j728979K06650n18288k057960q28785J674717J162982j749896
38647a500808k338318O9380R57702j510689l348389j375332K002790L265032L051654
38638g26978L925704N561768N209779J783647k582737m769579l766339j775418
38630B859847j813487l757709m298710j953778L15725k11062j521001o59051O68538
38621a0370688p50184k800401m68511N347699P804901L941516j142330j759419
$$ plain form
38682 7737925 5446323 7726018 11218998 12070800 11232103 12725227 17220020 20175802
38674 20175802 17536794 11207468 6510496 5152135 3873619 551933 -1889927 72388
38666 72388 4931342 8220782 8557045 8111263 8119987 7733510 6981760 7030735 7219824 5497511
38656 5497511 2338751 609772 816422 298134 -1759826 -2588611 -913894 249088 -1500808
38647 -1500808 -3839126 -3769746 -2812044 -4322733 -7671122 -9046454 -7043664 -3778632 -726978
38638 -726978 3198726 8760494 13970273 15753920 13171183 8401604 4635265 2859847
38630 2859847 1046360 -2711349 -7010059 -8963837 -8648112 -8859174 -10380175 -11039226 -10370688
38621 -10370688 -11120872 -13921273 -14389784 -9042085 -1237184 2704332 1562002 -197417
38613a97417J567332M756282N271700K620472k220979n950419n231320j486632
38605h70981K45099j604816l399119k723948j541876j268307j94341J732576J239379
38596h386334j896195k476173J979175O153938M904878J221714N77010K026836
38588D104849J505786J1662J069795K858066P46559l816504m774745j385629Q11680
38579A131519p48455k691714k914517l516268m701218k829331K478829N690118
38571h101037L606366O94143J812499M454979L321720j043322l580620k384920
38563a220192q0570J030901P91662p64476l055756l444774j49082L774965L456922
38554C39600o58055k783288K31666M724500N719436L332720J218454R68949J037916
$$ plain form
38613 -197417 1369915 6126197 11397897 14018369 11797390 5846971 615651 -870981
38605 -870981 -625882 -2230698 -5629817 -8353765 -9895641 -11163948 -11358289 -9625713 -8386334
38596 -8386334 -10282529 -12758702 -10779527 -4625589 279289 1501003 2078013 4104849
38588 4104849 5610635 5622297 6692092 9550158 10296717 6480213 1705468 319839 1131519
38579 1131519 383064 -2308650 -5223167 -8739435 -13440653 -16269984 -13791155 -8101037
38571 -8101037 -4494671 -3800528 -1988029 2466950 5788670 4745348 1164728 -1220192
38563 -1220192 -1300762 -269861 521801 -242675 -3298431 -6743205 -6892287 -3117322 339600
38554 339600 -318455 -3101743 -2870077 1854423 7573859 10906579 12125033 13093982 14131898
38545A4131898J50409j091831k056787l233405m694483m900503k385090J731571
38537b348221M052684K276291k013124m506006k463224K304173N127975L238858
38529E669406j419620m244447k620641J658052M418258L206824o70028l759513
38521B238291l596682l35037L875343O416817N598458J787461k420319m040790
38513I523542k447741J69020J540251J666267J559173P55229j910267n306913
38505E548561o295548l910793j002751p7864L93849K928410N856468M877410l08320
38496H009422m633496m088119m08643K272340K567040J453787m78012k384028
38488B310291j956228J474432M051184J700568l259198m220502N47035N227262
$$ plain form
38545 14131898 14282307 13190476 11133689 7900284 3205801 -1694702 -4079792 -2348221
38537 -2348221 1704463 3980754 1967630 -2538376 -5001600 -2697427 2430548 5669406
38529 5669406 4249786 5339 -2615302 -957250 3461008 6667832 5997804 2238291
38521 2238291 -1358391 -1693428 2181915 8598732 14197190 15984651 13564332 9523542
38513 9523542 7075801 7244821 8785072 10451339 12010512 12765741 10855474 5548561
38505 5548561 -746987 -4657780 -5660531 -5738395 -5344546 -2416136 3440332 8317742 8009422
38496 8009422 3375926 -712193 -1120836 1151504 3718544 5172331 4694319 2310291
38488 2310291 354063 1828495 5879679 7580247 4321049 100547 647582 5874844
38480E874844M538289M77584j682991r43306m65896j655033k293698p13087J225387
38471D362093O80048k052419l483912j121656L121894M799475K371935q30124
38463G847334j379051o64687k239008n396033n474886j044338L322337L214613
38455a813719j14485k634242k832599j488730J066269M273695N917937M417974
38447F792100J117879j926805m282993n034728j728673M832209Q129875L612342
38439A1511206l590191m892831o92956P13243l430835o227622k797377J915783
38431g491580J835721k86996J723601O445164O813014J351582l726694l853411
38423B810401j319270K00504Q19990J545368P50124k598455n066380k526543L186155
$$ plain form
38480 5874844 10413133 10890717 9207726 8264420 7798524 6143491 3849793 3136706 4362093
38471 4362093 5042141 2989722 -494190 -1615846 1506048 6305523 8677458 7847334
38463 7847334 6468283 5803596 3564588 -1831445 -7306331 -8350669 -5028332 -1813719
38455 -1813719 -1928204 -4562446 -7395045 -8883775 -7817506 -3543811 2374126 6792100
38447 6792100 7909979 5983174 1700181 -3334547 -5063220 -231011 7898864 11511206
38439 11511206 7921015 3028184 2335228 3048471 -382364 -6609986 -9407363 -7491580
38431 -7491580 -5655859 -5942855 -4219254 2225910 9038924 10390506 6663812 2810401
38423 2810401 1491131 1691635 2511625 4056993 4807117 2208662 -2857718 -5384261 -2198106
38414b198106N548349J843838l051834l124640J040550L662589J711942j686116
38406C746572k181004K05594J991166R99691j749633m049395m520564k947153
38398h504726k63912J698287J669485K97566o79197m00571N80706J176619O24257
38389c801486n75630j95907L222410O426374L287436o377922j2998007p615050
38381a8627782N305736J1860263O274424k055667k015245M684748P677073K789672
38373A5893222l853862n763423m052343l598793n235037n183258j334879K914501
38365a0213872K785765j000489k442428J362950N227196K927093l022004m339489
38357h715278O90498M681530K780263k42171J197911L962159K004435k767942
$$ plain form
38414 -2198106 3350243 5194081 2142247 -982393 58157 3720746 5432688 3746572
38406 3746572 1565568 1771162 3762328 4762019 3012386 -1037009 -5557573 -8504726
38398 -8504726 -8768638 -7070351 -5400866 -5103300 -5782497 -6183068 -5602362 -4425743 -3801486
38389 -3801486 -4377116 -4573023 -1350613 5075761 8363197 1985275 -11012732 -18627782
38381 -18627782 -13322046 -1461783 4812641 2756974 741729 5426477 13103550 15893222
38373 15893222 12039360 6275937 2223594 -1375199 -6610236 -11793494 -13128373 -10213872
38365 -10213872 -7428107 -8428596 -10871024 -9508074 -4280878 -1353785 -4375789 -8715278
38357 -8715278 -8024780 -3343250 -562987 -805158 392753 4354912 6359347 3591405
38349C591405l230329J506857N109599M112434J800533J099332K28322k304046
38341A1914107l862662j959211J462811K868460J515803j125868l779144n170036
38333A864260l674072P07863N236397O640633L809136j680536o474778p431224
38325a002321m416531m76063K191283M527779O873349O331502J956100j072250
38317A4912848J315783L761681j249605r638178r757652q88296M001631j986206
38309D72006q597963m400684N845955R434744M310050j093493k070432j262940
38301B637243n83079P57578J270991j183979l597326j513991K456665J931477
38293B175579k236660k823731J852648N520547M348657J488292n7232j025150
$$ plain form
38349 3591405 361076 1867933 6977532 11089966 12890499 13989831 14218153 11914107
38341 11914107 8051445 6092234 7555045 10423505 11939308 10813440 7034296 1864260
38333 1864260 -1809812 -1101949 4134448 10775081 14584217 12903681 6428903 -1002321
38325 -1002321 -5418852 -5894915 -3703632 824147 7697496 14028998 15985098 14912848
38317 14912848 16228631 19990312 18740707 9102529 -655123 -1543419 2458212 472006
38309 472006 -8125957 -12526641 -6680686 2754058 7064108 5970615 3900183 2637243
38301 2637243 2054164 2811742 4082733 2898754 -698572 -2212563 244102 2175579
38293 2175579 -61081 -2884812 -1032164 4488383 8837040 10325332 10268100 9242950
38285I242950r21846K199144N124051J420943p246195j0657088m623799K782516
38277b679324M141007K758061L828357M412372L27015m279801l474181k13381
38269D820125j059449m305747l045621K464497N113654K733280P48097K579132
38261A0047968N029728M523379J822093p28875j775580j75132L971715P366197
38253C0081493O569377K658681o58005k086263k095499K43570M907877Q181404
38245D7802635P864164Q035561J2045972J4682675J0169065M499261Q283659J8669312
38237A32052304K1777391J5038326J3360669K7671471M9480004O3923988O6879619
38230C90183772O0014741L9591868L535253l6029080o0697584o5284559n9832337
$$ plain form
38285 9242950 8321104 10520248 15644299 17065242 9819047 -838041 -5461840 -2679324
38277 -2679324 1461683 4219744 8048101 12460473 12787488 8507687 5033506 4820125
38269 4820125 3760676 -545071 -3590692 -1126195 3987459 6720739 7468836 10047968
38261 10047968 15077696 19601075 21423168 20694293 18918713 18743581 22715296 30081493
38253 30081493 36650870 39309551 38651546 36565283 34469784 34713354 39621231 47802635
38245 47802635 55666799 63702360 75748332 90431007 100600072 105099333 113382992 132052304
38237 132052304 153829695 168868021 182228690 209900161 259380165 323304153 390183772
38230 390183772 450198513 489790381 493325634 457296554 396598970 331314411 271482074
38223B71482074n3691868m7137634l8266488k8581951j9841334j2444396q342803
38216F3175600r285378j1383031q177344o32347K671306k155497q140797p383488
38208A8689024j936344J21019l794218q165585p081516o68599O009433P881209
38200A1054423L706350l043948o896930n321513j291016L9189k453257m059180
38192h265882N6748P785423J1038441N125884m923686j0064714p684865k716985
38184i649636M64793K001310K209655l48415m058840l645052J608945M564120
38176f853120L94705m921561k851987M862838R190968P018600L213234P69348
38168A0823025k357313n946005n572631o19842K811311M62637m128270n519570
$$ plain form
38223 271482074 217790206 170652572 132386084 103804133 83962799 71518403 63175600
38216 63175600 53890222 42507191 34329847 33697500 36368806 34213309 26072512 18689024
38208 18689024 16752680 16873699 13079481 4913896 -2167620 -2836219 3173214 11054423
38200 11054423 14760773 11716825 4819895 -501618 -1792634 -1753445 -4206702 -8265882
38192 -8265882 -8209134 -423711 10614730 15740614 10816928 752214 -6932651 -9649636
38184 -9649636 -9184843 -7183533 -4973878 -5322293 -9381133 -13026185 -11417240 -6853120
38176 -6853120 -6458415 -11379976 -14231963 -9369125 -178157 6840443 10053677 10823025
38168 10823025 8465712 2519707 -3052924 -3672766 -861455 -398818 -4527088 -10046658
38160a0046658l388063n07647J820910L042620K042114k29072m88798J540187
38152f214407J460093k740030n980357k893422L808028O760623L875104j2639
38144a937007o00334J171369K067666Q38061j119055j343178J483329N456369
38136F017220O399496K677713k090321l442005k048591k193433m735980n364147
38128d780048j069125M831835O716656L922662Q97575M84927M08204k186343n462298
38119C764045n094577m99727M287831N658602L377723j110708n532602n975887
38111a125300k77917O555078O080345j778939o907989l208397K095663n9142o151051
38102d777649o403670q83390J968829N95212J683568N886322N073411k649316
$$ plain form
38160 -10046658 -13434721 -13942368 -12121458 -9078838 -7036724 -7265796 -7754594 -6214407
38152 -6214407 -4754314 -7494344 -13474701 -16368123 -12560095 -5799472 -1924368 -1937007
38144 -1937007 -2537341 -1365972 701694 1539755 420700 -922478 560851 6017220
38136 6017220 12416716 15094429 13004108 9562103 7513512 5320079 584099 -4780048
38128 -4780048 -5849173 -1017338 5699318 9621980 10519555 11004482 11412686 9226343 3764045
38119 3764045 -1330532 -1830259 2457572 8116174 11493897 10383189 4850587 -1125300
38111 -1125300 -1403217 5151861 11232206 9453267 2545278 -663119 1432544 1373402 -4777649
38102 -4777649 -11181319 -12064709 -10095880 -9500668 -7817100 -1930778 3142633 493317
38094D93317p255522k313365M035549J540357o618422r435992l781930L752801
38086a9583207P084769N601757J605999j300962K69513M902000O346496K098435
38078G024800k257476j737875K55075j312790l801550j754944K974021M059795
38070C449056J107999o86436J96196J20315k451812m695920m336316j740324K128589
38061f908653N420063M824969j26068m482216m155635j660120p29280M10422M139826
38052c266692O688056M219089J141992L040903N474050Q56561o618408n803223
38044E732328K598868N778497r18336o923600l783756K694363L600960j99615
38036H579709l144027m270201m574837k357275K215968M189198J480208m31095
$$ plain form
38094 493317 -6762205 -9075570 -5040021 -3499664 -10118086 -19554078 -23336008 -19583207
38086 -19583207 -12498438 -6896681 -5290682 -6591644 -6322131 -1420131 4926365 7024800
38078 7024800 4767324 3029449 3284524 1971734 -1829816 -3584760 -610739 3449056
38070 3449056 4557055 3870619 4066815 4187130 1735318 -2960602 -7296918 -9037242 -6908653
38061 -6908653 -1488590 3336379 3210311 -1271905 -5427540 -7087660 -7816940 -7406518 -3266692
38052 -3266692 3421364 7640453 8782445 11823348 17297398 18153959 11535551 5732328
38044 5732328 8331196 14109693 13191357 6267757 2484001 5178364 8779324 8579709
38036 8579709 5435682 1165481 -3409356 -5766631 -3550663 638535 2118743 1687648
38028A687648K858137P128158O313690J373176l144806o061267p630879o068951
38020c545094j774346J90115k258308l311930J621841O986530M611582l664376
38012a143986q387817n084350K025556O898667O682921J977902k962883k665748
38004b659738K647712N843998K718296j549771r62700J631434M39817k574468
37996E534580j456934K648865L300189j79595k274297j072315q1728n33809m1193
37987E843763Q80723r16436l696870j859520L821559N162259j115289p425955
37979F94234o094696j26263K132777q61866k690157J352763P825258R256550K949364
37970A4437964n556409q461538m655057l63138k56718j640933l4337L416654M418025
$$ plain form
38028 1687648 4545785 11673943 17987633 19360809 16216003 10154736 2523857 -3545094
38020 -3545094 -5319440 -5129325 -7387633 -10699563 -9077722 -2091192 2520390 -1143986
38012 -1143986 -9531803 -14616153 -12590597 -5691930 990991 2968893 6010 -2659738
38004 -2659738 -12026 5831972 8550268 7000497 6037797 7669231 8109048 5534580
37996 5534580 4077646 6726511 10026700 9847105 7572808 6500493 6418765 5884956 5843763
37987 5843763 6724486 5808050 2111180 251660 4073219 9235478 8120189 694234
37979 694234 -5400462 -5526725 -3393948 -4255814 -6945971 -5593208 2232050 11488600 14437964
37970 14437964 8881555 420017 -4235040 -4598178 -4854896 -6495829 -6530166 -3113512 1304513
37961A304513K383446j5028j595363k052610N08249N647496P128586M73978q136396
37952E646871q491943q62847M477697K236878k067786k512277m13172J066005
37944i20574K213546L222142J946773j314001k613514r63518l34830k148140k010018
37935b922134K364961N970284L821189j426800l805116k192433n3200K1738j631336
37926A47153k789660j041207K698981K936281l130177q449898m240585N187804
37918h681308O456982k192759o858724K52928Q233283N443860k315181l715682
37910c376601j336410m100390q116101k463696R699104J3588833O045842p17030
37902I223551o44806k087044r314019j2113353l049351Q170605R004230K878164
$$ plain form
37961 1304513 3687959 3672931 2077568 24958 533207 6180703 13309289 13783267 5646871
37952 5646871 -2845072 -3707919 769778 3006656 938870 -1573407 -1986579 -920574
37944 -920574 1292972 4515114 6461887 5147886 2534372 1570854 1236024 -912116 -2922134
37935 -2922134 -557173 5413111 9234300 7807500 4002384 1809951 1756751 1778489 147153
37926 147153 -2642507 -3683714 -984733 1951548 -1178629 -9628527 -13869112 -8681308
37918 -8681308 -2224326 -4417085 -11275809 -11022881 -2789598 2654262 339081 -3376601
37910 -3376601 -4713011 -8813401 -16929502 -19393198 -9694094 3894739 9940581 9223551
37902 9223551 8578745 6491701 -2822318 -14935671 -17985022 -9814417 -810187 2067977
37894B067977J513844N620088O194962J179073k019054p2349J558050o76103k536610
37885A2829878m90289J427924j650685o770259o936179j405608L029094J288385
37877A322261l411853m247015J04501M109073L074662j015168l210677k428825
37869e703041j169119k07326J736579L493526K075411j135062n97227M378407
37861B872148O573191J098127o456382p858465l963602j517779j417338J103331
37853i566769N583555N339533p26034m451210q35199L774324J906611l205456
37845b180645l574151N99200K586506R24500L51045J823722J057844j839752p65320
37836a017051M989444O726929n20083q486902p111835J50600J690575m693110
$$ plain form
37894 2067977 3581821 9201909 15396871 16575944 14556890 14484541 16042591 15366488 12829878
37885 12829878 12339589 13767513 12116828 5346569 -1589610 -2995218 33876 1322261
37877 1322261 -2089592 -6336607 -6232106 -2123033 951629 -63539 -3274216 -5703041
37869 -5703041 -6872160 -7079486 -5342907 -1849381 226030 -909032 -1506259 2872148
37861 2872148 9445339 10543466 4087084 -3771381 -7734983 -9252762 -10670100 -9566769
37853 -9566769 -3983214 1356319 630285 -3820925 -4656124 -881800 1024811 -2180645
37845 -2180645 -5754796 -5155596 -2569090 -1644590 -1293545 530177 1588021 -251731 -1017051
37836 -1017051 3972393 10699322 10179239 1692337 -5419498 -5268898 -3578323 -8271433
37828h271433r430438o007874J136907N326493O087823N690670M173752J938017
37820F43917J692371L548450L119873j183065m011831j349343K105468M13685
37812D979525l099399j185777M164652L765406l478039p425500j906580N921150
37804A735438O651917J648741j777479k354928l762965n188128k125668M159134
37796a013938O528495K549794k241788l686987m385927o425770n855308M4821
37788a4486608N621972M014556k144164m621555k034313m45857k072221j904033
37780a8072223K526226N881520L493215j133997k164166L0488J374360J296225
37772f768352J880718K679424K079010J789280M078519N860709J882742o154937
$$ plain form
37828 -8271433 -17701871 -23709745 -22572838 -17246345 -11158522 -5467852 -1294100 643917
37820 643917 2336288 5884738 9004611 7821546 3809715 2460372 4565840 4979525
37812 4979525 1880126 694349 4859001 8624407 5146368 -2279132 -4185712 1735438
37804 1735438 8387355 10036096 8258617 5903689 2140724 -3047404 -5173072 -1013938
37796 -1013938 5514557 8064351 5822563 2135576 -2250351 -8676121 -14531429 -14486608
37788 -14486608 -8864636 -4850080 -6994244 -11615799 -13650112 -14095969 -16168190 -18072223
37780 -18072223 -15545997 -9664477 -6171262 -7305259 -9469425 -9438937 -8064577 -6768352
37772 -6768352 -4887634 -2208210 -129200 1660080 5738599 11599308 13482050 7327113
37764G327113r852661n019449K786833N853450L335286J2865r12939o47548j535266
37755A347684l203174k592380J843428O320202M737318k914747q543793n845814
37747h851276J014612L585166J068765n83702M00519j40844l042382l488588l4275
37738a0072005K198337N40160p27792J095798J769935j488517l522930K25947
37730i981067M973782L932262p35152k382431j119476j841997l994627k588868
37722a3737574J813535L211701M66377r18790J494119L430225K111999R03038
37714a225370K484366L523595M29387l942770l886755J133775N711684M962903
37706I190815l07736m666861l741561Q20071K917280m95381n316509n718978j360813
$$ plain form
37764 7327113 -2525548 -7544997 -4758164 1095286 4430572 4443437 3530498 2882950 1347684
37755 1347684 -1855490 -4447870 -2604442 3715760 8453078 5538331 -3005462 -8851276
37747 -8851276 -7836664 -4251498 -3182733 -3766435 -3365916 -3506760 -6549142 -10037730 -10072005
37738 -10072005 -7873668 -7333508 -8061300 -6965502 -5195567 -6684084 -10207014 -9981067
37730 -9981067 -5007285 -1075023 -1810175 -4192606 -5312082 -7154079 -11148706 -13737574
37722 -13737574 -11924039 -8712338 -8245961 -9164751 -7670632 -4240407 -2128408 -1225370
37714 -1225370 1258996 4782591 5211978 1269208 -2617547 -1483772 4227912 9190815
37706 9190815 8883079 4216218 474657 1294728 4212008 3716627 -1599882 -7318860 -8679673
37697h679673L788438P204888Q192597N072002k183271p797608n309472K733032
37689C020933O396879J169482o332097p450540j504199N509578Q108158N014724
37681A3932918q63192m279183k421663J216020J009143k629715l857477p48790
37673A358061J639671m38208l659927l445821p56309Q43858J082386J712339K111040
37664D47090K90283l183254n415555m433809n18201M213827O532633M677220J147156
37655C757390K01696J854827J850932j464450m537676m512629l196410k767112
37647h813432k038064L2200J386853P54046M36519J778444J981479p75579l310999
37638h568533k844049k035094l501698l702006J177511O734073N495982j127616
$$ plain form
37697 -8679673 -4891235 2313653 10506250 15578252 13394981 5597373 287901 3020933
37689 3020933 9417812 10587294 4255197 -3195343 -4699542 810036 8918194 13932918
37681 13932918 13069726 8790543 6368880 7584900 8594043 5964328 2106851 1358061
37673 1358061 2997732 2559524 -1100403 -4546224 -5302533 -4458675 -3376289 -1663950 447090
37664 447090 737373 -2445881 -7861436 -12295245 -12813446 -8599619 -2066986 2610234 3757390
37655 3757390 3959086 5813913 7664845 6200395 1662719 -2849910 -6046320 -8813432
37647 -8813432 -10851496 -10819296 -9432443 -8678397 -8241878 -6463434 -4481955 -5257534 -8568533
37638 -8568533 -11412582 -13447676 -16949374 -20651380 -19473869 -12739796 -7243814 -8371430
37630h371430l944200Q62894O846173O881588J548991l895612n726248k975917
37622h773761K856379P155619N398286p27607m136897j449864K563153K283391
37614E168699r27472k050512n21198j45143k192125l444213j543070J682367L456527
37605e16140L471972K491351L20054k685186m378436l659185k602553k807041
37597a0365164j676607L403430Q649272P426999M09210m275114k801869n48294
37589B21863j720578j785415L289835P225076K306140o537384p597968l60263
37581d958694M029334O21467k894764n41733K511307L88728l211359k304110J136987
37572e222837J696879j00407J1431K393748M137316M118391K499039j379553o214912
$$ plain form
37630 -8371430 -12315630 -11452736 -4606563 2275025 3824016 -71596 -5797844 -8773761
37622 -8773761 -5917382 1238237 6636523 5908916 1772019 322155 2885308 5168699
37614 5168699 4241227 2190715 1669517 1524374 -667751 -4111964 -5655034 -3972667 -516140
37605 -516140 2955832 5447183 5767237 3082051 -1296385 -4955570 -7558123 -10365164
37597 -10365164 -12041771 -8638341 10931 7437930 7847140 3572026 770157 221863
37589 221863 -1498715 -3284130 5705 7230781 9536921 2999537 -4598431 -4958694
37581 -4958694 -929360 -307893 -3202657 -3744390 -1233083 -844355 -4055714 -6359824 -5222837
37572 -5222837 -3525958 -3626365 -3614934 -1221186 2916130 7034521 9533560 8154007 1939095
37563A939095p589366l737085J332025L845625M640850M408531R57894m495050
37555A302519n435189j12288L609689O2758m803268l499591Q09092J315335j62789
37546f913732J464888L040244j024657o179545l905656K814701L623070j515114
37538h595801k669665K223001M095539p21962m176448n59935M842917N725184
37530A62830L236775K60212l301963n502013j945379N371498P846172L147388
37522I275520p16224J302933L275677p61099o566599p061110k774918J397977
37514b627843L668484L998635J396542k249327j802370K755341M097972j364679
37506G872755p131647o715206k911848j018202k03731J417314M37664m861898
$$ plain form
37563 1939095 -5650271 -9387356 -8055331 -4209706 431144 4839675 5797569 1302519
37555 1302519 -4132670 -4244958 -635269 -572511 -5375779 -8875370 -8066278 -6750943 -6913732
37546 -6913732 -5448844 -2408600 -3433257 -9612802 -13518458 -10703757 -7080687 -8595801
37538 -8595801 -11265466 -9042465 -4946926 -5668888 -9845336 -10405271 -5562354 162830
37530 162830 3399605 3659817 357854 -5144159 -7089538 -1718040 6128132 9275520
37522 9275520 8559296 9862229 13137906 12376807 5810208 -1250902 -4025820 -2627843
37514 -2627843 1040641 5039276 6435818 4186491 2384121 5139462 9237434 7872755
37506 7872755 741108 -5974098 -8885946 -9904148 -10107879 -8690565 -8252901 -13114799
37498a3114799p635857j859515O399584O701320l09776m617572j742662L152080
37490a3027197N071584M669110L534598J053897k634465n319103n319863k633145
37482a4604584J756796N404084N418018K461764P25671J372215K29652m615663
37474a852047p897361m550628K486649O951014P473612O028365K856674j265190
37466A0231088k419792K64315M28643o127394j2134414p548174N213323J3559918
37458A467513J1032903L228445k062712k997581j497126M69714J100368k61288
37450A0480236j857665k174274k446654l552065l290882n23356J477916J41673
37442a745071j772111j228147j25400m69252L27834L433089L914968p02848l487036
$$ plain form
37498 -13114799 -20750656 -22610171 -16210587 -9509267 -9819043 -14436615 -16179277 -13027197
37490 -13027197 -7955613 -3286503 248095 1301992 -1332473 -6651576 -11971439 -14604584
37482 -14604584 -12847788 -7443704 -2025686 436078 1161749 2533964 2763616 -1852047
37474 -1852047 -9749408 -14300036 -11813387 -4862373 2611239 8639604 11496278 10231088
37466 10231088 7811296 8075611 8504254 2376860 -9757554 -17305728 -12092405 1467513
37458 1467513 12500416 15728861 13666149 10668568 9171442 9641156 10741524 10480236
37450 10480236 8622571 6448297 4001643 449578 -2841304 -3364660 -1886744 -1745071
37442 -1745071 -3517182 -4745329 -4870729 -5339981 -5012147 -1579058 2335910 1633062 -1853974
37433a853974J573607Q232130P022134L54653k435409n42376k81939j997257j025608
37424I045961R92343j264773m914273k855007K057059Q23030m833507m499049
37416e448216K010285L794015j418315l301768J708429L730008k148056o564194
37408g637812k444539L490809L882715K110115K274754P69306l459624l037398
37400d051674M067837P559068J739459l338657Q65346N673922L45914q561469
37392D299746q431913j757513L24447j747806P75831O602420O369389K67898k375029
37383D327470K1741j50035m396691n639695j953309M43745m12905Q54911N354680
37374a550088O548504J509557m142829n351564l369001o69770K018030K770860
$$ plain form
37433 -1853974 -280367 7951763 14973897 15328550 12893141 12350765 12068826 10071569 9045961
37424 9045961 10038304 8773531 3859258 1004251 3061310 3884340 -949167 -5448216
37416 -5448216 -3437931 356084 -1062231 -4363999 -2655570 1074438 -1073618 -7637812
37408 -7637812 -10082351 -6591542 -2708827 -598712 1676042 2445348 -1014276 -4051674
37400 -4051674 16163 7575231 9314690 5976033 6841379 12515301 12861215 4299746
37392 4299746 -4132167 -5889680 -5565233 -7313039 -6537208 65212 6434601 6702499 4327470
37383 4327470 4349211 4199176 -197515 -5837210 -7790519 -7346774 -7759679 -6904768 -1550088
37374 -1550088 4998416 6507973 2365144 -2986420 -6355421 -7025191 -5007161 -2236301
37366b236301L00280j529445Q48411K417883l183807j0066121o440677N627657
37358a4262120J1165407N181926m37188K271207M965846l72287o480895l940731
37350a908835J911691N37862n202577m194692L538392O611421P58563m860489
37342b808664k093436N082721P650100L180397l474530o910543n295346k69404
37334d938705M596301O011531K964300l028259q718546j0084159m922741L752764
37326a4367514Q957370O780864Q63113k301975j050353J000119R42312k24285
37318E99651n13179k34720r70980k694978l590229k662056j146592m49734J98716
37309a1464101K097242L685824J986657j910359k680591J661806N804270M297067
$$ plain form
37366 -2236301 -1936021 -3465466 -2617055 -199172 -3382979 -13449100 -19889777 -14262120
37358 -14262120 -3096713 2085213 1648025 3919232 8885078 8512791 2031896 -1908835
37350 -1908835 2856 540718 -4661859 -8856551 -5318159 1293262 2051825 -2808664
37342 -2808664 -4902100 180621 7830721 11011118 7536588 626045 -4669301 -4938705
37334 -4938705 -342404 5669127 8633427 5605168 -3113378 -13197537 -18120278 -14367514
37326 -14367514 -5410144 1370720 2233833 -68142 -1118495 -118376 823936 599651
37318 599651 86472 -148248 -1119228 -3814206 -7404435 -10066491 -11213083 -11662817 -11464101
37309 -11464101 -9366859 -5681035 -3694378 -5604737 -8285328 -6623522 -819252 3477815
37301C477815o20539k759916p31218K084283L808692M522763K524746l190835
37293I115791p934368n981043J10922K195275j264013l524275j051685J681035
37285f652361J085588j65452R2424n73460k466852r09907M874731P762092L634701
37276F681504j088661M0022K461626j163052p430041p146728m20019L692768J506869
37267b865712j084264O78846M099203N122253L591507M22809m248444p961357
37259b245159o544374l31257M747700M478150Q96605k035069l127700k575871
37251f736975j22318K944395L575250J361485M0739J975033M069181K343736j758131
37242G692395l306795r82664J359737L31156k700229l949316j955439J313629
$$ plain form
37301 3477815 2857276 97360 -633858 1450425 5259117 9781880 12306626 9115791
37293 9115791 1181423 -4799620 -4688698 -2493423 -3757436 -7281711 -8333396 -6652361
37285 -6652361 -5566773 -5732225 -5639801 -6213261 -8680113 -9590020 -4715289 3046803 6681504
37276 6681504 5592843 5632865 8094491 6931439 -498602 -7645330 -8065349 -4372581 -2865712
37267 -2865712 -3949976 -3271130 828073 5950326 9541833 9964642 5716198 -2245159
37259 -2245159 -8789533 -9120790 -4373090 105060 1001665 -1033404 -4161104 -6736975
37251 -6736975 -6859293 -3914898 -339648 1021837 1062576 3037609 7106790 9450526 7692395
37242 7692395 4385600 3402936 4762673 5093829 2393600 -1555716 -3511155 -2197526
37234b197526L079160K190808o03080l507436m637226l227966m43706J698418
37226g648554K396598K049185L81702k997594n512610k733516M736625R074280
37218b53884M504399l948072o744430k902916L25123j17770J92828K786223K312498
37209c846001k951573n646418p12448N479898N052428J087937J262831M329834
37201D056488L161590k038850m223128j811188j66419p96507P47806M839974N497706
37192I267472J008292k102003L10205L263708J203092l487019n633653n202025
37184a371931m732923l648006n94042K242048K332539J343220J793264J998103
37176f37728q76691m982218n799205k558142J531792M260783N729503N705602
$$ plain form
37234 -2197526 881634 3072442 2469362 -1038074 -5675300 -8903266 -9346972 -7648554
37226 -7648554 -5251956 -3202771 -2821069 -5818663 -11331273 -14064789 -9328164 -253884
37218 -253884 4250515 302443 -6441987 -9344903 -9019780 -9137550 -8944722 -6158499 -3846001
37209 -3846001 -6797574 -12443992 -13156440 -7676542 -2624114 -1536177 -273346 4056488
37201 4056488 7218078 5179228 956100 -855088 -1021507 -1818014 -1070208 3769766 9267472
37192 9267472 10275764 8173761 8483966 11747674 12950766 9463747 3830094 -1371931
37184 -1371931 -6104854 -9752860 -10346902 -8104854 -5772315 -4429095 -2635831 -637728
37176 -637728 -1514419 -6496637 -12295842 -14853984 -13322192 -9061409 -3331906 2373696
37168B373696L574876O36754q14026p29877j178485l127054n334305o040827m153569
37159a4792817L51956N467524P667334N391862J240772j028460p80869j39168
37151C378134m42793j010040p51158N80066K154045K106321q98208n029725o078995
37142e992353k624809J484163K142885O95742J447394M481854M859262k26774
37134F267364o613876p610657j943225M780335O510530L044055j081895k775840
37126E76791l097532l543047k822217K00035K832554J748055j357600j720916
37118g183877J133481K757222J114915m83876N15748J768521O32777j407748k020776
37109c173613j821188j594876M38442M740394P258343M353760j762672o287624
$$ plain form
37168 2373696 5948572 6585326 5771300 5041423 3862938 735884 -4598421 -10639248 -14792817
37159 -14792817 -14440861 -8973337 -1306003 4085859 5326631 4298171 3517302 3378134
37151 3378134 2935341 1925301 1174143 1754209 3908254 6014575 5116367 86642 -5992353
37142 -5992353 -8617162 -7132999 -4990114 -4294372 -2846978 1634876 6494138 6267364
37134 6267364 -346512 -7957169 -9900394 -5120059 1390471 4434526 3352631 576791
37126 576791 -2520741 -6063788 -8886005 -8685970 -5853416 -4105361 -5462961 -7183877
37118 -7183877 -6050396 -3293174 -2178259 -2662135 -2146387 -377866 254911 -1152837 -3173613
37109 -3173613 -4994801 -6589677 -6151235 -1410841 5847502 10201262 8438590 2150966
37101B150966p606572o211578j687694M415630O463720J445900n095373n964222
37093a2089223k275606J84881J335288M863614Q084677M326418m098866o347037
37085f015854M07534N262916j42628q690388q439226N84611Q297349Q649934M122087
37076D036335o98766k933254j040369L070114L592808j737570o347140l368096
37068e425938L186894L597245k775194o680732l272792J773294K696767J753909
37060e146547K791512L978940K433658N15504J436761K665440l9938m785310n970881
37051b120861k993582n16704o29785n65797J226448K176829N57888j055973J07670
37042c813867K542887K869001Q32572o36062M35471K693857L113560K74710l819513
$$ plain form
37101 2150966 -5455606 -11667184 -13354878 -8939248 -2475528 -1029628 -6125001 -12089223
37093 -12089223 -14364829 -14179948 -12844660 -7981046 103631 4430049 331183 -6015854
37085 -6015854 -5608320 -345404 -488032 -9178420 -17617646 -17033035 -8735686 -85752 4036335
37076 4036335 3337569 404315 -636054 2434060 6026868 4289298 -2057842 -5425938
37068 -5425938 -2239044 1358201 -1416993 -8097725 -11370517 -9597223 -6900456 -5146547
37060 -5146547 -2355035 1623905 4057563 4573067 6009828 8675268 8635330 3850020 -2120861
37051 -2120861 -5114443 -5631147 -6260932 -6826729 -5600281 -3423452 -2865564 -3921537 -3813867
37042 -3813867 -1270980 1598021 2430593 1794531 2230002 4923859 8037419 8312129 4492616
37033D492616n346392k862536O85778J674833P74551J572620M327363M613717
37025I932550k98598o733052q752871n111955L00342L447406L241042R75353q04436
37016c804219K29783L438733M738963J361329l703174m934975j600874J432148
37008b842286O18872j772337j454603K142918N765324O355979L616052l84041
37000A2045878k987570l144272k385554k649595l204294j672920J615987L017821
36992F35481O40519k536241k708832l12449J487302J596889J204042L75931j875449
36983a492807m218107l433736O55678L870959L142256O57709L5152N10491j433177
36974a705582n460471o678561k677684K513328M149307L424819M414746O322627
$$ plain form
37033 4492616 -853776 -3716312 -3030534 -1355701 -581150 991470 5318833 9932550
37025 9932550 9633952 2900900 -5851971 -10963926 -10663584 -7216178 -3975136 -2999783 -3804219
37016 -3804219 -3574436 -135703 4603260 5964589 2261415 -2673560 -4274434 -2842286
37008 -2842286 -2223414 -3995751 -5450354 -3307436 2457888 8813867 12429919 12045878
37000 12045878 9058308 5914036 3528482 878887 -2325407 -3998327 -2382340 635481
36992 635481 1276000 -1260241 -3969073 -4281522 -2794220 -1197331 6711 382642 -1492807
36983 -1492807 -5710914 -9144650 -8488972 -4618013 -1475757 -818048 -782896 -272405 -1705582
36974 -1705582 -7166053 -13844614 -16522298 -14008970 -9859663 -6434844 -2020098 4302529
36966D302529M303427j759153n320634k687505R03370p05804m810158m332611
36958a0106539N62227K817713j7957k390875m81270J984891J142151j92094J940287
36949d741466N238504N037638K126045P41202J066863k97766l557413n152262
36941D61345l835719k192487j545776J49394M154275Q115424Q622937M544192
36933A8473585k176366p091356n842564R19956O532281N557200M30725k898617
36925A3904844l518550m216901l906724P50338O480750N189768l091600p797708
36917C794217k749447M477405M251435r58330k119376J643793L126804l93646
36909A1072855l826070l725445l078720m712620o332513m915454j329075K088558
$$ plain form
36966 4302529 8605956 6846803 1526169 -1161336 -257966 -963770 -5773928 -10106539
36958 -10106539 -9544312 -6726599 -6744556 -9135431 -9616701 -7631810 -6489659 -6681753 -4741466
36949 -4741466 497038 5534676 7660721 8401923 9468786 9171020 5613607 461345
36941 461345 -3374374 -5566861 -7112637 -6963243 -2808968 5306456 13929393 18473585
36933 18473585 16297219 9205863 3363299 4283255 10815536 16372736 16803461 13904844
36925 13904844 10386294 6169393 2262669 3013007 9493757 14683525 11591925 3794217
36917 3794217 1044770 5522175 9773610 8815280 6695904 8339697 11466501 11072855
36909 11072855 7246785 3521340 442620 -4270000 -10602513 -15517967 -16847042 -14758484
36901a4758484M772863O285336M793919R9793m073333l547045J607068P363412
36893B543529R600646O794428O62984m550712n077197j521054J332150k2582l586322
36884F175870m583535j583251J951887K246559l28137k338903j949756q47493
36876a256759j045502j383016P75117M786383O318177K754184l004725n768608
36868B175251l763526K85155K438319N90785m100953p205563m351579L207374
36860a0724737Q239133N518147j518422n338028l916138j580585j164855n01506
36852a0986991K269503M619407L444634p1945k150618j320107N22876J129641
36844b543600N17357O81970K881929N151029L854516j203643n344584m947342
$$ plain form
36901 -14758484 -9985621 -3700285 1093634 1193427 -2879906 -6426951 -4819883 2543529
36893 2543529 12144175 18938603 19601587 15050875 9973678 8452624 9784774 9762192 6175870
36884 6175870 1592335 9084 1960971 4207530 3879393 1540490 -409266 -1256759
36876 -1256759 -2302261 -3685277 -2910160 1876223 8194400 10948584 7943859 2175251
36868 2175251 -1588275 -1303120 1135199 1725984 -2374969 -9580532 -13932111 -10724737
36860 -10724737 -2485604 3032543 1514121 -3823907 -7740045 -9320630 -10485485 -10986991
36852 -10986991 -8717488 -4098081 -653447 -725392 -2876010 -4196117 -3673241 -2543600
36844 -2543600 -2026243 -1344273 1537656 6688685 10543201 9339558 3994974 -952368
36836i52368k367042j486712j131808J848300N231723M235375P43551J402082
36828G523101N779387N703600q86778n321985k522988J5209m486234q922064l494473
36819f613225O596431P876069k76346n034312n43478M500549K378236k825349
36811F058575m758970m498973m513454k180829L350074N597347K77395n671685
36803f340520l265247M779342Q225576M238523o02238j669359j193512j666064
36795B506501j794231m92589O84623M44888j079037m183491q286276r307172l640236
36786b5147020N161885R132713O026033J460202R3456K88153p05154j769556j009529
36777f468817M66674P09992l90901k469201n153499n752329r33991P186182J1293740
$$ plain form
36836 -952368 -3319410 -4806122 -5937930 -4089630 1142093 5377468 6121019 7523101
36828 7523101 13302488 19006088 18119310 12797325 10274337 10289546 5803312 -3118752 -6613225
36819 -6613225 -16794 7859275 7582929 2548617 2005139 6505688 8883924 6058575
36811 6058575 1299605 -3199368 -7712822 -9893651 -6543577 -946230 -668835 -6340520
36803 -6340520 -9605767 -4826425 3399151 7637674 7035436 5366077 4172565 2506501
36795 2506501 712270 219681 904304 1349192 270155 -3913336 -12199612 -21506784 -25147020
36786 -25147020 -19985135 -10852422 -4826389 -3366187 -3272731 -2984578 -3689732 -5459288 -6468817
36777 -6468817 -6002143 -5292151 -5683052 -8152253 -13305752 -19058081 -19992072 -12805890 -1512150
36768a512150P954848K025434q48704j256556j947639j894988N11893K578484
36760E610622J273360j206988j406053r47497k882323m783168k538404J248150
36752e632301N61019l387451l211033K549837O740281M818438Q88611l43184k40465
36743B743752j044446q46942J465601K207809p91920l082958o45163K584514Q22234
36734C412481l706158m332739p92845J282241M92786J167757M188431M244517
36726E956471j067359n933435m169378K085724N684003L617444q48280l365279
36718A959911k669195n39953J19229k098715m951559m194255J188814O767466
36710d418257P466523L574840M5405K41720K215246J635335k596693o582680n704218
$$ plain form
36768 -1512150 6442698 8468132 7619428 6362872 4415233 2520245 3032138 5610622
36760 5610622 6883982 5676994 4270941 3323444 441121 -4342047 -6880451 -5632301
36752 -5632301 -5071282 -8458733 -11669766 -9119929 -2379648 2438790 3327401 2984217 2743752
36743 2743752 1699306 852364 2317965 4525774 3733854 650896 5733 2590247 3412481
36734 3412481 -293677 -4626416 -5419261 -4137020 -3644234 -2476477 1711954 5956471
36726 5956471 4889112 -1044323 -5213701 -3127977 2556026 6173470 5325190 1959911
36718 1959911 -709284 -1249237 -1130008 -3228723 -8180282 -12374537 -11185723 -4418257
36710 -4418257 3048266 6623106 6668511 6910231 9125477 10760812 8164119 1581439 -4122779
36701d122779m41253L403803J370735l974772o063339k390834L036986N405235
36693c776218M325482K334385Q64889k28725p92012l40227M90230R8495k090481
36684H85818m250084l285215J659945O553820N521144j524148o759893l816172
36676e014785K664549K615483m639335q435028k009442P573162R784220M923404
36668G462228J110936J139256N47014k789894n289363m486203k341386l05984
36660d953396K854446O400978O446773K107362j976896k128933l85633J21776
36652H486477K48317J646161K250746n57928m717377n847115l527034j306566
36644c324319j167879j519477p01518M24018J49054j342916j655060J297907N934499
$$ plain form
36701 -4122779 -4564032 -1160229 210506 -3764266 -9827605 -12218439 -9181453 -3776218
36693 -3776218 549264 2883649 3748538 3519813 2727801 2387574 2877804 2976299 885818
36684 885818 -3364266 -6649481 -4989536 1564284 7085428 5561280 -1198613 -5014785
36676 -5014785 -2350236 265247 -4374088 -12809116 -14818558 -7245396 2538824 7462228
36668 7462228 8573164 9712420 10259434 7469540 2180177 -2306026 -4647412 -4953396
36660 -4953396 -2098950 4302028 10748801 12856163 10879267 8750334 8364701 8486477
36652 8486477 8734794 10380955 12631701 12073773 7356396 1509281 -2017753 -3324319
36644 -3324319 -4492198 -6011675 -6713193 -6289175 -6140121 -7483037 -9138097 -7840190 -1905691
36635a905691P099972J853983n290711o553695q87207M445060L802890k0251j623512
36626I20838q36775o00409j010008l65492P72852J219863K088834L607177K338804
36617H135684l159274p358952m752846J180908K990740M73109r51628n18512j530521
36608e491292k219440K107635P939174O237991k071818n486445k74957L317962
36600D058810r62328m292794J250193P557320L563964n813698p824343k538687
36592e001563n13755l549865l113415K703798N416803J406201k213395p01461
36584e566652R27217j543853l740341j190277K777243L493689K354092K246656
36576b42226J760083o77314k321322r14396P98152n2378j581570j250068k20449
$$ plain form
36635 -1905691 5194281 7048264 1757553 -4796142 -5683349 -1238289 2564601 2544350 920838
36626 920838 84063 -516346 -1526354 -1891846 -1118994 100869 2189703 5796880 8135684
36617 8135684 4976410 -2382542 -7135388 -5954480 -2963740 -2490631 -3442259 -3960771 -5491292
36608 -5491292 -7710732 -5603097 2336077 8574068 6502250 1015805 740848 4058810
36600 4058810 3096482 -1196312 53881 7611201 11175165 5361467 -2462876 -5001563
36592 -5001563 -5515318 -9065183 -12178598 -9474800 -4057997 -2651796 -4865191 -5566652
36584 -5566652 -4639435 -6183288 -9923629 -11113906 -8336663 -4842974 -2488882 -242226
36576 -242226 1517857 840543 -1480779 -2395175 -1597023 -1649401 -3230971 -4481039 -4701488
36567d701488J46083J173171K617252J188214k674715k935854K138092M992391
36559A943146J36419o026736m655768J793552M321727J613260j83619R58979J539545
36550A440505J185419K838232M683024J674536m163351m588563J747358O128901
36542A0946061K787852l179603m725198k220577M33160K279198K986659K03414
36534I510966n152945o178713J068474R600900R014537r22346r869758r364539
36526b293424j258630N892865N524613j462440p579475n994421J594992O436378
36518H60458L620952k022783l737918k223378k172294l022968l95407M422936
36510d670402M429878j910467o530090k773505M801026O946334K590304j011687
$$ plain form
36567 -4701488 -4555405 -3382234 -764982 423232 -2251483 -5187337 -3049245 1943146
36559 1943146 2079565 -3947171 -8602939 -6809387 -2487660 -874400 -1058019 -99040 1440505
36550 1440505 2625924 5464156 10147180 11821716 7658365 3069802 4817160 10946061
36542 10946061 13733913 10554310 5829112 3608535 4041695 6320893 9307552 9510966
36534 9510966 4358021 -1820692 -752218 8848682 17863219 16940873 7071115 -2293424
36526 -2293424 -3552054 2340811 7865424 6402984 -1176491 -7170912 -5575920 860458
36518 860458 4481410 2458627 -1279291 -3502669 -5674963 -8697931 -9093338 -4670402
36510 -4670402 -240524 -2150991 -8681081 -11454586 -6653560 292774 2883078 1871391
36502A871391K81425K417537Q87220k077459j665738J751642L589969K126992
36494I182979J0191j038905k546039n340718p252440o479002l931929n15173M245322
36485a3665714Q550086P576104L48343o243931n435459m1155J801824j361249
36477h471151l090939L35397M734945N016604J869840q04005r64811Q88472K500885
36468B015237L98292o170610j1210447p220367M085850J2031476J0253000L874964
36460H057395M60058J74890m70122j094847R8350Q07597j734188m695021l668124
36451b064012l28779L07076j749112k419343j343586j689335k891472r49028L537273
36442i590318M949043J994442M53880L541024N926827K013017m724875o349894
$$ plain form
36502 1871391 2152816 4570353 5457573 3380114 1714376 3466018 7055987 9182979
36494 9182979 9193170 8154265 5608226 267508 -6984932 -13463934 -17395863 -17911036 -13665714
36485 -13665714 -5115628 2460476 2808819 -3435112 -8870571 -8911726 -7109902 -8471151
36477 -8471151 -11562090 -11226693 -6491748 -1475144 394696 -409309 -1374120 -485648 2015237
36468 2015237 2413529 -3757081 -14967528 -22187895 -18102045 -6070569 4182431 8057395
36460 8057395 8517453 8692343 8222221 7127374 7225724 8033321 6299133 1604112 -2064012
36451 -2064012 -2392791 -2085715 -3834827 -6254170 -7597756 -9287091 -12178563 -13127591 -9590318
36442 -9590318 -4641275 -2646833 -2192953 1348071 7274898 9287915 4563040 -1786854
36434a786854j680314K767851K219274j085551k869890k842466l194360l517514
36426a1989824q82554M803688Q669442O399798L22068l040908j168382J977719
36418E091047K239093M76054k38483N85275J437935J705516J357012r7270j930428
36409A0625751j928931k70527n83042l954828n529464j709456K628132L97150
36401c25215o229501p842501j294196N773942N634026m9998m028016k409493K816511
36392g954441P079997O977997L021121l52042K54071K290215M75084n383329r841138
36383c432465r272782n448985j169807K731417M814332K755283j883002l239415
36375a4145424J287717O702193O887983K519432p71070q5864J911247J017087
$$ plain form
36434 -1786854 -3467168 -699317 1519957 434406 -2435484 -5277950 -8472310 -11989824
36426 -11989824 -12872378 -8068690 600752 7000550 7322618 4281710 3113328 5091047
36418 5091047 7330140 7806194 7567711 8152986 9590921 11296437 12653449 12556179 10625751
36409 10625751 8696820 8426293 7843251 3888423 -1641041 -3350497 -722365 -325215
36401 -325215 -6554716 -14397217 -15691413 -9917471 -4283445 -4333443 -8361459 -10770952 -7954441
36392 -7954441 -874444 6103553 9124674 8772632 9026703 11316918 11792002 6408673 -3432465
36383 -3432465 -12705247 -18154232 -19324039 -16592622 -11778290 -9023007 -10906009 -14145424
36375 -14145424 -12857707 -6155514 732469 3251901 2480831 2394967 4306214 5323301
36367E323301l442388p309415n588255J097231N679850L156873k211530k985818
36359f280151J34006J07533l773022l772849L249884R189376O096919k350672
36351B601024o625790l765794J536254M415762L345501o16314l782338k204583
36343e096278K488868L636829q18392m393771j767133L371949N104206L777168
36335F303446J851149k169755q298428j0034018l671364L224995K642947l70820
36327a0521848L045123Q151792L554041p097048p826422L621134J0358962K988623
36319F274357n231750j57717J0554812J0428410j30575o665957l921235q52972
36311A0297373l428282o212216l605197J288469L074405J631401o47480l226587
$$ plain form
36367 5323301 1880913 -5428502 -11016757 -9919526 -4239676 -1082803 -3294333 -6280151
36359 -6280151 -6146145 -6038612 -9811634 -13584483 -10334599 -1145223 4951696 2601024
36351 2601024 -4024766 -7790560 -6254306 -1838544 1506957 890643 -2891695 -5096278
36343 -5096278 -2607410 1029419 211027 -4182744 -5949877 -2577928 2526278 6303446
36335 6303446 8154595 5984840 -2313588 -12347606 -16018970 -12793975 -10151028 -10521848
36327 -10521848 -7476725 675067 4229108 -2867940 -10694362 -7073228 3285734 6274357
36319 6274357 1042607 884890 11439702 21868112 21737537 15071580 11150345 10297373
36311 10297373 6869091 656875 -2948322 -1659853 1414552 3045953 2398473 -828114
36303h28114n435102m989304j994067l61051j835533k264921K228125Q170335
36295g309632Q537979K570848k767889j832478K842086M646686J458191k645060
36287E500731l332323q46065J583059J823475J30340j911019k270516K05357L753429
36278D636468M536929J481952j483017o69271J731371J041187k195585k928493
36270F151541p2843J366797j506401m484715k937756P82582J192583j898178l796171
36261e202561k354437j02905Q85785J716362L204320L458314J034424j899750
36253G39552j998036O66328K537964J125036j933384l122591j586230o1203r50772
36244d583336k751021j840457K567069O957213P437959L846011p06218l303752
$$ plain form
36303 -828114 -6263216 -11252520 -13246587 -13607638 -15443171 -17708092 -15479967 -7309632
36295 -7309632 1228347 3799195 1031306 -801172 2040914 6687600 8145791 5500731
36287 5500731 2168408 1322343 2905402 4728877 4859217 2948198 677682 883039 4636468
36278 4636468 9173397 10655349 9172332 8503061 10234432 11275619 9080034 6151541
36270 6151541 6078698 7445495 5939094 1454379 -1483377 -700795 491788 -1406390 -5202561
36261 -5202561 -7556998 -7659903 -6774118 -5057756 -1853436 1604878 2639302 739552
36253 739552 -1258484 -592156 1945808 3070844 1137460 -1985131 -3571361 -3632564 -4583336
36244 -4583336 -7334357 -9174814 -6607745 349468 7787427 11633438 10927220 7623468
36236G623468l344436j926607l82636K95639p14131l696954p196710q038882m320046
36227b1701295J583202M996292M381897K432512J130552p48997l307179k908905
36219a4141921K082516O369770L957833k669458n422021j648303L590077N827711
36211b053796N505899L705145J69861l151029l019016j104169k766109p540492
36203a0253706q018243j492005M753709M597171K282851L999060O729752L907302
36195F505891k206802l094681K734196P471357N184531j489583o452500o516515
36187B135894k252344K907136M355538J078486k110187j066707J061188q56464
36179E252540m277562k158537M790290P445665J696021n226474n384908o27834
$$ plain form
36236 7623468 4279032 2352425 1969789 2265428 1551297 -2145657 -9342367 -17381249 -21701295
36227 -21701295 -20118093 -15121801 -10739904 -8307392 -7176840 -7925837 -11233016 -14141921
36219 -14141921 -12059405 -5689635 -1731802 -4401260 -9823281 -11471584 -7881507 -2053796
36211 -2053796 3452103 7157248 7327109 4176080 1157064 52895 -2713214 -10253706
36203 -10253706 -18271949 -19763954 -15010245 -10413074 -8130223 -4131163 2598589 6505891
36195 6505891 4299089 1204408 3938604 11409961 16594492 15104909 8652409 2135894
36187 2135894 -116450 2790686 7146224 8224710 6114523 5047816 6109004 5252540
36179 5252540 974978 -1183559 3606731 11052396 12748417 7521943 2137035 1509201
36171A509201K185870J433071Q03211K106192L120692J626285j927162n295404
36163E561956n936440k727319K059854L912302J127234k508321k058262K355707
36155A786711N600250L647870j770495n110073l133481J570735L728948J509472
36147G829937k125605m173052m855499m801586k357843K995742P034382M979200
36139D525676j606293o083330m640216L70038M445559M908477J440039l799935
36131d39985o851111n796024l100654j205040J998578Q704721J4416258J2079111
36123A9805854K540085n585557o977654m403193j901274L9590R70052r81544m403120
36114h96761m557349q84845J343148k03926p48174L142387O912274M752416j687874
$$ plain form
36171 1509201 3695071 5128142 5931353 8037545 11158237 12784522 10857360 5561956
36163 5561956 -374484 -3101803 -1041949 2870353 3997587 1489266 -568996 1786711
36155 1786711 7386961 11034831 9264336 4154263 1020782 2591517 6320465 7829937
36147 7829937 5704332 1531280 -3324219 -8125805 -10483648 -7487906 -453524 4525676
36139 4525676 2919383 -3163947 -7804163 -7434125 -2988566 1919911 3359950 -439985
36131 -439985 -7291096 -13087120 -16187774 -17392814 -15394236 -6689515 7726743 19805854
36123 19805854 22345939 16760382 9782728 5379535 3478261 3517851 4487903 3506359 -896761
36114 -896761 -5454110 -6338955 -4995807 -5199733 -5947907 -2805520 4106754 8859170 7171296
36105G171296o103315n381462q82127M244785N797504J133169n710433o648345
36097f378928o79013L655220R04116l320060k498991K75771n05580k149023K61788
36088a0434700L085122L9887n326149m473558J587178M291997K379746K397053
36080f453424M659339J963585n560223p479732K94227P629866N380512j593885
36072a159735l908819j378556Q38774K283952M462539M081683j516169o501448
36064b797779l726785L111099M129594j309327l735133J051284N252947J369140
36056C345040o249319p791391j700977M006102L140535r13241o09715N203272
36048a569694R471217O243016j244051m998412l176155j513269l376558m460253
$$ plain form
36105 7171296 1067981 -4313481 -5195608 -950823 4846681 5979850 269417 -6378928
36097 -6378928 -7057941 -3402721 -2498605 -5818665 -8317656 -8041885 -8547465 -10696488 -10434700
36088 -10434700 -7349578 -7309691 -12635840 -17109398 -15522220 -11230223 -8850477 -6453424
36080 -6453424 -1794085 169500 -5390723 -12870455 -12576228 -4946362 434150 -1159735
36072 -1159735 -5068554 -6447110 -5608336 -3324384 1138155 5219838 3703669 -2797779
36064 -2797779 -6524564 -3413465 716129 -593198 -4328331 -3277047 1975900 3345040
36056 3345040 -2904279 -10695670 -12396647 -8390545 -5250010 -6163251 -6772966 -1569694
36048 -1569694 7901523 14144539 12900488 7902076 4725921 3212652 -163906 -4624159
36040d624159q27318L147046Q30508n751857p855018k191585N005628O871922
36032e394833L599933l36834k211000k043296q26103K1738m20254q37440R64214
36023g483875M118658M877454J943439j286491j531200Q3868O65353q1653p11987
36014E93566j112542j775564j619472L43150K241088J403423j435464l068296
36006d430111k541739j661137q65105J568608N251298O439517L208421j153162
35998E816590k546267j425702q00704r61433R9091K119009K421379L95073j402997
35989C714039j243472k49323L36092Q97542J398874N13464j752216l178004k504472
35980b067476r21146P85645L245982N052094K575985l602029o423405j438767
$$ plain form
36040 -4624159 -5451477 -2304431 -1473923 -7225780 -15080798 -17272383 -12266755 -5394833
36032 -5394833 -1794900 -2131734 -4342734 -6386030 -7212133 -7190395 -7610649 -8448089 -7483875
36023 -7483875 -3365217 1512237 3455676 2169185 637985 721853 1387206 1305553 593566
36014 593566 -518976 -2294540 -3914012 -3570862 -1329774 73649 -1361815 -4430111
36006 -4430111 -6971850 -8632987 -9498092 -7929484 -2678186 3761331 6969752 5816590
35998 5816590 3270323 1844621 1043917 82484 181575 2300584 4721963 5117036 3714039
35989 3714039 2470567 2221244 2557336 3454878 4853752 5367216 3615000 436996 -2067476
35980 -2067476 -2988622 -2202977 1043005 6095099 8671084 5069055 -1354350 -2793117
35972b793117N284120M613546k403658o019504k151781K464747J310770k970684
35964b665561m425035k705027j172023k63650J863261M544309N349914M155470
35956D681658K432563q1443m047026p173014o432577k937180n52637q0510J036603
35947a3153563L271342L788332J646978M0444J386234L479706K911540n9585k424159
35938H87269k596635j529570o73437o26207j347449k524107l791625m657974l758326
35929b0618061O70558P458418J0739039N538158m327760q588921l105043M278401
35921g955211M234530j674504m655744j944618P65421j60051q72236K399336O507237
35912c355840O187556J610028k845266m304430k430136K094727O300974N318474
$$ plain form
35972 -2793117 2491003 7104549 4700891 -1318613 -3470394 -1005647 305123 -2665561
35964 -2665561 -7090596 -9795623 -10967646 -11231296 -9368035 -4823726 526188 4681658
35956 4681658 7114221 7032778 2985752 -4187262 -10619839 -13557019 -14109656 -14190166 -13153563
35947 -13153563 -9882221 -6093889 -4446911 -4406467 -3020233 459473 3371013 3311428 887269
35938 887269 -1709366 -3238936 -3912373 -4538580 -5886029 -8410136 -12201761 -16859735 -20618061
35929 -20618061 -19947503 -12489085 -1750046 3788112 -539648 -9128569 -12233612 -7955211
35921 -7955211 -3720681 -5395185 -10050929 -11995547 -11230126 -11390177 -12262413 -9863077 -3355840
35912 -3355840 2831716 4441744 1596478 -2707952 -5138088 -3043361 3257613 8576087
35904H576087j399707o946407n151128M80174J841847j767532l784075j725688
35896i876429l82468k484382m059086j974972R09026J770150K470224M022414
35888i605523K963325j542207l319732J595550P022332N471965J0843j346143
35880A250410R47361J61353l534697l124195K097673M343072L34756l549540k458761
35871c532568j37937m44885l89137K771296M956207K206190j934933k559666j606356
35862f71789l075739m677914j760638L735962N788117L671544J777621J491623
35854F278787K13691k073501k013032P39414K156607J44050k469093k596529q23987
35845d43593M82719Q2042j758567l369844k312370J629596M754843L535133m52490
$$ plain form
35904 8576087 7176380 229973 -4921155 -4440981 -2599134 -4366666 -8150741 -9876429
35896 -9876429 -10258897 -12743279 -16802365 -18777337 -17868311 -16098161 -13627937 -9605523
35888 -9605523 -6642198 -8184405 -11504137 -9908587 -2886255 2585710 2596553 1250410
35880 1250410 2197771 2359124 -1175573 -4299768 -2202095 2140977 2475733 -1073807 -3532568
35871 -3532568 -3670505 -4115390 -4504527 -1733231 3222976 5429166 3494233 934567 -671789
35862 -671789 -3747528 -8425442 -10186080 -6450118 -662001 3009543 4787164 6278787
35854 6278787 6492478 4418977 2405945 3145359 5301966 5446016 2976923 380394 -443593
35845 -443593 39126 121168 -1637399 -5007243 -7319613 -5690017 -935174 2599959 2147469
35836B147469k695612j811820l3050J371076L187405N078377N103564K758476
35828A5105885k89231k352815k470335l24948K117838J217510k818878m188334
35820E996692L1715L285213j634872r906980r847042k23248P392400N374772n52936
35811h4286k514336j792937k742127l184370Q83167O045957N521730o1522l603992
35802a532716k112541M65098P13894j68841n06490j049437k233993k548193j232211
35793a0205430L19171J029392J573743K470455K933365K397976J356957K58097
35785B133726o08114m0254K855969N806794M442428j986489p932066p252205j035219
35776c615430L104890N21443m209873l338729K988286O190898J297547n094677
$$ plain form
35836 2147469 -548143 -2359963 -2393013 -1021937 2165468 7243845 12347409 15105885
35828 15105885 14816654 12463839 9993504 9668556 11786394 13003904 10185026 5996692
35820 5996692 6028407 9313620 7678748 -2228232 -12075274 -12298522 -4906122 468650 -84286
35811 -84286 -2598622 -4391559 -7133686 -10318056 -9434889 -3388932 2132798 2071276 -1532716
35802 -1532716 -3645257 -3180159 -2466265 -2635106 -3141596 -4191033 -6425026 -8973219 -10205430
35793 -10205430 -9886259 -8856867 -7283124 -4812669 -1879304 518672 1875629 2133726
35785 2133726 1525612 1485358 4341327 10148121 14590549 12604060 4671994 -2580211 -3615430
35776 -3615430 -510540 10903 -4198970 -7537699 -4549413 1641485 2939032 -2155645
35768b155645l513196M516949P886020J345917p257764q129821k225842K147306
35760g386076J646672N83592K380158M308519K334078k670696o007634m794251
35752i605638p26724K296196K302277P95101K86343R16671P23566q85447j997393
35743e895048j357392m60726p74823q32622J394661M490285M908103K015613r57158
35734B530893j450951n90185n69232j061740j44189K145919L309884J720104j210045
35725D680458l142758l794519m161056l678825p64613L548053N338024K625494
35717F50258j712004l499314j755776J826401N247579O068309K151816m472803
$$ plain form
35768 -2155645 -5668841 -1151892 6734128 8080045 822281 -7307540 -9533382 -7386076
35760 -7386076 -5739404 -5155812 -2775654 1532865 3866943 1196247 -4811387 -9605638
35752 -9605638 -10332362 -8036166 -5733889 -4938788 -4652445 -3735774 -3012208 -3897655 -5895048
35743 -5895048 -7252440 -7713166 -8487989 -9320611 -7925950 -3435665 1472438 3488051 2530893
35734 2530893 1079942 489757 -79475 -1141215 -1285404 860515 4170399 5890503 4680458
35725 4680458 1537700 -2256819 -6417875 -10096700 -10861313 -7313260 -1975236 650258
35717 650258 -1061746 -4561060 -6316836 -4490435 757144 6825453 8977269 4504466
$$ [...]
##END NTUPLES=NMR SPECTRUM
##END=
