##TITLE=31Pdec_BAU-27PN
 CDCl3, 24 sc
 27.8.2019
##JCAMPDX= 6.0         $$ Bruker NMR JCAMP-DX V2.0
##DATA TYPE= NMR SPECTRUM
##DATA CLASS= NTUPLES
##ORIGIN= UXNMR, Bruker Analytische Messtechnik GmbH
##OWNER= root
$$ XWIN-NMR		Version 3.5
$$ Tue Aug 27 14:40:45 2019 Russian Standard Time (UT+4h)  she@DPX200
##.OBSERVE FREQUENCY= 81.013821
##.OBSERVE NUCLEUS= ^31P
##.ACQUISITION MODE= SIMULTANEOUS
##.ACQUISITION SCHEME= undefined
##.AVERAGES= 24
##.DIGITISER RES= 17
##SPECTROMETER/DATA SYSTEM= spect
##.PULSE SEQUENCE= zgpg30
##.SOLVENT NAME= CDCl3
##.SHIFT REFERENCE= (INTERNAL, CDCl3, 0, 182.463)
##AUDIT TRAIL= $$ (NUMBER, WHEN, WHO, WHERE, WHAT)
$$ ##TITLE= Audit trail, XWIN-NMR		Version 3.5
$$ ##JCAMPDX= 5.01
$$ ##ORIGIN= Bruker BioSpin GmbH
$$ ##OWNER= she
$$ F:/spectra/data/she/nmr/P31/1/pdata/1/auditp.txt
$$ ##AUDIT TRAIL=  $$ (NUMBER, WHEN, WHO, WHERE, WHAT)
(   1,<2019-08-27 14:39:51.50 +0400>,<she>,<DPX200>,
      <created by zg, POWCHK disabled, PULCHK disabled
       configuration hash MD5:
       00 E9 B6 7A A2 85 ED C7 34 08 36 98 17 FE 4E 26
       data hash MD5: 32K
       23 BE EB B2 4C B8 41 0C 8F DA B2 E5 37 33 F0 91>)
(   2,<2019-08-27 14:39:55.89 +0400>,<she>,<DPX200>,
      <Start of raw data processing
       efp BC_mod = 2 LB = 1 FT_mod = 6 PKNL = 1 PHC0 = -446.2279 PHC1 = 210.2004 SI = 64K 
       data hash MD5: 64K
       E5 C5 DB A2 79 EA 5F FE B8 AD 8C C3 5D 7A E5 DE>)
(   3,<2019-08-27 14:40:12.01 +0400>,<she>,<DPX200>,
      <pk PHC0 = 10.25485 PHC1 = 0 
       data hash MD5: 64K
       EA A9 58 DF C0 54 3F 84 5F 55 12 A8 42 85 F6 86>)
(   4,<2019-08-27 14:40:15.10 +0400>,<she>,<DPX200>,
      <abs ABSG = 5 
       data hash MD5: 64K
       A3 0D C3 95 97 C1 BD 22 C7 0D FC D5 B4 DD FE 34>)
$$ ##END=
$$ 
$$ hash MD5
$$ DC 70 5E 8E 25 E4 B5 2F A1 E2 EA 87 FD E9 5E AD
##$RELAX= 
##$RELAX= 
##$RELAX= 
##$RELAX= 
##$RELAX= 
##$RELAX= 
##$RELAX= 
##$RELAX= 
$$ Bruker specific parameters
$$ --------------------------
##$DU= <F:/spectra>
##$EXPNO= 1
##$NAME= <P31>
##$PROCNO= 1
##$TYPE= <nmr>
##$USER= <she>
##$AMP= (0..31)
100 100 100 100 100 100 100 100 100 100 100 100 100 100 100 100 100 100 
100 100 100 100 100 100 100 100 100 100 100 100 100 100 
##$AQSEQ= 0
##$AQ_mod= 1
##$AUNM= <au_zg>
##$AUTOPOS= <>
##$BF1= 81.014009
##$BF2= 200.13
##$BF3= 200.13
##$BF4= 200.13
##$BF5= 200.13
##$BF6= 200.13
##$BF7= 200.13
##$BF8= 200.13
##$BYTORDA= 1
##$CFDGTYP= 0
##$CFRGTYP= 5
##$CHEMSTR= <none>
##$CNST= (0..31)
1 1 145 1 1 1 1 1 1 1 1 1 1 1 1 1 1 1 1 1 1 1 1 1 1 1 1 1 1 1 1 1 
##$CPDPRG= <waltz16>
##$CPDPRG1= <>
##$CPDPRG2= <waltz16>
##$CPDPRG3= <>
##$CPDPRG4= <mlev>
##$CPDPRG5= <mlev>
##$CPDPRG6= <mlev>
##$CPDPRG7= <mlev>
##$CPDPRG8= <mlev>
##$CPDPRGB= <>
##$CPDPRGT= <>
##$D= (0..31)
0 1 0 0 0 0 0 0 0 0 0 0.03 2e-05 3e-06 0 0 0 0 0 0 0 0 0 0 0 0 0 0 0 0 
0 0 
##$DATE= 1566902390
##$DBL= (0..7)
120 120 120 11 120 120 24 19 
##$DBP= (0..7)
150 150 150 150 150 150 150 150 
##$DBP07= 0
##$DBPNAM0= <>
##$DBPNAM1= <>
##$DBPNAM2= <>
$$ [...]
##$SUBNAM3= <"">
##$SUBNAM4= <"">
##$SUBNAM5= <"">
##$SUBNAM6= <"">
##$SUBNAM7= <"">
##$SUBNAM8= <"">
##$SUBNAM9= <"">
##$SW= 369.568048894756
##$SWIBOX= (0..15)
0 1 3 0 0 0 0 0 0 0 0 0 0 0 0 0 
##$SW_h= 29940.119760479
##$TD= 32768
##$TD0= 1
##$TE= 0
##$TE2= 300
##$TE3= 300
##$TEG= 300
##$TL= (0..7)
0 120 53 12 22 120 120 120 
##$TP= (0..7)
150 150 150 150 150 150 150 150 
##$TP07= 0
##$TPNAME0= <>
##$TPNAME1= <>
##$TPNAME2= <>
##$TPNAME3= <>
##$TPNAME4= <>
##$TPNAME5= <>
##$TPNAME6= <>
##$TPNAME7= <>
##$TPOAL= (0..7)
0.5 0.5 0.5 0.5 0.5 0.5 0.5 0.5 
##$TPOFFS= (0..7)
0 0 0 0 0 0 0 0 
##$TUNHIN= 0
##$TUNHOUT= 0
##$TUNXOUT= 0
##$USERA1= <user>
##$USERA2= <user>
##$USERA3= <user>
##$USERA4= <user>
##$USERA5= <user>
##$V9= 5
##$VALIST= <valist>
##$VCLIST= <CCCCCCCCCCCCCCC>
##$VD= 0
##$VDLIST= <DDDDDDDDDDDDDDD>
##$VPLIST= <PPPPPPPPPPPPPPP>
##$VTLIST= <TTTTTTTTTTTTTTT>
##$WBST= 1024
##$WBSW= 4
##$XGAIN= (0..3)
0 0 0 0 
##$XL= 0
##$YL= 0
##$YMAX_a= 25469
##$YMIN_a= -24818
##$ZGOPTNS= <>
##$ZL1= 120
##$ZL2= 120
##$ZL3= 120
##$ZL4= 120
##$ABSF1= 182.463
##$ABSF2= -187.1042
##$ABSG= 5
##$ABSL= 3
##$ALPHA= 0
##$AQORDER= 0
##$ASSFAC= 0
##$ASSFACI= 0
##$ASSFACX= 0
##$ASSWID= 0
##$AUNMP= <proc_1d>
##$AZFE= 0.1
##$AZFW= 0.5
##$BCFW= 0
##$BC_mod= 2
##$BYTORDP= 0
##$COROFFS= 0
##$CY= -3
##$DATMOD= 1
##$DC= 0
##$DFILT= <>
##$DTYPP= 0
##$F1P= 0
##$F2P= 0
##$FCOR= 1
##$FTSIZE= 65536
##$FT_mod= 6
##$GAMMA= 0
##$GB= 0
##$INTBC= 1
##$INTSCL= 5.30512e-09
##$ISEN= 30
##$LB= 1
##$LEV0= 0
##$LPBIN= 0
##$MAXI= 10000
##$MC2= 0
##$MEAN= 0
##$ME_mod= 0
##$MI= 50
##$NCOEF= 0
##$NC_proc= -3
##$NLEV= 6
##$NOISF1= 182.463
##$NOISF2= 159.3651
##$NSP= 0
##$NTH_PI= 0
##$NZP= 0
##$OFFSET= 182.463
##$PC= 4
##$PHC0= -435.9731
##$PHC1= 210.2004
##$PH_mod= 1
##$PKNL= yes
##$PPARMOD= 0
##$PSCAL= 0
##$PSIGN= 0
##$REVERSE= no
##$SF= 81.0140089999434
##$SI= 65536
##$SIGF1= 159.3651
##$SIGF2= -187.1042
##$SINO= 113.3802
##$SIOLD= 16384
##$SREGLST= <1H.CDCl3>
##$SSB= 0
##$STSI= 65536
##$STSR= 0
##$SW_p= 29940.119760479
##$SYMM= 0
##$S_DEV= 0
##$TDeff= 32768
##$TDoff= 0
##$TI= <>
##$TILT= no
##$TM1= 0
##$TM2= 0
##$TOPLEV= 0
##$USERP1= <user>
##$USERP2= <user>
##$USERP3= <user>
##$USERP4= <user>
##$USERP5= <user>
##$WDW= 1
##$XDIM= 65536
##$YMAX_p= 387041792
##$YMIN_p= -6675458
$$ End of Bruker specific parameters
$$ ---------------------------------
##NTUPLES= NMR SPECTRUM
##VAR_NAME=  FREQUENCY,     SPECTRUM/REAL,   SPECTRUM/IMAG
##SYMBOL=    X,             R,               I
##VAR_TYPE=  INDEPENDENT,   DEPENDENT,       DEPENDENT
##VAR_FORM=  AFFN,          ASDF,            ASDF
##VAR_DIM=   65536,         65536,           65536
##UNITS=     HZ,            ARBITRARY UNITS, ARBITRARY UNITS
##FACTOR=    0.456856943014862, 1,           1
##FIRST=     14782.0589164792, 0,            0
##LAST=      -15158.0608439998, 0,           0
##MIN=       -15158.0608439998, -6675458,    0
##MAX=       14782.0589164792, 387041792,    0
$$ Real data points
##PAGE= N=1
##DATA TABLE= (X++(R..R)), XYDATA
$$ [...]
39119i08283K1084L28160K78426L5767j9405J53382K66542J63476k4628j49531
39109A44990k08898k15110j25538L4669J44988J44220R4407O1202M2340L2413
39099A49683M8613P3378O4064K2982k4139r2277j80285j94851o5695R4511J00397
39088c619m2853j44280j02149p726N2519J17771K03889K03141N4750j09573j36164
39077H5706q4509j27987k47251k06767R4585L98055L68778N0846j56494k1842
39067A53120K18710K27417M9196k3713L8764k2184k55093l47987j29595J14004
39057B2639P0821j19047j21078O1959J56878Q4364N011k1788p5228j05362J7690
39046b3141J79433J04153j78955l03317j07290J26748J32437L9333P2209J48310
$$ plain form
39119 -908283 -887199 -559039 -280613 -244846 -264251 -110869 155673 319149 294521 144990
39109 144990 -63908 -279018 -404556 -369887 -224899 -80679 13728 74930 117270 149683
39099 149683 198296 271674 335738 358720 334581 242304 62019 -132832 -198527 -104016 -3619
39088 -3619 -46472 -190752 -292901 -300627 -248108 -130337 73552 276693 331443 221870 85706
39077 85706 1197 -126790 -374041 -580808 -486223 -88168 280610 331456 174962 153120
39067 153120 371830 599247 648443 624730 663494 641310 386217 38230 -91365 22639
39057 22639 93460 -25587 -146665 -84706 72172 156536 161547 139759 64531 -40831 -23141
39046 -23141 156292 260445 81490 -221827 -329117 -202369 -69932 -30599 41610 189920
39036A89920O1659j20983j57565k7630N3223j3630r0504n6411K5471M8791K0648
39025f7011P686K6027M8527N8820N0140J2310m3265p2513m1292L2752R7301J17227
39013B26709R6976N5010k669o7260j06435j00578r1417j31793j77627j15404N8502
39002c55986J78207J14650l0489n1084Q3697J99141J58424K1072o6301m9202M925
38991B07054O574n6090j02597n0285P4484J54337J26095M5928j9042p9922j52078
38980A54458j79472j11750J1563J21834J94175K08739J43316O2060P3539J21946
38970H00408k707l16719n00417l04947O3165K06665O1847j00571j00919j615J04484
38959i1326J82912J70013M9290k8280M9722J06919o7957k97142k19754J02984
$$ plain form
39036 189920 251579 130596 -26969 -54599 -1376 -15006 -105510 -161921 -136450 -87659 -67011
39025 -67011 -59325 -33298 15229 74049 124189 136499 93234 20721 -20571 12181 109482 226709
39013 226709 323685 378695 376026 308766 202331 101753 10336 -121457 -299084 -414488 -355986
39002 -355986 -177779 -63129 -93618 -144702 -61005 138136 296560 317632 251331 202129 207054
38991 207054 213628 157538 54941 4656 79140 233477 359572 405500 386458 306536 154458
38980 154458 -25014 -136764 -125201 -3367 190808 399547 542863 604923 678462 800408
38970 800408 797701 480982 -19435 -324382 -261217 -54552 7295 -93276 -194195 -195810 -91326
38959 -91326 91586 261599 310889 282609 332331 439250 371293 74151 -145603 -42619
38949d2619K17268k3887k30344j04214J13879P9652j17566j66478l8107M7341
38939b65075R846k9745l150L1535L9054N7879J17704K05801K77251K52608R1650
38928G85358j02741j79619j56380j73058k16373j18866J09054K08194N0577j57212
38918D8934j99102j39834j18339q5554L9170J50956J28091N5310O1083Q4143K0577
38907D5435m1714L0945J55121J43950m424j37611j83029j60897n7400J16334K19380
38896A26090J33509l7424r4816j8989L5959l2661j79738k77407j91937R4502L65914
38885g6998L42332N9749j27545m0429Q7672L4724n0656K4411J05071k3627j95606
38874A39098j19481R6047J09035p1826j19798L7451J24305J4909r5926q2182n9228
$$ plain form
38949 -42619 174649 150762 -79582 -183796 -69917 9735 -107831 -274309 -312416 -265075
38939 -265075 -255229 -284974 -288124 -256589 -217535 -159656 -41952 163849 441100 693708 785358
38928 785358 682617 502998 346618 173560 -42813 -161679 -52625 155569 206146 48934
38918 48934 -150168 -290002 -408341 -493895 -454725 -303769 -175678 -120368 -59285 24858 45435
38907 45435 3721 34666 189787 333737 329313 191702 8673 -152224 -209624 -93290 126090
38896 126090 259599 222175 127359 108370 144329 111668 -68070 -345477 -537414 -442912 -76998
38885 -76998 265334 325083 197538 157109 244781 279505 228849 253260 358331 334704 139098
38874 139098 19617 115664 224699 152873 33075 70526 194831 209740 113814 31632 -27596
38863b7596p9954k2033J13237J31560j396o3299L1116O0323j10043k66274j89405
38852d23764J221P7837O0520R5649J43412M7382j67524k89784j94716J9858J58596
38841d71313J12328m5533j10890L0443K24740K13951j1413j89001j51815k1147
38831d19650M7399R5836J95653K37001R1503j28951j84570l1525J35433J41877
38821A80006k90j68686k51790j98045m5937Q1646Q1457k0610j01093p0981N0150
38810d64173J66255J84483R3629j4147l5357J7059L0671m2331j09354p4798J1037
38799b37026K0476o1618j05622j6981J18402J31318p927j40912j22997P76Q9914
38788c32197J08642J13929R0728l1475j88708j96528j9963J42021J33033L4691
$$ plain form
38863 -27596 -107550 -129583 -16346 115214 113818 50519 81635 141958 31915 -234359 -423764
38852 -423764 -422543 -344706 -284186 -188537 -45125 2257 -165267 -455051 -649767 -629909 -471313
38841 -471313 -358985 -404518 -515408 -484965 -260225 -46274 -57687 -246688 -398503 -419650
38831 -419650 -372251 -276415 -80762 156239 247742 118791 -65779 -97304 38129 180006
38821 180006 179716 11030 -240760 -438805 -484742 -403096 -321639 -342249 -443342 -514323 -464173
38810 -464173 -297918 -113435 -19806 -33953 -69310 -52251 -21580 -63911 -173265 -248063 -237026
38799 -237026 -216550 -278168 -383790 -400771 -282369 -151051 -158978 -299890 -422887 -422111 -332197
38788 -332197 -223555 -109626 -18898 -50373 -239081 -435609 -455572 -313551 -180518 -145827
38778a45827k0347n0524r5052o2225R5409K04806R8297r7098j31463n060P3181
38767a35903L3649l338Q430j5719p5876n2417P1822J46129N6344j41951l01978
38756d10808k85424l9272K86206L84165J37552j73324k14398m0526N0241j2919
38746c18507n7143l2562m2724m9103Q2917K44431J74244p5712j59772J0539J41123
38735h2269P9635L3625J08754P8702j41528k23652M0925L09168J86564j34238
38725B55686j78480O8229J89637K0650j51818r2429O2728R3804J5949l1276k5842
38714B26838n3063j44448k26413k06580p7469O4697J22723J16097J37552J93330
38704A53264J84100O8196o4252j19511j00106m3834K7429P0021M6658J1439L8989
$$ plain form
38778 -145827 -166174 -216698 -311750 -373975 -278566 -73760 24537 -72561 -204024 -209084 -135903
38767 -135903 -102254 -105592 -97162 -112881 -188757 -241174 -169352 -23223 33121 -108830 -410808
38756 -410808 -696232 -735504 -449298 -65133 72419 -100905 -315303 -355829 -305588 -318507
38746 -318507 -375650 -408212 -450936 -500039 -417122 -172691 1553 -74159 -233931 -223392 -82269
38735 -82269 -2634 30991 139745 218447 76919 -146733 -105808 203360 389924 255686
38725 255686 77206 145435 335072 355722 203904 111475 174203 268007 283956 252680 226838
38714 226838 173775 29327 -197086 -403666 -481135 -416438 -293715 -177618 -40066 153264
38704 153264 337364 405560 341308 221797 121691 77857 105286 175307 221965 233404 272393
38693B72393O8222k1204j74426k02179q1023N198k7477m4663M1506J16748P4095
38682B7190k6166r7985j32498r1313P8357K55750K27288L1053n6811L7118P4093
38671C26076n3638j27773k3167M4334p9259j84220p2074R0846R2490M0453Q9027
38660A43095J01348o1252j92284o9532J16692P1908q4111l2475J89874K76351
38650D59614J50211k0227j59154k48236j34961J96767L57579M5388l66205k90978
38640a0202J46084K78957m4933k64287n3537K03350J26180p3199n6351P0139L5809
38629C58010r8367j04191R379Q5687J13530J45920J00559r3555k85235k69993
38619c8256p4258J03719J43778O4129o0171j28676p2704M0491P6694M3172O6554
$$ plain form
38693 272393 340615 319411 144985 -57194 -138217 -133019 -160496 -205159 -163653 -46905 27190
38682 27190 1024 -96961 -229459 -320772 -242415 13335 240623 271676 214865 251983 326076
38671 326076 272438 144665 121498 165832 86573 -97647 -169721 -78875 13615 54068 143095
38660 143095 244443 183191 -9093 -78625 38067 109975 25864 -6611 183263 459614
38650 459614 609825 589598 430444 182208 47247 244014 601593 646981 280776 -10202
38640 -10202 135882 414839 369906 105619 52082 255432 381612 308413 252062 322201 358010
38629 358010 259643 155452 164831 250518 364048 509968 610527 516972 231737 -38256
38619 -38256 -112514 -8795 134983 199112 138941 10265 -62439 -21948 54746 97918 164472
38608A64472J39130J04624m9320j27856m7934K6465j6118n1124J7258N5064m7755
38597A66906j44191p4566L6962k2942j91197k08176n902K01474K11200N7129p6188
38586d9491o7175L3631P4615r624j04863p5814K6636M4624l1642o0161O194O5403
38574a47667P7327J13693J54942P2520j08129j70801n0548L0208p7491j89438
38564b95384r7799O6764M5237j17911j40678N4448K35189K13228P7134M050J0915
38553E5193J34m8777n3948K7024J27810J72465J72625J63610R9856p3463k64433
38542C78096l01576j83892r3241r8039n0801J07705J80456M3018q9985R110J89635
38531I0486J70788P246n2289k4835r9262j88562m1482K34341K52811p780j33259
$$ plain form
38608 164472 303602 408226 358906 231050 183116 209581 193463 142339 159597 214661 166906
38597 166906 22715 -51851 -14889 -37831 -229028 -437204 -443106 -241632 -30432 26697 -49491
38586 -49491 -116666 -83035 -8420 -18044 -122907 -198721 -172085 -127461 -159103 -219264 -213070 -147667
38574 -147667 -70340 43353 198295 270815 162686 -8115 -58663 -28455 -105946 -295384
38564 -295384 -393183 -326419 -281182 -399093 -539771 -485323 -250134 -36906 40228 44278 55193
38553 55193 55327 6550 -47398 -20374 107436 279901 452526 616136 715992 642529 378096
38542 378096 76520 -107372 -200613 -298652 -349453 -241748 -61292 -18274 -108259 -99149 90486
38531 90486 261274 268520 216231 191396 92134 -96428 -137910 96431 349242 341462 208203
38520B08203N2461K22182J16278p5155j12718p7700j02954j03834k2141j596q9429
38509A3597r4390L8742O7220j01775j78298J4061J85283N7177j53572j09075R2956
38498a68074J36492J8645l0534L2266Q2626R6746R1223j2452j80078j64109R2345
38487d904K41306O2232j18950L2325K33827L4864l73434m13458m0363K25089J42674
38476B1208K1816Q9902J50480J2842j90051k69401k17777p9379J05624J84766
38466a69970L8648j46631q4825J45775K06377M7186n1378J0961L6581l7628l3020
38455c7924O8372N0695j02280j26840M6732J59898R5395N3904J16207P4904j14327
38444B84736j68754O328R2123p9416j88403N126J89659K1714k55938k06149P3306
$$ plain form
38520 208203 260664 482846 599124 523969 411251 333551 230597 126763 104622 103026 13597
38509 13597 -80793 -42051 25169 -76606 -254904 -240843 -55560 1617 -151955 -261030 -168074
38498 -168074 -31582 -12937 -43471 -11205 71421 168167 259390 246938 66860 -97249 -4904
38487 -4904 236402 298634 179684 212009 445836 480700 107266 -306192 -346555 -121466 21208
38476 21208 43024 132926 283406 296248 106197 -163204 -380981 -460360 -354736 -169970
38466 -169970 -131322 -277953 -362778 -217003 -10626 36560 -14818 -3857 32724 -4904 -37924
38455 -37924 30448 81143 -21137 -147977 -101245 58653 154048 207952 324159 399063 284736
38444 284736 115982 122310 214433 135017 -53386 -48260 141399 163113 -92825 -298974 -225668
38433b25668J38249o0548j52891N082J57321J40948J13738J95829K44282J21299
38423F77641p8496j95386j96669j08337N3527J85652J13031j66553l84939k97584
38413c98113l399J69223P4237q8113n9390J35572K47530J57582J6864r169K0743
38402B63567l7772j54610j71798n1283Q6685J39816R4939l1496j73454j93113
38392b28519m5665R9315Q2828J0801N7453J23437n827k36793k66364q3658J9176
38381d73816l6551j3337J46449J75048p846q8513R5617K34733P6774j21645m8068
38370f1155J15234L1309j80221j52594R2259K00448Q0449j5333K9420N0676m0726
38359A49766j22891j28446j40011j72634j24107J7236J37098J79876J72005R5408
$$ plain form
38433 -225668 -87419 -147967 -300858 -295776 -138455 2493 116231 312060 556342 677641
38423 677641 599145 403759 207090 98753 152280 337932 450963 284410 -100529 -398113
38413 -398113 -401512 -232289 -158052 -246165 -305555 -169983 77547 235129 251993 242824 263567
38402 263567 225795 71185 -100613 -151896 -65211 74605 169544 138048 -35406 -228519
38392 -228519 -274184 -174869 -92041 -81240 -23787 99650 93823 -142970 -409334 -492992 -473816
38381 -473816 -510367 -523704 -377255 -202207 -210053 -298566 -202949 31784 108558 -13087 -61155
38370 -61155 54079 85388 -94833 -247427 -155168 45280 125729 110396 139816 190492 149766
38359 149766 26875 -101571 -241582 -414216 -538323 -521087 -383989 -204113 -32108 63300
38349F3300n1169j26696k4324R6890K5292j31862r9313J00759J85328R5585O3479
38338A97269J53646J36628o4354j81019m7070Q9170n1417l26191l70850j03101
38328e67289K09966L05760J69214k5530r4054j380J00067N0404j02007j82293
38318a37142j64285j75488k22416j49647O4660K16942J87533J10018J05565Q3546
38308h0714l1559j03687j9767P9792L5464m0004L7116J65872R4908j56600k93715
38297c12894j58411Q6397K08537J52680P581j14436j36365p5039m5610j07077
38287d94637j41008j2230J93258K48735Q9363j15888j89257j03310O9657K20165
38277b35152K25137O4178q8471m1043J47734K35864J28695l6733j42855k17096
$$ plain form
38349 63300 12131 -114565 -138889 -41999 -16707 -148569 -247882 -147123 38205 133790 197269
38338 197269 350915 487543 423189 242170 195100 284270 232853 -93338 -464188 -567289
38328 -567289 -357323 -51563 117651 92121 -1933 -3313 96754 147158 45151 -137142
38318 -137142 -301427 -476915 -699331 -848978 -784318 -567376 -379843 -269825 -164260 -80714
38308 -80714 -112273 -215960 -235727 -155935 -120471 -160475 -123359 42513 137421 -19179 -312894
38297 -312894 -471305 -384908 -176371 -23691 -16110 -130546 -266911 -341950 -387560 -494637
38287 -494637 -635645 -647875 -454617 -205882 -116519 -232407 -421664 -524974 -455317 -235152
38277 -235152 -10015 54163 -34308 -75351 72383 308247 436942 400209 257354 40258
38267D0258k61381j76790L8169J97058J58733J0316r1270j22019j24285p7729
38257d08940L1534J27229J52268J57438J74685J29067j423p8010m525R2266N5905
38246D27494m9098o7901k0786k7265o7399n1082l8650j36109k34377j32376J10255
38235b87294K30226J62591Q8531P2996j5330j67217j65810K3435J29910R510j17730
38224c6182o0118K7869l1164r1915K6047J55305M3793j81486j91780J6459J40919
38213a82253N7208o5644j02962r6449m8127Q6818J91029Q2066j51064k11760m1828
38202d82966R4329L3248p5834o7864J4207R5577J97515K74786J90086k1855j21774
38191A29455l1458L1778o1679j15669M0765K23831J73067m5664j83924j93545
$$ plain form
38267 40258 -221123 -397913 -359744 -162686 -3953 6363 -84907 -206926 -331211 -408940
38257 -408940 -377406 -250177 -97909 59529 234214 363281 361858 283848 279323 371589 427494
38246 427494 378396 310495 289709 262444 195045 143963 105313 -30796 -265173 -397549 -287294
38235 -287294 -57068 105523 194054 267050 251720 84503 -81307 -57872 72038 81548 -36182
38224 -36182 -96300 -68431 -99595 -191510 -165463 -10158 33635 -147851 -339631 -323172 -182253
38213 -182253 -125045 -190689 -293651 -390100 -438227 -351409 -160380 -78314 -229378 -441138 -482966
38202 -482966 -388637 -355389 -431223 -499087 -484880 -389303 -191788 82998 273084 251229 129455
38191 129455 97997 129775 68096 -47573 -6808 217023 390090 344426 160502 -33043
38181c3043j90769j65752j6012J94966K73901J73491K8917n5152p7893m5093K4557
38170A12118L4898p3829j81595j26957M1841J20178L2764r0083j14291m4212L1158
38159b58010K6619p9546j87322j42958L9794J36819K7610q4718K9021K29886J90294
38148g2511r0601k60946j30142Q9360J46834R4385J11455J93306K01144J01480
38138C83764j2110p2057q6898p9388o0856l6266O504O1640N2402q2284k25341
38127a50890j53872J45175L73965K70176m8863k39193j59218J5471P4202K018
38117A28971q8831j17878p9248k0541j1904n6760l3916J52128L54500K89907o3012
38106D53416l50249k74955P932J30214K2569p3678m3601l2319j10334j25280p317
$$ plain form
38181 -33043 -223812 -389564 -405576 -210610 63291 236782 265699 210547 132654 87561 112118
38170 112118 147016 73187 -108408 -235365 -193524 -73346 -40582 -130665 -244956 -289168 -258010
38159 -258010 -231391 -310937 -498259 -641217 -601423 -464604 -436994 -521712 -492691 -262805 -72511
38148 -72511 -163112 -424058 -554200 -464840 -318006 -223621 -112166 81140 282284 383764
38138 383764 371654 299597 212699 133311 72455 36189 42693 104333 156735 74451 -150890
38127 -150890 -304762 -159587 214378 484554 435691 196498 37280 52751 126953 128971
38117 128971 40140 -77738 -156986 -177527 -189431 -246191 -280107 -127979 226521 516428 453416
38106 453416 103167 -171788 -163856 -33642 -11073 -84751 -128352 -160671 -271005 -396285 -403602
38095d03602O5761j8600q9758O91J00007L8196l4178R4583K85247K55804O8681
38084C62832J6709J00982M4312j85343k95789j75152o4259j11769j43287l0868
38074d81632O0561j1915j10638o8058O0982J58398K05400J67120R49j18929O0129
38063g7633L76855L25980j69696n13673k75415J67359K36191K746p0231P2625
38053G5108J02878n5273j58457j24135r3772p4747M3881J70410J12942n6200j24358
38042a81723j31890k29736k62358K1149M13496M40510J06763q7278O4887K04266
38032C58086N7000j54082j56354m5847j6912l2715R42K6408q063l8879o5809j64074
38020b40299k27647l5266L14280M02587R2498k30638k15548j0J10255Q5112L6735
$$ plain form
38095 -403602 -337841 -356441 -446199 -445508 -345501 -307305 -341483 -246900 38347 294151 362832
38084 362832 379541 480523 524835 339492 43703 -131449 -195708 -307477 -450764 -481632
38074 -481632 -421071 -432986 -543624 -611682 -550700 -392302 -186902 -19782 -18833 -137762 -77633
38063 -77633 299222 625202 455506 -58167 -333582 -166223 69968 72714 2483 75108
38053 75108 177986 122713 -35744 -159879 -253651 -328398 -284517 -114107 -1165 -57365 -181723
38042 -181723 -313613 -543349 -805707 -784558 -371062 69448 176211 88933 153820 358086
38032 358086 415086 261004 104650 58803 41891 9176 10118 36526 28463 -10416 -76225 -240299
38020 -240299 -467946 -503212 -188932 213655 306153 75515 -140033 -140043 -29788 55324 92059
38009I2059n7767k13915k58927p2702J71253K38175J38200J2480r5606j68563
37999b15313j11403Q1231K23931J79364L9162o0259j07481q8826O8046K83123
37989B91575L04828N9080k16849l18943k87947j65225J12894M04415L40182j16356
37979D07654m55095k93261O9763J36191o5926j64760q5137l2282j6869J17645
37969c82077K86517K38783J1516r5389J874P9931J1244p4389o9199l8113l8890
37958f8192k7963J3064M3189O2054Q9528Q1527J1460l9939k2718l1357j22394
37947a1741j70593r1382k4287p5229q5342P1353J81648K6305j80620r0989J85933
37936b64944K36086N046j45597l4771J22625J39769R7968Q6985N6274M239R407
$$ plain form
38009 92059 34292 -179623 -438550 -511252 -339999 -101824 36376 48856 -46750 -215313
37999 -215313 -326716 -245485 -21554 157810 196972 136713 29232 -59594 8452 291575
37989 291575 596403 655483 438634 119691 -168256 -333481 -220587 183828 524010 407654
37979 407654 -47441 -340702 -270939 -134748 -200674 -365434 -450571 -482853 -499722 -382077
37969 -382077 -95560 143223 154739 59350 61224 141155 152399 78010 8811 -29302 -68192
37958 -68192 -96155 -83091 -39902 22152 111680 193207 204667 164728 142010 110653 -11741
37947 -11741 -182334 -273716 -298003 -373232 -458574 -387221 -205573 -179268 -359888 -450877 -264944
37936 -264944 -28858 -23812 -169409 -204180 -81555 58214 156182 243167 299441 303680 313087
37925C13087K5410n6600j33103j3996J72825R6214k10322l21010p5522J59842
37915d3175P8636j12232q5734Q7272J22126p904q9015j9124J07017J76598J37120
37904C51585k1372k14807k76447j42749M1349R1358r485j25264j17569L9078K13939
37893a70384K17878M4769o4554M3301J57085J3255k24350j58969J92563L62859
37883D13453J21016k09358k73737j49592p1411l6060M3997P0610n5684j79678
37873c26444j02806R3865J82107J19157L6556J2254L6223Q5129Q2741o1981k40561
37862h3760j78468J38844L16406P8849k80056k99224j8435J35713K3308p0308
37852b37131K6239J00660m5898k49267k24378L8472L03162M01947L66975K98693
$$ plain form
37925 313087 338497 281897 148794 134798 307623 403837 193515 -127495 -203017 -43175
37915 -43175 35461 -76771 -162505 -75233 46893 38989 -50026 -69150 37867 214465 351585
37904 351585 330213 115406 -161041 -303790 -262441 -171083 -180568 -305832 -423401 -384323 -170384
37893 -170384 47494 92263 27709 71010 228095 241350 17000 -141969 50594 413453
37883 413453 534469 325111 51374 -98218 -169629 -205689 -161692 -91082 -146766 -326444
37873 -326444 -429250 -335385 -153278 -34121 2435 14689 50912 136041 218782 156801 -83760
37862 -83760 -262228 -123384 193022 271871 -8185 -307409 -325844 -190131 -166823 -237131
37852 -237131 -210892 -110232 -156130 -405397 -629775 -591303 -288141 113806 480781 779474
37842G79474K22216R1656r8679k40031k03145k8600O8694l5657j97494k10633
37832A47801j05244o9828j28431j12720K4749R4239l0626j81220j30732N6760
37822d35252J20380J687p8828P662P7173n8493k33245j35378J86064L26764J03875
37811a17591j62699j16824J30301K19226R2523J0880R2925J62862P9456o0244
37801C30815j14765p7765n80P5171O5324q2371k27054j58304P8528K05848J12830
37790B07677j6216m3331o9540j61328j63743K2007K09260J96857Q2483P5342J46979
37779D86447J09871n3889j67365j15885L8184J57381J30818n5933k58363k79783
37769h517j25663j8030o7894j11465j236J36370J17147j14l6835K5904R8374J72058
$$ plain form
37842 779474 1001690 1093346 994667 754636 551491 522891 591585 555928 358434 147801
37832 147801 42557 -27271 -155702 -268422 -243673 -149434 -180060 -361280 -492012 -435252
37822 -435252 -314872 -313185 -392013 -384351 -307178 -365671 -598916 -734294 -548230 -221466 -117591
37811 -117591 -280290 -397114 -266813 -47587 44936 55816 148741 311603 391059 330815
37801 330815 216050 138285 137705 212876 278200 195829 -31225 -189529 -111001 94847 207677
37790 207677 191461 148130 78590 -82738 -246481 -224474 -15214 181643 264126 339468 486447
37779 486447 596318 542429 375064 259179 297363 454744 585562 529629 271266 -8517
37769 -8517 -134180 -152210 -220104 -331569 -332805 -196435 -79288 -79402 -116237 -90333 8041 180099
37757A80099K40288J69887r9099l40041k90334l4508J19594P7400O317k40k8918
37746D45j20338j86770j74819j08975J6367J90100K68401J32429p3496j07110
37736a63766K348K6640m4212R067J93052K16329k0637j95663m5704K06595J90687
37725C74736m8672j48484N819J29322k1791l05108l86687j45434K11753L81338
37715D6792K50889k3709j97089j76457o7095M131L3390P6322J23378J23050Q6369
37704B79971P2405P8080L7014n0777q1183j954O5376l1176k29032k80931p6373
37693b18580J84696K37891Q6753m2763k4746M9522O4937K3940l8430j25616k06249
37682h645k04367j26408p0882n3608K9983J92378K70245J71478M5963N1230Q7712
$$ plain form
37757 180099 420387 590274 491175 151134 -139200 -173708 -54114 23286 29603 29363 445
37746 445 -119893 -306663 -481482 -590457 -574090 -383990 -115589 16840 -56656 -163766
37736 -163766 -161418 -134778 -178990 -169923 23129 239458 218821 23158 -22546 184049 374736
37725 374736 326064 177580 183399 312721 290930 -14178 -400865 -546299 -334546 46792
37715 46792 297681 273972 76883 -99574 -166669 -162538 -129148 -52826 70552 193602 279971
37704 279971 352376 430456 467470 416693 335510 333556 398932 367756 138724 -142207 -218580
37693 -218580 -33884 204007 290760 247997 223251 272773 337710 361650 323220 197604 -8645
37682 -8645 -213012 -339420 -410302 -463910 -433927 -241549 28696 200174 246137 297367 385079
37671C85079l1277k40960k84926q9226J32378J75162P5828j1166m1800r6837k19525
37660b47270l14683k36173K4366K73824L06246J41559j3626l9493j4318l3631
37650a53199o7727n9894k5247K4906J22136K24331K00094J8507j80294k79840
37640a76227k98219k41390n5547J74403K21906O6285p468J50038K76542J18408
37630B28731j32877j51701m230J9363p1055l5165J06040R5878o7687j09241K2711
37619i9233O0859q2854j36118N7048K43987J64933m4345r4409K2820Q1968j7840
37608A56816j46846j47477j9986Q0373J0526j57758j68875P0630K83906J65858
37598A27167j58956k92922j26074P5656J30594J37139J62322J00717m1793o7160
$$ plain form
37671 385079 353802 112842 -172084 -261310 -128932 46230 122058 110892 69092 -27745 -247270
37660 -247270 -561953 -798126 -773760 -499936 -193690 -52131 -65757 -105250 -119568 -153199
37650 -153199 -220926 -280820 -306067 -281161 -159025 65306 265400 283907 103613 -176227
37640 -176227 -474446 -715836 -771383 -596980 -375074 -308789 -316257 -166219 110323 228731
37630 228731 95854 -55847 -60077 -40714 -111769 -146934 -40894 54984 -12703 -121944 -99233
37619 -99233 -38374 -121228 -257346 -200298 43689 208622 164277 69868 92688 174656 156816
37608 156816 9970 -137507 -157493 -77120 -66594 -224352 -393227 -322597 -38691 127167
37598 127167 -31789 -324711 -450785 -375129 -244535 -107396 54926 155643 113850 46690
37588D6690N9865R6916o1685j69532l6796J41005J10732m0165q2927k7323k4348
37577A2432o7258n9800l3639m7669j9193R6709J20259q0351k75497j53007J85897
37566c21117L42428J87809j4395n6335l1337o4792r2639l7192J8335j7849o8390
37555a55474o75J71571L02926K72106O7050k09690l70730k70432J8631K21017
37545D6300J41587r8124j97334m8050J28089P0516j67494k77070j02785J47476
37535c56889J82421K343j43508j05229K9330J24919J55499J45323J05327P4326
37525B13862R8446J33087Q7864o887k1330N3815P0420l6798j38228j19029m3939
37514B91283j6719k6613m4899j22981k55202k79078q3354J74986K38325Q8912
$$ plain form
37588 46690 106555 203471 141786 -27746 -64542 76463 187195 147030 64103 36780 12432
37577 12432 -54826 -114626 -148265 -195934 -215127 -118418 1841 -78510 -354007 -507014 -321117
37566 -321117 21311 209120 194725 138390 107053 42261 -50378 -87570 -69235 -87084 -155474
37555 -155474 -156149 15422 318348 590454 657504 447814 77084 -193348 -174717 46300
37545 46300 187887 89763 -107571 -155621 -27532 42984 -124510 -401580 -504365 -356889
37535 -356889 -174468 -172125 -315633 -420862 -391532 -266613 -111114 34209 139536 213862
37525 213862 312308 445395 533259 526372 505042 558857 629277 592479 454251 335222 291283
37514 291283 274564 247951 203052 80071 -175131 -454209 -537563 -362577 -124252 -35340
37504c5340l9807J2490J36167J20621o4676k29719k03286n5232K724o4601m7106
37493d67765J66647L47938K36572m0237j41263k9455K1651o9152o5754J22017
37483H1199K35472J01402p5182p2587N697J575J8879J70562K70655J21112r9024
37472G59760r0787P4147Q5975r1141k07616j65949j11553j03656l0714J21518
37462B39984K07103J60594N8787o3657k19270k99354j66991O6780J23596m7194
37452F0378j97829j48789O749J10418J26423P3418j8729m3246Q2583K24460J66130
37441D41966l9985j16448K396O8898n1187j52249m6189J25650J42193M2837l092
37430D14790J1074q732m6672m7274p2693j71356k04132m2313J49227R4666j62997
$$ plain form
37504 -35340 -75147 -62657 73510 194131 129455 -100264 -303550 -358782 -356058 -420659 -467765
37493 -467765 -301118 46820 283392 243155 101892 72437 94088 24936 -40818 81199
37483 81199 316671 418073 342891 270304 276001 277576 296455 467017 737672 858784 759760
37472 759760 668973 743120 829095 737954 530338 364389 252836 149180 118466 239984
37462 239984 447087 607681 666468 602811 383541 84187 -82804 -16024 107572 60378
37452 60378 -137451 -286240 -279491 -169073 -42650 30768 12039 -31207 51376 275836 441966
37441 441966 401981 285533 287929 356827 305640 153391 107202 232852 375045 417882 414790
37430 414790 425864 417132 370460 323186 250493 79137 -124995 -167308 -18081 76585 -86412
37419h6412k90305j44056M3492M4168m6326k1120R5562J25090M4266m373J7851
37408b22163j7988j57993k37578j13066J08556K10195J56642R5259J02843R7118
37398B1825J9111m8513j2867Q7008J44114J14780K8424o1023q2963Q801J44183
37387C62880J68697L3070j28995j76737j24152n2844K5203J07672J09831j8628
37377C05997j53118j29285J5375Q4233r731j56116k19545j65105j6104J68878
37367b74521K62364J60581m6341j33031l0339P0580o632j64970j83346m2342P1320
37356c16677P0702Q9735K24129L16250J64513j36950k75749j41541L7903M6694
37346G9009l7788m3441O771j15k2981L1001O6793o2645k43686k19454j464J38060
$$ plain form
37419 -86412 -376717 -520773 -477281 -433113 -479439 -500559 -404997 -279907 -235641 -240014 -222163
37408 -222163 -240151 -398144 -635722 -748788 -640232 -430037 -273395 -178136 -75293 21825
37398 21825 40936 -7577 -20444 66564 210678 325458 353882 292859 209896 218697 362880
37387 362880 531577 564647 435652 258915 134763 81919 107122 214794 324625 305997
37377 305997 152879 23594 38969 123202 113471 -42645 -262190 -427295 -443399 -274521
37367 -274521 -12157 148424 102083 -30948 -61287 9293 2661 -162309 -345655 -387997 -316677
37356 -316677 -245975 -156240 67889 384139 548652 411702 135953 -5588 32315 79009
37346 79009 41221 -2220 4551 4436 -18545 12456 79249 16604 -227082 -446536 -448000 -309940
37334c09940R6698M5567O0060l357j56618j63092N2499K05816R0330q1414l6474
37323a99925J15778R5854r2078k19461j96955j01623L2375J90617K57203J56269
37313C8054J5340j3657K7951M5856P3417J12152J3230k27961k96305M268L54142
37302A46487L30657L3113j11975j9842K7413o7541j11365m8247m4955j18069r4280
37291g8604P279m0386k27761k41750M0054L35999L67361J76076o2696k47195k81592
37280b53215j05753J17329J36746L255P988J79700K19739L2985r5237k0441p702
37269B15394k22498l59017j34167J74718J18036k07055k82351N6432L95059L47668
37259A02219M6122j25375n3197N3372L5050q656O7123J88621J70742K3154o3588
$$ plain form
37334 -309940 -213242 -167675 -107615 -110972 -267590 -430682 -378183 -172367 -82037 -163451 -199925
37323 -199925 -84147 11707 -80371 -299832 -496787 -598410 -566035 -375418 -118215 38054
37313 38054 53394 39737 67688 113544 186961 299113 312343 84382 -211923 -207655 146487
37302 146487 477144 510257 398282 378440 405853 338312 226947 178700 133745 15676 -78604
37291 -78604 -71325 -111711 -339472 -581222 -541168 -205169 162192 338268 275572 28377 -253215
37280 -253215 -358968 -241639 -104893 -101638 -93650 86050 305789 338774 243537 223096 215394
37269 215394 -7104 -366121 -500288 -325570 -207534 -414589 -696940 -640508 -245449 102219
37259 102219 148341 22966 -30231 23141 58191 49535 116658 305279 476021 499175 435587
37248D35587n2711j24134l00034l01220J077K66884J46741j63155k19196j5385
37238c25546Q3800o883j7831J09211J03033r3962j57593O7452K80230K02923j9395
37227B25439j21550j00866p7053n1300j4553m9830j44487j29822M1528J87673
37217b34821J89566J47953J44149J07697K2013j5202k6337j50950l27877l08866
37207d52675p7439R4553R1856P4720P6907o3647k57124j54125K26105L88494J36348
37196H3973q7899M2266J93360O432k38032j11775K17877K90047Q2154q6630j21973
37185B69800j29442o5832J06886J53963p6147k68227r5814J83249J11882j99586
37175i268k58723K368J76831O9023j00558j51898j31520n4582J12043K28682J30478
$$ plain form
37248 435587 382876 258742 -41292 -342512 -341435 -74551 72190 -90965 -310161 -325546
37238 -325546 -241746 -248629 -266460 -157249 -54216 -148178 -305771 -238319 41911 244834 225439
37227 225439 103889 3023 -74030 -125330 -139883 -189713 -334200 -464022 -422494 -234821
37217 -234821 -45255 102698 246847 354544 376557 361355 335018 184068 -143809 -452675
37207 -452675 -530114 -435561 -343705 -268985 -192078 -255725 -512849 -666974 -440869 -52375 83973
37196 83973 -3926 38340 231700 238132 100 -111675 106202 396249 478403 391773 269800
37185 269800 140358 74526 181412 335375 259228 -8999 -104813 78436 190318 -9268
37175 -9268 -267991 -265623 -88792 -19769 -120327 -272225 -403745 -458327 -346284 -117602 12876
37164A2876n1844p8782j1029n3801j25606r419J87871J84065L0437O320R3426
37153A84514L8308j26377j17675P3229J68573R1623J1085n2121j89338k43023
37143a61202R90L14086K73201k4036q9316J12522J06773k21763l84889j12842
37133a86476K15786K33567J00649O0008M451j69614k38741m5520J66568J43733
37123B84411J0159k4220j1749n0846n2799J4853j2618j43044r4586K04815L62636
37112D87012J01895k51823k43961L9890J75202L9178j38582j93426j37604R175
37102a13044J86876K14459J8000j84390j70274m0519k0395r4202r2752K933R5688
37091a97620J69186K16792J32496q1639j70047L5801K86161K28755o4763k11536
$$ plain form
37164 12876 -38968 -117750 -128779 -182580 -308186 -317605 -129734 54331 84768 91088 184514
37153 184514 222822 96445 -21230 51999 220572 312195 323280 271159 81821 -161202
37143 -161202 -160212 153874 427075 403039 313723 426245 533018 311255 -73634 -186476
37133 -186476 29310 262877 363526 423534 427985 258371 19630 -25890 140678 284411
37123 284411 294570 270350 258601 207755 154956 169809 157191 14147 -80439 124376 487012
37112 487012 588907 337084 93123 133013 308215 347393 208811 15385 -122219 -113044
37102 -113044 73832 288291 306291 121901 -48373 -88892 -109287 -203489 -296241 -293308 -197620
37091 -197620 -28434 188358 320854 239215 69168 104969 391130 619885 555122 343586
37081C43586q4121O0049N468j54921k20152j26479N6091K14168K50245J62461
37071E06395N6711M081m2165j05605r3763K0723P3010n3173j91901j33651J0492
37060E1154l5605k39363k54156N6310L71926L44116O6993q2965K4417J29093j7593
37049D14327k97859l99575k43501n8852l1910o9358n816J17163J47521Q9613P2247
37038b66000J01241N1844r4278j93164j45155m190J36288K28876K41158J72659
37028B29279R4534N4392p739j14981j25348N5937K39302J78287m8110j67193j55034
37017B33326k08665l13638k33094K8905J52346Q009j26584k2513J56489J66129
37007a59290O2928N1048J45389J86567P1219j46454k83707j56279J67842L12430
$$ plain form
37081 343586 259465 319514 324982 170061 -50091 -176570 -120479 93689 343934 506395
37071 506395 563106 567187 525022 419417 325654 346377 419387 366214 174313 40662 51154
37060 51154 15549 -223814 -477970 -421660 -49734 294382 361375 278410 302827 431920 414327
37049 414327 116468 -283107 -526608 -585460 -617370 -686728 -692544 -575381 -427860 -338247 -266000
37038 -266000 -164759 -112915 -207193 -400357 -545512 -549702 -413414 -184538 56620 229279
37028 229279 323813 378205 370466 255485 130137 186074 425376 603663 555553 388360 233326
37017 233326 24661 -288977 -522071 -493166 -340820 -332811 -459395 -481908 -325419 -159290
37007 -159290 -96362 -45314 100075 286642 357861 211407 -72300 -228579 -60737 251693
36997B51693M6260k97696k18771J96623L74821J19902j42436r1768N9069O3757
36987C61454M2515J04120N7431j71216k79443r6668P5010p778q8971Q4391K46733
36976C27578Q6384j49329o6027J75411J46921r8397j60270o363L7036q8615j27357
36965G6972m6520p6024k02509j41917J24731K63361J29426k7048j3256L5486k4414
36954I8288q9292l1885Q0329J30881J16926P0369p482p2680o3921l1088p8723
36943A21722j73588j71730m0256R7371J30019N0144q0742j46035l9072J68289
36933h3878K47808J35131N1105J32018J60312p7348l68028l41054k4942K05487
36923C6611J59716r342j19889j34313n7759O5281R5648k0275r5137L4855K10257
$$ plain form
36997 251693 297953 257 -218514 -21891 352930 472832 330396 238628 297697 361454
36987 361454 403969 508089 565520 394304 114861 18193 93203 85425 -3546 80845 327578
36976 327578 413962 264633 198606 374017 520938 422541 262271 255908 292944 204329 76972
36965 76972 30452 -45572 -248081 -389998 -265267 -1906 127520 100472 87216 122702 98288
36954 98288 8996 -22889 57440 188321 305247 375616 368134 295454 231533 200445 121722
36943 121722 -51866 -223596 -263852 -166481 -36462 13682 -67060 -213095 -252167 -83878
36933 -83878 163930 299061 350166 482184 642496 565148 197120 -143934 -168876 36611
36923 36611 196327 186985 67096 -67217 -124976 -59695 35953 15678 -79459 -44604 165653
36912A65653J87725M1965R125O0740K83j19459p9457O3498L8066j45481j79006
36901D3652K0764J73221J01959k7389n0812m9038j03637j03507L6831J87091J83301
36890D12436M6447q0665r2734K3403J72909J94103M0430j21780j31908o1780n8595
36879C42266q7060m3062R404k9090n6320M8116J36224J6739j58708j09199P4220
36868A43530N7477j56526k18033j4993J63360J15789j2970n8034n9027n3822K6067
36857f7182J47564J54168L8298l2630j3987l3687j15560j41778j08025j14911
36847b87730j07021M7924K28027J76901l9013r3163N6988J19265Q362k9976O8061
36836A48625M1894j59789j98111O7681K76586J43378q2480p0375N5661J0815j32884
$$ plain form
36912 165653 353378 395343 404468 465208 465491 346032 266575 330073 368139 222658 43652
36901 43652 64416 237637 339596 312207 261395 212357 108720 5213 42044 229135 412436
36890 412436 458883 378218 285484 308887 481796 675899 716329 594549 462641 400861 342266
36879 342266 255206 212144 221548 192458 136138 184254 320478 337217 178509 69310 143530
36868 143530 201007 44481 -173552 -188545 -25185 90604 77634 19600 -39427 -93249 -67182
36857 -67182 80382 234550 272848 240218 226231 192544 76984 -64794 -172819 -287730
36847 -287730 -394751 -346827 -118800 58101 19088 -74075 -17087 102178 110540 80564 148625
36836 148625 190519 30730 -167381 -99700 176886 320264 237784 167409 223070 233885 101001
36825A01001j23628N787L7152l4841n3976k1066l7915m2898Q4136K31798J77876
36814C23426l3793j21181J7292J61749J10098m2524p3434M3113J19077L1981j07471
36803D28333j28229m5186L492J5445J09260K29028J35931j78720l55354j63247
36793E0753J23701J37897k9244l9186J19734J74252N9505l7384n3106q3591j07965
36782C15366m4243j431j06970j91549m5317J45733P3827j22062q4295R5183L7323
36771G1565j74465q4854K85757L97382J00189j21473l806Q8591j18175l18927
36761A21784j94223Q5449K44531K95644K63773J7577l43264m30910j74967J1211
36751a03395q1012j40234L3471J69191R8706P8669K00721J20636k31837l46166
$$ plain form
36825 101001 -22627 -16840 20312 -14529 -68505 -89571 -127486 -170384 -86248 145550 323426
36814 323426 289633 168452 185744 347493 457591 415067 341633 384746 503823 535804 428333
36803 428333 300104 254918 258410 273855 383115 612143 748074 569354 214000 50753
36793 50753 174454 312351 283107 243921 363655 537907 597412 560028 506922 423331 315366
36782 315366 271123 269692 162722 -28827 -74144 71589 145416 23354 -60941 34242 71565
36771 71565 -102900 -187754 98003 495385 595574 474101 470295 558886 440711 121784
36761 121784 -72439 13010 257541 553185 816958 834535 491271 60361 -114606 -103395
36751 -103395 -184407 -324641 -291170 -121979 -23273 55396 256117 376753 144916 -201250
36741b01250m251K28116m9923l20150l5426L67862J79455l59354m48655k3090
36731f66666K53306J13495m3969L1546J18918O2157P766L7577N6972O8165J40695
36720A79962J63483J3132j49811j37649j02601k28082k91705l5048K64069J64465
36710a59785j72558k04738J14490L02930J51860m1252o1924m1816p0481m1749
36700b25023L4356j214j17649j07367L6574J13890P4229L3149j2985j28174j79526
36689d79740k1489J66795J31630N302P3569K21891J20959j42554j75603L2518
36679f6722J02580n1297j04636N2514J32439L579r4678l6591k6036j59264k16181
36668d64293p5573N9783M3563L2332J58044K69483J95796J6955r1214q3274j1341
$$ plain form
36741 -201250 -205501 22615 -27308 -347458 -382884 -15022 164433 -194921 -643576 -666666
36731 -666666 -413360 -299865 -343834 -312288 -193370 -131213 -123447 -85870 -28898 39267 179962
36720 179962 343445 356577 206766 69117 -33484 -261566 -553271 -588319 -324250 -159785
36710 -159785 -332343 -537081 -422591 -119661 32199 -9053 -70977 -112793 -183274 -225023
36700 -225023 -190667 -191881 -309530 -416897 -380323 -266433 -192204 -159055 -172040 -300214 -479740
36689 -479740 -501229 -334434 -202804 -197502 -123933 97958 218917 76363 -99240 -66722
36679 -66722 35858 -15439 -120075 -67561 64878 68457 -26221 -62812 -88848 -248112 -464293
36668 -464293 -539866 -480083 -436520 -404188 -246144 23339 219135 236090 144876 61602 50261
36657E0261N7449M3582n7906j09396k7200L7300o2070j69651o3194J37476J38664
36646b4685m9046j60068j15208m7348K2646J46168J75391m5006k87687j90328
36636e75171J54262L11569J77399O3247J12714J19373k5108j59055j95177k17677
36626b33624j86720L5829L22455L62922J55107j229k0940r6367k20547j43988
36616b7102J09667J79588m3319k19053j08450R8142J64591J32242R5042Q302j17126
36605B72524j41978m9224J0360p343j597K1392k9150p2959K4355J20458j9348
36594A27490k52212k17268O6002K34101J88228J51159J32673q2669l75527l34270
36584c62293L1228K23577N9201o7720Q2029K04582O1226j01957o1962k4376j71120
$$ plain form
36657 50261 107710 151292 93386 -16010 -43210 -5910 -67980 -237631 -300825 -163349 -24685
36646 -24685 -73731 -233799 -349007 -396355 -373709 -227541 -52150 -97156 -384843 -575171
36636 -575171 -420909 -109340 68059 131306 244020 363393 338285 179230 -15947 -233624
36626 -233624 -420344 -384515 -62060 300862 455969 454740 433800 337433 116886 -27102
36616 -27102 82565 262153 218834 -219 -108669 -10527 154064 286306 381348 389650 272524
36605 272524 130546 81322 91682 84339 82742 104134 74984 2025 26380 146838 127490
36594 127490 -124722 -341990 -275988 -41887 146341 297500 430173 347504 -28023 -362293
36584 -362293 -331065 -107488 -48287 -116007 -33978 170604 231830 129873 67911 43535 -127585
36573a27585k66837q4036J72022K11689R5188J3763m0516j06008o2276J25103
36563f9493K52203J94823J04208J02457P8244m4849j41731j45174j67236k29663
36553f6211j90606n1120K471m4610J608J44853J59166L2572K7167J97171K78373
36542D90834J61628M1747L750q6569k01746j43065J9487O119j25998n9873J18660
36531B24974q784l76190m16126k4093K23891N8655o3104J48881K98912R7764q3995
36520H0785N1951J58131n5331k13590K7028K84582R4132k80946l22919r1070L5354
36509b31893L2300O4692L7756j26159j47463J34648L39409J31801j76435j62001
36499a03345k160n9755j71918o217K30854J27802j67671j95343J8846O4210j06714
$$ plain form
36573 -127585 -394422 -478458 -306436 -94747 441 14204 -26312 -132320 -194596 -69493
36563 -69493 182710 377533 481741 584198 662442 617593 475862 330688 163452 -66211
36553 -66211 -256817 -307937 -305466 -350076 -348468 -203615 -44449 -11877 15290 212461 490834
36542 490834 652462 694209 697959 611390 409644 266579 286066 292185 166187 106314 224974
36531 224974 216190 -160000 -576126 -600219 -376328 -317673 -380777 -231896 67016 164780 80785
36520 80785 132736 290867 235536 21946 48974 333556 427688 146742 -176177 -267247 -231893
36509 -231893 -199593 -134901 -97145 -223304 -370767 -236119 103290 235091 58656 -103345
36499 -103345 -105505 -165260 -337178 -343395 -112541 15261 -152410 -347753 -328907 -264697 -371411
36488c71411j53507J2477J19896L9364o2165n1746L0802J14695J31299K5895q9072
36477b53473j0981J86009J90150o230m7532J28078J18837j95611l47256p2344
36467c10353K11706J47890K4806J28696J58657j31339l34410q9557K07318R0247
36457A03661j37056L749K59973J48145j10147r106K75608K12255j10223j87514
36447D49345k7390l9200k02485j48572Q8254J50142M0526L8459R4187k8783j96346
36436B18137j30123K3082k6944j20710K6508K04117P8613j27919l0339J74881
36426B89303Q6416j18750m5743J18648k1066k34775o4178K64175K17993n0567
36416D41456k6374J45654m9775m29642l72687K6037J10653j46028j61215J26258
$$ plain form
36488 -371411 -524918 -512441 -392545 -353181 -415346 -467092 -436290 -321595 -190296 -164401 -253473
36477 -253473 -264454 -78445 111705 105475 57943 186021 304858 109247 -238009 -310353
36467 -310353 -98647 49243 74049 202745 361402 230063 -104347 -193904 13414 103661
36457 103661 -33395 -29646 230327 378472 268325 259219 534827 747082 636859 449345
36447 449345 421955 382755 180270 31698 119952 270094 310620 349079 443266 414483 218137
36436 218137 88014 111096 84152 -36558 -10050 194067 272680 144761 114422 289303
36426 289303 375719 256969 211226 329874 308808 74033 9855 274030 492023 441456
36416 441456 415082 560736 510961 81319 -291368 -265331 -154678 -300706 -461921 -335663
36406c35663K01258J9985N7211K91938J95642k06096k93583K7816J75511k8464
36396A05555j19354L2632K351k59872k52921J13409L13642J67462R3540K12813
36386D09257J24254k12964k99949l8143N8086j67585k32051M3141K05965O4275
36376d5714J0814J75067J42594j71922k58489M4618K07342l3885k14612j4561
36366a58748K14181J71083R2796J50830J03229j11992j57092K7901N0514j68459
36356B14243k07459L5127J25550n6527q1656J62001K21441k9692j30606N5678
36346C08100Q2200j39611j03561K50071K73840j94593m19418m5366K49361k6987
36336B34036l17222o8833K82921J55162j77337j98099n2519q0524r6363J36703
$$ plain form
36406 -335663 -134405 -114420 -57209 234729 430371 224275 -69308 -41492 134019 105555
36396 105555 -13799 18833 21184 -238688 -491609 -378200 -64558 102904 196444 409257
36386 409257 533511 320547 20598 -17545 40541 -127044 -359095 -315954 -109989 -45714
36376 -45714 -34900 140167 282761 110839 -147650 -103032 104310 70425 -144187 -158748
36366 -158748 55433 226516 319312 470142 573371 461379 304287 332188 382702 214243
36356 214243 6784 41911 167461 110934 29278 191279 412720 383028 252422 308100
36346 308100 390300 250689 147128 397199 671039 476446 57028 11662 261023 234036
36336 234036 -83186 -152019 130902 286064 108727 -89372 -141891 -222415 -318778 -182075
36326a82075L02266R1056j71362q6089J41085J48632L3866N485n0671j87556j32776
36315h8139J51324K32385m4875k07296K4247K28410N3105j82322j29406L153k6330
36304A4256k9780J06712J09873q1903q9254J62013K01106j15079k84427q8022
36294i4505J8793j64198j79700J30428K39599j7482m3300L43828M21935j11108
36284E44290m49254o1989L44445J00798k67536j02961J83682K513k58056l4610
36274A322K89759J38392j54029l8582J80837J3186k04286N871K54971J4971l20045
36263A82367j47703K11885J43280j30062p4847J01889l6334k02603K0225K39187
36253C07284m6590l96558j49572L65817M04570N8360r9543r1977k39337l16006
$$ plain form
36326 -182075 120191 211247 39885 -46204 94881 243513 277379 282864 232193 44637 -88139
36315 -88139 63185 295570 250695 43399 67646 296056 349161 166839 37433 40586 14256
36304 14256 -15524 91188 201061 119158 29904 191917 393023 277944 -6483 -94505
36294 -94505 -75712 -239910 -419610 -289182 -49583 -67065 -110365 233463 655398 544290
36284 544290 95036 33047 377492 478290 210754 107793 291475 293988 35932 1322
36274 1322 291081 429473 275444 236862 417699 430885 226599 232470 487441 502412 182367
36263 182367 34664 246549 389829 259767 184920 286809 250475 47872 68097 307284
36253 307284 260694 -135864 -285436 80381 484951 543311 443768 351791 112454 -203552
36243b03552j3558K82811J45188n3037J09923J95759k23035n27937m9988O01341
36233B63915M56386j86190l36811K0669J42668n5580p4068O1287l2884j75098
36223H4294J7974K44329N8078j73838P3572M05010J91383k20323j22947K86153
36213H43685L91377L03941L72929K35239m20600q62677m04586K37742O8041m48279
36203C16812k63091L40887L32828j72115k62070K7486l6793l32488j87210J81695
36193e4059J01928j36640J31010M63735O0933n58236l55874K82638K28443k85444
36183a21566j63277M05414L19657k62726k05325L94765L66902k96668m42739N7665
36173E2102J74641k25537k08371K96025L63787n2793o2727L11977J62445m03555
$$ plain form
36243 -203552 -217110 65701 210889 157852 267775 463534 240499 -287438 -337426 263915
36233 263915 720301 534111 197300 217969 360637 305057 230989 292276 259392 84294
36223 84294 102268 346597 404675 230837 304409 709419 900802 680479 557532 843685
36213 843685 1235062 1539003 1911932 2147171 1726571 863894 459308 697050 765091 316812
36203 316812 53721 394608 727436 555321 293251 320737 283944 -48544 -235754 -54059
36193 -54059 47869 -88771 42239 505974 566907 8671 -347203 -64565 163878 -121566
36183 -121566 -284843 120571 440228 177502 -27823 366942 733844 437176 -5563 52102
36173 52102 226743 1206 -207165 88860 452647 399854 337127 649104 811549 407994
36163D07994l56921K24887K32540l34833l57023K18656K80876k46192k50379L53811
36153A73416M19296j98824l60308J42638K38402k60730l03528K71525L98118j01074
36143D18931j99560K28838J66990l97885l24679L80490M16320l26312m83802K07558
36133H6889M64745k4282j07339L80916K29715n91947o14146L21175N94287j96899
36123E43114m96353K24651N16386j75641m77717J36633L28776l46113m68603L88180
36113A73313O61252j98419n74797K37010O70930q5030n76399J7426L41358l20920
36103C45724n64479K81248O86258j12473n56326J98424O04145k18543o86207J81859
36093A59630Q24129J31253n05374k2719L27160k92117n17889L52577P04732k59723
$$ plain form
36163 407994 51073 275960 508500 173667 -183356 35300 316176 69984 -180395 173416
36153 173416 592712 393888 33580 176218 414620 153890 -149638 121887 520005 418931
36143 418931 219371 448209 615199 217314 -107365 273125 689445 363133 -120669 86889
36133 86889 551634 527352 420013 800929 1030644 438697 -175449 145726 740013 543114
36123 543114 46761 271412 787798 612157 134440 271073 599849 253736 -214867 173313
36113 173313 834565 636146 61349 298359 969289 884259 307860 325286 666644 345724
36103 345724 -218755 62493 748751 636278 79952 278376 882521 663978 -22229 159630
36093 159630 983759 1115012 609638 586919 914079 621962 104073 456650 1161382 901659
36083I01659p86148R0213O33716j68553n86451L60263Q32835j85327p35439K81797
36073F38565P99287l84954j077369J06687R13095k49396j137828M3769J160994
36064H12850K79544o92586M4111O14684n41549j225297K12914J304134J05109
36055I13914r13863L13694J280706j29060j241528K09003J385887j72698j462268
36046A83787K42829J797914J36317j575093J7386J771660J59169j603105J85244
36037A316108K115602K17515j851704K95805K791498P01561k045438k6519K813634
36028F328062P43120j944920J039205M882223K199159k127094K86315M647592
36020A6053662K006812k130210K491246R646277P389728K898195J0065298J9511004
$$ plain form
36083 901659 115511 205724 839440 670887 84436 444699 1277534 1092207 356768 638565
36073 638565 1437852 1052898 -24471 82216 995311 745915 -391913 -348144 812850
36064 812850 1092394 399808 443919 1058603 517054 -708243 -495329 808805 913914
36055 913914 51 313745 1594451 1465391 223863 432866 1818753 1646055 183787
36046 183787 426616 2224530 2360847 785754 803140 2574800 2733969 1130864 1316108
36037 1316108 3431710 3649225 1797521 2093326 4884824 5586385 3540947 3514428 6328062
36028 6328062 7071182 5126262 6165467 11047690 13246849 11119755 11406070 16053662
36020 16053662 18060474 15930264 18421510 28067787 35457515 38355710 48421008 67932012
36012F7932012J5029331J5528583N4810970J10911142J07526171J5303583r1197567
36005B95844225j19203108o9981227j9850050j1749567j9628152j3408657l089026
35998C8934438n427512j0910408n956629J591898R9210m257530j764079K204956
35990A4514344o50814n030827k819543J541390L46076k967287j551123J658666
35982E040882N38632k219584r97183J679884N33023k063441j031417J480108N58772
35973C519676j931071j253185J089156O81270j239839o58380J261945P83253r88585
35964A264240n68636R41909K84112j320926o32797J108186O00505j051542n87090
35955C7961J002895N13241j142517p43693R60647P62739q34197p66529O59838
$$ plain form
36012 67932012 82961343 98489926 153300896 264212038 371738209 387041792 295844225
36005 295844225 176641117 106659890 86809840 75060273 55432121 42023464 38934438
35998 38934438 33506926 22596518 16639889 18231787 18330997 14073467 12309388 14514344
35990 14514344 13863530 8832703 6013160 7554550 7900626 4933339 3382216 5040882
35982 5040882 5579514 3359930 2362747 4042631 4575654 2512213 1480796 2960904 3519676
35973 3519676 1588605 335420 1424576 2105846 866007 207627 1469572 2252825 1264240
35964 1264240 695604 1637513 1921625 600699 -32098 1076088 1676593 625051 37961
35955 37961 1040856 1554097 411580 -332113 628534 1391273 557076 -209453 450385
35946D50385O13310o74763n83974O45319N39340o19614m33902P78511O25010o20858
35936G18764o07118M46144K71688q76893o94192O34904P67050l19435m59150M16047
35926B97809L28648o55986n24887O29281O80032m32679n89412M54461P06133k06179
35916F87221m83889K75380M69972k40724m01221K07845K00334m87705m07257M39138
35906B59094M91875l07696l77806L95397M37333m00327n22717L15653N72002q2869
35896G79939k39613L82475M11521l89342o10198M8513K32256l65818m40743K79661
35886H8651M70337j75619l63892K22624L32786l04857m09925K71604L80000l97608
35876A14101o22359J84856O19199J4365m28393k5396K23148k01273k80163M17659
$$ plain form
35946 450385 1063695 388932 -195042 450277 989617 370003 -63899 714612 1339622 718764
35936 718764 111646 557790 829478 -47415 -741607 -106703 660347 340912 -118238 297809
35926 297809 626457 -29529 -554416 74865 754897 322218 -267194 187267 893400 687221
35916 687221 203332 478712 948684 707960 306739 514584 714918 227213 -180044 259094
35906 259094 750969 443273 65467 460864 898197 497870 -24847 290806 862808 779939
35896 779939 540326 922801 1334322 944980 334782 383295 615551 249733 -191010 88651
35886 88651 558988 383369 19477 242101 574887 270030 -139895 131709 511709 114101
35876 114101 -508258 -323402 295797 310162 -118231 -143627 79521 -121752 -401915 15744
35866A5744P27143N8846m64619r0005K98205J3101k17763J10817K43639k26441
35856D68667m48101J6506K87118j39461m36625q1014J94269n6844j28328L04554
35846a9259M19599j22786m08553O982K34944k04285m19566J19833N09167Q6214
35836B02290l54363p8355L04584J22271j63763n4714Q541k72435k92355K10660
35826c67639M44358K456k96971Q5146M04354O8548k62367o382K19467j43958m60355
35815c13343r7231L81336K80276k9390K0651J47376k2989j30760J21307L27724
35805F84957K74905L98339O71741K96702p35682j141755l25385N07969K63907
35796H95698l59869k85455J30197K0087l51436k44670J46129K14103R2131J45397
$$ plain form
35866 15744 742887 801733 337114 247109 545314 558415 340652 451469 695108 468667
35856 468667 20566 37072 324190 184729 -251896 -332910 -138641 -195485 -323813 -19259
35846 -19259 400340 277554 -130999 -124017 110927 -93358 -512924 -393091 116076 202290
35836 202290 -152073 -230428 74156 196427 32664 -22050 -13509 -285944 -578299 -367639
35826 -367639 76719 79175 -217796 -132650 271704 340252 77885 71503 290970 147012 -313343
35815 -313343 -410574 -29238 251038 221648 242299 389675 366686 235926 357233 684957
35805 684957 959862 1358201 2029942 2326644 1590962 449207 123822 631791 895698
35796 895698 535829 250374 380571 400658 49222 -195448 -49319 164784 256915 402312
35786D02312R3450k96632m52320K9668M80702K52584j49329n3231J59353r2557
35776C74000m04324j96612J24611k6392k50270L2684L88761J70694k20191p6110
35766h3149K90460J69274k15524j86774J25809J47675l6721j3071N9164j10557
35756A46586j75281J71195L82392l9837n03477k72938K27023K01164j06328j5015
35746A5484K32109J4752l41035j36948K98487J55722l34743l05227J80457L37607
35736A16665J38724J94175L97642J06649m65174m48771J19930L10719p8472k47641
35726A44446J04015K90878o0283l85248k30666N6854P2058l8952m2787p043J7743
35715g8985J12890J68077R55j97492j13147Q6849K7800j48675m2473J91640P9733
$$ plain form
35786 402312 495762 199130 -253190 -223522 257180 509764 360435 307204 466557 374000
35776 374000 -30324 -226936 -102325 -128717 -378987 -346303 42458 213152 -7039 -83149
35766 -83149 207311 376585 161061 -25713 100096 247771 211050 197979 257143 146586
35756 146586 -28695 142500 524892 485055 -18422 -291360 -64337 136827 30499 15484
35746 15484 247593 262345 -78690 -215638 82849 238571 -96172 -401399 -220942 116665
35736 116665 255389 449564 847206 953855 488681 39910 159840 470559 392087 144446
35726 144446 248461 539339 479056 93808 -136858 -80004 -7946 -46898 -89685 -96728 -78985
35715 -78985 33905 201982 202937 5445 -107702 -20853 6947 -141728 -184201 7439 87172
35704H7172k51199k29793J46117K96454N2503j54755j23218j03665j50027j3940
35694d44351K42559K55817M9824K2769J93965J56391j54929l22164j56815P0250
35684h6684J76187K55229K86344J26630q9824r5514M718p6574k13691p6343J75058
35673C85536Q7296k54860l11589k187J75092R1j68189o3422J20099J66960J32455
35662B67282Q8119J4916r911Q4530J22269n9530k40446j43612N0446N275j65097
35651A4241j29593L6243L8481l8868O3253J92397M2456k05041j59060O0084N7147
35640b8260q5126j670K03495J46276p4667o6279P7034l4233k71358j84100J28175
35629a90713J79887P817N1337K39794J12269k27969k29990N9993M5975k98207
$$ plain form
35704 87172 -164027 -393820 -247703 48751 101254 -53501 -176719 -280384 -430411 -444351
35694 -444351 -201792 54025 103849 126618 320583 476974 322045 -119 -156934 -86684
35684 -86684 89503 344732 631076 757706 667882 572368 577086 500512 286821 210478 385536
35673 385536 472832 217972 -93617 -95804 79288 79379 -88810 -152232 -32133 134827 267282
35662 267282 355401 370317 360406 444936 567205 507675 267229 123617 174063 179338 14241
35651 14241 -115352 -79109 -40628 -79496 -16243 176154 218610 13569 -145491 -85407 -28260
35640 -28260 -113386 -115056 88439 234715 160048 93769 170803 136570 -134788 -318888 -190713
35629 -190713 -10826 -3009 48328 288122 400391 172422 -57568 2425 48400 -249807
35619b49807l53783J895J78968l1943j30822R7488K11820K2218m4216J84138K52253
35608A38209n2747k74925j19153N3810m4033j25682L8613J63713M0371l7699J49665
35597f9858L06840J49049j27873k44368k40159k03118n7792J38403J45296k3130
35587b26710p0600M5308N0200q0304m8326J70163K39136P8800k0236J6331l9201
35576A14561j51621l5000K05871J54355j24110j20675J92529K76919j0267k05696
35566B96866j44728j92268l71228j99712L13688M63364J3106l52991j74771R7325
35556b51349M2191j0051K32150L61970N1421k62788j27984J56892J48033K522
35546C43007J8736M4022p5045n6775K26249L31112l479l03602j50996R4356j4060
$$ plain form
35619 -249807 -603590 -601695 -422727 -454670 -585492 -488004 -276184 -253966 -298182 -114044 138209
35608 138209 85462 -189463 -308616 -254806 -298839 -424521 -385908 -222195 -181824 -219523 -69858
35597 -69858 236982 386031 258158 13790 -226369 -429487 -487279 -348876 -203580 -226710
35587 -226710 -297310 -252002 -201802 -282106 -330432 -160269 78867 157667 137431 153762 114561
35576 114561 -37060 -72060 133811 288166 164056 43381 235910 512829 502562 296866
35566 296866 152138 -40130 -411358 -611070 -297382 165982 179088 -173903 -348674 -251349
35556 -251349 -209158 -219209 12941 374911 426332 163544 35560 192452 340485 343007
35546 343007 361743 405765 330720 273945 500194 831306 827827 524225 373229 467585 453525
35535D53525k16535j18790L8744r6125k40338q200K85096J26420k75553l22180
35525c73936K6969L14108L23758J67146r5942l75043l83181n2939K01022Q3278
35515a64760j05451k6710J30763J18205J29954L00376K58130j94110n08219j99386
35505b61208K89404K82859m7647j03916P7618M9504j14328l516K60351K06977
35495F36098j06601k18130j07357j31802k52144j16709J69783J47581j59831k56392
35485c95504k9269J15381J3918k9043J36556K60200J80362N1848k605l3237k6852
35474B41755O9291J13586m8142k37747j76921M0522J12165K9443k291P490p5186
35463G3965j49186n5982N3466j9159q9564R3283L12957J98673j16258k05526n9593
$$ plain form
35535 453525 236990 118200 156944 60819 -179519 -187719 97377 223797 -51756 -373936
35525 -373936 -346967 -32859 290899 458045 362103 -12940 -396121 -449060 -248038 -164760
35515 -164760 -270211 -296921 -166158 -47953 82001 382377 640507 446397 -61822 -261208
35505 -261208 28196 311055 263408 159492 237110 286614 172286 168770 429121 636098
35495 636098 529497 311367 204010 72208 -179936 -296645 -126862 20719 -139112 -395504
35485 -395504 -424773 -309392 -295474 -324517 -187961 72239 252601 304449 301844 268607 241755
35474 241755 311046 424632 376490 138743 -38178 2344 114509 143952 141661 149151 73965
35463 73965 -75221 -131203 -77737 -96896 -186460 -93177 219780 418453 302195 96669 37076
35452C7076j8522j27364j24914K0400R7163Q1161Q8710L9162j44135j89834J20376
35441a20721M20722K42224j74497k21703P9234J59371j00745k22652q739J64980
35431B17474N6857r1850p7459l9074q6181j07613p1970q4652q8910O2800K35857
35420g4721J60732p0572j24514L251L5610k7831N3539K08360J16572j73156k67901
35409a60631r6986J6741j9603L9950K13608K12134J7307l9488J05655J14615j30135
35398B73167l03906k01490k8535K3051L5095O8011M1821J3227J38714K90596J63460
35387E13211j73137l01627j08812O5333J3416p6883l8293M7221J16293J97105
35377B53827J77120o8829l20402k46988K5966R0485n2615m5054J24215J03659
$$ plain form
35452 37076 18554 -108810 -233724 -213324 -116161 -35000 53710 92872 -51263 -241097 -120721
35441 -120721 300001 542225 367728 146025 225259 384630 283885 61233 52494 217474
35431 217474 274331 182481 105022 65948 -20233 -127846 -199816 -284468 -373378 -310578 -74721
35420 -74721 86011 15439 -109075 -105824 -70214 -98045 -44506 163854 280426 107270 -160631
35409 -160631 -257617 -240876 -260479 -220529 -6921 205213 222520 183032 288687 403302 273167
35398 273167 -30739 -232229 -260764 -237713 -202618 -134607 -92786 -79559 59155 349751 513211
35387 513211 340074 38447 -70365 -5032 8384 -68499 -106792 -59571 56722 253827
35377 253827 430947 362118 41716 -205272 -179306 -88821 -141436 -186490 -62275 41384
35367D1384j15338j46328O4626J27567o3498j56339l1348K409j30554q6852K09189
35356b85082L48991J49532m4874j1966J0760j19722j71411n6396j8547o6095J36836
35345a27974N50219O10836J30503l24137l13812j36857j62953k08367l7828J09779
35335H9409m035j40446n4841M4280m9825j20894L459O7716q6779j29503J56175
35324b25284L90041K18222p3479r2557o826j24400k61091j17431J10428Q4401
35314i7976o7934o4029k8500j69444k42208N0816M25594M06025J02663r518J12481
35303D17970J08176j10713k81303k87188k36679j40629M3617J61465O4305p0900
35293c31879j870J71711K23714K03402K40776K04930k5020k09294j15091K9647
$$ plain form
35367 41384 -73954 -220282 -155656 -28089 -91587 -247926 -279274 -276865 -407419 -494271 -285082
35356 -285082 63909 213441 168567 156601 167361 47639 -123772 -180168 -198715 -264810 -127974
35345 -127974 422245 1033081 1163584 839447 525635 388778 225825 17458 -20370 89409
35335 89409 85374 -55072 -109913 -65633 -115458 -236352 -232893 -165177 -251956 -381459 -225284
35324 -225284 164757 382979 309500 216943 210117 85717 -175374 -292805 -182377 -97976
35314 -97976 -165910 -229939 -258439 -427883 -670091 -619275 -193681 212344 315007 305489 417970
35303 417970 526146 415433 134130 -153058 -389737 -530366 -486749 -325284 -260979 -331879
35293 -331879 -333749 -162038 61676 265078 505854 710784 685764 476470 361379 391026
35283C91026p4477k28460q5236J80442J42011j23840j65610O6577J73602M94j77482
35272I9047j68949p4167L1350J69135K12293J593k84594k84022J1759K42358J99445
35261A55248K0738j12054j41818m5735J16880J43806l1281j42786j098J08364
35251G0264j43458m94294m10478O6259L52704J95503l8996k1725J01166Q7171
35241b35884o658j2695O0473J08162R3684K6624o3579r6436k7628N4749N9842
35230c9346L7632M4836J0077q6129q4153P7081J70017L4988j08445k4977J10739
35219A42320L4635r9873J3582K57135K68578O1287l9894J1629k8763j70388j62461
35208B87787K126N0440o5335q8959N5721J38723N6330j9004k208k4833j16325
$$ plain form
35283 391026 316549 88089 2853 183295 325306 201466 35856 102433 276035 276529 99047
35272 99047 -69902 -144069 -112719 56416 268709 270302 -14292 -298314 -286555 -44197 155248
35261 155248 175986 63932 -77886 -123621 -6741 137065 105784 -37002 -38100 70264
35251 70264 -73194 -567488 -977966 -911707 -559003 -363500 -402496 -424221 -323055 -235884
35241 -235884 -242542 -255237 -194764 -86602 7082 33706 -29873 -126309 -153937 -99188 -39346
35230 -39346 -1714 43122 53199 -32930 -117083 -40002 130015 165003 56558 31581 142320
35219 142320 176955 77082 90664 347799 616377 677664 637770 649399 620636 450248 287787
35208 287787 289913 340353 275018 186059 241780 380503 436833 417829 415621 390788 274463
35197B74463j19504j5643J716j30047k25373j55068n825J07493J48207Q1768o3173
35186a00986j05710N7692K24182J69256K4309K7728O4400j11512l33199k19639
35176c03479J43314K70459M5944j23760j3603R8600j9546j69385j12829M1563
35166a42722Q1402K0977q449L3303J22464K00149J32619j22428l23006k03726
35156b09417R8284K07623P0626j9299O0994J28714R4644Q1983R8507K6j56398
35145D56287j27542P4008J47442j2068j80679k14454j94325j21382R6302K92694
35135B16283J48775k46479m05560j47881J56698J94089R5077M5867k7513j63125
35125a33769j75300p206R9277J0831o8382K2207J35374J28644J00218J21424O6360
$$ plain form
35197 274463 154959 139316 141032 10985 -214388 -369456 -375281 -267788 -119581 -37813 -100986
35186 -100986 -206696 -149004 75178 244434 268743 296471 360871 249359 -83840 -303479
35176 -303479 -160165 110294 156238 32478 18875 117475 97929 -71456 -184285 -142722
35166 -142722 -61320 -40343 -48792 -15489 106975 307124 439743 317315 -5691 -209417
35156 -209417 -111133 96490 167116 147817 208811 337525 432169 514152 612659 612685 456287
35145 456287 328745 402753 550195 538127 357448 142994 -51331 -172713 -76411 216283
35135 216283 365058 118579 -286981 -434862 -278164 -84075 11002 56869 29356 -133769
35125 -133769 -309069 -316275 -216998 -206167 -274549 -252342 -116968 11676 111894 233318 299678
35114B99678j04251k04131j31632j8178N0033J32777J78507M5259j43310q7352
35104A7400J56495J99131k1498j24262K8527R3131r5115k02192k3016J28563k165
35093A54999j62695r0836K7794k2558q1179p09K5634q8291l9185K76966M04019
35082D03959M6393l41480k47567O5612M4307k23536k30592P2243K81786K38819
35072A09944J17662j9969k02319k40779O795K24636L9926l18183l25913L962J89613
35061d14625Q5369Q932R2058J07148j3098m0256P6246R9432k9737p4843M2776
35050f0598J05097K5652M574J21273J58651j061j43914p3148Q2121Q9002n9233
35039B48416j84272j54823J0187J64688J45129l9087j72676j14889o966l0022
$$ plain form
35114 299678 195427 -8704 -140336 -158514 -108481 24296 202803 248062 104752 17400
35104 17400 173895 373026 351528 227266 255793 348924 253809 51617 28601 157164 154999
35093 154999 -7696 -98532 -70738 -93296 -174475 -175184 -149550 -237841 -277026 -60 403959
35082 403959 450352 108872 -138695 -73083 -28776 -252312 -482904 -410661 -128875 109944
35072 109944 227606 207637 5318 -235461 -228666 -4030 35896 -282287 -608200 -604238 -414625
35061 -414625 -329256 -320324 -228266 -121118 -134216 -174472 -98226 1206 -28531 -103374 -60598
35050 -60598 44499 70151 74725 195998 354649 353588 209674 136526 218647 307649 248416
35039 248416 64144 -90679 -80492 84196 229325 190238 17562 -97327 -104293 -134315
35029a34315r7186k5773J10078Q5902r3474k04191j40831J0699J69117K76155
35019d3819K11770l6618k17785j19198P9215O9852p7658m9873J48897J86346m4660
35008A06469k65422k61721j32701j1780J22578K53556K48038R4498l5377o8404
34998D9734j36469k97897l76853k10665J06316L36290L45571J82480N828m1702
34988c7367L3265R0790O5629N5807J09571Q9580q1323k09898r5447J41395K36506
34977C98508J54544L6302p3261j67282j12458J31635K79028O9438k70786l15768
34967A29900q7453J7529j09894j70590j7308J23134P7447l0034p5137j14908j55831
34956d13145p7588R1950J39427K3095k8952J03204K37540J99136O3542l0840p7030
$$ plain form
35029 -134315 -231501 -257274 -147196 -61294 -154768 -358959 -499790 -489091 -319974 -43819
35019 -43819 167951 131333 -86452 -205650 -126435 -56583 -134241 -184114 -35217 151129 106469
35008 106469 -158953 -420674 -553375 -565155 -442577 -189021 59017 153515 118138 49734
34998 49734 -86735 -384632 -761485 -972150 -865834 -529544 -183973 -1493 4335 -37367
34988 -37367 -4102 86688 152317 208124 317695 407275 325952 116054 20607 162002 398508
34977 398508 553052 589354 516093 348811 236353 367988 647016 716454 445668 129900
34967 129900 42447 59976 -49918 -220508 -237816 -114682 -37235 -67269 -142406 -257314 -413145
34956 -413145 -490733 -398783 -259356 -236261 -265213 -162009 75531 274667 338209 307369 230339
34945B30339r3369m0259N3841P1138j7541j20168j87947k29519j84058m810J63467
34934c58886J44865L2582M8791J51708J07470p7104j55902p7691l7158o2191M7374
34923b36142K89272L62952J32686j62510k88891k82629k23832p8132J12748J95238
34913a79240J69183J88325K28828J04155j23147j44228P5569J97455O9156n3073
34903E32983k0440o8232l22187m70803k60978N3306J14764M293J8143J59109K04362
34892e5680R1704o6231j93505k36033j12545J14716K21686J50693J12292J93746
34882B20843J78011l4983j73470l8917J29663N8923j09180j24392p5813j35905
34872a05220j47687P9349L02539J72556j43306j77924R0470K22076K8631j84862
$$ plain form
34945 230339 136970 96711 150552 221690 204149 83981 -103966 -333485 -517543 -522353 -358886
34934 -358886 -214021 -181439 -132648 19060 126530 49426 -106476 -184167 -221325 -283516 -236142
34923 -236142 53130 416082 548768 386258 97367 -185262 -409094 -487226 -374478 -179240
34913 -179240 -10057 178268 407096 511251 388104 243876 319445 516900 586056 532983
34903 532983 512543 444311 122124 -348679 -609657 -556351 -441587 -437294 -419151 -260042 -55680
34892 -55680 36024 -30207 -223712 -459745 -572290 -457574 -235888 -85195 27097 220843
34882 220843 398854 363871 190401 151484 281147 340070 230890 106498 30685 -105220
34872 -105220 -252907 -173558 128981 301537 158231 -19693 70777 292853 321484 136622
34862A36622j56541j7452J8681k8801m6711k6286N115O1884J22208J20080N9628
34851B48427J0748j2961m9200q6707r2893r1656r3463k9495J10905J83428Q7558
34840A84691m9616o2194j751j4265p7431p1496j2504k403l1721k7112k100J9752
34828a48150J05976K48316K55656M6768j21214r50K23564J91131p9788k43531
34818D77778j65010m3903k7308m7211n5104r6743j26951m5411O3348J5847j31308
34807a81976j30882M3280J50422R5342N9193J31205J32943m7712k25779j94521
34797a68485j8552J03887R8835J1143r9746j52102p7379N3863Q7359K0342J0697
34786a30138J01084J33778J7729j19406j44542r8737n9599l134Q4575J25205R1658
$$ plain form
34862 136622 -19919 -37371 -18690 -47491 -94202 -120488 -115373 -53489 68719 188799 248427
34851 248427 259175 246214 197014 110307 17414 -74242 -167705 -197200 -86295 97133 184691
34840 184691 135075 72881 71130 56865 -20566 -92062 -104566 -106969 -138690 -165802 -167902 -148150
34828 -148150 -42174 206142 461798 508566 387352 386402 609966 801097 721309 477778
34818 477778 312768 268865 241557 194346 139242 42499 -84452 -129863 -66515 -50668 -181976
34807 -181976 -312858 -269578 -119156 -23814 35379 166584 299527 251815 26036 -168485
34797 -168485 -187037 -83150 15685 26828 -72918 -225020 -302399 -248536 -161177 -140835 -130138
34786 -130138 -29054 104724 122453 3047 -141495 -240232 -299831 -302965 -218390 -93185 -1527
34775a527P2658Q3720j0193k43075l87825k30153J11503L16353K36904k468k07940
34764b62043k66493j50261P2465K41611K40100J26088N1005O6550R5281P1412
34754B85715J9158j2687j7385r625J0384M2706O0587K3900p5269j85662k26150
34743h4328j52426J748J43164J76270P1898q5675j51985q4079j2764n7517j13183
34732c48877J1180K42587K63634k7118l06868k55264R528J51786J10544Q2494
34722f6374J19313P7751m3316n1736Q2880J26696l3993j68764n4478J49826J19137
34711B56942j51138l21044j68372J26390K36650J02689m1719j7607P3047L8146
34701A33984r9443j38829q959J34099J43439M6506p6269j97942k55995j59690
$$ plain form
34775 -1527 71131 154851 144658 -98417 -486242 -716395 -604892 -288539 -51635 -54103 -262043
34764 -262043 -528536 -678797 -606332 -364721 -124621 1467 52472 119022 214303 285715
34754 285715 304873 292186 274801 265176 275560 318266 378853 402753 327484 141822 -84328
34743 -84328 -236754 -235006 -91842 84428 156326 70651 -81334 -165413 -178177 -235694 -348877
34732 -348877 -337697 -95110 168524 141406 -165462 -420726 -411198 -259412 -148868 -66374
34722 -66374 52939 130690 87374 35638 118518 245214 211221 42457 -12021 137805 256942
34711 256942 105804 -215240 -383612 -257222 -20572 82117 40398 22791 95838 133984
34701 133984 34541 -104288 -113247 20852 164291 210797 134528 -63414 -319409 -479099
34691d79099M200J78j65855j44750K25402N44595L58528j48471l89200k00785
34681c95257K0889K443o8923P385J03325O9903K6444R9512J59149O8705l5016
34670E8559K8835J58243J31910k9171j11203m1347M3646K5483o4998j25712q5090
34659a0845L8322J18358M3299j02669j14449K1678P6975n2368j40331K0120K50742
34648A48832K25711l8959k09434j09481Q5174J46911O9727j6310l4420Q341O3946
34637C40038O3775j4288p6062o948J43594J85593L5235j69475k56510k23311j69604
34626a47963j10198J8904J86118K28285N3129j95215k69901j13395P3264Q6392
34616a90580l6412j04465m6759K5219K4280K1718J07666K18867K17306R4628k2574
$$ plain form
34691 -479099 -474899 -474721 -640576 -785326 -559924 -15329 343199 194728 -194472 -395257
34681 -395257 -374368 -371925 -440848 -433463 -330138 -260235 -233791 -134279 24870 93575 58559
34670 58559 87394 245637 377547 348376 237173 195826 239472 264955 199957 74245 -10845
34659 -10845 27477 145835 189134 86465 -27984 -6306 70669 18301 -122030 -101910 148832
34648 148832 374543 335584 126150 16669 101843 248754 318481 302171 267751 276092 340038
34637 340038 403813 389525 313463 306515 450109 635702 670937 501462 244952 21641 -147963
34626 -147963 -258161 -239257 -53139 175146 228275 33060 -236841 -350236 -276972 -190580
34616 -190580 -226992 -331457 -378216 -352997 -328717 -306999 -199333 19534 236840 331468 308894
34605C08894o9530j17924k00892j86232L8886L12408L14016j4420l34315l18445
34595b67554n9893J01202N9205J3359Q6107J45244P4962k5662m4630m7172j05443
34584g0275j21593n698J22475J07953J1256j4434J8457L641l7668k8680k8465
34573d3031j08300j30357O8819L31505L24377K9657k13278j99448r6308j04020
34563a40384j54028q8432P3623K01423K33245J71964L2485j08369j35000n1513
34553C5014J785m0104o8544Q957J10325J08579K1210l0143O729N6554J3224j30515
34541I3071k48387k14482q2365k4683n0723L9437K99095M49225K70982j6730p5193
34530D39247K8358j1030j66547j32044Q8302J30503j13643k93844j62286P8232
$$ plain form
34605 308894 239364 121440 -79452 -265684 -226798 85610 399626 385206 50891 -267554
34595 -267554 -327447 -226245 -167040 -153681 -67574 77670 152632 126970 82340 35168 -70275
34584 -70275 -191868 -197566 -75091 32862 44118 29684 48141 51782 14114 -14566 -43031
34573 -43031 -151331 -281688 -212869 118636 443013 472670 259392 59944 -36364 -140384
34563 -140384 -294412 -382844 -309221 -107798 125447 297411 329896 221527 86527 35014
34553 35014 36799 -3305 -71849 -62892 47433 156012 177222 147079 153808 210362 223586 93071
34541 93071 -155316 -369798 -452163 -476846 -527569 -488132 -189037 260188 531170 514440 439247
34530 439247 467605 456575 290028 157984 246286 376789 263146 -30698 -192984 -114752
34520a14752J64939J29644P1685m8800j79256j04699J57521K58494O5001p8185
34510C21592O8633K00580L302k50798j35059J93380K42421j1788j47090m2545
34500D42628k3575k18968l15738j16383J08561N6577j52944k10775o9986P3480
34490d27123J05195Q8185J05417J56744J88611J49583M0496o3607q3093l1166
34480B29242Q958m264l9380n5536l5348K7060J10591J55628J13929o564j60322
34469C43994k79686k74710j11773R3328J72447J14935N3763L5022k2823j11516
34459A2981r4512L6833R6213L309p6895l0550R790o4217j16492l0058M1957o0254
34447b71895j95412j49277J2011J00073J43163K57212L27580J60108j43394k86612
$$ plain form
34520 -114752 50187 179831 251516 202716 23460 -81239 76282 334776 399777 321592
34510 321592 390225 590805 594107 343309 208250 401630 644051 632263 485173 442628
34500 442628 419053 200085 -115653 -232036 -123475 -66898 -219842 -430617 -500603 -427123
34490 -427123 -321928 -233743 -128326 28418 217029 366612 407108 343501 260408 229242
34480 229242 238200 233936 194556 139020 103672 130732 241323 396951 510880 504316 343994
34469 343994 64308 -210402 -322175 -228847 -56400 58535 112298 147320 124497 12981
34459 12981 -81531 -44698 51515 54824 -22071 -52621 -42831 -107048 -223540 -253598 -211641 -271895
34447 -271895 -467307 -616584 -604573 -504500 -361337 -104125 223455 383563 240169 -46443
34437d6443j95754m3802O9507J64004J74979J8661j73630j82079l2261O6705O3910
34426a16203O6364O8551o218o0998L9911J49432K2624k15709k00910O8357J99332
34415A4533M6026p3860N0411J71321L1552k07102k56457j32286k3592K5536M6624
34404c07294k2719j78145k08091J7626K72092K54468L0923p9228K1301J25424
34394g3643R4916M4739R0103J25820m449k30064k97715r2898J92747K81425J38202
34383B69183k5357n7351k1950o238M1975J50227J69199p201j98912j69091j2163
34372A32321k6851k30765l07430q2615K27622L40244K40594Q0979n3945j47568
34362A72586j65607r5545J4176J15626J80510J55604K2348j06914j01525j3750
$$ plain form
34437 -46443 -242197 -285999 -216492 -52488 122491 141152 -32478 -214557 -246818 -180113 -116203
34426 -116203 -49839 18712 12494 -48504 -8593 140839 163463 -52246 -253156 -184799 14533
34415 14533 60559 -13301 37110 208431 239983 32881 -223576 -355862 -379454 -353918 -307294
34404 -307294 -330013 -508158 -716249 -698623 -426531 -172063 -141140 -220368 -199067 -73643
34394 -73643 21273 66012 156115 281935 277486 47422 -250293 -343191 -150444 130981 269183
34383 269183 243826 186475 164525 158287 200262 350489 519688 512487 313575 144484 132321
34372 132321 105470 -125295 -432725 -515340 -287718 52526 293120 374099 320154 172586
34362 172586 6979 -88566 -74390 41236 221746 377350 399698 292784 191259 177509
34352A77509l903q0074j04363n2140m8165j24690j62666j11266n4044j8055O5133
34341e16724J62526J30997k7478j17261l2598J05379J58365J24253L2838j02931
34331h2634j82623q6083R8259J35143j4931j46519j47562j26037j37992p4517
34321g65496Q2062J67755J19916Q6364J37710J42096M5247q537L6000L3839m5959
34310C0997k0459J25431J15476j31325k58364k5346K34359J00340k59176l43982
34300d32049q6842R8302j9541j97665j43089R8755K76190K43140O4233o7503k955
34289a69024J86019K48594O2152j88821k44671q1687J15421J82175P5156j27766
34279E7548k32240q4340J85119K58626P0695q7109k7415N5281k7219r4167P4023
$$ plain form
34352 177509 173606 93532 -10831 -62971 -111136 -235826 -398492 -509758 -563802 -581857 -516724
34341 -516724 -354198 -223201 -250679 -367940 -400538 -295159 -136794 -12541 20297 -82634
34331 -82634 -265257 -351340 -253081 -117938 -132869 -279388 -426950 -552987 -690979 -765496
34321 -765496 -683434 -515679 -395763 -309399 -171689 -29593 15654 7117 43117 76956 30997
34310 30997 10538 135969 251445 120120 -138244 -163590 70769 171109 -88067 -432049
34300 -432049 -518891 -420589 -440130 -637795 -780884 -682129 -405939 -162799 -98566 -166069 -169024
34289 -169024 16995 265589 327741 138920 -105751 -187438 -72017 110158 185314 57548
34279 57548 -174692 -259032 -73913 184713 255408 168299 140884 196165 168946 74779 148802
34268A48802K93308K32539n1459k10203j37882m8782o6640q0281k1474J2178l0312
34257C9794m5214N0795J82139J96862K2205k38319l41034j49521J32508J73103
34247B3318l267l4590J74170K44830m7582l36619k12983J26699K20318N9672k0779
34236A93187K9210j0764j13586l9081J54941J52310n6470j35492J7200J14160
34226C05615l057j15677l0741J28008J66995P0620q3888k03129j55396N5351J46228
34215B80929p7696l05913j14096K97974L16168j14526l51802n9111K78325J56026
34205C06278j83904k19933L8911J85559P5130r3664j78199j92059j28046R510
34195c80417R6479N0723j5507Q437M5454J4661k578L3639j0770j58807j68230
$$ plain form
34268 148802 442110 674649 623190 412987 275105 226323 159683 79402 57928 70106 39794
34257 39794 -5420 45375 227514 424376 446581 208262 -132772 -282293 -149785 23318
34247 23318 20051 -14539 159631 404461 356879 20260 -192723 -66024 154294 213966 193187
34236 193187 222397 211633 98047 58966 213907 366217 309747 174255 191455 305615
34226 305615 302558 186881 156140 284148 451143 521763 437875 234746 79350 134701 280929
34215 280929 203233 -102680 -216776 81198 397366 282840 -68962 -128073 150252 306278
34205 306278 122374 -97559 -58648 126911 202041 108377 -69822 -261881 -389927 -380417
34195 -380417 -283938 -233215 -248722 -240285 -194831 -180170 -182748 -149109 -159879 -318686 -486916
34184d86916P3814K69523J46252p5377l3893J59296J10605j67783k47623K8505
34174b23597L01734K51024J9494q6266l5977n561n5087q7408m4595J5642K5350
34163G4753p90R005Q4406J49279R7349m5409j04757K5986K13396K21479m752k73495
34151D46450l52379j86998O8242K00167J37806J1257k6758k519m3652j35399j28821
34140a2604j1734L3655p1593j44445j5072K01617K69887J46960k0015j08620r1326
34129A76710J1645J12757Q2958p6107j83630j21028k204K3746n017L639m585r3618
34117g4734j41428k6256J02675J9244j81932j82735P1062K76513K16275K4233
34107A02917p7406o3621j3307N7281J24715R2355n4505j59714j05334O582K2687
$$ plain form
34184 -486916 -413102 -143579 2673 -72704 -106597 52699 163304 -4479 -252102 -223597
34174 -223597 78137 329161 348655 262389 226412 220851 165764 78356 33761 49403 74753
34163 74753 73963 82968 167374 316653 414002 368593 263836 289822 503218 724697 719945 446450
34151 446450 94071 -92927 -24685 175482 313288 324545 297787 295268 251616 116217 -12604
34140 -12604 -24338 9317 -62276 -206721 -221793 -20176 249711 396671 376656 268036 176710
34129 176710 188355 301112 384070 307963 124333 3305 1101 24847 19830 23469 18884 -74734
34117 -74734 -216162 -242418 -139743 -120499 -302431 -485166 -414104 -137591 78684 102917
34107 102917 25511 -38110 -51417 5864 130579 222934 168429 8715 -96619 -90037 -67350
34096f7350k5514j9023J4961l0150r6817k1895J49219J50199j07754l37888k48156
34085f40168M3831J80860O1330p8665n5681M6795J07727J65196K58368K78102
34075C67695J44653j7866n8988k7148m3762p7755m2581m184o7735j45569p8552
34064e1792P4550J16508L4533j0224J8350J2028j9572M5063J59975J33023l3016
34053D79426j12239k9315K7847n2314j40757j41179j45839k01208j82485k4817
34043e22880J58436K78092L41958K79864J2251k52212j73989J58144K53970l3871
34033D99763k60807j17513Q9679J8293j32567n3781R4798L1923r0026r939R3839
34022A63662m6134j86929L8850L81273L12575n6530j43214R7463J13521k39153
$$ plain form
34096 -67350 -92864 -111887 -96926 -127076 -223893 -245788 -96569 53630 -54124 -392012 -640168
34085 -640168 -596337 -415477 -354147 -432812 -488493 -441698 -333971 -168775 89593 367695
34075 367695 512348 494482 435494 408346 364584 286829 244248 240064 172329 26760 -51792
34064 -51792 22758 139266 173799 163575 181925 193953 174381 219444 379419 512442 479426
34053 479426 367187 337872 365719 313405 172648 31469 -114370 -315578 -498063 -522880
34043 -522880 -364444 -86352 255606 535470 547721 295509 121520 279664 533634 499763
34033 499763 238956 121443 211122 229415 96848 43067 137865 169788 79762 69823 163662
34022 163662 117528 -69401 -30551 350722 663297 606767 463553 561016 674537 435384
34012D35384m20538j35401J82338J20374r8632j11192J3196P0257J27109K41309
34002D24204J86356j38233l79171k21389R5387J54570j0682p7476O228L9370j6456
33991F2708l5874l1291r7145j44112k2271J63344J72252R610r5146m3945N1749
33980a0121R8715R2232J8452r1802r3239O4965J67068K1755j89672j55294P4372
33969b569J78262R1960N9874J49655J18126j27265l00626j66793Q4692J22849
33959B08165o4601k14541j61657K2443J76979J87299L8781j49797k09883j19944
33949b86756l3976m9572p3549j3126M3872q344o6373N0930K92065L87622J92710
33938D35503j31016l12388k45237l4156J45727J91351J24409L3731l7412j11207
$$ plain form
34012 435384 14846 -120555 61783 182157 83525 -27667 -14471 55786 182895 424204
34002 424204 610560 472327 93156 -128233 -32846 121724 111042 33566 39794 79164 62708
33991 62708 26834 -4457 -101602 -245714 -267985 -104641 67611 77221 -17925 -61870 -10121
33980 -10121 88594 180826 199278 107476 14237 79202 246270 268025 78353 -76941 -2569
33969 -2569 175693 267653 327527 477182 595308 468043 167417 624 85316 208165
33959 208165 143564 -70977 -232634 -210191 -33212 154087 192868 43071 -166812 -286756
33949 -286756 -320732 -370304 -443853 -456979 -413107 -421451 -487824 -436894 -144829 242793 435503
33938 435503 304487 -7901 -253138 -287294 -141567 49784 174193 207924 170512 59305
33928E9305j66292j08577N8835J42860N986j64343o2697K57001L79754J03377
33918E05209k45466k62716k2915Q7876l6839j25493m588J45988J09419m4240j02709
33907C526j9552P4277P3978k745o6802l7706O7451J02856m1542k26978j81986
33896b55223J03585K90339J31296j64093k02174O4085K92937K11152p9654k78988
33886A13262k29158l0204J10294R6941K4114K6855Q4390O1976n6960j26278p3595
33875A637k4594r5655k01094j82118j5694K00463L51646L25304R5959j27416o1447
33864B66991K22253K93933k4534l47435k96075p3495q1696k30758j30344J88027
33854b13133K98238R6383o0223R593O3925l7202o7067R3876J79026O411j69184
$$ plain form
33928 59305 -106987 -215564 -156729 -13869 -7883 -172226 -234923 22078 401832 505209
33918 505209 259743 -2973 -25888 61988 25149 -100344 -104932 41056 150475 106235 3526
33907 3526 -16026 58251 132229 129484 62682 24976 92427 195283 153741 -73237 -255223
33896 -255223 -151638 138701 269997 105904 -96270 -32185 260752 471904 392250 113262
33886 113262 -115896 -146100 -35806 61135 85249 112104 196494 258470 201510 75232 1637
33875 1637 -22957 -118612 -319706 -501824 -517518 -317055 34591 359895 455854 328438 266991
33864 266991 489244 783177 758643 411208 115133 41638 -40058 -270816 -401160 -213133
33854 -213133 85105 181488 121265 130858 194783 157581 90514 184390 363416 369827 200643
33843B00643q8046P0089J4748j62237j85127p4925o4485j68496j82680m5192R5206
33832e90502J44871J62537J99521K20403J77322N6701j01717j73974n9830J16072
33822A51404R2512j42135k73304j15718R7623R0238l2813j2496J08422Q8142p6210
33811b4335j50617n5921M6701N3479L3457L3045r75p3544j03412n4821L2720J22134
33799a42089J57289M4368j77485k49861l739L27362L64042J05464q4409j3499
33789C27443J08861M4628j33721j99747q3760R1600J65961O1623j45273k48472
33779a0857j27565O1106O4962r6489j43972M4089K44515K16269K1465j16592j21945
33768C4986p1516m728Q8228J35384K1738k13262l51308k41099N670J47347J04125
$$ plain form
33843 200643 112597 182686 197434 35197 -149930 -224855 -289340 -457836 -640516 -685708 -590502
33832 -590502 -445631 -283094 -83573 136830 314152 370853 269136 95162 35332 151404
33822 151404 243916 101781 -171523 -287241 -189618 -99380 -132193 -144689 -36267 51875 -24335
33811 -24335 -174952 -230873 -184172 -130693 -97236 -64191 -65166 -138710 -242122 -296943 -264223 -142089
33799 -142089 15200 59568 -117917 -367778 -371517 -44155 319887 425351 340942 327443
33789 327443 436304 480932 347211 147464 63704 155304 321265 382888 237615 -10857
33779 -10857 -138422 -77316 -12354 -108843 -252815 -208726 35789 252058 273523 156931 34986
33768 34986 -36530 -41258 46970 182354 204092 -9170 -360478 -601577 -595907 -448560 -344435
33757c44435J3827q403k8482j19378j56935J8932K92374L58690J52509n1966n4701
33746G2032L858n5322j17923J5474K53900L17545J30843j23236k82214l18038
33736a03081k24680j7693J68604J77281K2736j46976k31616j95890j8871J98592
33726c71594K14001l7357k40999j07532J52030J15940j68277k28743Q7624L70474
33716b14433K77138j775j18163o0793j6226j3804R727M13q0551p5390J44914L87496
33704B38553L39566P446k83656l09263j61290l9314n977K644M3488J05690J36771
33693G4658J02137K7466l0385n2674n9779n0927n699N7020R1396Q9823O5546j294
33681C07288j09035j70212j22421n3184o4376p0780O7995K57429K55616N1484
$$ plain form
33757 -344435 -330608 -339011 -367493 -486871 -643806 -624874 -332500 26190 178699 126733 72032
33746 72032 75890 20568 -97355 -81881 172019 489564 620407 497171 214957 -103081
33736 -103081 -327761 -345454 -176850 431 23167 -123809 -355425 -551315 -570186 -371594
33726 -371594 -157593 -194950 -435949 -543481 -391451 -275511 -443788 -672531 -584907 -214433
33716 -214433 62705 60930 -57233 -118026 -134252 -148056 -138329 -137916 -218467 -293857 -148943 238553
33704 238553 578119 585565 301909 -7354 -168644 -207958 -213935 -211291 -167803 -62113 74658
33693 74658 176795 204261 173876 121202 61423 10496 4797 61817 153213 243036 308582 307288
33681 307288 198253 28041 -94380 -147564 -211940 -282720 -214725 42704 298320 349804
33671C49804j07369j01467p9103j39222j61990p4491r964m8935n8348L9657Q7991
33660c03437k1969j27394p2289J9914o700l9650Q2090K39845K23856Q9498K1687
33649A05451r450j30967k30868r9881J63385K51324J19592P254j356o1646j83672
33638g0834j48965P9630K18145R4353p9138n0807J03728J59661P6802m2463j53376
33627A86736k35270k06892n8015O1476M7757Q339O0147J06008O427j48969j60220
33616c32476k4340Q8024J01262P3670K3333o5368r9942J7926J59255R3432j24087
33605h9311j64451Q1539K94106J77025j12545k17736r4285N526l4522p4030k0539
33594b49223K3614j6735n6543m1741o9570j82721k20157n1535J67385J80514Q234
$$ plain form
33671 349804 242435 140968 61865 -77357 -239347 -313838 -323802 -372737 -431085 -391428 -303437
33660 -303437 -325406 -452800 -525089 -505175 -511875 -551525 -469435 -229590 -5734 83764 105451
33649 105451 96001 -34966 -265834 -365715 -202330 48994 168586 175840 174484 112838 -70834
33638 -70834 -219799 -140169 77976 172329 93191 42384 146112 305773 382575 340112 186736
33627 186736 -48534 -255426 -313441 -251965 -204208 -195869 -135722 -29714 -23287 -172256 -332476
33616 -332476 -356816 -268792 -167530 -93860 -70527 -135895 -235837 -217911 -58656 34776 -89311
33605 -89311 -253762 -172223 121883 298908 186363 -31373 -125658 -120132 -154654 -228684 -249223
33594 -249223 -225609 -242344 -298887 -340628 -410198 -592919 -813076 -864611 -697226 -516712 -508478
33583e08478p1028Q4206K89090K92107Q5169j26571j80734j01913k0934q350m671
33572b72107P9028K06898K30665Q9374q3607j31782q2941p4901j25696j16484
33562b81553P499J53566K16163J82725Q7508l4096j24681j37263j06807r8009
33552a34948q4181M950J13157Q4854r4034k24297j39291Q5851K46838K41532J19204
33541B19635j7997q9851p5944l5203m1802q2915q5978m5272k0325o244O3583J63627
33529e4686J73895Q1404L1905J00956J54407M3305j70487k90491k15845k4105
33519a69742J08680M0315j87820l24933j75802J03793J74668M792p0634J21247
33509c75436K98712J70310r1034j14519J05970K43017J37276m8494j49352j82990
$$ plain form
33583 -508478 -579506 -495300 -206210 85897 171066 44495 -136239 -238152 -259086 -267436 -272107
33572 -272107 -193079 13819 244484 333858 250251 118469 35528 -39373 -165069 -281553
33562 -281553 -274054 -120488 95675 278400 365908 331812 207131 69868 -36939 -134948
33552 -134948 -219129 -214179 -101022 -16168 -110202 -334499 -473790 -387939 -141101 100431 219635
33541 219635 201638 111787 35843 640 -41162 -124077 -210055 -255327 -275652 -281896 -218313 -54686
33529 -54686 119209 200613 232518 333474 487881 531186 360699 70208 -145637 -169742
33519 -169742 -61062 -20747 -208567 -533500 -709302 -605509 -430841 -426049 -496683 -375436
33509 -375436 -76724 93586 2552 -111967 -5997 237020 374296 325802 176450 -6540
33499f540j92053j45794n1037K2741O4496J14912J34713M2880j07650j58173o8214
33488c49719L6479N8499L5109L3008N9478R3570J09203P6830K2368K9050Q8398
33477B92273N1861j31652k57603j44913M7557M3137j04526r7993J04189K19294
33467B1624J11210j1447K7291J06167O8113k6168p6896j37126k42869k66511j32842
33456e59454J0534L0861K9518J18120J69421M4517r5950m433K33999L03241J30425
33445D10799m4833p5695q1279j54251j76470n3482Q9169J00713L2293J0042J2131
33434F9137n2790j34151r6993L8133R1003j7938j48234j36863l766J13726J47236
33423a31500J27486Q3057J1897o2010r6442j01626j23345j43796q2457P4521K23577
$$ plain form
33499 -6540 -198593 -344387 -395424 -372683 -308187 -193275 -58562 -15682 -123332 -281505 -349719
33488 -349719 -313240 -254741 -219632 -186624 -127146 -33576 75627 152457 174825 203875 292273
33477 292273 344134 212482 -45121 -190034 -142477 -99340 -203866 -301859 -197670 21624
33467 21624 132834 121387 148678 254845 322958 296790 219894 82768 -160101 -426612 -559454
33456 -559454 -548920 -518059 -488541 -370421 -201000 -156483 -252433 -256866 -22867 280374 410799
33445 410799 365966 290271 208992 54741 -121729 -175211 -86042 14671 46964 57006 69137
33434 69137 16347 -117804 -214797 -176664 -85661 -103599 -251833 -388696 -392462 -278736 -131500
33423 -131500 -4014 79043 90940 28930 -67512 -169138 -292483 -436279 -518736 -444215 -220638
33412b20638K63978J99083P7239q0333k21903k25294l6427J93394K36868O2410
33402B48377j27498j50862m8440J0038m7710j29440j18916k7282L0125k7k5474
33391c87109M9865J44700Q3082j27391k44197r8665J63230K65655J39950m9620
33381f0500j43107j05369L5975K12973K93627J86404j6413j18926n9734L0782
33371B55712J7899q7886j77239j59861l6631Q9480J05721M1436M8052J56323J81181
33360D34187J783k05087k14472j11145j29624k22632j24616J58845K90624J25290
33350C153n3895M277J30557N5072j30948j40570L1528J18643J7465q1210k6318
33339g2246P2216M5880p6348j27932l2649J24758K18210J95988Q2977o8357j90855
$$ plain form
33412 -220638 43340 242423 319662 239329 17426 -207868 -244295 -50901 185967 248377
33402 248377 120879 -29983 -78423 -68385 -116095 -245535 -364451 -391733 -361608 -361635 -387109
33391 -387109 -337244 -192544 -109462 -236853 -481050 -579715 -416485 -150830 -10880 -60500
33381 -60500 -203607 -308976 -273001 -60028 233599 420003 403590 284664 224930 255712
33371 255712 273611 185725 8486 -151375 -188006 -98526 7195 48631 96683 253006 434187
33360 434187 435970 230883 16411 -94734 -224358 -446990 -571606 -412761 -122137 3153
33350 3153 -50742 -46465 84092 139164 8216 -132354 -100826 17817 35282 -45928 -72246
33339 -72246 -30 45850 -30498 -158430 -191079 -66321 151889 347877 430854 362497 171642
33328A71642k02497p3803Q5466R6835o2336j87915j05806P7456J26746K3776k9012
33317g9448O1220J54263J28287N1141J0567m2693j53376k13391j12052O3079J29508
33306b895N8525j4161M116O3118P2230J0545p7385j33623j17324k2678J04087
33295e5445J72430J10096m2632j29548n1733O9659L6285j08512j02319J09943
33285H224K14023j6218l24000l16143l2118J70053J72161J55059J64941M3017
33275B38999j90399k86436j73142m1719L5197J82380L45016K66836k3633j50060
33265B03039P846J01298o6870j81527R365K12313Q2732j88569k29181r4873n8527
33254b02954p6197M3508J73887Q1930q2468j8306J61328J16942q6169p7541J53624
$$ plain form
33328 171642 -30855 -104658 -19192 77643 15307 -172608 -278414 -200958 -74212 -50436 -79448
33317 -79448 -18228 136035 264322 315463 326030 283337 129961 -83430 -195482 -132403 -2895
33306 -2895 55630 41469 45585 108703 180933 191478 114093 -19530 -136854 -159532 -55445
33295 -55445 116985 227081 184449 54901 3168 72827 109112 600 -101719 8224
33285 8224 222247 206029 -117971 -434114 -466232 -296179 -124018 31041 195982 238999
33275 238999 48600 -237836 -410978 -452697 -417500 -235120 109896 376732 353099 203039
33265 203039 210885 312183 245313 63786 73151 285464 368196 179627 -49554 -144427 -202954
33254 -202954 -279151 -235643 -61756 20174 -62294 -80600 80728 197670 111501 33960 187584
33243A87584K40759Q0207m1670J576J1924p5511o6791N2614L3341j48176j84725
33232I1132L171O4282j92994m28321k80658R1590K91869K35358J12352J4476r9404
33221i7147j92815j62992m755J88501L19758L09524J43353m3904q1880p677j8556
33210C51410j48875k11344j10259K5599R1768J39604J73970Q2049j19194k13577
33200F1151r5677P1715J20822P1470k9520j96164l25443k26172L6891J33046l5389
33189d13270j45215K9987K45749K03143L3253L0079J45256J20196m4334j16843
33179H8001l7933L0866O692m0539p0079r5324p6986J1879Q4982Q0067Q7873J65773
33167B35272J68634j8652k30887k54653j68490j70520j93979k2041K82933M04227
$$ plain form
33243 187584 428343 508550 466880 468456 480380 404869 338078 390692 424033 275857 91132
33232 91132 94303 158585 -34409 -462730 -743388 -651798 -359929 -124571 -12219 2257 -97147
33221 -97147 -289962 -452954 -457709 -269208 50550 360074 503427 459523 377643 369966 351410
33210 351410 202535 -8809 -119068 -93469 -1701 137903 311873 393922 274728 61151
33200 61151 -34526 37189 158011 229481 199961 3797 -321646 -547818 -510927 -377881 -413270
33189 -413270 -558485 -528498 -282749 -79606 -46353 -16274 128982 249178 204844 88001
33179 88001 50068 80934 87626 47087 -22992 -118316 -195302 -183423 -98441 -18374 69499 235272
33167 235272 403906 385254 154367 -100286 -268776 -439296 -633275 -655316 -372383 31844
33157C1844K29268j1291r5021m3757L1445R0187J08620N1680m3596r2354q8698
33146A68327r2161j07182r5722o7051l4806M4001J57636J72672L8144o8207K384
33135A18035R5844j3544k29909k62164p2540J02440J40448J35290J24187L4692
33125A72779o7022N814K17126K73939M7065k21825k54535p2834J06659J36433
33115C43599J0138j67624k23057q1618Q2418M7050j09938j04339R6523J98180
33105I1332M1007j53434j36297K4741J20492R8347J5524j07201k11277j59020
33095c75786N7507K23222J78662L7903k6064m1281j02116j43763o7958L8677L7782
33084a83215j0357M4330J58730J56109L2835k1984P1835J59651Q4314r2284j72118
$$ plain form
33157 31844 261112 249821 154800 111043 142488 232675 341295 392975 349379 257025 168327
33146 168327 76166 -31016 -126738 -193789 -228595 -184594 -26958 145714 183858 115651 118035
33135 118035 213879 200335 -29574 -291738 -364278 -261838 -121390 13900 138087 172779
33125 172779 105757 111571 328697 602636 649701 427876 173341 100507 207166 343599
33115 343599 353737 186113 -36944 -118562 -36144 10906 -99032 -203371 -106848 91332
33105 91332 132339 -21095 -157392 -132651 -12159 86188 101712 -5489 -216766 -375786
33095 -375786 -318279 -95057 83605 121508 95444 54163 -47953 -191716 -259674 -220997 -183215
33084 -183215 -193572 -149242 9488 165597 198432 176448 248283 407934 492248 399964 227846
33073B27846o0303J26693J82863M2554j34828j67857j00879j13877k01986j57118
33063c56892P1263K36471J58088K423l973N5074l4883k11685k16717k0158J37492
33052a83497J31442R9413J50110J73444M4206j64746k79404k22279n1995J01458
33042b01848J21399K2773k7031P7774J93231J19277o8378j12754Q857M4568j01538
33031G6330k01385j01696L306q0969j80742l0414K50800K96947M2380j93460j72977
33020b91880J46J34338J87461J59722O189j98941k26955o002K02064J40888n8577
33009D8453p3379J15879J96228j697k54644k68810n9388J26198J40572N1997p435
32998A3974J0873N5112L2727q7410j96608j35358Q9944K64874K19109L4866r4650
$$ plain form
33073 227846 167543 294236 477099 519653 384825 216968 116089 2212 -199774 -356892
33063 -356892 -285629 -49158 108930 111353 107380 162454 127571 -84114 -300831 -320989 -183497
33052 -183497 -52055 47358 197468 370912 415118 250372 -29032 -251311 -303306 -201848
33042 -201848 -80449 -57676 -84707 -6933 186298 305575 237197 124443 133300 177868 76330
33031 76330 -125055 -226751 -223445 -304414 -485156 -515570 -264770 32177 74557 -118903 -291880
33020 -291880 -291734 -157396 30065 189787 195976 -2965 -229920 -235922 -33858 107030 48453
33009 48453 -24926 90953 287181 285484 30840 -237970 -297358 -171160 -30588 21409 13974
32998 13974 24847 79959 112686 25276 -171332 -306690 -216746 48128 267237 302103 207453
32987B07453j23385j31535j25662m6636M9187K1230j10170j40665K0808J98258
32977a81117J95979N9164l5252l1459L88K4007N4106O8625L9916J3514L2804L2521
32965B73196n8664j58197j33393l2682k4054j02826p6870J01447K12582J05109
32955A05648m3456J0545J95764K35112O1125j16392j45335j01190p9410l6461
32945H5950O1694J12829L8685n9030n1065R131j7066j17904j58284r9895k7380
32934b22335K4791R6743J50056P8805p8810j25999K368J04521K528j73135j68651
32923c09118J5570J39450Q9080J6670O6278J42199P1437j10990j89603o3290J13209
32912a9108J28662k3194j64003j78692j28219q4913J2498K15720L71811K70916
$$ plain form
32987 207453 84068 -47467 -173129 -219765 -170578 -149348 -259518 -400183 -379375 -181117
32977 -181117 14862 74026 38774 7315 7703 31710 85816 154441 194357 207871 240675 273196
32965 273196 214532 56335 -77058 -109740 -133794 -236620 -313490 -212043 539 105648
32955 105648 62192 72737 268501 503613 564738 448346 303011 201821 122411 85950
32945 85950 147644 260473 299158 240128 189063 198194 181128 63224 -95060 -194955 -222335
32934 -222335 -197544 -100801 49255 128060 49250 -76749 -74381 30140 32668 -140467 -309118
32923 -309118 -293548 -154098 -65018 -48348 17930 160129 231566 120576 -69027 -132317 -19108
32912 -19108 109554 86360 -77643 -256335 -384554 -469467 -456969 -241249 130562 401478
32902D01478j6350j64868k9338J49091R7078j12297k15508j47094m9002J3325
32892g3485R5002J64269R8230q4515j95731j35981j1863N1545N5546L7629q678
32881h032o6249q0102n3590l3480J1241J36959K46836J66872o5197k07239j64338
32870a16319r1505o8798L9261K56017L25528J03820j45606j29458K8727L9569
$$ plain form
32902 401478 385128 220260 190922 340013 437091 324794 109286 -37808 -86810 -73485
32892 -73485 21517 185786 284016 199501 3770 -132211 -144074 -92529 -36983 646 -8032
32881 -8032 -74281 -154383 -207973 -241453 -230212 -93253 153583 320455 255258 48019 -116319
32870 -116319 -207824 -276622 -237361 18656 344184 448004 302398 172940 201667 241236
$$ [...]
##END NTUPLES=NMR SPECTRUM
##END=
