##TITLE=31Pdec_BAU-26PN
 CDCl3, 24 sc
 26.8.2019
##JCAMPDX= 6.0         $$ Bruker NMR JCAMP-DX V2.0
##DATA TYPE= NMR SPECTRUM
##DATA CLASS= NTUPLES
##ORIGIN= UXNMR, Bruker Analytische Messtechnik GmbH
##OWNER= root
$$ XWIN-NMR		Version 3.5
$$ Mon Aug 26 14:16:10 2019 Russian Standard Time (UT+4h)  she@DPX200
##.OBSERVE FREQUENCY= 81.013821
##.OBSERVE NUCLEUS= ^31P
##.ACQUISITION MODE= SIMULTANEOUS
##.ACQUISITION SCHEME= undefined
##.AVERAGES= 24
##.DIGITISER RES= 17
##SPECTROMETER/DATA SYSTEM= spect
##.PULSE SEQUENCE= zgpg30
##.SOLVENT NAME= CDCl3
##.SHIFT REFERENCE= (INTERNAL, CDCl3, 0, 182.463)
##AUDIT TRAIL= $$ (NUMBER, WHEN, WHO, WHERE, WHAT)
$$ ##TITLE= Audit trail, XWIN-NMR		Version 3.5
$$ ##JCAMPDX= 5.01
$$ ##ORIGIN= Bruker BioSpin GmbH
$$ ##OWNER= she
$$ F:/spectra/data/she/nmr/P31/1/pdata/1/auditp.txt
$$ ##AUDIT TRAIL=  $$ (NUMBER, WHEN, WHO, WHERE, WHAT)
(   1,<2019-08-26 14:15:02.95 +0400>,<she>,<DPX200>,
      <created by zg, POWCHK disabled, PULCHK disabled
       configuration hash MD5:
       00 E9 B6 7A A2 85 ED C7 34 08 36 98 17 FE 4E 26
       data hash MD5: 32K
       CC 90 92 74 1E 80 91 71 01 2C B3 9B 43 78 AF 0C>)
(   2,<2019-08-26 14:15:05.37 +0400>,<she>,<DPX200>,
      <Start of raw data processing
       efp BC_mod = 2 LB = 1 FT_mod = 6 PKNL = 1 PHC0 = -476.9891 PHC1 = 303.8004 SI = 64K 
       data hash MD5: 64K
       08 40 0A 77 20 6B 09 40 99 81 56 56 65 42 02 18>)
(   3,<2019-08-26 14:15:35.18 +0400>,<she>,<DPX200>,
      <pk PHC0 = 30.76122 PHC1 = -93.60001 
       data hash MD5: 64K
       E5 CA A7 2D E2 A4 CD 5D 70 3C 8E B4 61 DD 9B E9>)
(   4,<2019-08-26 14:15:46.67 +0400>,<she>,<DPX200>,
      <abs ABSG = 5 
       data hash MD5: 64K
       61 1A 75 D2 63 44 EE 70 14 13 AF 7F 3F A3 86 2C>)
$$ ##END=
$$ 
$$ hash MD5
$$ 00 BA 57 B2 6C 85 92 CF 2E AA 96 7A 56 56 D2 21
##$RELAX= 
##$RELAX= 
##$RELAX= 
##$RELAX= 
##$RELAX= 
##$RELAX= 
##$RELAX= 
##$RELAX= 
$$ Bruker specific parameters
$$ --------------------------
##$DU= <F:/spectra>
##$EXPNO= 1
##$NAME= <P31>
##$PROCNO= 1
##$TYPE= <nmr>
##$USER= <she>
##$AMP= (0..31)
100 100 100 100 100 100 100 100 100 100 100 100 100 100 100 100 100 100 
100 100 100 100 100 100 100 100 100 100 100 100 100 100 
##$AQSEQ= 0
##$AQ_mod= 1
##$AUNM= <au_zg>
##$AUTOPOS= <>
##$BF1= 81.014009
##$BF2= 200.13
##$BF3= 200.13
##$BF4= 200.13
##$BF5= 200.13
##$BF6= 200.13
##$BF7= 200.13
##$BF8= 200.13
##$BYTORDA= 1
##$CFDGTYP= 0
##$CFRGTYP= 5
##$CHEMSTR= <none>
##$CNST= (0..31)
1 1 145 1 1 1 1 1 1 1 1 1 1 1 1 1 1 1 1 1 1 1 1 1 1 1 1 1 1 1 1 1 
##$CPDPRG= <waltz16>
##$CPDPRG1= <>
##$CPDPRG2= <waltz16>
##$CPDPRG3= <>
##$CPDPRG4= <mlev>
##$CPDPRG5= <mlev>
##$CPDPRG6= <mlev>
##$CPDPRG7= <mlev>
##$CPDPRG8= <mlev>
##$CPDPRGB= <>
##$CPDPRGT= <>
##$D= (0..31)
0 1 0 0 0 0 0 0 0 0 0 0.03 2e-05 3e-06 0 0 0 0 0 0 0 0 0 0 0 0 0 0 0 0 
0 0 
##$DATE= 1566814502
##$DBL= (0..7)
120 120 120 11 120 120 24 19 
##$DBP= (0..7)
150 150 150 150 150 150 150 150 
##$DBP07= 0
##$DBPNAM0= <>
##$DBPNAM1= <>
##$DBPNAM2= <>
$$ [...]
##$SUBNAM3= <"">
##$SUBNAM4= <"">
##$SUBNAM5= <"">
##$SUBNAM6= <"">
##$SUBNAM7= <"">
##$SUBNAM8= <"">
##$SUBNAM9= <"">
##$SW= 369.568048894756
##$SWIBOX= (0..15)
0 1 3 0 0 0 0 0 0 0 0 0 0 0 0 0 
##$SW_h= 29940.119760479
##$TD= 32768
##$TD0= 1
##$TE= 0
##$TE2= 300
##$TE3= 300
##$TEG= 300
##$TL= (0..7)
0 120 53 12 22 120 120 120 
##$TP= (0..7)
150 150 150 150 150 150 150 150 
##$TP07= 0
##$TPNAME0= <>
##$TPNAME1= <>
##$TPNAME2= <>
##$TPNAME3= <>
##$TPNAME4= <>
##$TPNAME5= <>
##$TPNAME6= <>
##$TPNAME7= <>
##$TPOAL= (0..7)
0.5 0.5 0.5 0.5 0.5 0.5 0.5 0.5 
##$TPOFFS= (0..7)
0 0 0 0 0 0 0 0 
##$TUNHIN= 0
##$TUNHOUT= 0
##$TUNXOUT= 0
##$USERA1= <user>
##$USERA2= <user>
##$USERA3= <user>
##$USERA4= <user>
##$USERA5= <user>
##$V9= 5
##$VALIST= <valist>
##$VCLIST= <CCCCCCCCCCCCCCC>
##$VD= 0
##$VDLIST= <DDDDDDDDDDDDDDD>
##$VPLIST= <PPPPPPPPPPPPPPP>
##$VTLIST= <TTTTTTTTTTTTTTT>
##$WBST= 1024
##$WBSW= 4
##$XGAIN= (0..3)
0 0 0 0 
##$XL= 0
##$YL= 0
##$YMAX_a= 6237
##$YMIN_a= -9546
##$ZGOPTNS= <>
##$ZL1= 120
##$ZL2= 120
##$ZL3= 120
##$ZL4= 120
##$ABSF1= 182.463
##$ABSF2= -187.1042
##$ABSG= 5
##$ABSL= 3
##$ALPHA= 0
##$AQORDER= 0
##$ASSFAC= 0
##$ASSFACI= 0
##$ASSFACX= 0
##$ASSWID= 0
##$AUNMP= <proc_1d>
##$AZFE= 0.1
##$AZFW= 0.5
##$BCFW= 0
##$BC_mod= 2
##$BYTORDP= 0
##$COROFFS= 0
##$CY= -3
##$DATMOD= 1
##$DC= 0
##$DFILT= <>
##$DTYPP= 0
##$F1P= 0
##$F2P= 0
##$FCOR= 1
##$FTSIZE= 65536
##$FT_mod= 6
##$GAMMA= 0
##$GB= 0
##$INTBC= 1
##$INTSCL= 5.30512e-09
##$ISEN= 30
##$LB= 1
##$LEV0= 0
##$LPBIN= 0
##$MAXI= 10000
##$MC2= 0
##$MEAN= 0
##$ME_mod= 0
##$MI= 50
##$NCOEF= 0
##$NC_proc= -6
##$NLEV= 6
##$NOISF1= 182.463
##$NOISF2= 159.3651
##$NSP= 0
##$NTH_PI= 0
##$NZP= 0
##$OFFSET= 182.463
##$PC= 4
##$PHC0= -446.2279
##$PHC1= 210.2004
##$PH_mod= 1
##$PKNL= yes
##$PPARMOD= 0
##$PSCAL= 0
##$PSIGN= 0
##$REVERSE= no
##$SF= 81.0140089999434
##$SI= 65536
##$SIGF1= 159.3651
##$SIGF2= -187.1042
##$SINO= 113.3802
##$SIOLD= 16384
##$SREGLST= <1H.CDCl3>
##$SSB= 0
##$STSI= 65536
##$STSR= 0
##$SW_p= 29940.119760479
##$SYMM= 0
##$S_DEV= 0
##$TDeff= 32768
##$TDoff= 0
##$TI= <>
##$TILT= no
##$TM1= 0
##$TM2= 0
##$TOPLEV= 0
##$USERP1= <user>
##$USERP2= <user>
##$USERP3= <user>
##$USERP4= <user>
##$USERP5= <user>
##$WDW= 1
##$XDIM= 65536
##$YMAX_p= 411490536
##$YMIN_p= -9149241
$$ End of Bruker specific parameters
$$ ---------------------------------
##NTUPLES= NMR SPECTRUM
##VAR_NAME=  FREQUENCY,     SPECTRUM/REAL,   SPECTRUM/IMAG
##SYMBOL=    X,             R,               I
##VAR_TYPE=  INDEPENDENT,   DEPENDENT,       DEPENDENT
##VAR_FORM=  AFFN,          ASDF,            ASDF
##VAR_DIM=   65536,         65536,           65536
##UNITS=     HZ,            ARBITRARY UNITS, ARBITRARY UNITS
##FACTOR=    0.456856943014862, 1,           1
##FIRST=     14782.0589164792, 0,            0
##LAST=      -15158.0608439998, 0,           0
##MIN=       -15158.0608439998, -9149241,    0
##MAX=       14782.0589164792, 411490536,    0
$$ Real data points
##PAGE= N=1
##DATA TABLE= (X++(R..R)), XYDATA
$$ [...]
38707d03460q81522k87362o96477j474125r42260P32204J780287J373882L21968
$$ -403460 -1284982 -1572344 -2268821 -3742946 -4685206 -3953002 -2172715 -798833 -476865
38698d76865m96431j010283j260667r59597m7056R49480J351460Q57259k83775
$$ -476865 -973296 -1983579 -3244246 -4203843 -4250899 -3301419 -1949959 -1092700 -1376475
38689a376475j327916j457767n31994O89682J348986J331289J027441N66864j71230
$$ -1376475 -2704391 -4162158 -4694152 -4004470 -2655484 -1324195 -296754 270110 98880
38680I8880q74049p68297L96483J685178J792088N57846p15261p13486L87599
$$ 98880 -775169 -1543466 -1146983 538195 2330283 2888129 2172868 1459382 1846981
38671A846981J244044R69251r6522j160242j792314j788731r88707K89417J190032
$$ 1846981 3091025 4060276 3963754 2803512 1011198 -777533 -1766240 -1476823 -286791
38662b86791J188589N76777k22623j130638j791462j412303p49J100099Q96767
$$ -286791 901798 1478575 1255952 125314 -1666148 -3078451 -3079200 -1979101 -1082334
38653a082334J87811K20383P15907O09400L7717n8950K05508M4371j26156P08411
$$ -1082334 -894523 -674140 41767 651167 688884 629934 835442 879813 753657 1462068
38643A462068J776236J126033j001097j917117n44746P25660k39181j953606j788460
$$ 1462068 3238304 4364337 3363240 1446123 901377 1627037 1387856 -565750 -2354210
38634b354210r6150O75219M31k47514Q57096J862763J285141m26280j874099k329670
$$ -2354210 -2450360 -1775141 -1774710 -2022224 -1165128 697635 1982776 1556496 -317603 -2647273
38624b647273j798378n63136P19440J230472Q31584K44454J38475M46686O68945
$$ -2647273 -4445651 -5008787 -4289347 -3058875 -2227291 -1982837 -1844362 -1397676 -728731
38615g28731M28663k84536j049759j290547r43633n70257m46277o0990R15303
$$ -728731 -300068 -584604 -1634363 -2924910 -3868543 -4438800 -4885077 -4946067 -4030764
38606d030764J787979J772234J189585P85002M49384k24573o95522k27771M98155
$$ -4030764 -2242785 -470551 719034 1504036 1953420 1728847 1033325 805554 1303709
38597A303709J57843r92583j372729n54474L40753Q21505J468344J766450J6059
$$ 1303709 1461552 468969 -903760 -1458234 -1117481 -295976 1172368 2938818 2954877
38588B954877l342664m721919j811195K692642M194561J983095n39611p85803
$$ 2954877 -387787 -5109706 -6920901 -4228259 -33698 1949397 1409786 623983
38580F23983M18779J161978R62179L42139k58086l71437L15862J074467O51601
$$ 623983 1042762 2204740 3166919 3509058 3250972 2879535 3195397 4269864 4921465
38571D921465q53937j882554j593797p90545j93892O08677J653737J654768q7570
$$ 4921465 4067528 2184974 591177 -199368 -393260 215417 1869154 3523922 3436352
38562C436352k034960k197677p98508K77106J31426m21069m31748J25846P10690
$$ 3436352 1401392 -796285 -1594793 -1317687 -1186261 -1607330 -2039078 -1913232 -1202542
38553a202542O90063k36351j324950j150558L95225J383962M36479r72592o11999
$$ -1202542 -512479 -748830 -2073780 -3224338 -2829113 -1445151 -1008672 -1981264 -2593263
38544b593263R57656J285725O1749n06127M33696J006870L1094r47274n06901
$$ -2593263 -1635607 -349882 -288133 -794260 -360564 646306 677400 -269874 -776775
38535g76775K68968J66797K66416J563328K204549J76607k612947k436943N52990
$$ -776775 -507807 -341010 -74594 1488734 3693283 3869890 1256943 -1180000 -627010
38526f27010K255081N69367j897558k079208m18319R80594J631587K046128J750781
$$ -627010 1628071 2197438 299880 -1779328 -2197647 -1217053 414534 2460662 4211443
38517D211443K52206j210489j098618m4466J18398p26123j040151l60166J03890
$$ 4211443 4463649 3253160 2154542 2110076 2228474 1502351 462200 102034 205924
38508B05924k43270m64672r307K39309k71878n01048M60280J600886J394457J64724
$$ 205924 -37346 -502018 -511325 -272016 -543894 -1044942 -584662 1016224 2410681 2575405
38498B575405n49587m93917p75565j504225j311803J59639J106792J44521j366538
$$ 2575405 2025818 1531901 756336 -747889 -2059692 -1900053 -793261 -648740 -2015278
38489b015278j210420M19881J434469J085327N88823N77553K00881p02919p73410
$$ -2015278 -3225698 -2805817 -1371348 -286021 302802 880355 1081236 378317 -395093
38480c95093M29162J146752J07114j244284j021354R3996K64664l23101j83405
$$ -395093 34069 1180821 1287935 43651 -977703 -883707 -619043 -942144 -1125549
38471a125549M50539J35026o66210m811J839421K177526K49987j251534m17841
$$ -1125549 -675010 -539984 -1206194 -1211005 628416 2805942 3055929 1804395 1386554
38462A386554Q44410P576k037722k484886o79878J532999K489930J809506j65329
$$ 1386554 2230964 2238540 200818 -2284068 -2963946 -1430947 1058983 2868489 2703160
38453B703160k151307k173607J1478J737111P47351j358566j483601Q1382K36742
$$ 2703160 551853 -1621754 -1610276 126835 874186 -484380 -1967981 -1886599 -1649857
38444a649857j665205k534800l63323K643651L286925J501518m08336r54430k24440
$$ -1649857 -3315062 -5849862 -6213185 -3569534 -282609 1218909 810573 -143857 -368297
38435c68297J185769K338966K049157L14611j133265j016959l71643q04349j783893
$$ -368297 817472 3156438 5205595 5520206 4386941 3369982 2998339 2193990 410097
38426D10097j469631K03560J202710L18409j234830j650189o88018O36818J515517
$$ 410097 -1059534 -855974 346736 665145 -569685 -2219874 -2907892 -2271074 -755557
38417g55557J705316J119954n3378j064841j134468l39007M09316L51010l52332
$$ -755557 949759 2069713 2016335 951494 -182974 -521981 -112665 238345 -113987
38408a13987q70919n64727M76558J599896K100731J608169K82894j146859j788278
$$ -113987 -984906 -1549633 -1073075 526821 2627552 4235721 4518615 3371756 1583478
38399A583478j391833o47221l24386l10014k3512M15211K92048l62712n66191
$$ 1583478 191645 -455576 -779962 -1089976 -1113488 -698277 -406229 -768941 -1335132
38390a335132O2797N54801J27632m71983k05338M93218N55682L02479R12556K032155
$$ -1335132 -1272335 -717534 -589902 -1061885 -1267223 -774005 -218323 84156 996712 3028867
38380C028867J854664J1750j519629j328958o32992j033469j760750j067743O98772
$$ 3028867 4883531 4895281 3375652 2046694 1413702 380233 -1380517 -2448260 -1749488
38371a749488J627237J267604Q21082N44190m81108j724820j138163J279160K498475
$$ -1749488 -122251 1145353 1966435 2510625 2029517 304697 -833466 445694 2944169
38362B944169P31407j667564j736897k50413K18634j59625O69710K176092J553932
$$ 2944169 3675576 2008012 271115 20702 239336 79711 749421 2925513 4479445
38353D479445j314985l000524j683587K38310L37801j82216O97806J985783J542067
$$ 4479445 3164460 163936 -1519651 -1281341 -943540 -1125756 -427950 1557833 3099900
38344C099900q0410p17031l46508p02592j724507j449013M54566J790822J113568
$$ 3099900 3019490 2302459 1955951 1253359 -471148 -1920161 -1465595 325227 1438795
38335A438795l39854q45822n13227l96016o53502o78796k83387O3374j47639q54697
$$ 1438795 1098941 253119 -260108 -656124 -1309626 -1988422 -2271809 -2208435 -2356074 -3210771
38325c210771j174274j10031J886642K728132J165096j176243j700096l05545
$$ -3210771 -4385045 -4495076 -2608434 119698 1284794 108551 -1591545 -1897090
38317a897090Q09309N27898m5040O0047L04977J64325P2421J39455k60672q75092
$$ -1897090 -1087781 -559883 -604923 -544876 -239899 -75574 -3153 136302 -124370 -999462
38307i99462m51441Q46284R49436q55560k187991r29632J389300J815544L51653
$$ -999462 -1450903 -604619 344817 -510743 -2698734 -3628366 -2239066 -423522 -71869
38298g1869m35528L98574J000494m7849j562384j667170l58019Q38317R40600
$$ -71869 -507397 -108823 891671 843822 -718562 -2385732 -2743751 -1905434 -964834
38289i64834M18338L08277Q70955J200167L55691j099610j407291N7475J594560
$$ -964834 -546496 -238219 632736 1832903 2188594 1088984 -318307 -260832 1333728
38280A333728J277323l89666j173787j92593J083279J049433m8452q70300q53917
$$ 1333728 2611051 2221385 1047598 855005 1938284 2987717 2939265 2068965 1215048
38271A215048o41451r99940j840079k306799j696003k28549J193830J933019J955022
$$ 1215048 573597 -426343 -2266422 -4573221 -6269224 -6497773 -5303943 -3370924 -1415902
38262a415902J289678q4739j509031j681568k05020J494903J662535K60244j239711
$$ -1415902 -126224 -210963 -1719994 -3401562 -3606582 -2111679 -449144 -188900 -1428611
38253a428611j727912j291209n01203K01856N28236N36935P50826J431336J920722
$$ -1428611 -3156523 -4447732 -4948935 -4747079 -4218843 -3681908 -2931082 -1499746 420976
38244D20976J385926K6724j134973j464579j065202k32919O67951J053790O54772
$$ 420976 1806902 1833626 698653 -765926 -1831128 -2064047 -1396096 -342306 312466
38235C12466N561k88083m22507p89712j020671o13007J9788K96539P01957J800269
$$ 312466 318027 29944 -392563 -1182275 -2202946 -2815953 -2796165 -2499626 -1797669 2600
38225B600K518968J343841q74446j511550m0487R08957n61889k676757k576874
$$ 2600 2521568 3865409 2990963 1479413 1438926 2347883 1785994 -890763 -3467637
38216c467637l69082J373367J272448L07480l34714o51064q64523o66069J8591
$$ -3467637 -3836719 -2463352 -1190904 -883424 -1218138 -1869202 -2733725 -3399794 -3381203
38207c381203O12001Q21197J143587J835371K087352J029476p91572j773249j170452
$$ -3381203 -2769202 -1948005 -804418 1030953 3118305 4147781 3356209 1582960 412508
38198D12508o767K76437l49857o42031L6282P77436N11213l46742n17428J62266
$$ 412508 405741 682178 332321 -309710 -273428 504008 1015221 668479 151051 313317
38188C13317N04298j12937p33997l85606L01671R7926p47111p50534M69825J421915
$$ 313317 817615 704678 -29319 -414925 -113254 -15328 -762439 -1512973 -1043148 378767
38178C78767Q81070k39452k11553Q76476J160525k22089j712436j447280J52297
$$ 378767 1259837 1020385 808832 1685308 2845833 2623744 911308 -535972 -383675
38169c83675J067668M63421n65263r55625r34365r07453m99693M13907Q65532
$$ -383675 683993 1147414 582151 -373474 -1307839 -2215292 -2714985 -2301078 -1435546
38160a435546J86277n71516L0959J543016K101460J014517m80427j079801p69842
$$ -1435546 -1249269 -1820785 -1789826 -246810 1854650 2869167 2388740 1308939 539097
38151E39097j47557M00032N13438l9355o86224m84751L96832P05253M5031m23872
$$ 539097 391540 791572 1305010 1265655 579431 94680 491512 1196765 1241796 817924
38141H17924O0620M76953k64507j255621p97828Q32301J515392K91458j286080
$$ 817924 878544 1355497 1090990 -164631 -962459 -130158 1385234 1676692 390612
38132C90612j391919l37182K30875k10523o39935l83981j40282n87590j002127
$$ 390612 -1001307 -1338489 -1107614 -1318137 -1958072 -2342053 -2482335 -3069925 -4072052
38123d072052l37408Q46120R20668k91139j003127p3815J224645J114178j28342
$$ -4072052 -4409460 -3563340 -2642672 -2933811 -3936938 -4010753 -2786108 -1671930 -1800272
38114a800272r24566q53409o62169l75251O34962J797453J653731L85437j1474
$$ -1800272 -2724838 -3578247 -4240416 -4615667 -3980705 -2183252 -529521 -144084 -155558
38105a55558J151794J917699O76304j223722j488330k25339N60843L9086p33200
$$ -155558 996236 2913935 3590239 2366517 878187 652848 1213691 1252777 519577
38096E19577q30860m81504k7967O57508J408763J540828Q16053r8242m32927o5993
$$ 519577 -311283 -792787 -820754 -163246 1245517 2786345 3602398 3504156 3071229 3005236
38086C005236O08569J040031P34876l44749j508911j862341j160781L2375Q55474
$$ 3005236 3613805 4653836 5388712 5043963 3535052 1672711 511930 544305 1399779
38077A399779O60335n24785j706001j634048k73109R97940J148708P13826N41351
$$ 1399779 2060114 1535329 -170672 -1804720 -2077829 -1079889 68819 782645 1323996
38068A323996K73092o88594j453462o13057J238658J782898J98874j501182j226179
$$ 1323996 1597088 908494 -544968 -1158025 80633 1863531 2062405 561223 -664956
38059f64956L40332Q06809o97852k534379k640165p67430J454108K226471J253042
$$ -664956 -324624 482185 -215667 -2750046 -5390211 -6157641 -4703533 -2477062 -1224020
38050a224020j33675n18200L5580L41517o9024k42669O68036J903570J937967
$$ -1224020 -1357695 -1875895 -1840315 -1498798 -1567822 -1810491 -1142455 761115 2699082
38041B699082M73885j268664k153493k122174j505639l89715Q15779J151843M22678
$$ 2699082 3172967 1904303 -249190 -2371364 -3877003 -4266718 -3450939 -2299096 -1876418
38032a876418K6246J160620K592231J924969p16818k214468o55078J760512J730708
$$ -1876418 -1850172 -689552 1902679 3827648 3110830 896362 241284 2001796 3732504
38023C732504n10228j811126p69238O71346M60540r58148j978905j929760r93659
$$ 3732504 3222276 1411150 641912 1313258 1773798 815650 -1163255 -3093015 -4086674
38014d086674M25477J438058J169288K20965J58248R46389P53260q55678j738666
$$ -4086674 -3661197 -2223139 -1053851 -832886 -674638 271751 1025011 169333 -1569333
38005a569333o10186O14326k4113j072998o1567K186245K727229J133181k07774
$$ -1569333 -2179519 -1565193 -1589306 -2662304 -2723871 -537626 2189603 3322784 3115010
37996C115010j43528m1592q08272j467714j299711r13618n44977M02703J467897
$$ 3115010 2971482 2929890 2121618 653904 -645807 -1559425 -2104402 -1701699 -233802
37987b33802J140529m08074r40084M45165J774111J336053J82942n9021J32297
$$ -233802 906727 498653 -441431 3734 1777845 3113898 3296840 3237819 3370116
37978C370116m39559j267181j134521l34296M6097J03797N39456R10062L43032
$$ 3370116 2930557 1663376 528855 194559 240656 344453 883909 1793971 2137003
37969B137003n64199m20005O20616Q88039l57964j887786k158454j079544J03081
$$ 2137003 1572804 1152799 1773415 2661454 2303490 415704 -1742750 -2822294 -2719213
37960b719213K11019n53990o18067J063659L099420K903760K83828j809672j131881
$$ -2719213 -2508194 -3062184 -3680251 -2616592 482828 3386588 3670416 1860744 728863
37951G28863Q32366J177984m70445k137932k522126j815044l29649J523133K368351
$$ 728863 1561229 2739213 2268768 130836 -2391290 -4206334 -4535983 -3012850 -644499
37942f44499J156477q39801j316586j43740O69152J58429n13289l50880J48802
$$ -644499 511978 -327823 -1644409 -1788149 -1118997 -960568 -1473857 -1824737 -1675935
37933a675935M12359O58757P96975J56109j096386j790348j467549p92183m7101
$$ -1675935 -1263576 -604819 192156 348265 -748121 -2538469 -4006018 -4798201 -4845302
37924d845302J018328J671313P24749r36049q18366J268087K351769P70055j104087
$$ -4845302 -3826974 -2155661 -1430912 -2366961 -3185327 -1917240 434529 1204584 100497
37915A00497o53021Q45729N65575j186396j720144l55940R89489J144595P61040
$$ 100497 -552524 293205 858780 -327616 -2047760 -2403700 -1414211 -269616 491424
37906D91424J95963r38915j925326j237375P90887J900750J119857q3257m26101
$$ 491424 687387 -251528 -2176854 -3414229 -2623342 -722592 397265 314008 -112093
37897a12093l76420l51632K97356J368245J164389o77801j812176n62059J162986
$$ -112093 -488513 -840145 -542789 825456 1989845 1312044 -500132 -1062191 100795
37888A00795O70724j225281j471822M18527J746420Q88889n37005n88966J75948
$$ 100795 771519 -453762 -1925584 -1507057 239363 1128252 591247 2281 178229
37879A78229J79142m39821k76157Q23671J309246J49887j557092j852364m32068
$$ 178229 357371 -82450 -358607 465064 1774310 1924197 367105 -1485259 -1917327
37870a917327Q88010N68098m82324j98589J399885J930085K42915j477501p80893
$$ -1917327 -1029317 -461219 -943543 -1142132 257753 2187838 2430753 953252 172359
37861A72359J276556J676983P100j159490m54720M49597P531p13183k10518P51318
$$ 172359 1448915 3125898 3132998 1973508 1518788 1968385 1975916 1262733 1052215 1803533
37851A803533M97557q00460j565451j181369l24130L96830O94137J80013q93600
$$ 1803533 2301090 1500630 -64821 -1246190 -1570320 -1173490 -479353 -299340 -1192940
37842a192940j159461J26085J564959J435944L14468J3431N46268M08943m02278
$$ -1192940 -2352401 -2226316 -661357 774587 1089055 1102486 1648754 2057697 1655419
37833A655419k50554R70302J185090m12021j728691j053448K11799J7871r16622
$$ 1655419 1404865 2375167 3560257 3148236 1419545 366097 577896 595767 -320855
37824c20855n23492R57075J369579K77130l90751L78727J071964K29452j204616
$$ -320855 -844347 112728 1482307 1759437 1368686 1747413 2819377 3048829 1844213
37815A844213j428347m33641L41946K88824P7430J03380q1302n64835n56637K88263
$$ 1844213 415866 -17775 324171 612995 690425 793805 712503 147668 -408969 -120706
37805a20706R52757L76112q72328j267724m21389N89166R47636R40457Q03619
$$ -120706 832051 1208163 335835 -931889 -1353278 -764112 183524 1123981 1927600
37796A927600P1876j177249j654145n64183R66982J446789J116944R85959O33938
$$ 1927600 1999476 822227 -831918 -1396101 -429119 1017670 2134614 3120573 3754511
37787C754511r27138k631779k117861N50705K365547J498007k86408o40849L0908
$$ 3754511 2827373 195594 -1922267 -1371562 993985 2491992 2205584 1564735 1595643
37778A595643O0445m36696k76014K04000k93801j442925j619332o53742o4567
$$ 1595643 1656088 1219392 943378 1147378 853577 -589348 -2208680 -2862422 -2926989
37769b926989l94693l92054O79016J770501J818948J223407P63334L99733r484
$$ -2926989 -3321682 -3713736 -3034720 -1264219 554729 1778136 2541470 2941203 2931719
37760B931719l3556L80652L88253l53712p90375p3853Q40475M99649p79257j343942
$$ 2931719 2898163 3278815 3667068 3313356 2522981 2449128 3289603 3789252 3009995 1666053
37750A666053o02759L75603O17270L01680j33578p14508j265867j088605n8418
$$ 1666053 1063294 1438897 2056167 2357847 2224269 1509761 243894 -844711 -903129
37741i03129P43543L94190m30254m00816L92315N33087m46079j157559l92968
$$ -903129 -159586 234604 -195650 -596466 -204151 328936 -117143 -1274702 -1667670
37732a667670R52505J080608j48202j115150p99565J4380J84124k30814m52725
$$ -1667670 -715165 365443 217241 -897909 -1697474 -1683094 -1498970 -1729784 -2182509
37723b182509k04427K67791P83442J116786P99232j75897q34131k91879Q33327
$$ -2182509 -2386936 -2119145 -1335703 -218917 580315 404418 -429713 -721592 111735
37714A11735R97860k29905j561719j701729r38819m97866p48952p76464K19820
$$ 111735 1109595 879690 -682029 -2383758 -3322577 -3820443 -4569395 -5345859 -5126039
37705e126039J657649K167650J316862J67061j41914J62255O8034n37158o88725
$$ -5126039 -3468390 -1300740 16122 183183 41269 203524 271558 -265600 -954325
37696i54325J05397J080714J351350J030960O85459L25327l67076j183062j415545
$$ -954325 -848928 231786 1583136 2614096 3299555 3624882 3257806 2074744 659199
37687F59199o93169M84937J011288J35827j452828j906975m38501J144745N15716
$$ 659199 -33970 450967 1462255 1598082 145254 -1761721 -2200222 -1055477 -539761
37678e39761j730062k607608j016996P76068Q80576N43920J364379K022452N38453
$$ -539761 -2269823 -4877431 -5894427 -5118359 -4237783 -3693863 -2329484 -307032 231421
37669B31421j742070j660439Q24860K379082J133993j011965j545542m10520Q95265
$$ 231421 -1510649 -3171088 -2346228 32854 1166847 154882 -1390660 -1801180 -905915
37660i05915J352505P60543l54521o52429O49001K090434J485770p10536j753241
$$ -905915 446590 1207133 852612 200183 849184 2939618 4425388 3714852 1961611
37651A961611p01066L56383m8345n74881J02155Q67044M19984l02755j16606n667
$$ 1961611 1260545 1616928 1568583 993702 1095857 1962901 2382885 2080130 1963524 1957857
37641A957857j126831k088190r51027J249517J803380M09551p85690q02194p04738
$$ 1957857 831026 -1257164 -2208191 -958674 844706 1254257 468567 -333627 -1038365
37632a038365r12543m14421P86432R24561p90383k557419k271225j62887J787097
$$ -1038365 -1950908 -2365329 -1578897 -654336 -1444719 -4002138 -6273363 -6436250 -4649153
37623d649153K136351J007584l63909o35859L86235J311625P62774o52308j064767
$$ -4649153 -2512802 -1505218 -1869127 -2504986 -2118751 -807126 -44352 -696660 -1761427
37614a761427p771J032621R27292K30553k98496r06066j668363j553054K3961
$$ -1761427 -1769198 -736577 190715 421268 122772 -783294 -2451657 -4004711 -3980750
37605c980750J719520J795229N36459k49513J81229Q11997P18040K57372M5354
$$ -3980750 -2261230 -466001 70458 -179055 2174 814171 1532211 1789583 1834937
37596A834937j14524n73123q95435m56145M08047P15915K40835k06977m1742L09052
$$ 1834937 1720413 1147290 251855 -204290 203757 919672 1160507 953530 911788 1220840
37586A220840K43315o8267j57949j34727l38073n34408l23694l6530k31613n18427
$$ 1220840 1464155 1395888 1237939 1103212 765139 230731 -92963 -129493 -361106 -879533
37576h79533n7660Q29256R17203J17675k40192L67547P41416P3034n93964j91645
$$ -879533 -937193 -107937 809266 926941 686749 1054296 1795712 1868746 1274782 1083137
37566A083137N18029L86264q1506J36379M39783l69584j598122j386684K67420
$$ 1083137 1601166 1987430 1905924 2042303 2482086 2112502 514380 -872304 -604884
37557f04884J337634Q06436n8467P1007P72391R39770L10903p01775j609601j798892
$$ -604884 732750 1539186 1480719 1551726 2324117 3263887 3574790 2873015 1263414 -535478
37547e35478q89330M96035J238066J134806Q15381L77128n08875j227320p24778
$$ -535478 -1424808 -928773 309293 1444099 2259480 2636608 2127733 900413 175635
37538A75635M25798M42470p14756j008995J73530N95366j152313k787687j525324
$$ 175635 601433 1043903 329147 -679848 -506318 89048 -1063265 -3850952 -5376276
37529e376276J511280K842019J634218K01648j48658o10647j696231j628927N01818
$$ -5376276 -3864996 -1022977 611241 812889 664231 53584 -1642647 -3271574 -2769756
37520b769756K353307J353470j300084k120561k66236J437663P00233j188035
$$ -2769756 -416449 937021 -363063 -2483624 -2749860 -1312197 -611964 -1799999
37512a799999j582599j62827J192424J329601Q69677N36720J33816m36533n67715
$$ -1799999 -3382598 -3545425 -2353001 -1023400 -153723 382997 516813 80280 -487435
37503d87435r6867R6499m49497p06770L24164J793739K041242J014243K58504
$$ -487435 -584302 -487803 -937300 -1644070 -1319906 473833 2515075 3529318 3787822
37494C787822O11677J223269J006736n9120j307071k120766k109586j372196o73109
$$ 3787822 4399499 5622768 6629504 6570384 5263313 3142547 1032961 -339235 -1012344
37485a012344n76590n18305L16485J415876J500409N57193j66421k99604q07369
$$ -1012344 -1588934 -2107239 -1790754 -374878 1125531 1682724 1516303 1216699 409330
37476D09330j901268k236045j017647O25491J375904J445058J463742J008870
$$ 409330 -1491938 -3727983 -4745630 -4120139 -2744235 -1299177 164565 1173435
37468A173435l81169j775666j897190q85255K11716R59252J364633J052482J7730
$$ 1173435 792266 -983400 -2880590 -3765845 -3554129 -2594877 -1230244 -177762 -160032
37459a60032n65455J58618J058281N34523q13131j007395K2258K23592j072797
$$ -160032 -725487 -566869 491412 1025935 212804 -794591 -772333 -548741 -1621538
37450a621538j693429L9336K259278J837914j050716k810441j172986J767057
$$ -1621538 -3314967 -3275631 -1016353 821561 -229155 -3039596 -4212582 -2445525
37442b445525K456235O15017q25361k40922N51353l37128j513143n50035J721919
$$ -2445525 10710 625727 -199634 -440556 110797 -226331 -1739474 -2289509 -567590
37433e67590K147314K33310r82683J75435J334568k2048k531414l144807j466542
$$ -567590 1579724 1813034 830351 1005786 2340354 2318306 -213108 -3357915 -4824457
37424d824457N55824J838446K513342K182073M96679j165804j155155k30404l52200
$$ -4824457 -4268633 -2430187 83155 2265228 2761907 1596103 440948 210544 -141656
37415a41656j243658q24091J088398K300374J713946O15509M1664n39693j245396
$$ -141656 -1385314 -2209405 -1121007 1179367 2893313 3508822 3550486 3010793 1765397
37406A765397j029253J38878O97680J08673k40161K17579L7126j306471j810069
$$ 1765397 736144 875022 1572702 1681375 1441214 1658793 1695919 389448 -1420621
37397a420621j69548J606675J112581o79046j034457M01418J550023J185281J2758
$$ -1420621 -1590169 16506 1129087 450041 -584416 -182998 1367025 2552306 2565064
37388B565064j016568j466809r20055M52258J228137L59973r82707q85330M97266
$$ 2565064 1548496 81687 -838368 -386110 842027 1202000 219293 -666037 -168771
37379a68771J384650J139526O30629J77496p26164j680558j535347n41600k92893
$$ -168771 1215879 2355405 2986034 3163530 2437366 756808 -778539 -1320139 -1613032
37370a613032j049057j124877K95406J605283J137864m13002j173252o03870L66310
$$ -1613032 -2662089 -3786966 -3491560 -1886277 -748413 -1161415 -2334667 -2938537 -2572227
37361b572227R58512J162601J132682Q52907L35858k32380m73861o0038O31493
$$ -2572227 -1613715 -451114 681568 1534475 1870333 1637953 1164092 1104054 1735547
37352A735547M80007r18881k139109j500766M58674J585978J131723L87637J18914
$$ 1735547 2215554 1296673 -842436 -2343202 -1884528 -298550 833173 1220810 1339724
37343A339724m84840j528914j350128P57391K642707K057163j05513j381203j362861
$$ 1339724 854884 -674030 -2024158 -1266767 1375940 3433103 3327590 1946387 583526
37334E83526j424055j642079o72002J380357K492023J662037K49866l28880m36714
$$ 583526 -840529 -2482608 -3154610 -1774253 717770 2379807 2629673 2300793 1864079
37325A864079q82059j339749j169941o29337k73623q4410K3803k14681n86510
$$ 1864079 982020 -357729 -1527670 -2157007 -2430630 -2515040 -2491237 -2705918 -3292428
37316c292428j87586J103654J954186J352232J21703l88258k35234l22749o99564
$$ -3292428 -3480014 -2376360 -422174 930058 1051761 663503 428269 105520 -594044
37307e94044p35371m02171q8445L39249J002868J123839J27700r00810n49607
$$ -594044 -1329415 -1731586 -1820031 -1480782 -477914 645925 773625 -127185 -676792
37298f76792N30843M57402q73746j695197j303062p48463k80781J208739L247243
$$ -676792 -145949 311453 -562293 -2257490 -3560552 -4309015 -4589796 -3381057 -133814
37289a33814L144152J20728k464185j519940J180275J765191N5863q76139n6652
$$ -133814 3010338 3131066 666881 -853059 327216 2092407 2148270 1272131 1215479
37280A215479L61079m98295o99330N54107R94615p88981k477626j519280P79123
$$ 1215479 1576558 1078263 378933 933040 1927655 1138674 -1338952 -2858232 -2079109
37271b079109J406752K75065k13311P39526J555119J285139P25578L68768l97973
$$ -2079109 -672357 -397292 -610603 128923 1684042 2969181 3694759 4063527 3665554
37262C665554j542865j836353p61248N86379J138117J040938P06870N7023p17140
$$ 3665554 2122689 286336 -474912 111467 1249584 2290522 2997392 3054415 2337275
37253B337275r58024p10230q11522j247208q32513P09134J852818J520681P85399
$$ 2337275 1379251 669021 -142501 -1389709 -2222222 -1513088 339730 1860411 2645810
37244B645810R43821J194935N3880j800177k184291o83376P26216N95555j80037
$$ 2645810 3589631 4784566 4838446 3038269 853978 170602 896818 1492373 1312336
37235A312336j14433O65126Q99186M5534j236731k010221j792561o51920Q47870
$$ 1312336 1197903 1863029 2762215 2807749 1571018 -439203 -2231764 -2883684 -2035814
37226b035814J864606J834859R29074r5737n13055k21967J68977K8023m34205
$$ -2035814 -171208 1663651 2592725 2496988 1983933 1761966 1930943 1958966 1524761
37217A524761l65870M12651Q55702M6167j357297j848045r88848K76437J068950
$$ 1524761 1158891 1571542 2427244 2473411 1116114 -731931 -1720779 -1444342 -375392
37208c75392J331325J117410K34592j024548j694058j207240n7845R54159J505562
$$ -375392 955933 2073343 2307935 1283387 -410671 -1617911 -1675756 -721597 783965
37199G83965J500761Q31277j44348n99004k73490R9413p3936l65786j90760J46638
$$ 783965 2284726 3116003 2971655 2372651 2099161 2198574 2124638 1758852 1568092 1714730
37189A714730O4866k42409l12022m79014j294857k103323j501480M99524J911890
$$ 1714730 1779596 1537187 1225165 746151 -548706 -2652029 -4153509 -3653985 -1742095
37180a742095J107487r41314j678388j24210J834567J782289j25701j356600m12339
$$ -1742095 -634608 -1575922 -3254310 -3378520 -1543953 238336 112635 -1243965 -1656304
37171a656304J098165P54900j136692j921621l81086J654993K032077R78519R6201
$$ -1656304 -558139 196761 -939931 -2861552 -3242638 -1587645 444432 1422951 1519152
37162A519152N788K56170N23896N84466l2574j082182j235661p0244O40783o00160
$$ 1519152 1524940 1781110 2305006 2889472 2856898 1774716 539055 468811 1109594 509434
37152E09434k273012j831029K69703J199992K16719m45601L98972R60777j92864
$$ 509434 -1763578 -3594607 -3324904 -2124912 -1908193 -2353794 -1954822 -994045 -1186909
37143a186909j527132j068646N21116J391600J396435J476035J437956N20495
$$ -1186909 -2714041 -3782687 -3261571 -1869971 -473536 1002499 2440455 2960950
37135B960950o85857r44674m42550l01118n47684m21747k15293p81368j479059
$$ 2960950 2275093 1330419 887869 586751 39067 -382680 -597973 -1379341 -2858400
37126b858400p95899Q85467J389219J54886o54749M47001J701046O53838j983395
$$ -2858400 -3654299 -2768832 -1379613 -1224727 -1879476 -1432475 268571 922409 -1060986
37117a060986l067838j247167J411293K312694J356688K75456J9596M5760j66473
$$ -1060986 -4128824 -5375991 -3964698 -1652004 -295316 -19860 -264 45496 -120977
37108a20977k42925J13786L70272Q8662k03875N6601L80390J32591j51059K38964
$$ -120977 -363902 -250116 120156 208818 4943 61544 441934 574525 423466 662430
37098F62430M75883o28367k019611j325693J282131K674589J185205r94108j287332
$$ 662430 1138313 509946 -1509665 -2835358 -1553227 1121362 2306567 1312459 25127
37089B5127k46492L31378N35988J075585Q19922j310295l345521k510431K73104
$$ 25127 -221365 110013 646001 1721586 2541508 1231213 -2114308 -4624739 -4351635
37080d351635J503467M02834l54365O40394J608194J141669L81451L88419K61410
$$ -4351635 -2848168 -2445334 -2799699 -2159305 -551111 590558 972009 1360428 1621838
37071A621838o41952j195479p53756m77696q33827k70403J718262K694262Q66458
$$ 1621838 979886 -215593 -969349 -1447045 -2280872 -2551275 -833013 1861249 2727707
37062B727707j556434j439689M57333Q37353r06977k006477p35429J298152J790060
$$ 2727707 1171273 -268416 188917 1026270 119293 -1887184 -2622613 -1324461 465599
37053D65599N61264r08101j298233l63636Q75444P73010j046155k600448j629912
$$ 465599 1026863 118762 -1179471 -1543107 -667663 105347 -940808 -3541256 -5171168
37044e171168J357250L493925L065067J248919J06177J20043K94395k09109j193734
$$ -5171168 -3813918 -319993 2745074 3993993 4100170 4220213 4514608 4305499 3111765
37035C111765j834878j647193j091320j000008j288024q82573O28041K083794
$$ 3111765 1276887 -370306 -1461626 -2461634 -3749658 -4632231 -4004190 -1920396
37027a920396K234606J347958M15028m24505j450128k061069j417243m8989O42653
$$ -1920396 314210 1662168 2077196 1652691 202563 -1858506 -3275749 -3324738 -2682085
37018b682085L94035K28704N98267P20162K6523q38539q67633J51648J496813
$$ -2682085 -2288050 -2059346 -1461079 -740917 -714394 -1552933 -2420566 -2268918 -772105
37009g72105K061305J223902l47614j196664q90286n28275p26715l49542J362104
$$ -772105 1289200 2513102 2165488 968824 78538 -449737 -1176452 -1525994 -163890
37000a63890K676637J531369r77937j781109k99743Q91589J80793r33687p12948
$$ -163890 2512747 4044116 3066179 1285070 985327 1876916 2057709 1124022 411074
36991D11074J65079J92537n68332j147292j290285j043202M715J665162K464896
$$ 411074 576153 768690 200358 -946934 -2237219 -3280421 -3275706 -1610544 854352
36982H54352J462166j50671o33778p7081K01786r1508j32716K57543K76794m23096
$$ 854352 2316518 2165847 1532069 1454988 1656774 1565266 1432550 1690093 1966887 1543791
36972A543791j148127j169144n17813K63031N76549J31903o10504o55346K89639
$$ 1543791 395664 -773480 -1291293 -1028262 -451713 -319810 -930314 -1585660 -1296021
36963a296021J203370J054747K47772p3920K54291L98597k7335n67246q98927
$$ -1296021 -92651 962096 1209868 1135948 1390239 1788836 1761501 1194255 295328
36954B95328j129972j047556k02916R36270J037456k32754j328479p63721P07007
$$ 295328 -834644 -1882200 -2085116 -1148846 -111390 -344144 -1672623 -2436344 -1729337
36945a729337J055044r4299q85742K1644J432355J380492M6512n84940K73433
$$ -1729337 -674293 -768592 -1654334 -1632690 -200335 1180157 1226669 641729 915162
36936I15162J207654R56874J62264j51125m13427j373483k144312j257356P00747
$$ 915162 2122816 3079690 3241954 3090829 2677402 1303919 -840393 -2097749 -1397002
36927a397002J420822O5705j529304j427839p146R91873Q21199K46991K86942
$$ -1397002 23820 89525 -1439779 -2867618 -2874764 -1882891 -1061692 -814701 -527759
36918e27759J115804J954464J778822M81246p05300n50481N07531Q94185M6168
$$ -527759 588045 2542509 4321331 4802577 4097277 3546796 4054327 4948512 4994680
36909D994680j037570j483052j554089j635659j431346p65373j46533Q8427K87122
$$ 4994680 3957110 2474058 919969 -715690 -2147036 -2912409 -3058942 -2970515 -2683393
36900b683393O17721O44737K70352Q3288K61835K47223L4599M44890J370358J271296
$$ -2683393 -2065672 -1420935 -1150583 -1067295 -805460 -558237 -523638 -78748 1291610 2562906
36890B562906m15039j797023j009493R53908J634867N48027n84773n70893O2069
$$ 2562906 2147867 350844 -658649 295259 1930126 2478153 1893380 1322487 1384556
36881A384556M59224M20755l5630p19785q57347P9764J139505Q20504o75066j484668
$$ 1384556 1843780 2264535 2228905 1509120 651773 731537 1871042 2691546 2016480 531812
36871E31812o62022N83190P04277k41403j100513j209470p79502k41366J92238
$$ 531812 -130210 452980 1157257 915854 -184659 -1394129 -2173631 -2414997 -2222759
36862b222759N40632R21551J258465J172343M77622l86803q67584r95009j004846
$$ -2222759 -1682127 -760576 497889 1670232 2147854 1761051 893467 -101542 -1106388
36853a106388o04702N13256J600991J369665k09486j536456j241983K23041J267487
$$ -1106388 -1711090 -1197834 403157 1772822 1563336 26880 -1215103 -992062 275425
36844B75425R62252j98389j012034p51588K11482Q66359P15945K71032J65245
$$ 275425 1237677 1039288 27254 -724334 -512852 353507 1069452 1340484 1505729
36835A505729J62026m00502j423214k000101j535061l22315R71045J825157J861709
$$ 1505729 1667755 1267253 -155961 -2156062 -3691123 -4013438 -3042393 -1217236 644473
36826F44473R48390m75630j582645j860674j437963p17247N3994Q30563J549950
$$ 644473 1592863 1117233 -465412 -2326086 -3764049 -4481296 -4427302 -3596739 -2046789
36817b046789J903120J473233L97695l45320j2199O54175K70540j008559j521197
$$ -2046789 -143669 1329564 1727259 1381939 1369740 2023915 2294455 1285896 -235301
36808b35301p31624j85725q72788j371372k32642J324009J243854K1660k39253
$$ -235301 -966925 -1152650 -2025438 -3396810 -3629452 -2305443 -1061589 -1039929 -1279182
36799a279182N77839P08889p7671j64979N59151J58929j636012k264202m86894
$$ -1279182 -701343 7546 -70125 -235104 324047 482976 -1153036 -3417238 -3904132
36790c904132J121379J11280j771509j310096J041761J975347N41988p01873N0005
$$ -3904132 -2782753 -2671473 -4442982 -5753078 -4711317 -2735970 -2193982 -2895855 -2845850
36781b845850J341160J133405j95763q46338j88511Q52789J179365M30239q51128
$$ -2845850 -1504690 -371285 -567048 -1413386 -1601897 -749108 430257 860496 9368
36772I368j417961m18332J243202J515110k15278k026115j781197K03638J819967
$$ 9368 -1408593 -1826925 -583723 931387 716109 -1310006 -3091203 -2887565 -1067598
36763a067598J924127J229837O78218K30099m26590j012622j094872p63927l41623
$$ -1067598 856529 2086366 2764584 2994683 2568093 1555471 460599 -303328 -644951
36754f44951J38475O73076Q95035M82086k42387n94155l39868R8565J79669k00966
$$ -644951 -506476 166600 1061635 1543721 1301334 707179 367311 465876 645545 444579
36744D44579n47908j38018J061179J874336J089400o74387j371014l71055M38514
$$ 444579 -103329 -241347 819832 2694168 3783568 3109181 1738167 1367112 1805626
36735A805626m60789j640835r27071R25345J314349L5106n60866J73054Q1798
$$ 1805626 1344837 -295998 -1223069 -297724 1016625 1051731 490865 663919 745717
36726G45717j565792k137188q655K113023J171917j249846j425018N69234J262510
$$ 745717 -820075 -2957263 -2965918 -852895 319022 -930824 -2355842 -1786608 -524098
36717e24098m32540j747462p53051R18876J083152n4584j167669j710795j368160
$$ -524098 -956638 -2704100 -3457151 -2538275 -1455123 -1509707 -2677376 -4388171 -5756331
36708e756331L06930K438418K875074J008815j048831j309655l69804J81294K05288
$$ -5756331 -5449401 -3010983 -135909 872906 -175925 -1485580 -1855384 -1674090 -1468802
36699a468802L87467N38007J73592j62574L13491J202502J522584J072598J74790
$$ -1468802 -1081335 -543328 -369736 -532310 -218819 983683 2506267 3578865 3753655
36690C753655j099863k367237k514508j124709M39718O60874p2667k73975L97350
$$ 3753655 2653792 286555 -2227953 -3352662 -2912944 -2252070 -2324737 -2598712 -2201362
36681b201362J017826J035095O96470J89802l93221n15125J70475Q52463M30998
$$ -2201362 -1183536 -148441 548029 737831 344610 -170515 -40 852423 1283421
36672A283421p60537j257530m80132O29676J057260P97711L26576j12082m25732
$$ 1283421 522884 -734646 -1214778 -585102 472158 1269869 1596445 1484363 1058631
36663A058631n78867p99581j310503j723038j279753J08274J538399K030177J441060
$$ 1058631 479764 -319817 -1630320 -3353358 -4633111 -4524837 -2986438 -956261 484799
36654D84799L88235m13448o48831n30894n49874r15222j204834p72984L80336
$$ 484799 873034 459586 -189245 -720139 -1270013 -2185235 -3390069 -4163053 -3782717
36645c782717J320665J079239l8946m43850Q68332K630901K478559M9015k251347
$$ -3782717 -2462052 -1382813 -1421759 -1865609 -997277 1633624 4112183 4161198 1909851
36636A909851k293249q25371J35853K94587O54265J011160K32045j158263j108216
$$ 1909851 -383398 -1208769 -1072916 -778329 -124064 887096 1119141 -39122 -1147338
36627a147338Q01887K471718K233252Q07702l83522j016547j191948p72934k64641
$$ -1147338 -345451 2126267 4359519 5167221 4783699 3767152 2575204 1802270 1537629
36618A537629o39137j501397j270781M5379M11416q69521j673470l86999J525985
$$ 1537629 898492 -602905 -1873686 -1828307 -1416891 -2286412 -3959882 -4346881 -2820896
36609b820896K012516J363518P73873N8605j074272j443064l71953N80828J61086
$$ -2820896 -808380 555138 1329011 1387616 313344 -1129720 -1501673 -920845 -759759
36600g59759k63249O29044J306565J88445r45754J05552J592482N08832j894761
$$ -759759 -1023008 -393964 912601 1101046 155292 260844 1853326 2362158 467397
36591D67397j930362J71076P57960o58201o48584J653449K646625M88871j646763
$$ 467397 -1462965 -1291889 -533929 -1192130 -1840714 -187265 2459360 2948231 1301468
36582A301468r14793Q53466Q95750j00444l64958n22713j465909j580688M20196
$$ 1301468 386675 1240141 2135891 2035447 1670489 1147776 -318133 -1898821 -1478625
36573a478625K199768R60189j812583k366546k56255J565909J460584N67202r9178
$$ -1478625 721143 1681332 -131251 -2497797 -2754052 -1188143 272441 839643 740465
36564G40465q59039j529522j109097K55425J155750J108244R45810Q58280K7670
$$ 740465 -118574 -1648096 -2757193 -2501768 -1346018 -237774 708036 1566316 1593986
36555A593986j401042j856624n40334J312906K016269J256287n1353q42118o17936
$$ 1593986 192944 -1663680 -2204014 -891108 1125161 2381448 2330095 1487977 870041
36546H70041J53572L61656l16913o61300M73499K293627L107163K740882K276490
$$ 870041 1023613 1385269 1068356 407056 880555 3174182 6281345 9022227 11298717
36537A1298717J680538k15175l050951m399759k950649n81994J17772p78565j156769
$$ 11298717 12979255 12764080 9713129 5313370 2362721 1780727 1898499 1119934 -36835
36528c6835r5182J159396J282528M72242l49278q14264j006721q39632k77123
$$ -36835 -132017 1027379 2309907 2782149 2432871 1618607 611886 -227746 -504869
36519e04869J92435M6085l92693k61403N04729Q26150o9009j346604j414809Q9758
$$ -504869 -312434 -266349 -659042 -920445 -415716 410434 341425 -1005179 -2419988 -2330230
36509b330230J801195K127504P71053j211451k343831j763222O6498J576022J540030
$$ -2330230 -529035 1598469 2369522 1158071 -1185760 -2948982 -2882484 -1306462 233568
36500B33568L52951o08563p03293l31368K78571J357247K426232K208623N14590
$$ 233568 586519 -22044 -725337 -1056705 -778134 579113 3005345 5213968 5728558
36491E728558q97957m99208P35813N84842j216758k474705j477356P64344J879766
$$ 5728558 4830601 4331393 5067206 5652048 4435290 1960585 483229 1247573 3127339
36482C127339R74417p21137j651634j458050o62750K15687O75582Q8590j460692
$$ 3127339 4101756 3380619 1728985 270935 -391815 -176128 499454 588044 -872648
36473h72648k491232j476496R77881K480413J789764K39877l75816p5735J13804
$$ -872648 -3363880 -4840376 -3862495 -1382082 407682 647559 271743 196008 309812
36464C09812J0630J3747k2688k44318k7264P90582R35629l21589j332262l88006
$$ 309812 320442 334189 311501 67183 39919 830501 1766130 1444541 112279 -275727
36454b75727J170316Q54515p44670q61524O03513Q22882r15720j748026j19317
$$ -275727 894589 1749104 1004434 142910 746423 1569305 653585 -1094441 -1213758
36445a213758J525256R24420m36350m40668n7369r38824j768433m36880J882676
$$ -1213758 311498 1235918 799568 358900 301531 -637293 -2405726 -2842606 -959930
36436i59930K358858J073183N21624J199606J082818n60548j964481j860488j038398
$$ -959930 1398928 2472111 2993735 4193341 5276159 4715611 2751130 890642 -147756
36427a47756l88664L07195J014512Q95485j69408j114940j255237r07620k53919
$$ -147756 -536420 -229225 785287 1680772 1511364 396424 -858813 -1766433 -2020352
36418b020352Q28603J578385P61878j201598k173038j099654N10219P69107r9835
$$ -2020352 -1191749 386636 1148514 -53084 -2226122 -3325776 -2815557 -2046450 -2146285
36409b146285m51490L61414J261876R70397l41358j129604l02741J188108J286507
$$ -2146285 -2597775 -2236361 -974485 -4088 -345446 -1475050 -1777791 -589683 696824
36400F96824m02391j822733j208925M50323R17936j72528j212137j090189j91306
$$ 696824 294433 -1528300 -2737225 -2286902 -1368966 -1541494 -2753631 -3843820 -4035126
36391d035126Q06624J582163J659477O67129p34969j297730o65695M13642J195746
$$ -4035126 -3228502 -1646339 13138 680267 -54702 -1352432 -2018127 -1604485 -408739
36382d08739J420962J031451L08634q3480O775j20027o85738p49078J27805P68198
$$ -408739 1012223 2043674 2352308 2268828 2275603 2155576 1469838 720760 848565 1616763
36372A616763L17930j01881N12734P96097p09888k305318j234418J616340K476335
$$ 1616763 1934693 1832812 2345546 3141643 2431755 126437 -1107981 508359 2984694
36363B984694K20663k107272j936617l50849M31388J78549r0029K4738L94633
$$ 2984694 3205357 1098085 -838532 -1189381 -757993 -579444 -669473 -644735 -250102
36354b50102Q34286P45797k49451j064983l39436J057917R88707l33002m41122
$$ -250102 584184 1329981 1080530 15547 -323889 734028 1722735 1389733 948611
36345I48611J130083J788450K01383j453706j242228n05926r68450j523941n72212
$$ 948611 2078694 3867144 4068527 2614821 1372593 866667 -101783 -1625724 -2197936
36336b197936P12542M28094n05319l841J235909P89835j110983j613896J53505
$$ -2197936 -1485394 -1057300 -1562619 -1566460 -330551 459284 -651699 -2265595 -2112090
36327b112090J574513N80450j229427j016786J237183K786142J787496m48139
$$ -2112090 -537577 42873 -1186554 -2203340 -966157 1819985 3607481 3159342
36319C159342j286308j31025J014668M80537p67818q29302Q8798J68239q79202
$$ 3159342 1873034 1742009 2756677 3237214 2469396 1640094 1728892 1897131 1017929
36310A017929j413902q10655m23842r09728r68759R4557Q65673M00892J32130
$$ 1017929 -395973 -1206628 -1630470 -2540198 -3508957 -3414400 -2548727 -2147835 -2015705
36301b015705J289233K363056J377224q30182j881483j227353r9439P77212J295325
$$ -2015705 -726472 1636584 3013808 2183626 302143 -925210 -1024649 -247437 1047888
36292A047888Q89046m70842j258576n48275K7409j096089k205613q03326J761561
$$ 1047888 1936934 1466092 207516 -340759 -313350 -1409439 -3615052 -4418378 -2656817
36283b656817J831150p35823k161108n84849J510466J792160J337825J634436
$$ -2656817 -825667 -1561490 -3722598 -4307447 -2796981 -1004821 333004 1967440
36275A967440J623674K00751r82379p5943J506002J167183o05059j109554R0569
$$ 1967440 3591114 3791865 2809486 2733543 4239545 5406728 4801669 3692115 3782684
36266C782684O48780n08486j490182o54634Q49995J104786K29887m10176n86297
$$ 3782684 4431464 3922978 2432796 1778162 2628157 3732943 3962830 3552654 2966357
36257B966357j007827j395980o45367J026765J764816N37137j301865j767960
$$ 2966357 1958530 562550 -82817 943948 2708764 3245901 1944036 176076
36249A76076p08919M39319P35349M76274J61963j47087l66207k25636J66968K82768
$$ 176076 -532843 -93524 641825 1118099 1280062 1132975 766768 541132 708100 990868
36239I90868q5191n57038p26483m69453K47997J200450J588639P15326q91572
$$ 990868 905677 348639 -377844 -847297 -599300 601150 2189789 2905115 2013543
36230B013543j782655j205945J88108J296195J532073Q74623k49959j082654j236098
$$ 2013543 230888 -975057 -786949 509246 2041319 2915942 2665983 1583329 347231
36221C47231j175271j278123q88213N28491J791167J273628l94176q65433M31093
$$ 347231 -828040 -2106163 -2994376 -2465885 -674718 598910 204734 -660699 -229606
36212b29606J383107M22643j305852j962018j410771m83925N19440J320845J106653
$$ -229606 1153501 1576144 270292 -1691726 -3102497 -3586422 -3066982 -1746137 -639484
36203f39484j45230r85422m05317O85511J032142Q65978R40889R63337L65469
$$ -639484 -784714 -1770136 -2175453 -1489942 -457800 408178 1349067 2312404 2677873
36194B677873l83376n59522l60719j50061M38650J470987J885095R46046m95691
$$ 2677873 2294497 1734975 1374256 1224195 1662845 3133832 5018927 5964973 5469282
36185E469282j349967j743921j971946j357663L46869J664362J174240l34162
$$ 5469282 4119315 2375394 403448 -954215 -607346 1057016 2231256 1897094
36177A897094j014849m31372M73036R46929O98620l95975j628460j619626l10067
$$ 1897094 882245 450873 923909 1870838 2569458 2173483 545023 -1074603 -1384670
36168a384670N39717K3994l79850N79838J605628J018410m21683r65344o59410
$$ -1384670 -844953 -820959 -1200809 -620971 984657 2003067 1581384 616040 -43370
36159d3370n04810k21271Q56617J847835J530948M26151l13032q16896j370283
$$ -43370 -548180 -769451 87166 1935001 3465949 3892100 3579068 2762172 1391889
36150A391889r84630O77948J676899N71474r27200p44610L7469m90865j199968
$$ 1391889 407259 1085207 2762106 3333580 2406380 1661770 1699239 1208374 8406
36141H406l1001J699106J166898r74864j654708n58886m990k74571M75892J863708
$$ 8406 -22595 1676511 2843409 1868545 213837 -345049 -350039 -624610 -148718 1714990
36131A714990J390390p87803j560392j9121J144712K74070r95656j065342m65601
$$ 1714990 3105380 2317577 757185 738064 1882776 2156846 1161190 95848 -369753
36122c69753K52608J384843K098211R10891j224640j668419l94914J5019r11653
$$ -369753 -117145 1267698 3365909 4276800 3052160 1383741 988827 1003846 92193
36113I2193q16000P86756J281701l56125j691091j100051p0614K53618R63266
$$ 92193 -723807 62949 1344650 988525 -702566 -1802617 -1873231 -1619613 -656347
36104f56347K197729J957316k5737r86763K86921J234146R319j455033j243067
$$ -656347 1541382 3498698 3472961 2486198 2773119 4007265 4016584 2561551 1318484
36095A318484p60370j540244j985945k90155K042582K497981J278510K47172J4522
$$ 1318484 558114 -982130 -2968075 -3258230 -1215648 1282333 2560843 2808015 2822537
36086B822537J50359N15492O95931j13491j415745j534261k63162Q05397J033607
$$ 2822537 2972896 3488388 4184319 4070828 2655083 1120822 857660 1663057 2696664
36077B696664J158742Q43300q46315k378647j169243J577469J905491m18125j427100
$$ 2696664 3855406 4698706 3852391 1473744 304501 1881970 3787461 3369336 1942236
36068A942236J37776R51212l98454r16583O14441R58349j207278k166205J36232
$$ 1942236 2080012 3031224 2632770 1716187 2330628 3288977 2081699 -84506 51726
36059E1726J966392L08329j880968j180130N42539L09811o50422j66638N80125
$$ 51726 2018118 2326447 445479 -734651 -192112 117699 -532723 -699361 -119236
36050a19236J37232R488J137136J494149M31993N18601K073552J600878j286877
$$ -119236 17996 27484 1164620 2658769 3090762 3609363 5682915 7283793 5996916
36041E996916k003019O09609J525188r72787j529482J896690L257596k44048k100005
$$ 5996916 3993897 4603506 6128694 5155907 3626425 5523115 8780711 8536663 6436658
36032F436658J331536L328111l07999k237014K682302O407189K083457k516785
$$ 6436658 7768194 11096305 10788306 8551292 11233594 17640783 19724240 17207455
36024A7207455P78599N062793K157357q14452M145609Q508233M255133L203510
$$ 17207455 17986054 23048847 25206204 24391752 28537361 37045594 41300727 44504237
36016D4504237J4800793K1955616J2403483J7029615O8399381J26529198J05868213
$$ 44504237 59305030 81260646 93664129 110693744 179093125 305622323 411490536
36009D11490536o460228j14110954j26160814o4415498j5542229j3304769k1487341
$$ 411490536 405030308 290919354 164758540 100343042 84800813 71496044 50008703
36002E0008703j2294719j701832n455442j0365297l963167L062509J22088m249115
$$ 50008703 37713984 36012152 30556710 20191413 16228246 19290755 19412843 15163728
35994A5163728j254024J895376j867745n259056j424577K631034l87227m469987
$$ 15163728 13909704 15805080 13937335 8678279 7253702 9884736 9497509 5027522
35986E027522j985475K548550J601454k151678k253645L1039J93380n58403N87304
$$ 5027522 3042047 5590597 7192051 5040373 2786728 2817767 3011147 2452744 3040048
35977C040048J246285j085082k923652q10778K014323J380550o71558m98626O34501
$$ 3040048 4286333 3201251 277599 -533179 1481144 2861694 2190136 1691510 2326011
35968B326011L75998M24211K244866K746455k31629l042310k231661m89389j220366
$$ 2326011 2702009 3126220 5371086 8117541 7885912 4843602 2611941 2122552 902186
35959I02186k187512k99242K038483J381382k68729M83246J851624M86140j907894
$$ 902186 -1285326 -1584568 453915 1835297 1566568 2049814 3901438 4387578 2479684
35950B479684j708411J8743N8623p42657J93402J354029k19854k761147k402969
$$ 2479684 771273 790016 848639 105982 299384 1653413 1433559 -1327588 -3730557
35941c730557j00473J94894j214083n58632K199301L047158P65277j393481j286183
$$ -3730557 -3831030 -3636136 -4850219 -5408851 -3209550 -162392 602885 -790596 -2076779
35932b076779l47741O9601N46542J133371P65076k43886l15061M44017L49870
$$ -2076779 -2424520 -2354919 -1808377 -675006 90070 -153816 -468877 -24860 325010
35923C25010o70113q52657L14491J379654J359492O29544l81019j300408j187586
$$ 325010 -345103 -1197760 -883269 496385 1855877 2485421 2104402 803994 -383592
35914c83592J42342J019813K43314o87238K0221J228972P81750p29170j096914
$$ -383592 -241250 778563 1021877 334639 354860 1583832 2365582 1636412 539498
35905E39498k31897L19351M84823J106192J321534j05177j726911j198470N98512
$$ 539498 307601 626952 1111775 2217967 3539501 3434324 1707413 508943 1107455
35896A107455Q16390n74560j067726l10624m40760j614875j352679Q94462K391098
$$ 1107455 1923845 1349285 281559 -29065 -469825 -2084700 -3437379 -2542917 -151819
35887a51819J550758K68523L49031O97671j51085j272803j079917J7487M34367
$$ -151819 1398939 1667462 2016493 2714164 2563079 1290276 210359 227846 662213
35878F62213k80801j206012j325451m45791N02489J91804j200237j564127K45492
$$ 662213 381412 -824600 -2150051 -2595842 -2093353 -1901549 -3101786 -4665913 -4420421
35869d420421K183389J789708N2480l03887N48631J22845j539069j572474O79386
$$ -4420421 -2237032 -447324 -394844 -698731 -150100 -27255 -1566324 -3138798 -2459412
35860b459412K282132J498267K49294K40031K20191q31619j199417K69785J369400
$$ -2459412 -177280 1320987 1570281 1810312 2030503 1198884 -533 269252 1638652
35851A638652J34156j305185m4285K325652J829973j407551l002510r45526J448821
$$ 1638652 1772808 467623 423338 2748990 4578963 3171412 168902 -776624 672197
35842F72197O76608j905075k464250k85173J690044J373630J03246P3747J058540
$$ 672197 1348805 -556270 -3020520 -3305693 -1615649 -242019 -138773 -65026 993514
35833I93514J180981N8241o54257M6017R21624M01479j109366j926096j363869
$$ 993514 2174495 2232736 1578479 1624496 2546120 2947599 1838233 -87863 -1451732
35824a451732k54775L36487n52r80366j687566j222905L2735N91302L1884j40402
$$ -1451732 -1706507 -1370020 -1370572 -2350938 -4038504 -5261409 -5228674 -4637372 -4605488 -4745890
35814d745890J102192K354376J789363l8227j224386j298449r60801r6911J549732
$$ -4745890 -3643698 -1289322 500041 461814 -762572 -2061021 -3021822 -3118733 -1569001
35805a569001K571490J465194n23033r20957L759j35758j455884j506127K87535
$$ -1569001 1002489 2467683 1944650 1023693 1027452 891694 -564190 -2070317 -1782782
35796a782782J503792R77661N73952J258466R58860j484371l414236k180536O02805
$$ -1782782 -278990 698671 1272623 2531089 3489949 2005578 -1408658 -3589194 -2986389
35787b986389J581114N77566l683O21691R90996L48412l52970k95402K12455M97346
$$ -2986389 -1405275 -827709 -831392 -209701 781295 1129707 776737 481335 693790 1191136
35777A191136P5446j063918j847999q49645J397846K302525P43449r97659n48169
$$ 1191136 1266582 202664 -1645335 -2494980 -1097134 1205391 1948840 951181 403012
35768D03012J067769J432252O02918L29812O31840R7666j068719j218008k28694
$$ 403012 1470781 2903033 3505951 3835763 4467603 4565269 3496550 2278542 2049848
35759B049848L91528L12333O79863J507261J332134j51033j454968j724488j632576
$$ 2049848 2441376 2753709 3433572 4940833 6272967 6121934 4666966 2942478 1309902
35750A309902j525771r16824j84775m07790j039138l05497J434376J592404k76777
$$ 1309902 -215869 -1132693 -1317468 -1725258 -2764396 -3069893 -1635517 -43113 -319890
35741c19890j081222R45402K925087J635599j236872j613527O31714J656220l07152
$$ -319890 -1401112 -455710 2469377 4104976 2868104 1254577 1886291 3542511 3235359
35732C235359k547049k274220l70924O98364M36378R368q6140k69956o28298q81662
$$ 3235359 688310 -1585910 -1956834 -1258470 -822092 -812724 -898864 -1168820 -1797118 -2678780
35722b678780j063146j080230k16379J677315L022733K056071n70410k194352
$$ -2678780 -3741926 -4822156 -5038535 -3361220 -338487 1717584 1147174 -1047178
35714a047178j401784M32541J310444J024621N98365M27693K03250N5544M48055
$$ -1047178 -2448962 -2016421 -705977 318644 917009 1344702 1547952 1603496 2051551
35705B051551J054795Q93613k39820j331407j404931n97491K29842M56238J28283
$$ 2051551 3106346 3999959 3760139 2428732 1023801 426310 656152 1112390 1240673
35696A240673j82693O1448O06273M55544p67177j893793j545567j11427P63836
$$ 1240673 1057980 1119428 1725701 2181245 1414068 -479725 -2025292 -2136719 -1372883
35687a372883N72302M28956R48116J183047L97789m79513k48543P10120J092865
$$ -1372883 -800581 -371625 576491 1759538 2157327 1677814 1429271 2139391 3232256
35678C232256M82579m99541j253839j508893j137035m82304k67602m61796p9430
$$ 3232256 3714835 3215294 1961455 452562 -684473 -1166777 -1434379 -1896175 -1975605
35669a975605J071329J554331M47422p93720k97982J234869J501898J10583r91510
$$ -1975605 -904276 650055 1097477 303757 5775 1240644 2742542 2853125 1861615
35660A861615n86442L66391O71692M03209n0491p37541j341769j209345p29700
$$ 1861615 1275173 1641564 2313256 2716465 2665974 1928433 586664 -622681 -1352381
35651a352381j033339j739397r63585J468422K916666J597626n25664n88739R44533
$$ -1352381 -2385720 -4125117 -5088702 -3620280 -703614 894012 368348 -220391 724142
35642G24142J381857J66789o49541r5957L30324m69281j325372r04753J32213
$$ 724142 2105999 2272788 1623247 1527290 1857614 1388333 62961 -841792 -709579
35633g09579M05510l3816j61203K58012N74844M25233N0842j83121M3652Q17090
$$ -709579 -304069 -337885 -499088 -241076 333768 759001 809843 626722 670374 1487464
35623A487464J446109Q53618q18393j849013j089089L69457P97604K77812R7885
$$ 1487464 2933573 3787191 2968798 1119785 30696 400153 1197757 1475569 1573454
35614A573454L69400J04457n61399k86735R89214J446281R0740j627525j974849
$$ 1573454 1942854 2047311 1485912 1199177 2188391 3634672 3725412 2097887 123038
35605A23038j237784o03775n4367J051599K217755K305808J315248K55569l62107
$$ 123038 -1114746 -1718521 -1772888 -721289 1496466 3802274 5117522 5373091 5010984
35596E010984o62855n64794j27921j85004j163556j851143r84522M99108P28886
$$ 5010984 4348129 3783335 3655414 3470410 2306854 455711 -528811 -29703 699183
35587F99183p2652j28390N88437L05812j066564j390884q1297O03048m99945j209282
$$ 699183 626531 498141 1086578 1392390 325826 -1065058 -1146355 -543307 -1043252 -2252534
35577b252534J72341J564822N11443j392991r47349J287723J875754J18987j072886
$$ -2252534 -2080193 -515371 -3928 -1396919 -2344268 -1056545 819209 938196 -134690
35568a34690j57086Q39531J34302r07838l51890J102083J339720j14359j729473
$$ -134690 -291776 547755 682057 -225781 -577671 524412 1864132 1749773 20300
35559B0300j821122J5232K440474L048550P78466k184394k596035m81727Q45641
$$ 20300 -1800822 -1785590 654884 3703434 4481900 2297506 -298529 -780256 65385
35550F5385l25813j721985r03767J004804J507433P02777N21153J258747J495482
$$ 65385 -260428 -1982413 -2886180 -1881376 -373943 328834 849987 2108734 3604216
35541C604216Q40261L29603K97458j9507p52646j146017j087198j191439j300183
$$ 3604216 4444477 4774080 5071538 5052031 4299385 3153368 2066170 874731 -425452
35532d25452n75365P45459J308511O44585k58385o40059p52913o87822q866R20224
$$ -425452 -1000817 -255358 1053153 1697738 1439353 799294 46381 -641441 -650307 269917
35522B69917Q05224n69027j516649o12697J313190K283371J533764l3554j152307
$$ 269917 1075141 506114 -1010535 -1623232 -310042 1973329 3507093 3473539 2321232
35513B321232j250502o55515k18474l84104n73517j07952M59103P3177q51635
$$ 2321232 1070730 415215 196741 -187363 -760880 -868832 -409729 -336552 -1188187
35504a188187p87896L12694O50507m61032j249538l74507P55476L83030n54660
$$ -1188187 -1976083 -1663389 -1012882 -1473914 -2723452 -3097959 -2342483 -1959453 -2514113
35495b514113j25778J094985R89223k67573l33262J205845J821525K7630k183528
$$ -2514113 -2639891 -1544906 -555683 -823256 -1156518 49327 1870852 1898482 -285046
35486b85046k344844r59058j90192n14322n52027M64190J687112J944402R87924
$$ -285046 -2629890 -3588948 -3779140 -4293462 -4845489 -4381299 -2694187 -749785 238139
35477B38139m01066r64323m0357J445171J711519L35133j090584j075291l0852
$$ 238139 -162927 -1127250 -1167607 277564 1989083 2324216 1233632 158341 127489
35468A27489P75489R56207O99539j43823j369321j788482p83637L18039K5573
$$ 127489 902978 1859185 2558724 2414901 1045580 -742902 -1526539 -1208500 -1182927
35459a182927r24912q15216O1449p8211j183509j112082P64547K111858J029808
$$ -1182927 -2107839 -2923055 -2861606 -2939817 -4123326 -5235408 -4470861 -2359003 -1329195
35450a329195r92765j166577P53556K395698J991004K33857j015185q91508j47884
$$ -1329195 -2321960 -3488537 -2734981 -339283 1651721 1885578 870393 -21115 -168999
35441a68999R319n34980p30330m3332N07345o7733p98710j5174J742471K081127
$$ -168999 -159680 -694660 -1424990 -1468322 -960977 -1028710 -1827420 -1842594 -100123 1981004
35431A981004L17392j395349j256961j34215M05555M29231N44370K50814q05629
$$ 1981004 2298396 903047 -353914 -488129 -82574 346657 891027 1141841 336212
35422C36212j400776n29790N59483J83636r49552r21768J98666O73700R5599l12999
$$ 336212 -1064564 -1594354 -1034871 -851235 -1800787 -2722555 -2523889 -1850189 -1754590 -2067589
35412b067589j70873l22952o88933o4115J537312K447717J797224N37969m50238
$$ -2067589 -2238462 -2561414 -3250347 -3314462 -1777150 670567 2467791 3005760 2555522
35403B555522j383849k140468j739648j20110J229539J294452P34952L78496P6640
$$ 2555522 1171673 -968795 -2708443 -2828553 -1599014 -304562 430390 808886 885526
35394H85526k19368Q4709Q39965R05362K05958K30588J338720J524320n15141
$$ 885526 666158 750867 1590832 2496194 2702152 2932740 4271460 5795780 5280639
35385E280639k854737k919213j202749j80871m99264o37813J08268O85305M07860
$$ 5280639 2425902 -493311 -1696060 -1876931 -2376195 -3014008 -2905740 -2220435 -1812575
35376a812575J7750K07867O37720Q52361R31167Q43077K50520o44875r76230l68003
$$ -1812575 -1794825 -1586958 -949238 -96877 834290 1677367 1927887 1283012 306782 -61221
35366f1221M14762L28107p72565j911356j806370j92347J513195J516820n2804
$$ -61221 353541 681648 -90917 -2002273 -3808643 -4000990 -2487795 -970975 -1023779
35357a023779j110576m87200L94692j58910j365708j269267R7568R47606P41589
$$ -1023779 -2134355 -2621555 -2226863 -2385773 -3751481 -5020748 -4923180 -3975574 -3233985
35348c233985P13520J285476J201809p5377j073689n26070O09678O33397l97373
$$ -3233985 -2520465 -1234989 -33180 -108557 -1182246 -1708316 -1098638 -465241 -862614
35339h62614r32494j75591J003175J275127L38150q08679r02967J44931J029727
$$ -862614 -1795108 -1970699 -967524 307603 645753 -162926 -1065893 -920962 108765
35330A08765O55996m29617r62213q37294q59355r36824j71966J126972J354106
$$ 108765 764761 335144 -627069 -1464363 -2323718 -3260542 -3432508 -2305536 -951430
35321i51430J81543n12672N88572K016278J542199n94585k129063j902573r53033
$$ -951430 -769887 -1282559 -693987 1322291 2864490 2269905 140842 -1761731 -2714764
35312b714764n44749n17104j7624R84301J515863P78062p43721j573691r04726
$$ -2714764 -3259513 -3776617 -3794241 -2809940 -1294077 -516015 -1259736 -2833427 -3738153
35303c738153L25761P02055M30437R80355K491468L071012J484996q11736j584991
$$ -3738153 -3412392 -2710337 -2279900 -1299545 1191923 4262935 5747931 4936195 3351204
35294C351204p61379l6935k34334n91255m12404j446J36865m5654m10473q02795
$$ 3351204 2589825 2552890 2318556 1727301 1314897 1313451 1450316 1404662 994189 191394
35284A91394r53204p57454m29493K6800Q57651J548272Q62022j098448k118712
$$ 191394 -761810 -1519264 -1948757 -1921957 -1064306 483966 1345988 247540 -1871172
35275a871172p52580J171196J034491n16400p14146O03439P20178j072368j849158
$$ -1871172 -2623752 -1452556 -418065 -934465 -1648611 -1045172 -324994 -1397362 -3246520
35266c246520J30492K169160J197597j356428j837727Q5049J450755Q57789k3064
$$ -3246520 -3116028 -946868 250729 -1105699 -2943426 -2858377 -1407622 -549833 -572897
35257e72897J08227K60224m82705j123933n56957N27108Q02685J75452n61164
$$ -572897 -464670 -204446 -687151 -1811084 -2368041 -1840933 -1038248 -862796 -1423960
35248a423960r62930r60063n16378j1440j34873p49283p38017L57991J483596
$$ -1423960 -2386890 -3346953 -3863331 -3874771 -4009644 -4758927 -5496944 -5138953 -3655357
35239c655357J579691J006555O35115M76717K08754J66257O48549R99119O23537
$$ -3655357 -2075666 -1069111 -433996 42721 251475 417732 1066281 2065400 2688937
35230B688937K31067O58321J067385K0715j931117k620532j405171r8828j57107
$$ 2688937 2920004 3578325 4645710 4666425 2735308 114776 -1290395 -1389223 -1546330
35221a546330o43522p3765J083038J216120J49117n80236R5608J427376J880475
$$ -1546330 -2189852 -2263617 -1180579 35541 184658 -395578 -299970 1127406 3007881
35212C007881Q56686p95079j663488j152179j02478J84780l99716o84983m0100
$$ 3007881 3864567 3069488 1406000 253821 151343 336123 -63593 -748576 -788676
35203g88676N70951J03794p57188n19351P25717J243380J78132j174968j214941
$$ -788676 -217725 -113931 -871119 -1390470 -664753 578627 756759 -418209 -1633150
35194a633150r7425Q69356J071972Q32043L69949l02114o83266j87614O62124
$$ -1633150 -1730575 -861219 210753 1042796 1412745 1110631 427365 239751 901875
35185I01875N84059n91930j482007j115077k93238j79485m90387k22853N52369
$$ 901875 1485934 894004 -588003 -1703080 -1996318 -2175803 -2666190 -2889043 -2336674
35176b336674R55742Q60198P49365M01586n98619j246508q2361K006092K276651
$$ -2336674 -1380932 -520734 228631 630217 31598 -1214910 -1297271 708821 2985472
35167B985472K23133j266979k65793J141569L54101j400756j200022P47861J975525
$$ 2985472 3208605 1941626 1675833 2817402 3171503 1770747 570725 1318586 3294111
35158C294111K433960M123198O109615M507687j186567n912130n590811k443866
$$ 3294111 5728071 9851269 15960884 20468571 19282004 13369874 7779063 5335197
35150E335197r00623j226367q62899J89613k63836j850507j659649P01423J987657
$$ 5335197 4434574 3208207 2345308 2534921 2271085 420578 -1239071 -537648 1450009
35141A450009L42706j796372j449761P43074J996463J273854j40948q71992o71111
$$ 1450009 1792715 -3657 -1453418 -710344 1286119 2559973 2419025 1547033 875922
35132H75922o2848J04182o77681j622848j215218N19752J405407o1856k223206
$$ 875922 813074 917256 239575 -1383273 -2598491 -2078739 -673332 -735188 -2958394
35123b958394k136494M89660K838385K568855M80181r29360n43258N47373P70722
$$ -2958394 -5094888 -4605228 -1766843 802012 1282193 352833 -190425 356948 1127670
35114A127670k34683j590226k147837j305767N88998K263554K355823P85102r28894
$$ 1127670 892987 -697239 -2845076 -4150843 -3561845 -1298291 1057532 1842634 913740
35105I13740j266058l94505L94387N86128P01187Q15150K86311p36535j079206
$$ 913740 -352318 -746823 -352436 233692 934879 1750029 2036340 1299805 220599
35096B20599m80801k24370q95246j130379O9116J378484J256091N46961Q09723
$$ 220599 -260202 -484572 -1379818 -2510197 -2441081 -1062597 193494 740455 1550178
35087A550178J279880J45657j890289k237884m97515R09394N16821m14472n19892
$$ 1550178 2830058 2975715 1085426 -1152458 -1649973 -740579 -223758 -638230 -1158122
35078a158122k59288l29276l11675J07879M02961M62059Q06432J051496K11315
$$ -1158122 -1417410 -1746686 -2058361 -1950482 -1547521 -1085462 -279030 772466 983781
35069I83781r88197n61453J237078J625125l17103j858623r24173O52797M44848
$$ 983781 -4416 -565869 671209 2296334 1979231 120608 -803565 -150768 294080
35060B94080n79067j31767J386194J907744J179647L71368m75499j769868k311552
$$ 294080 -284987 -416754 969440 2877184 4056831 4428199 3952700 2182832 -128720
35051a28720q43944J229164J570421N90216M81187J262589R65262n50471j238687
$$ -128720 -972664 256500 1826921 2417137 2898324 4160913 5126175 4575704 3337017
35042C337017n10393j40489r86228j593495q61169L19957Q86089R44284O51621
$$ 3337017 2826624 2686135 1699907 106412 -754757 -434800 451289 1395573 2047194
35033B047194k29308j087925p49510M78121R38331J81090n75482p81155j150442
$$ 2047194 1817886 729961 -19549 458572 1396903 1577993 1002511 221356 -929086
35024i29086j605037j022276M15808J041629N33393M71203J326734J512929M06481
$$ -929086 -2534123 -3556399 -3140591 -2098962 -1565569 -1094366 232368 1745297 2151778
35015B151778l71878Q1954M18225j20831j29494R08116Q69338j360464l138055
$$ 2151778 1779900 1861854 2280079 2159248 2029754 2937870 3807208 2446744 -691311
35006f91311j805389R93416J839922O45544o0621L51600K92593n11187n69751
$$ -691311 -2496700 -1503284 336638 982182 921561 1273161 1565754 1054567 484816
34997D84816L18878O08479j13273m75051r77O4078p10536q79649L81622J590153
$$ 484816 803694 1412173 1298900 823849 822872 886950 176414 -703235 -321613 1268540
34987A268540J010010q59304k005909j405209N3782Q20438M19164n1986O42983
$$ 1268540 2278550 1419246 -586663 -1991872 -1938090 -1117652 -698488 -750474 -107491
34978a07491J918796J766074l44856k208005j731412J30741R74611M91492K91933
$$ -107491 1811305 3577379 3232523 1024518 -706894 -576153 398458 889950 1181883
34969A181883P64923N40200q32982j932155j711186q37881j89051L37265Q70214
$$ 1181883 1946806 2487006 1654024 -278131 -1989317 -2827198 -3016249 -2678984 -1808770
34960a808770R29766M51959K01228N44846Q92078P62304L40201k37847r21900
$$ -1808770 -879004 -427045 -225817 319029 1211107 1973411 2313612 2075765 1153865
34951A153865r74476L31027K007284K031121J82380j480013j536839q26030m32768
$$ 1153865 179389 510416 2517700 4548821 4731201 3251188 1714349 888319 455551
34942D55551j0295P73709R61531m3516j075365r95694n10155o07852n93384M16286
$$ 455551 445256 1218965 2180496 2136980 1061615 65921 -444234 -1052086 -1645470 -1229184
34932a229184J280792M28237j141804r69426R59309J911057M09112j659704j810726
$$ -1229184 51608 479845 -661959 -1631385 -672076 1238981 1648093 -11611 -1822337
34923a822337j32554J363861J343307N9485j439971k042271j107850Q32374K235543
$$ -1822337 -1954891 -591030 752277 811762 -628209 -2670480 -3778330 -2945956 -710413
34914g10413K048024Q38788K6867K68089R87710J228028N61760o60032j650828
$$ -710413 1337611 2176399 2203266 2471355 3459065 4687093 5248853 4588821 2937993
34905B937993j866357j489539j117350r67507p01226p2085O71065J204070J540290
$$ 2937993 1071636 -417903 -1535253 -2502760 -3203986 -3276071 -2605006 -1400936 139354
34896A39354J739814J547124P01090n57191j605356k004958j758132j116681l45571
$$ 139354 1879168 3426292 4127382 3570191 1964835 -40123 -1798255 -2914936 -3260507
34887c260507L63780Q71340R93816N47070k82358p36921j92684Q15372R17497
$$ -3260507 -2896727 -2025387 -1031571 -484501 -766859 -1503780 -1696464 -881092 36405
34878C6405l13998j509462j138069M24604J397674R83431J59151o7555k4911m09291
$$ 36405 -277593 -1787055 -2925124 -2500520 -1102846 -119415 39736 -27819 -52730 -462021
34868d62021r43507r26680m82174k47850j95678K24466R17320J090756M30833
$$ -462021 -1405528 -2332208 -2814382 -3062232 -3257910 -3033444 -2116124 -1025368 -594535
34859e94535m55876q63938o26069L6815O62896O63706p857m83158m0510P69005
$$ -594535 -1050411 -1914349 -2540418 -2503603 -1840707 -1177001 -1184858 -1668016 -1708526 -939521
34849i39521J026000J033597J617164K166055J232930q10834j787927r44455p2340
$$ -939521 86479 1120076 2737240 4903295 6136225 5325391 3537464 2593009 2520669
34840B520669m87201j045290n56269n0020p01162j330136l48932J193754J115009
$$ 2520669 2033468 988178 431909 381889 -319273 -1649409 -1998341 -804587 310422
34831C10422l05620r07693k45869J00217m14912n93063M5365N52421N60496P04862
$$ 310422 4802 -902891 -1148760 -1048543 -1463455 -2056518 -2011153 -1458732 -898236 -193374
34821a93374Q32502J44486o67010j5583J452511J174869j092395k331662q72545
$$ -193374 639128 783614 116604 101021 1553532 2728401 1636006 -695656 -1568201
34812a568201R54854O21088p87286q71071J60966N22820J96619N27570J471456
$$ -1568201 -613347 7741 -779545 -1650616 -1489650 -966830 -770211 -242641 1228815
34803A228815J725774J011389J57474n27206j152872j186835k52408P11514P74167
$$ 1228815 2954589 3965978 4123452 3596246 2443374 1256539 1004131 1715645 2489812
34794B489812O43550J212616J513595K41569j600125j970651j034018o11835q94761
$$ 2489812 3133362 4345978 5859573 6101142 4501017 2530366 1496348 884513 -10248
34785a0248m38137P40403R62236N3990j60912Q03481J072118k06446j114276j63072
$$ -10248 -448385 292018 1254254 1308244 1147332 1950813 3022931 2816485 1702209 1539137
34775A539137J070922M76113j197599j633815m90432M71699K10649n24254p75883
$$ 1539137 2610059 3086172 1888573 254758 -235674 236025 446674 -77580 -853463
34766h53463m99402J7726P03475J371517J542787R09435k41944j152100j218801
$$ -853463 -1352865 -1335139 -631664 739853 2282640 3192075 2950131 1798031 579230
34757E79230p18845o21289j137646r31269J067605L316840K882810n22834l491588
$$ 579230 -139615 -760904 -1898550 -2829819 -1762214 1554626 4437436 3914602 423014
34748D23014l015444k04365J548202R91148k10098n14587k74823k83725l30124
$$ 423014 -2592430 -2796795 -1248593 -257445 -467543 -982130 -1256953 -1540678 -1870802
34739a870802n412K36512j40747n47578R4232J622024K475711J597249j59263
$$ -1870802 -1876214 -1639702 -1780449 -2328027 -2233795 -611771 1863940 3461189 3301926
34730C301926j102179q09748l65744n69166r02628o50979p1822L01919O86521
$$ 3301926 2199747 1389999 1024255 455089 -447539 -1098518 -1170340 -868421 -181900
34721a81900J326025J433427K24931j361755j549828l20337M93164K4057m04407
$$ -181900 1144125 2577552 2802483 1440728 -109100 -429437 63727 87784 -316623
34712c16623L30913J113195L04341j527322k215764r81498O53920J066248M53266
$$ -316623 14290 1127485 1431826 -95496 -2311260 -3292758 -2638838 -1572590 -1119324
34703a119324N3893K64153L81743K7277q1792P25205J699298J395908k30620j534720
$$ -1119324 -1065431 -801278 -419535 -392258 -474050 251155 1950453 3346361 3115741 1581021
34693A581021j416632p41298o82725p61138J00555J384308J589468O90774J62612
$$ 1581021 164389 -576909 -1259634 -2020772 -1920217 -535909 1053559 1744333 1906945
34684A906945N15112N97179k70245j111808q98236p373N84575N23816p550o44737
$$ 1906945 2422057 3019236 2748991 1637183 738947 731574 1316149 1839965 1832415 1187678
34674A187678p96469j96551M21516K64615j08346K55540O78633k02212j599710
$$ 1187678 391209 194658 616174 880789 772443 1027983 1706616 1504404 -95306
34665i5306j220639Q73798J840595M39658r86795m12426P46092M30677o21777
$$ -95306 -1315945 -442147 1398448 1838106 851311 438885 1184977 1615654 993877
34656I93877p08304l04616o38738q73022L28417J754923J244742n80776j208129
$$ 993877 285573 -19043 -657781 -1530803 -1202386 552537 1797279 1216503 8374
34647H374k63936L31878p8882j74756M70034O61352J20580J24963R90575J235876
$$ 8374 -255562 76316 -2566 -177322 292712 954064 1074644 1199607 2190182 3426058
34637C426058L1836j468345j981804j611784r45670j84401L65592L42358J52822
$$ 3426058 3457894 1989549 7745 -1604039 -2549709 -2734110 -2368518 -2026160 -1873338
34628a873338M24572O80600Q9973o79512k46677R55933J068560j63665r68711
$$ -1873338 -1448766 -768166 -678193 -1357705 -1604382 -648449 420111 256446 -712265
34619g12265n09172l3146m69147r82520o95666K4757O94758J369680J652576Q82135
$$ -712265 -1221437 -1254583 -1723730 -2706250 -3401916 -3377159 -2682401 -1312721 339855 1221990
34609A221990k63114l25333M26504L01471o50278m73957R97934J311896m70670
$$ 1221990 958876 633543 1060047 1361518 711240 237283 1235217 2547113 2076443
34600B076443j846262r18453N02668J87605p30484r7897J246749J002228m67139
$$ 2076443 230181 -688272 -185604 2001 -728483 -826380 420369 1422597 955458
34591I55458p84909L85356R85733J01430q03920m63421M73528P66798K00637m79076
$$ 955458 170549 555905 1541638 1643068 839148 375727 849255 1616053 1816690 1337614
34581A337614m16602M94018J170130M83744p67194m54946J545742K517800P78651
$$ 1337614 921012 1415030 2585160 3068904 2301710 1846764 3392506 5910306 6688957
34572F688957j612242j989039r96308q62938j450352j071691q8863l40979j493980
$$ 6688957 5076715 3087676 2091368 1228430 -221922 -1293613 -1382476 -1723455 -3217435
34563c217435j278559N98080J857444J317393L39313R9670N9030j97496q8146
$$ -3217435 -4495994 -3897914 -2040470 -723077 -383764 -284094 -225064 -422560 -510706
34554e10706K45193k79809j365408j157325O12749J622880L89043j401106j507188
$$ -510706 -265513 -545322 -1910730 -3068055 -2455306 -832426 -443383 -1844489 -3351677
34545c351677l12521K80118k49991q96505r23011l74184N30099J412745J743533
$$ -3351677 -3664198 -3384080 -3634071 -4530576 -5453587 -5827771 -5297672 -3884927 -2141394
34536b141394J572051J515769J482059M99452j431507k521122j337679J090848
$$ -2141394 -569343 946426 2428485 2927937 1496430 -1024692 -2362371 -1271523
34528a271523K445526J820597L11502o56317p24762n13061o78786j065182q45737
$$ -1271523 1174003 2994600 3306102 2649785 1925023 1411962 733176 -332006 -1177743
34519a177743J69527Q37608J88662q35939n58841P50383J149678J31967n45416
$$ -1177743 -1008216 -170608 18054 -817885 -1376726 -626343 523335 655302 109886
34510A09886K05316J012704L47803j036374j392638m77760O30204J228184J189161
$$ 109886 315202 1327906 1675709 639335 -753303 -1231063 -600859 627325 1816486
34501A816486L47222r69743j478022l51091J323593J684129M61223p67903o08705
$$ 1816486 2163708 1193965 -284057 -635148 688445 2372574 2833797 2065894 1457189
34492A457189N83557J236171M03224r60646r46714O54746J494578k41593k703946
$$ 1457189 2040746 3276917 3680141 2719495 1772781 2427527 3922105 3680512 976566
34483I76566k556191J7027J347542j42581j568694l02850J936639K133726O80890
$$ 976566 -1579625 -1562598 -215056 -357637 -1926331 -2229181 -292542 1841184 2522074
34474B522074M8589M65268J96422p94361p02348P84237J810155J210086k31183
$$ 2522074 2570663 3035931 3232353 2437992 1735644 2519881 4330036 5540122 5308939
34465E308939j520927k411993k533624j557666l60727j74656n51014l0418J248109
$$ 5308939 3788012 1376019 -1157605 -2715271 -3075998 -3250654 -3801668 -3832086 -2583977
34456b583977J693231J033338O56072R11715N00438q04528j241363L2206J268473
$$ -2583977 -890746 142592 798664 1710379 2210817 1406289 164926 197132 1465605
34447A465605P75744n48670q67738j41886L66388K17464r5608l42164n15338k84817
$$ 1465605 2241349 1692679 824941 683055 1049443 1266907 1171299 829135 313797 28980
34437B8980L32465M49192l88837j090005m95366O27532N42064p75658j450997
$$ 28980 361445 810637 421800 -668205 -1163571 -536039 6025 -769633 -2220630
34428b220630m18754J031898J105625R332l79880Q37515K220693J810253j74844
$$ -2220630 -2639384 -1607486 -501861 -492529 -872409 -34894 2185799 3996052 3821208
34419C821208j454678p06135O02459K88637j413045k211345j049367N14101O25900
$$ 3821208 2366530 1660395 2262854 2551491 1138446 -1072899 -2122266 -1608165 -982265
34410i82265m46592j002804j84875J229211J887799J194954j58547q04143j74070
$$ -982265 -1428857 -2431661 -2616536 -1387325 500474 1695428 1536881 732738 558668
34401E58668P17342N61686m09288q55666m58122k68433p17863p79833K10091J276594
$$ 558668 1276010 1837696 1428408 572742 114620 -153813 -871676 -1651509 -1441418 -164824
34391a64824J331149Q34085P72320Q84673K08472j172302k174392k212485j604212
$$ -164824 1166325 2000410 2772730 3657403 3865875 2693573 519181 -1693304 -3297516
34382c297516p34064J97294P55597N53061n7511l17004p6973J45564O5688l7768
$$ -3297516 -4031580 -3834286 -3078689 -2525628 -2583139 -2900143 -2977116 -2831552 -2765864 -2803632
34372b803632J08257L88862N39630M35634J69668J8106J28897J41820m33680j269684
$$ -2803632 -2695375 -2306513 -1766883 -1331249 -1161581 -1143475 -1014578 -872758 -1306438 -2576122
34362b576122j288146r9392J272951J694193J341135J084215R80372L40095r10432
$$ -2576122 -3864268 -3963660 -2690709 -996516 344619 1428834 2409206 2749301 1838869
34353A838869j849527j660520n52263N30453Q37171M96043L57391Q84444J281157
$$ 1838869 -10658 -1671178 -2223441 -1692988 -855817 -359774 -2383 882061 2163218
34344B163218M48771j134827j634800m23010Q95231R14747M80628Q50904J145289
$$ 2163218 2611989 1477162 -157638 -580648 314583 1229330 1709958 2560862 3706151
34335C706151j70418k015969j624449J087145K742317J118985j703990k386176
$$ 3706151 3535733 1519764 -104685 982460 3724777 4843762 3139772 753596
34327G53596p85322N90475M88350N2209L44479P96587N98332J01836L000O2900
$$ 753596 -31726 558749 1047099 1099308 1443787 2240374 2838706 2940542 2943542 3006442
34317C006442m30452j330117j572357n19763J076538J731353Q43130n25481p91197
$$ 3006442 2575990 1245873 -326484 -846247 230291 1961644 2804774 2279293 1488096
34308A488096J82461P70439l12310k040787k114985J510K070782J702403o76817
$$ 1488096 1670557 2440996 2128686 87899 -2027086 -2025576 45206 1747609 1070792
34299A070792k338177j491631Q67708K438885K134956P26747m34305o93626k81732
$$ 1070792 -1267385 -2759016 -1891308 547577 2682533 3409280 2974975 2281349 1999617
34290A999617J98511L14748M9975l49332o80084q11548n44961J43775O94265L55674
$$ 1999617 2198128 2512876 2562851 2213519 1533435 721887 176926 320701 1014966 1370640
34280A370640p48111j501545j166145l37841O487j32902j42293l2526k61406n36184
$$ 1370640 622529 -879016 -2045161 -2383002 -2376515 -2509417 -2651710 -2684236 -2945642 -3481826
34270c481826k0866J069992J267674j42744j760690j560218O04328K682679K627614
$$ -3481826 -3502692 -2432700 -1165026 -1307770 -3068460 -4628678 -4024350 -1341671 1285943
34261A285943N57315j386786j313665L72711J504917Q00135o58176j068817l15095
$$ 1285943 1843258 456472 -857193 -484482 1020435 1820570 1162394 93577 -221518
34252b21518K51808n5429n73378n86242j25328N21062J013173P88484j48192n47254
$$ -221518 30290 -25139 -598517 -1184759 -1310087 -789025 224148 1012632 864440 317186
34242C17186M71308J461100L59291j912847k170616J44294J711001L50397j609805
$$ 317186 788494 2249594 2608885 696038 -1474578 -1330284 380717 731114 -878691
34233h78691j222275M36118N39012n71264l92315R37061P82666j185498k158405
$$ -878691 -2100966 -1664848 -1125836 -1697100 -2089415 -1152354 -369688 -1555186 -3713591
34224c713591q29045N89291K49409m85804J48768J226813R79037k07730q58884
$$ -3713591 -4542636 -3953345 -3703936 -4189740 -4040972 -2814159 -1835122 -2042852 -2901736
34215b901736r84952j321108j166865N35408K591816K577718M94646r41270j92550
$$ -2901736 -3886688 -5207796 -6374661 -5839253 -3247437 -669719 -175073 -1116343 -1308893
34206a308893J056229P97635k06393N7038J398675J618383m5783j690099j556009
$$ -1308893 -252664 544971 338578 395616 1794291 3412674 3366891 1676792 120783
34197A20783l83372J67111R1262L94246P30441k10417k065464k712044j388442
$$ 120783 -262589 -95478 -4216 390030 1120471 910054 -1155410 -3867454 -5255896
34188e255896O9074J16454j93882P16185K098636K028003M76745p14780n05145
$$ -5255896 -5186822 -5070368 -5264250 -4548065 -2449429 -421426 55319 -659461 -1164606
34179a164606M07169J017307R07062N2313q59791m44935J492382K729553J198177
$$ -1164606 -757437 259870 1166932 1219245 359454 -85481 1406901 4136454 5334631
34170E334631j712908k651433r02781R03956Q29771j60585n97868o39955p66442
$$ 5334631 3621723 970290 67509 971465 1801236 1640651 1042783 402828 -363614
34161c63614n33136R1122K3803r64325j290839L3735J616568J766302Q98575K83056
$$ -363614 -896750 -805628 -781825 -1746150 -3036989 -3003254 -1386686 379616 1278191 1561247
34151A561247k18398j300453k168670j411888N37626J642190R18147n07473j043999
$$ 1561247 1342849 42396 -2126274 -3538162 -3000536 -1358346 -440199 -947672 -1991671
34142a991671l32108P36515J002361J23808r01666o25028J115988K820136K931026
$$ -1991671 -2323779 -1587264 -584903 -461095 -1362761 -1987789 -871801 1948335 4879361
34133D879361J262063j181590k900033k523640j27895J975090J419554r58825
$$ 4879361 6141424 4959834 2059801 -463839 -591734 1383356 2802910 1844085
34125A844085j967684n83389P41650J99132o64796o3847Q20571K07272q50788
$$ 1844085 -123599 -706988 34662 233794 -431002 -494849 325722 532994 -317794
34116c17794l28663J011525Q26491q04644j629497r51805k33617k10815j17994
$$ -317794 -646457 365068 1191559 386915 -1242582 -2194387 -2428004 -2638819 -2756813
34107b756813K28316P3326m56416m18613P3635J80406K74317J204889J980977
$$ -2756813 -2528497 -2455171 -2911587 -3330200 -3256565 -3076159 -2801842 -1596953 384024
34098C84024R37579r39919r62675P50757J071565r95103k377050p52834J733586
$$ 384024 1321603 381684 -580991 169766 1241331 246228 -2130822 -2883656 -1150070
34089a150070J797284k62707j583495r15421M70629J057567M29393r38661j873545
$$ -1150070 647214 384507 -1198988 -2114409 -1643780 -586213 -156820 -1095481 -2969026
34080b969026j217701O34980J799631J273573R2149n69697r00589j162377o96815
$$ -2969026 -4186727 -3551747 -1752116 -478543 -386394 -956091 -1856680 -3019057 -3715872
34071c715872M91840R31625J7828n60295M64413J477618M55036j537554j896209
$$ -3715872 -3224032 -2292407 -2274579 -2834874 -2370461 -892843 -437807 -1975361 -3871570
34062c871570n55828K40916k28355l84697N18328J161302P07370K71508P94533
$$ -3871570 -4427398 -4186482 -4414837 -4799534 -4281206 -3119904 -2412534 -2141026 -1346493
34053a346493J287338N04706q99274j259654k82973O24801K36674j072944j891636
$$ -1346493 -59155 445551 -453723 -1713377 -1996350 -1371549 -1134875 -2207819 -4099455
34044d099455j404726k42210M11649L71629N45191J349700J884147J280340J14886
$$ -4099455 -5504181 -5746391 -5334742 -4963113 -4417922 -3068222 -1184075 96265 211151
34035B11151m29198k59185k29879o77705j101448j071057n45901M50127J549227
$$ 211151 -218047 -477232 -707111 -1384816 -2486264 -3557321 -4103222 -3653095 -2103868
34026b103868J748299M73340j234744j697943p27855K68983L16421p9115o3127
$$ -2103868 -355569 117771 -1116973 -2814916 -3542771 -3273788 -2957367 -3036482 -3099609
34017c099609L86269P50354P04951K81533j78981j60790M41203R76206Q15697
$$ -3099609 -2713340 -1962986 -1258035 -976502 -1155483 -1316273 -875070 101136 916833
34008I16833K04043l06767p99368j431600j440057m3447J846512K283230Q17018
$$ 916833 1120876 814109 14741 -1416859 -2856916 -2900363 -1053851 1229379 2046397
33999B046397r35770j484362r62431j77409N05351Q95241Q35552P87559J344891
$$ 2046397 1110627 -373735 -1336166 -1513575 -1008224 -112983 722569 1510128 2855019
33990B855019J804949P14117j585928k667887j312385N46573O11447m96806n92735
$$ 2855019 4659968 5374085 3788157 1120270 -192115 354458 965905 469099 -123636
33981a23636N23323J030853J06891j151944j790686k040592k062652j427833l33977
$$ -123636 399687 1430540 1537431 385487 -1405199 -3445791 -5508443 -6936276 -7270253
33972g270253K26800J09427L91498J449261K090411J489681O48401P81093J372781
$$ -7270253 -7043453 -6934026 -6542528 -5093267 -3002856 -1513175 -864774 -83681 1289100
33963A289100J164226J93519n60157q92050j220668j221940l04852P30718L28734
$$ 1289100 2453326 2646845 2086688 1194638 -26030 -1247970 -1552822 -822104 -493370
33954d93370j259838j793550j23129K033730K375396Q54434q97889j928100k312155
$$ -493370 -1753208 -3546758 -3669887 -1636157 739239 1593673 695784 -1232316 -3544471
33945c544471j857586j68251K000318K939637K030895N94257J40065N02854L91236
$$ -3544471 -5402057 -5570308 -3569990 -630353 1400542 1994799 2134864 2637718 3028954
33936C028954o33757j538349j283568l07680N4177m79149o17022N18702J688984
$$ 3028954 2395197 856848 -426720 -734400 -680223 -1159372 -1776394 -1257692 431292
33927D31292J066647q88823j795254q23883J37808l06358p40709M46260J902449
$$ 431292 1497939 609116 -1186138 -2010021 -1872213 -2178571 -2919280 -2473020 -570571
33918e70571J290672o59910j035986N95750J452519j0812j753751j458750J75869
$$ -570571 720101 60191 -975795 -380045 1072474 1061662 -692089 -2150839 -1974970
33909a974970J040658P01318J87662K8129R4581M34830R10533Q48857J31358l31753
$$ -1974970 -934312 -232994 -45332 -17203 77378 512208 1422741 2271598 2402956 2071203
33899B071203j65843l44339j333969j815709o91979R11947J280925O00713J05128
$$ 2071203 1905360 1561021 227052 -1588657 -2280636 -1368689 -87764 512949 618077
33890F18077j36626o41874p41146M00102J687016J332304k11936q39222q5978
$$ 618077 481451 -160423 -901569 -501467 1185549 2517853 2305917 1466695 1380717
33881A380717M63601N1727l23118j20662j31538o12139o47313l2980J65923l33735
$$ 1380717 1844318 1896045 1572927 1452265 1320727 708588 61275 28295 194218 -139517
33871a39517l23188P15677J534472J178252L98438k2393o43543j814893k332799
$$ -139517 -462705 252972 1787444 2965696 3364134 3341741 2698198 883305 -1449494
33862a449494j167427O27164J192170K35780j016127j423059n66087J202778K432099
$$ -1449494 -2616921 -1989757 -797587 -561807 -1577934 -3000993 -3567080 -2364302 67797
33853F7797J509683r87349k215106o67929J528553J614069J31792l42583N72650
$$ 67797 1577480 590131 -1624975 -2292904 -764351 849718 981510 638927 1211577
33844A211577P97838m63273j438342q21415K62245M08163J49067N89930J216990
$$ 1211577 2009415 1546142 107800 -713615 -451370 -43207 105860 695790 1912780
33835A912780P39787o23920j326737p64899L787j6600m60622n07100k25124k45205
$$ 1912780 2652567 2028647 701910 -62989 -59202 -75802 -536424 -1043524 -1268648 -1513853
33825a513853n22931l28086M84522R86778M10516o26670p80888K72179J385254
$$ -1513853 -2036784 -2364870 -1880348 -893570 -483054 -1109724 -1890612 -1618433 -233179
33816b33179J381895M80663n8324M67339J306512J151724j41905j167401p13940
$$ -233179 1148716 1629379 1571055 2038394 3344906 4496630 4354725 3187324 2473384
33807B473384M73374N96459o04003j460184r87379l39565o27432q66396J39860
$$ 2473384 2946758 3543217 2939214 1479030 491651 152086 -475346 -1341742 -1201882
33798a201882J183002L43196j440451j336803Q57252K130221Q63537q57357q20969
$$ -1201882 -18880 324316 -1116135 -2452938 -1595686 534535 1398072 540715 -280254
33789b80254R7626J43666k15692K93056J009054N37360n41958o58414n4120j37271
$$ -280254 -182628 -38962 -254654 38402 1047456 1584816 1042858 384444 330324 193053
33779A93053o87342k50920R91958J328478N24118K05817Q22668O98156r55606
$$ 193053 -494289 -745209 246749 1575227 2099345 2305162 3127830 3825986 2870380
33770B870380k258647j312395R26217J952022R51841o23184j206006p14151j66438
$$ 2870380 611733 -700662 225555 2177577 3129418 2506234 1300228 586077 419639
33761D19639m16558j259749j587980o60922Q02018J331258N27808n07481o80581
$$ 419639 3081 -1256668 -2844648 -3505570 -2703552 -1372294 -844486 -1351967 -2032548
33752b032548j01592M42235M80200J5041o46948q68488r9757J250510J869462
$$ -2032548 -2134140 -1691905 -1211705 -1196664 -1843612 -2712100 -2811857 -1561347 308115
33743C08115R53383p27212j586443r36665L02926O26936l54034j334257p48861
$$ 308115 1261498 534286 -1052157 -1988822 -1685896 -1058960 -1412994 -2747251 -3496112
33734c496112J202716K578561K019757L11890r18627j221052j130291p69518K6881
$$ -3496112 -2293396 285165 2304922 2616812 1698185 477133 -653158 -1422676 -1395795
33725a395795O51501K65788o90102r17316k36591K26736P399J2764Q18155J572010
$$ -1395795 -744294 -478506 -1168608 -2085924 -2322515 -2095779 -2088380 -2075616 -1257461 314549
33715C14549J304243K98479n51176r23885r68504p38143l32820l4675J22694L35115
$$ 314549 1618792 1917271 1366095 442210 -526294 -1264437 -1597257 -1631932 -1509238 -1174123
33705a174123L51727l25914j229919r78125P36719K148402J465522o17104j595386
$$ -1174123 -822396 -1148310 -2378229 -3356354 -2619635 -471233 994289 377185 -1218201
33696a218201k81764J715074J991244K43091j475218j369374r6485L08624o83753
$$ -1218201 -1499965 215109 2206353 2449444 974226 -395148 -491633 -183009 -866762
33687h66762j501786r99193j33832j73991n61553r3903P72062P00717n6284m9399
$$ -866762 -2368548 -3367741 -3501573 -3675564 -4237117 -4331020 -3558958 -2858241 -2914525 -2963924
33677b963924Q00443J164646P72014O74524R24770L80603p90855r54245k6980
$$ -2963924 -2163481 -998835 -226821 447703 1372473 1753076 962221 7976 -19004
33668a9004K5943j233479j470734N00427K314382J709224O1861k94189J3932p76244
$$ -19004 6939 -1226540 -2697274 -2196847 117535 1826759 1888620 1594431 1608363 832119
33658H32119j739265q30523R77064R19466p61134j057792P04015J737429M42906
$$ 832119 -907146 -1737669 -760605 158861 -602273 -1660065 -956050 781379 1224285
33649A224285j270117j465929q55759m95189K85319J698875J796701n91944l053288
$$ 1224285 -45832 -1511761 -2367520 -2862709 -2577390 -878515 918186 326242 -2727046
33640b727046k387398Q29517K961620K112616p908r79346m94986J65258J17072
$$ -2727046 -5114444 -4284927 -1323307 789309 781401 -197945 -692931 -527673 -410601
33631d10601m02201p07067n66287m21804o26424o44770K86978J640937J811570
$$ -410601 -812802 -1519869 -2086156 -2507960 -3134384 -3779154 -3492176 -1851239 -39669
33622c9669L58192j072683r24883J67602N70964R1102j45065K98590P46317Q13367
$$ -39669 318523 -754160 -1679043 -1511441 -940477 -849375 -994440 -695850 50467 863834
33612H63834Q64198J022271Q99769M36725j2892m80726j214186j690585j048724
$$ 863834 1728032 2750303 3650072 4086797 4073905 3593179 2378993 688408 -360316
33603c60316K75622O82100l19444j248062q14167K50955N14973p3220o42101j015854
$$ -360316 -84694 597406 277962 -970100 -1784267 -1533312 -1018339 -1091559 -1733660 -2749514
33593b749514j366536r44726R68432L041063K872576M15432j514953j035198K96561
$$ -2749514 -4116050 -5060776 -4092344 -1051281 1821295 2236727 721774 -313424 -16863
33584a6863J39316j044340j051333L84624J296944O62041l46855o10681n57861
$$ -16863 122453 -921887 -1973220 -1588596 -291652 370389 23534 -587147 -1145008
33575a145008p19069o09596l4936J11831m56608m58472P60627J515982K13115
$$ -1145008 -1864077 -2473673 -2508609 -2396778 -2853386 -3311858 -2551231 -1035249 -822134
33566h22134j618138j111490J583536L268227K189270J21291p60056p69575j135543
$$ -822134 -2440272 -3551762 -1968226 1300001 3489271 3610562 2850506 2080931 945388
33557I45388j464843o86899O63396J103578N71452L01525N64179L09043p57524
$$ 945388 -519455 -1206354 -542958 560620 1132072 1433597 1997776 2306819 1549295
33548A549295j378262o34416O41161J138191Q11031M62390K87416j40964p61436
$$ 1549295 171033 -463383 177778 1315969 2127000 2589390 2876806 2735842 1974406
33539A974406r10938l83353J61380O7987n57510j161105j350345r68445l1759
$$ 1974406 1063468 680115 841495 909482 351972 -809133 -2159478 -3127923 -3159682
33530c159682J032471J460063R61452K49264K07666O15471L46499r56680k014301
$$ -3159682 -2127211 -667148 294304 543568 751234 1366705 1713204 756524 -1257777
33521a257777j282574R99190K727564K131212k25254j978585j534723K27387J128901
$$ -1257777 -2540351 -1541161 1186403 3317615 3092361 1113776 -420947 -193560 935341
33512I35341L51452p21882n09965O56135J112609J19901j344877j952172j349749
$$ 935341 1286793 564911 54946 711081 1823690 1943591 598714 -1353458 -2703207
33503b703207j18604P74490M34497j094923k231085j209331J494724L198140K216262
$$ -2703207 -2821811 -2047321 -1612824 -2707747 -4938832 -6148163 -4653439 -1455299 760963
33494G60963K6452p91237Q1631P41958J7693j106880j167332j50278P53334O89850
$$ 760963 787415 -3822 77809 819767 837460 -269420 -1436752 -1587030 -833696 -143846
33484a43846l3924m72846j61120L86878M22322l3298m67351q67566j379992j156103
$$ -143846 -177770 -650616 -811736 -424858 -2536 -35834 -503185 -1370751 -2750743 -3906846
33474c906846P42808K959638K594278m86638k489558r25504J334475L92077k183729
$$ -3906846 -3164038 -204400 2389878 1903240 -586318 -1511822 -177347 214730 -1968999
33465a968999j572761K253048L804851M71286l256251k572204O74551J505043
$$ -1968999 -3541760 -1288712 2516139 2987425 -268826 -2841030 -2166479 -661436
33457f61436n73925j811651n79929Q54837P26362J39115L94928R32442R02881
$$ -661436 -1235361 -3047012 -3626941 -2772104 -2045742 -1906627 -1511699 -579257 323624
33448C23624N50454J53935n40085j158773p92194J31865n5851j505628k094397
$$ 323624 874078 1028013 487928 -670845 -1463039 -1331174 -1387025 -2892653 -4987050
33439d987050n46360J440023J612936K95445n12874j19618M48064L96609j8268
$$ -4987050 -5533410 -4093387 -2480451 -2185006 -2697880 -2817498 -2369434 -1972825 -1991093
33430a991093l68225n22892m17597k50286n34853j125818q55279P52958K156397
$$ -1991093 -2359318 -2882210 -3299807 -3550093 -4084946 -5210764 -6066043 -5313085 -3156688
33421c156688J685933J77661j62219P58019Q37626n03728j048439N91482K357024
$$ -3156688 -1470755 -1293094 -1455313 -697294 140332 -363396 -1411835 -820353 1536671
33412A536671J750605k44974p93882K41836K81890j529020k776556j545205P15148
$$ 1536671 3287276 3042302 2248420 2490256 2772146 1243126 -1533430 -3078635 -2363487
33403b363487J546190Q46851J80177J14868J24461J80586N31257M80483p02879
$$ -2363487 -817297 29554 209731 324599 449060 629646 1160903 1641386 938507
33394I38507j953530j411953O86231J962965J122594m34650q57063k62264m6268
$$ 938507 -1015023 -2426976 -1740745 222220 1344814 910164 53101 -209163 -255431
33385b55431q07816j820205j971776p76031R97570J673215N49566p08549L7382
$$ -255431 -1063247 -2883452 -4855228 -5631259 -4633689 -2960474 -2410908 -3119457 -3082075
33376c082075K105614K503825K56484j935301j566654K07631Q19458K30042J98610
$$ -3082075 -976461 1527364 1783848 -151453 -1718107 -1510476 -691018 -460976 -262366
33367b62366P89516M23042r42935j445622m61306L46769r9978n53078K50641J352441
$$ -262366 527150 950192 7257 -1438365 -1899671 -1552902 -1652880 -2205958 -1955317 -602876
33357f02876J205413K39295K2011O06827N88413l05642n01315Q95380K251461
$$ -602876 602537 841832 863843 1470670 2059083 1753441 1252126 2147506 4398967
33348D398967J364770j343169l062963k165373j55416O66800K45342Q0195L90026
$$ 4398967 5763737 4420568 1357605 -807768 -963184 -296384 -51042 29153 419179
33339D19179j3051j155006j439523l46316N14722R6118l49350L31267J019576
$$ 419179 406128 -748878 -2188401 -2534717 -2019995 -1923877 -2273227 -1941960 -922384
33330i22384M92702o8614P72936J605189K82144j872128j515801J313412K952744
$$ -922384 -429682 -498296 274640 1879829 2161973 289845 -1225956 87456 3040200
33321C040200J734265J46162K00064K73841j366132l052868k478722o06570J24099
$$ 3040200 4774465 4920627 5120691 5394532 4028400 975532 -1503190 -2109760 -1985661
33312a985661k45964k5019O65840L92284m26997l1470J246425J154801n88312
$$ -1985661 -2231625 -2256644 -1590804 -1198520 -1625517 -1656987 -410562 744239 155927
33303A55927j522997l87765Q21544Q6293j492255j523573J57596J611030J613299
$$ 155927 -1367070 -1754835 -933291 -846998 -2339253 -3862826 -3705230 -2094200 -480901
33294d80901P37015n5756n29654q13934q86556p13354m32213j93746r042J77021
$$ -480901 256114 200358 -329296 -1143230 -2029786 -2743140 -3175353 -3369099 -3378141 -3201120
33284c201120L45413L89609L17239M25242R60031J497860J163475j88681j544207
$$ -3201120 -2855707 -2466098 -2148859 -1723617 -763586 734274 1897749 1709068 164861
$$ [...]
##END NTUPLES=NMR SPECTRUM
##END=
