##TITLE=31Pdec_BAU-23PK
 CHCl3, 24 sc
 23.3.2020
##JCAMPDX= 6.0         $$ Bruker NMR JCAMP-DX V2.0
##DATA TYPE= NMR SPECTRUM
##DATA CLASS= NTUPLES
##ORIGIN= UXNMR, Bruker Analytische Messtechnik GmbH
##OWNER= root
$$ XWIN-NMR		Version 3.5
$$ Mon Mar 23 14:25:27 2020 Russian Standard Time (UT+4h)  she@DPX200
##.OBSERVE FREQUENCY= 81.013821
##.OBSERVE NUCLEUS= ^31P
##.ACQUISITION MODE= SIMULTANEOUS
##.ACQUISITION SCHEME= undefined
##.AVERAGES= 24
##.DIGITISER RES= 17
##SPECTROMETER/DATA SYSTEM= spect
##.PULSE SEQUENCE= zgpg30
##.SOLVENT NAME= DMSO
##.SHIFT REFERENCE= (INTERNAL, DMSO, 0, 182.463)
##AUDIT TRAIL= $$ (NUMBER, WHEN, WHO, WHERE, WHAT)
$$ ##TITLE= Audit trail, XWIN-NMR		Version 3.5
$$ ##JCAMPDX= 5.01
$$ ##ORIGIN= Bruker BioSpin GmbH
$$ ##OWNER= she
$$ F:/spectra/data/she/nmr/P31/1/pdata/1/auditp.txt
$$ ##AUDIT TRAIL=  $$ (NUMBER, WHEN, WHO, WHERE, WHAT)
(   1,<2020-03-23 14:23:34.03 +0400>,<she>,<DPX200>,
      <created by zg, POWCHK disabled, PULCHK disabled
       configuration hash MD5:
       00 E9 B6 7A A2 85 ED C7 34 08 36 98 17 FE 4E 26
       data hash MD5: 32K
       68 11 19 DC 8D 2B 4C EF 7C 69 DE 4F 33 56 D4 03>)
(   2,<2020-03-23 14:24:10.54 +0400>,<she>,<DPX200>,
      <Start of raw data processing
       efp BC_mod = 2 LB = 1 FT_mod = 6 PKNL = 1 PHC0 = -1294.935 PHC1 = 40.80169 SI = 64K 
       data hash MD5: 64K
       F9 F6 A3 13 1C 4B 29 0E 11 75 96 BF F4 05 1D 1B>)
(   3,<2020-03-23 14:24:26.23 +0400>,<she>,<DPX200>,
      <pk PHC0 = -24.13765 PHC1 = 76.4 
       data hash MD5: 64K
       FE 13 74 60 3C 47 4B B8 A5 8F E6 0C D5 40 0A 43>)
(   4,<2020-03-23 14:24:54.64 +0400>,<she>,<DPX200>,
      <pk PHC0 = 4.698006 PHC1 = -10 
       data hash MD5: 64K
       FC 22 AF 55 B0 75 BC F7 5D FC 6E 9A 26 6D BC 58>)
$$ ##END=
$$ 
$$ hash MD5
$$ 53 24 57 03 FF 13 35 BE 45 FB 1C 35 19 09 62 AF
##$RELAX= 
##$RELAX= 
##$RELAX= 
##$RELAX= 
##$RELAX= 
##$RELAX= 
##$RELAX= 
##$RELAX= 
$$ Bruker specific parameters
$$ --------------------------
##$DU= <F:/spectra>
##$EXPNO= 1
##$NAME= <P31>
##$PROCNO= 1
##$TYPE= <nmr>
##$USER= <she>
##$AMP= (0..31)
100 100 100 100 100 100 100 100 100 100 100 100 100 100 100 100 100 100 
100 100 100 100 100 100 100 100 100 100 100 100 100 100 
##$AQSEQ= 0
##$AQ_mod= 1
##$AUNM= <au_zg>
##$AUTOPOS= <>
##$BF1= 81.014009
##$BF2= 200.13
##$BF3= 200.13
##$BF4= 200.13
##$BF5= 200.13
##$BF6= 200.13
##$BF7= 200.13
##$BF8= 200.13
##$BYTORDA= 1
##$CFDGTYP= 0
##$CFRGTYP= 5
##$CHEMSTR= <none>
##$CNST= (0..31)
1 1 145 1 1 1 1 1 1 1 1 1 1 1 1 1 1 1 1 1 1 1 1 1 1 1 1 1 1 1 1 1 
##$CPDPRG= <waltz16>
##$CPDPRG1= <>
##$CPDPRG2= <waltz16>
##$CPDPRG3= <>
##$CPDPRG4= <mlev>
##$CPDPRG5= <mlev>
##$CPDPRG6= <mlev>
##$CPDPRG7= <mlev>
##$CPDPRG8= <mlev>
##$CPDPRGB= <>
##$CPDPRGT= <>
##$D= (0..31)
0 1 0 0 0 0 0 0 0 0 0 0.03 2e-05 3e-06 0 0 0 0 0 0 0 0 0 0 0 0 0 0 0 0 
0 0 
##$DATE= 1584959013
##$DBL= (0..7)
120 120 120 11 120 120 24 19 
##$DBP= (0..7)
150 150 150 150 150 150 150 150 
##$DBP07= 0
##$DBPNAM0= <>
##$DBPNAM1= <>
$$ [...]
##$SUBNAM2= <"">
##$SUBNAM3= <"">
##$SUBNAM4= <"">
##$SUBNAM5= <"">
##$SUBNAM6= <"">
##$SUBNAM7= <"">
##$SUBNAM8= <"">
##$SUBNAM9= <"">
##$SW= 369.568048894756
##$SWIBOX= (0..15)
0 1 3 0 0 0 0 0 0 0 0 0 0 0 0 0 
##$SW_h= 29940.119760479
##$TD= 32768
##$TD0= 1
##$TE= 0
##$TE2= 300
##$TE3= 300
##$TEG= 300
##$TL= (0..7)
0 120 53 12 22 120 120 120 
##$TP= (0..7)
150 150 150 150 150 150 150 150 
##$TP07= 0
##$TPNAME0= <>
##$TPNAME1= <>
##$TPNAME2= <>
##$TPNAME3= <>
##$TPNAME4= <>
##$TPNAME5= <>
##$TPNAME6= <>
##$TPNAME7= <>
##$TPOAL= (0..7)
0.5 0.5 0.5 0.5 0.5 0.5 0.5 0.5 
##$TPOFFS= (0..7)
0 0 0 0 0 0 0 0 
##$TUNHIN= 0
##$TUNHOUT= 0
##$TUNXOUT= 0
##$USERA1= <user>
##$USERA2= <user>
##$USERA3= <user>
##$USERA4= <user>
##$USERA5= <user>
##$V9= 5
##$VALIST= <valist>
##$VCLIST= <CCCCCCCCCCCCCCC>
##$VD= 0
##$VDLIST= <DDDDDDDDDDDDDDD>
##$VPLIST= <PPPPPPPPPPPPPPP>
##$VTLIST= <TTTTTTTTTTTTTTT>
##$WBST= 1024
##$WBSW= 4
##$XGAIN= (0..3)
0 0 0 0 
##$XL= 0
##$YL= 0
##$YMAX_a= 49665
##$YMIN_a= -25306
##$ZGOPTNS= <>
##$ZL1= 120
##$ZL2= 120
##$ZL3= 120
##$ZL4= 120
##$ABSF1= 0
##$ABSF2= 0
##$ABSG= 0
##$ABSL= 0
##$ALPHA= 0
##$AQORDER= 0
##$ASSFAC= 0
##$ASSFACI= 0
##$ASSFACX= 0
##$ASSWID= 0
##$AUNMP= <proc_1d>
##$AZFE= 0.1
##$AZFW= 0.5
##$BCFW= 0
##$BC_mod= 2
##$BYTORDP= 0
##$COROFFS= 0
##$CY= -3
##$DATMOD= 1
##$DC= 0
##$DFILT= <>
##$DTYPP= 0
##$F1P= 0
##$F2P= 0
##$FCOR= 1
##$FTSIZE= 65536
##$FT_mod= 6
##$GAMMA= 0
##$GB= 0
##$INTBC= 1
##$INTSCL= 5.30512e-09
##$ISEN= 30
##$LB= 1
##$LEV0= 0
##$LPBIN= 0
##$MAXI= 10000
##$MC2= 0
##$MEAN= 0
##$ME_mod= 0
##$MI= 50
##$NCOEF= 0
##$NC_proc= -5
##$NLEV= 6
##$NOISF1= 182.463
##$NOISF2= 159.3651
##$NSP= 0
##$NTH_PI= 0
##$NZP= 0
##$OFFSET= 182.463
##$PC= 4
##$PHC0= -1314.375
##$PHC1= 107.2017
##$PH_mod= 1
##$PKNL= yes
##$PPARMOD= 0
##$PSCAL= 0
##$PSIGN= 0
##$REVERSE= no
##$SF= 81.0140089999434
##$SI= 65536
##$SIGF1= 159.3651
##$SIGF2= -187.1042
##$SINO= 113.3802
##$SIOLD= 16384
##$SREGLST= <1H.CDCl3>
##$SSB= 0
##$STSI= 65536
##$STSR= 0
##$SW_p= 29940.119760479
##$SYMM= 0
##$S_DEV= 0
##$TDeff= 32768
##$TDoff= 0
##$TI= <>
##$TILT= no
##$TM1= 0
##$TM2= 0
##$TOPLEV= 0
##$USERP1= <user>
##$USERP2= <user>
##$USERP3= <user>
##$USERP4= <user>
##$USERP5= <user>
##$WDW= 1
##$XDIM= 65536
##$YMAX_p= 351236710
##$YMIN_p= -6108056
$$ End of Bruker specific parameters
$$ ---------------------------------
##NTUPLES= NMR SPECTRUM
##VAR_NAME=  FREQUENCY,     SPECTRUM/REAL,   SPECTRUM/IMAG
##SYMBOL=    X,             R,               I
##VAR_TYPE=  INDEPENDENT,   DEPENDENT,       DEPENDENT
##VAR_FORM=  AFFN,          ASDF,            ASDF
##VAR_DIM=   65536,         65536,           65536
##UNITS=     HZ,            ARBITRARY UNITS, ARBITRARY UNITS
##FACTOR=    0.456856943014862, 1,           1
##FIRST=     14782.0589164792, 0,            0
##LAST=      -15158.0608439998, 0,           0
##MIN=       -15158.0608439998, -6108056,    0
##MAX=       14782.0589164792, 351236710,    0
$$ Real data points
##PAGE= N=1
##DATA TABLE= (X++(R..R)), XYDATA
$$ [...]
42846D69486n06604k97252p1058J22510K54925K28669o6831n39334p86095m31124
42836a622708L37655Q20077O00185P6654p1401K40689N08510M06323J53766Q5772
42826A535522J84144J72487q0090l59531l27435j200P6108n40454j381508j367062
42816b089019j84217J144861J507582J036214O04628M30175J8276o90033j046519
42807G31948p08783j74180l5935k52169l99451k33238J81466N53506N10278M755
42797A78197m45953l24588J62315L72024J03000l31819o98479q54432m32120O01944
42787a669911J269602N96972o89637p93966N44552J485743P60609m88664n81513
42778D33787J80042K74617n18708r30682k93290N83061P47749K43860l32860n91583
$$ plain form
42846 469486 -37118 -334370 -405428 -282918 -27993 200676 133845 -405489 -1191584 -1622708
42836 -1622708 -1285053 -464976 135209 211863 140462 381151 889661 1295984 1449750 1535522
42826 1535522 1719666 1892153 1812063 1452532 1125097 1123897 1200005 659551 -721957 -2089019
42816 -2089019 -2273236 -1128375 379207 1415421 2020049 2450224 2468500 1778467 731948
42807 731948 23165 -151015 -186950 -439119 -838570 -1071808 -890342 -336836 173442 178197
42797 178197 -267756 -592344 -430029 -58005 44995 -286824 -985303 -1839735 -2271855 -1669911
42787 -1669911 -400309 196663 -492974 -1286940 -742388 743355 1503964 1015300 433787
42778 433787 613829 888446 369738 -560944 -854234 -271173 476576 720436 387576 -204007
42768b04007m29600J6242L20121J43929k81467m74419m08143l81340l17823J30583
42758a885924P67885Q42904Q3449p78640q11564P2501J052485J206527L75019
42749I24642o14952p09772J64990Q88820M70872o85939j329999r38192j33709
42740a963239L61402M92000M87884L53582L5211l07977m85778n02019m21108j91842
42730b141884K54371Q16819J198737J086165M75316j79295l97183k82822l27056
42721E03168n46436m09500J61706M54197R2808k61876l5418K11642j83967o04641
42711f18317p0262R12422Q96677k19231r72194n89136K1861n639j87752J52957
42701f78614O25735O00663L61820M45927N52466J04248o37276r53736p69094n23289
$$ plain form
42768 -204007 -633607 -617365 -297244 -153315 -434782 -909201 -1317344 -1698684 -2016507 -1885924
42758 -1885924 -1118039 -275135 -191686 -970326 -1781890 -1709389 -656904 549623 924642
42749 924642 309690 -400082 -235092 653728 1124600 438661 -891338 -1829530 -1963239
42740 -1963239 -1601837 -1109837 -621953 -268371 -233160 -541137 -1026915 -1528934 -1950042 -2141884
42730 -2141884 -1887513 -1070694 128043 1214208 1689524 1510229 1113046 830224 503168
42721 503168 -43268 -452768 -291062 163135 255943 -5933 -41351 170291 -13676 -618317
42711 -618317 -688579 223843 1120520 901289 -70905 -660041 -638180 -643819 -831571 -678614
42701 -678614 -52879 547784 909604 1355531 1907997 2012245 1374969 421233 -347861 -871150
42691h71150l09488L7493L15158K59356K18526O57970J169214Q81050j72404r79720
42681A206005r53922n76071m12808k86189J43948N90559N13048m7696n31233o02447
42671i56806l96141q5900L48992Q20275R62317N50714r2340m40728m53419n39709
42661b82745p80887o70753O0155P94964P33002j0978n90458n54680j74886K34914
42651a242352N80486N76156p6178r03721r17482j5266O86337M13087j70227q2839
42641a151999M73572N93448J39089j85464K1420M46175O52263M39299k00350q86735
42631C40718q88180j0290Q42081P11041j07085n93611n09420l94241l44046K2950
42621i30083M51562K11091m53177l86796N27365Q68635j25616j162109p84753
$$ plain form
42691 -871150 -1180638 -1143145 -827987 -568631 -350105 307865 1477079 2358129 2185725 1206005
42681 1206005 252083 -323988 -736796 -1022985 -879037 -288478 224570 176874 -354359 -956806
42671 -956806 -1352947 -1438847 -1089855 -269580 692737 1243451 1151111 710383 256964 -282745
42661 -282745 -1063632 -1734385 -1674230 -879266 -146264 -157242 -747700 -1302380 -1477266 -1242352
42651 -1242352 -661866 -85710 -161888 -1065609 -1983091 -1998357 -1312020 -898933 -1069160 -1151999
42641 -1151999 -678427 -84979 54110 -131354 -109934 336241 988504 1427803 1227453 340718
42631 340718 -547462 -557752 284329 995370 888285 294674 -214746 -608987 -953033 -930083
42621 -930083 -478521 -267430 -720607 -1107403 -580038 288597 162981 -999128 -1783881
42612a783881M09251Q19724L38859J97977O83084P30077l0739m51492K39679J017745
42602B170284N46023p69635j354664o67448K97718O30661N65709O47779P32097
42593B798524M23027m1863r5428J77147J04935m50840p50615k94399L00529J44946
42583B315963n61796p97991k67882J81040o9669m62889k67463J61299j3881o48245
42573d31514p75899j68273L00604P3453k69178p8713L12559K82210j9443r1780
42563h65974m2290k29130l36199J88132R75582J090427N07007J29142K18779J8467
42553A653943o80786q64017N3622J003375P50940k26208n65936j46988l6258n57202
42543C84485p90973j63232O29785O70513k3006p33985q31761j42923Q69034J240888
$$ plain form
42612 -1783881 -1374630 -554906 -216047 -18070 665014 1395091 1364352 912860 1152539 2170284
42602 2170284 2716307 1946672 592008 -75440 222278 852939 1418648 2066427 2798524
42593 2798524 3221551 3179688 3084260 3261407 3366342 2915502 2164887 1870488 2171017 2315963
42583 2315963 1754167 956176 688294 869334 799665 336776 69313 230612 216731 -431514
42573 -431514 -1207413 -1375686 -1075082 -1001629 -1270807 -1349520 -1036961 -754751 -774194 -865974
42563 -865974 -908264 -1137394 -1473593 -1285461 -309879 780548 1287555 1416697 1635476 1653943
42553 1653943 973157 109140 162762 1166137 1917077 1690869 1124933 977945 941687 384485
42543 384485 -406488 -569720 60065 730578 707572 -26413 -858174 -1001097 -132063 1108825
42533A108825M98535m97187m94807L71881P51358J17986n47027m79539k53850
42524E76175m79153n92389J2694O45961L63374l66724l93763J82486K39475l91593
42514b03457o38412l6164M95824K00095l33657k25001L10008M48146R5243j04859
42504G766J29263L46317J23138l49741o14592n27321k61448O3084M53635P67115
42494A37216O82156J42847m06724n38637l99979l33789j39415N96395J437499
42485A177569J284618k872j065778q18437q84j4005p83681r87926j87478N58449
42475h40425L89979j80199k65283J10784L48787K84991K18030K68304K60672R6284
42465F91924j20886k35848j50509N2746M0237l89870p69999l02526R69472J811462
$$ plain form
42533 1108825 1607360 1110173 615366 987247 1738605 1856591 1309564 830025 576175
42524 576175 97022 -495367 -482673 163288 526662 159938 -233825 -51339 188136 -203457
42514 -203457 -841869 -878033 -382209 -182114 -515771 -740772 -430764 17382 112625 7766
42504 7766 137029 483346 606484 256743 -357849 -885170 -1146618 -1083534 -629899 137216
42494 137216 819372 962219 555495 16858 -383121 -716910 -856325 -259930 1177569
42485 1177569 2462187 2459315 1393537 575100 574216 560211 -223470 -1211396 -1398874 -840425
42475 -840425 -450446 -630645 -895928 -785144 -436357 -151366 66664 334968 595640 691924
42465 691924 571038 335190 184681 237427 277664 -112206 -882205 -1184731 -215259 1596203
42455A596203J149050m89386j481947j036522l0169K60545k42675n62818j55087
42446i92806M06031L89233k6115j48618J04343J78920q3540j39288L08329P19497
42436G15986N09006n6994k40471K04368Q41569J053582M51246q19436j874025
42427G84831j705462m40642N41285K75495n46568o50633N3187O19608N80363L60228
42417a28308L64177N15913O41159O05991K07112m33352o39376p4955M84316J43882
42407A686559o91500r06761m03168r0340k93341l67225O9586O29910R46365R43703
42397A523788L89014p13612j419372q44257K38187L09794m22082k64812J025779
42388a77573J578573L74039j075901j102035k15922K21823J75565L20181M72414
$$ plain form
42455 1596203 2745253 2255867 773920 -262602 -292771 -32226 -274901 -837719 -992806
42446 -992806 -586775 -197542 -223657 -372275 -267932 -89012 -172552 -311840 -3511 715986
42436 715986 1224992 1167998 927527 1131895 1973464 3027046 3478292 2658856 784831
42427 784831 -920631 -1361273 -819988 -544493 -1091061 -1741694 -1688507 -1068899 -488536 -128308
42417 -128308 235869 751782 1392941 1998932 2206044 1772692 1133316 1058361 1542677 1686559
42407 1686559 995059 88298 -314870 -405210 -698551 -1065776 -996190 -366280 580085 1523788
42397 1523788 1912802 1199190 -220182 -1064439 -826252 -516458 -938540 -1203352 -177573
42388 -177573 1401000 1775039 699138 -402897 -618819 -396996 -221431 98750 571164
42379E71164J41295k76833k06375J7215o3061m5520L84780N52592M9006k30515
42369H93748L33083O77264j40141r49109k60080R84379P49974o95923j221405
42360C71790l53957K01014l19741o30213M0528O06733K45741j62331J94350N72705
42350G66619J61168l94618k18550K18208K4273n17517n24936l7261J77291p5020
42340d20343k56073j841N17388R42811R49213L73534n10043j097012j052534n33381
42330a088281J75833P77821Q29480K09230l45099k7885P19172O90129k32011q79756
42320H28633o65032l27772l91077k58987L97226O69725j13514j010611p66930
42311a638339K76288P81833L75898j59871k97288k58480k54093j65476J5244J15502
$$ plain form
42379 571164 712459 435626 229251 246466 183405 137885 522665 1075257 1124263 893748
42369 893748 1226831 1904095 1763954 814845 554765 1539144 2289118 1593195 371790
42360 371790 17833 218847 -100894 -731107 -690579 -83846 161895 -436 193914 766619
42350 766619 927787 533169 314619 532827 557100 39583 -485353 -522614 -345323 -420343
42340 -420343 -676416 -678257 -160869 781942 1731155 2104689 1594646 497634 -554900 -1088281
42330 -1088281 -912448 -134627 694853 904083 558984 531099 1250271 1940400 1708389 828633
42320 828633 163601 -164171 -555248 -814235 -417009 252716 139202 -871409 -1638339
42311 -1638339 -1362051 -580218 -204320 -364191 -661479 -919959 -1174052 -1339528 -1324284 -1208782
42301a208782J33428J66485J13705j36939m02481m14295j09139M60629J098462
42292b98927J243359M54777o66136q83745l0728O33042K81404l08947k02645J71629
42282C93083N229l45951j06737L61800J88285l18860j00909P61725J044968K77811
42272B160444o57416r49791p33997l83658Q65J96110r1857n77194o36378k78410
42262a951282j7437J69352P01815J222001Q27754k82970p21855L9316P89432M66491
42252A242617k45951j83504M02855M15289k30045n63131j64887L05657K59589
42243A238489l7424p2809J45385K28183m4532n28798q74588p94966l30450J47790
42233i23720L28757K95768L27681M71206N11822L09649l2915l22525m42473l75760
$$ plain form
42301 -1208782 -1075354 -908869 -795164 -932103 -1334584 -1748879 -1858018 -1397389 -298927
42292 -298927 944432 1399209 733073 -150672 -181400 451642 733046 424099 221454 393083
42282 393083 398312 52361 -54376 307424 495709 176849 75940 837665 1882633 2160444
42272 2160444 1503028 553237 -180760 -564418 -563553 -367443 -459300 -1036494 -1672872 -1951282
42262 -1951282 -1968719 -1799367 -1097552 124449 952203 669233 -52622 -13306 776126 1242617
42252 1242617 996666 813162 1216017 1631306 1401261 838130 673243 978900 1238489
42243 1238489 1201065 1128256 1273641 1501824 1457292 928494 53906 -741060 -1071510 -923720
42233 -923720 -594963 -299195 28486 499692 1011514 1321163 1288248 965723 523250 147490
42223A47490j76822O2236K47533K62585l2997o10209j064469q69925j5570Q10777
42213a239371R19144L77558j83838m13787m96472n56153l25155K72402O45022
42204a000650K44379m51500m18437L95703Q72784L84094k26639n447N58680L85877
42194G38844l40834m82700J06467L71503p4594l22713J42994N15647J44587l22826
42184D76375j95350K6302k25941k83443N84884J519509J122262l29904j234656
42175A460038r65375l74311j19316O3178L23809K84968p8614k67983j92507k45298
42165a11411l20611J29508Q78899R46678J50294m95970l42000K5565m3472k54928
42155E62552j30874J18008J00704j02467k99387n10282n63711j43296M34573L82162
$$ plain form
42223 147490 -29332 32904 280437 543022 510025 -100184 -1164653 -2034578 -2050148 -1239371
42213 -1239371 -320227 57331 -126507 -540294 -1036766 -1592919 -1918074 -1645672 -1000650
42204 -1000650 -756271 -1207771 -1626208 -1230505 -357721 26373 -200266 -205713 352967 738844
42194 738844 398010 -84690 21777 393280 318686 -4027 138967 654614 799201 476375
42184 476375 281025 307327 81386 -202057 382827 1902336 3024598 2694694 1460038
42175 1460038 494663 120352 1036 64214 388023 672991 594377 326394 133887 -111411
42165 -111411 -432022 -302514 576385 1523063 1673357 1177387 835387 860952 817480 562552
42155 562552 431678 549686 650390 547923 248536 -261746 -825457 -968753 -534180 -152018
42145a52018k58337m78950P1558M38022j8792m72361J228Q67357R77253K44019
42135A218979n06664p69287n70099l4636M38260J96946o59569r89041j66440Q31915
42125a009636Q65200L19241K09358M10069J78246k28585m5912L47261k0072p51327
42115B73843m97107O20694Q78851l22234j372553q68209M03694Q86194M21763
42106D24936j08254l48289n00210m59000l9502L57390K76865N9721K58085N41728
42096D63470J82781n55669n91549L18643J097910Q82708J95991J3292K90782K07202
42086B505561m22845q36859n19311L4467J38210m6650J12068N96382P02283J27837
42076B391143n53505p14123m50241k53300l00573l67109j64485M01287J003378
$$ plain form
42145 -152018 -410355 -889305 -817747 -379725 -398517 -870878 -869650 -2293 974960 1218979
42135 1218979 712315 -56972 -627071 -661707 -223447 -26501 -686070 -1675111 -1841551 -1009636
42125 -1009636 -144436 174805 384163 794232 972478 743893 697981 1045242 1025170 273843
42115 273843 -223264 397430 1276281 954047 -418506 -1286715 -883021 3173 424936
42106 424936 316682 -31607 -531817 -990817 -1030319 -672929 -396064 -336343 -78258 463470
42096 463470 646251 90582 -500967 -182324 915586 1798294 1994285 2007577 2298359 2505561
42086 2505561 2082716 1245857 726546 761013 899223 852573 964641 1561023 2263306 2391143
42076 2391143 1837638 1123515 673274 419974 119401 -247708 -412193 -10906 992472
42067I92472R13384k03152j449440j443993j70477Q29561N87273j4573J06721
42058A47776M09447j50418j039371q79589J49168M74209k68649o31527J89936
42049a599018J015655O59779j91894k36545L82162N51431O1042k64937q889L43208
42039G11994K89257r9528m71126n06953k5040P50075J142218O76217l42243j194618
42029I30253j451634j056208j53044P45940R03026K37563l30104m6943N44834
42020C23683M07515l62662o32606P0370Q71274Q00591J0741o34813o76606l49496
42010a72009n9480M8384P6333J37882J76608N9555j30903j12185J24295J34002
42000B82482l55567q96876q56208l04551J70454M08536P48310J125201Q82117
$$ plain form
42067 992472 1905856 1702704 253264 -1190729 -1361206 -531645 55628 41055 147776
42058 147776 557223 406805 -632566 -1512155 -1362987 -888778 -1157427 -1788954 -1599018
42049 -1599018 -583363 76416 -115478 -352023 30139 581570 642612 377675 368786 711994
42039 711994 1001251 901723 430597 -76356 -101396 648679 1790897 2467114 2124871 930253
42029 930253 -521381 -1577589 -1730633 -984693 -81667 155896 -174208 -221151 323683
42020 323683 731198 368536 -264070 -193700 677574 1478165 1488906 854093 177487 -172009
42010 -172009 -231489 -183105 -106772 31110 207718 267273 136370 24185 148480 282482
42000 282482 -73085 -969961 -1826169 -2130720 -1960266 -1551730 -803420 321781 1203898
41991A203898j80544j206940j252840m29938M24547Q64171J012853Q71465K16562
41982A523234p11845j115425o14151J25494K06741l10277n55718j05116M64005
41973a093058M24518j49812o04228n65185k00029J96451M51640M22676R2377j88830
41963a213480L6798O69366R77746M29912o13331j262666j031142k20751N16887
41954a710661Q16154P91493O96731M94913o0882q44690j160374n19999N18902
41945i78413Q22432O9235q20918q56953j43639M29773L37732j17370l30762q2459
41935a671342K83105K74265j00616k29205K87898Q96904P11299j81824p53671
41926d83187n04591r1079j41673l03611p4425J96540l0357m21728l11236J24222
$$ plain form
41991 1203898 1023354 -183586 -1436426 -1866364 -1441817 -577646 435207 1306672 1523234
41982 1523234 811389 -304036 -918187 -792693 -585952 -896229 -1451947 -1557063 -1093058
41973 -1093058 -668540 -818352 -1422580 -1987765 -2187794 -1991343 -1539703 -1117027 -1024650 -1213480
41963 -1213480 -1176682 -507316 470430 900342 287011 -975655 -2006797 -2227548 -1710661
41954 -1710661 -894507 -103014 593717 1088630 1027748 183058 -977316 -1497315 -978413
41945 -978413 -155981 -86746 -907664 -1764617 -1908256 -1478483 -1140751 -1258121 -1588883 -1671342
41935 -1671342 -1388237 -1113972 -1214588 -1443793 -1155895 -258991 452308 270484 -483187
41926 -483187 -987778 -1078857 -1220530 -1524141 -1598566 -1402026 -1432383 -1854111 -2165347 -2041125
41916b041125K16295L0494J86190O00583N19869j29439m83177q1950M75697N71248
41906a35315M06067L64207K77561j40634o71431q83411o60720j27342N22727Q83708
41896a64583N65044j45357l97990J03206O51623N50999q253m82269p50394q46635
41886i24609n35741J90717P01593N01255J421j50474p2898k15930l46061Q9671
41876g61056Q03387Q65092Q3314o87942p43766k69438K36588N38409M96219N6833
41866F17640l56843j48332M80262N59963k66140j072169q72637L8609N68782K51813
41856a99052l99905p08352m46382J93492P65313Q05153K91281k26368k65317j2099
41846b02236L5707j91865l57195k82673n1640K99832O95640P42476J23947p13544
$$ plain form
41916 -2041125 -1824830 -1794336 -1608146 -1007563 -487694 -617133 -1100310 -1182260 -706563 -135315
41906 -135315 270752 634959 912520 771886 100455 -782956 -1443676 -1571018 -1048291 -164583
41896 -164583 400461 255104 -142886 -39680 611943 1162942 1154689 672420 -77974 -924609
41886 -924609 -1460350 -1269633 -568040 -66785 -65364 -215838 -288736 -504666 -850727 -761056
41876 -761056 42331 907423 990737 302795 -440971 -710409 -473821 64588 560807 617640
41866 617640 260797 112465 592727 1152690 886550 -185619 -1058256 -1019647 -450865 -199052
41856 -199052 -598957 -1307309 -1753691 -1560199 -794886 10267 301548 75180 -190137 -202236
41846 -202236 -166529 -358394 -715589 -998262 -1049902 -750070 -54430 688046 811993 98449
41836I8449q61894r6147P93828J016677O30995J27844l04641o52027o44632q9512
41826A8940N55030N79503J5180l52454r9365K66789J49647k34442l04831j05802
41816D88195j62064m61786l66970K71956O69425K54882l55278k53057L34435M27265
41806H47003r7624l45562K7775K12869k98993p00338j52304P23053P23288n8763
41796H80404m27314N2655N75792N20873K07457j1911l28362p18658o03037J41635
41786B89534O55489K52595n72655r40082p40512l47420J37356N70606L84358n13326
41776h24057j025189j89329J174351J396693L63377l52475J28637Q11694M79159
41767A962861o02739j300372j120446m21471K99716P28092P53164O21545P01037
$$ plain form
41836 98449 -763445 -859592 -65764 950913 1581908 1709752 1405111 753084 108452 18940
41826 18940 573970 1153473 1168653 816199 716834 983623 1133270 898828 593997 488195
41816 488195 326131 -135655 -502625 -230669 438756 693638 338360 85303 419738 847003
41806 847003 749379 403817 431592 644461 345468 -354870 -507174 215879 939167 880404
41796 880404 453090 505745 1081537 1602410 1809867 1797956 1469594 750936 147899 289534
41786 289534 945023 1197618 624963 -315119 -1055631 -1403051 -1265695 -695089 -310731 -824057
41776 -824057 -1849246 -2038575 -864224 532469 895846 543371 672008 1483702 1962861
41767 1962861 1360122 59750 -1060696 -1482167 -1182451 -454359 298805 920350 1621387
41758A621387Q31638M30040m97839j110409q97700m19993l49514m22008l4872
41749h49270O18427P99221L31576k35677m20395k03447K27165O59249Q98688R42096
41739B767633Q99696N79153l60516j558113j939494j093528J0494L57741K51967
41730h4967M83417Q18418M82388k99723n50199j55062M2299k38489l55938n7097
41720H5047P6619j99128l08487M6155L33879J95264L1688J30378J38785r8423
41710D31777j21767J87181J94357l30285o21606j94252K80161K04415J55923P13564
41700H99468J125563M35343p77180j172119o74284l14045l90439k56677K09917
41691i14453L88042K01976K35735M23573K1840q60724j128168n08318p4140l66001
$$ plain form
41758 1621387 2453025 2883065 2385226 1274817 377117 -42876 -392390 -814398 -849270
41749 -849270 -230843 568378 899954 664277 243882 40435 267600 926849 1825537 2767633
41739 2767633 3667329 4246482 3885966 2327853 388359 -705169 -694675 -336934 -84967
41730 -84967 398450 1216868 1699256 1399533 849334 694272 736571 498082 142144 85047
41720 85047 161666 -37462 -345949 -299794 34085 229349 261037 391415 530200 431777
41710 431777 310010 497191 691548 361263 -260343 -454595 -174434 29981 185904 899468
41700 899468 2025031 2460374 1683194 511075 -163209 -477254 -867693 -1124370 -914453
41691 -914453 -526411 -324435 -88700 334873 356713 -504011 -1632179 -2140497 -2214637 -2580638
41681b580638m43280L28442R43101M09070m35740k26617O67436Q02429O0864l00804
41671g75737J45843M34456N5192k01541J88124M42160j49898q84728p14690P5650
41661a385169L54866j19271n20323l52592l1059J7789l4323L5173N0700r8289
41651b082498j03052K28972N17873L64497L4355N9152L60321L56242j00607m92737
41641h57482m67063l22573l74276l44966J11591O41207O05464J60871K05878J058433
41631D17084J798013J353012j29116j458499j731756j054731j13260M74868M25235
41622a9150p3678l82907j9702O21670O11595k47390j002633p86765r207K72374
41612a035793j31756l90428K9598O37486P28491L11546j26303l21627k94465n5325
$$ plain form
41681 -2580638 -3023918 -2695476 -1752375 -1343305 -1779045 -2005662 -1338226 -535797 -474933 -775737
41671 -775737 -629894 -195438 -140246 -341787 -153663 288497 138599 -746129 -1460819 -1385169
41661 -1385169 -1030303 -1149574 -1669897 -2022489 -2053548 -2035759 -2070082 -2034909 -1984209 -2082498
41651 -2082498 -2185550 -1956578 -1438705 -1074208 -1039853 -980701 -620380 -264138 -364745 -857482
41641 -857482 -1324545 -1647118 -2021394 -2366360 -2254769 -1613562 -1008098 -847227 -641349 417084
41631 417084 2215097 3568109 3438993 1980494 248738 -805993 -919253 -444385 -19150
41622 -19150 -92828 -475735 -495437 126233 737828 490438 -512195 -1298960 -1308167 -1035793
41612 -1035793 -1167549 -1557977 -1528379 -890893 -162402 149144 22841 -298786 -593251 -648576
41602f48576L12392N18179M19656K98655L69235K54893m74482j368556j402465
41593a721069l69500O64991O63684j04895n64325k78472J88699K65985J06071
41584a148831J23973K76635K07844j03331k74763r3403K18886M02928M70074M28325
41574E08337Q1022n34928q26295l09587N45418P64046J62495m59462n09527k31503
41564h09984Q4696O19960J222254J005770l35237j523276j160734K43596R64029
41555C11074N27441R5689L58904N71625J28251l40898k43500j71728p31723j185505
41545f80370m89692R06285J527164Q59660j90629o92846n97163k84282l6096r437
41535C12594j17418K3737N07396P22754J69391n87567n78892J30834N40917J82473
$$ plain form
41602 -648576 -336184 181995 601651 900306 1269541 1524434 1049952 -318604 -1721069
41593 -1721069 -2090569 -1425578 -761894 -866789 -1431114 -1709586 -1520887 -1254902 -1148831
41584 -1148831 -1024858 -748223 -540379 -643710 -918473 -1011876 -792990 -390062 80012 508337
41574 508337 589359 54431 -771864 -1081451 -536033 228013 390508 -68954 -578481 -809984
41564 -809984 -725288 -105328 1116926 2122696 1787459 264183 -896551 -652955 311074
41555 311074 838515 934204 1293108 1864733 1992984 1652086 1408586 1236858 505135 -680370
41545 -680370 -1170062 -263777 1263387 2123047 1932418 1239572 642409 358127 322031 312594
41535 312594 195176 218913 726309 1449063 1618454 1030887 451995 582829 1123746 1306219
41525A306219m04952o91873p49928o81963l27518K09002M81059L92475K98062
41516a69417K69433J1361l47234k44073K88866M88608Q7168k54081j46827j00609
41506a16805l67371k37234O44018J236221N30396p19280r74801j50692M75145
41497C19597L43638J94226M82909N81871l956p16523q46306n49975l64835l43358
41487i02712k76094k68802m65263n44536j18824N48203P79842M00436m6981n0003
41477i44734K62907M00930J71992j40798k15424j03086o1122q3078R7228M61093
41467a54092N47565J26183l25443k73020L4576p021k87948j49421L74213M23660
41457C09252k60108p25443k62211L58731L0274q86990j056330k21065M69107L15547
$$ plain form
41525 1306219 901267 209394 -540534 -1222497 -1550015 -1341013 -859954 -467479 -169417
41516 -169417 100016 111377 -235857 -479930 -191064 297544 384712 130631 -16196 -116805
41506 -116805 -484176 -721410 -77392 1158829 1689225 969945 -4856 -155548 319597
41497 319597 663235 857461 1340370 1922241 1918285 1201762 355456 -194519 -559354 -902712
41487 -902712 -1178806 -1447608 -1912871 -2457407 -2576231 -2028028 -1248186 -847750 -894731 -944734
41477 -944734 -681827 -280897 -108905 -249703 -465127 -568213 -629335 -712413 -615185 -154092
41467 -154092 393473 519656 194213 -78807 -44231 -51252 -339200 -488621 -114408 309252
41457 309252 49144 -676299 -938510 -579779 -549505 -1436495 -2492825 -2713890 -2244783 -1929236
41447a929236M7329M46955J043694R84598M48086K01979K15988j90365r53201
41438C15827j137088m31273K09919n6340o94375o02267K94231J051757J097265
41429D7656P97565N79082K27936n45149j319084j301728l85016N62906O33731
41420g02101p7553o04745k97404L90453N52014R0726j70016K62370P79996N98234
41410H21974k2891j89271K22763M18238j547m40086l60609j55122l67821o65405
41400g39777l72755L21489N66965J65468j75611m2005M3802m27649j002686q63829
41390b526588k5463O87208P31776L74990J14154P0544J18067K20505L71013M29331
41380E65537K84830O1743l5816K3164J58484L40068M80015L34498j83973p07639
$$ plain form
41447 -1929236 -1881907 -1434952 -391258 593340 1041426 1243405 1459393 1269028 315827
41438 315827 -821261 -1252534 -1042615 -1098955 -1793330 -2395597 -2101366 -1049609 47656
41429 47656 845221 1424303 1652239 1107090 -211994 -1513722 -1898738 -1335832 -702101
41420 -702101 -779654 -1384399 -1681803 -1291350 -739336 -648610 -818626 -556256 223740 821974
41410 821974 799083 609812 832575 1250813 1249266 809180 448571 293449 -74372 -739777
41400 -739777 -1112532 -791043 -224078 -58610 -234221 -276226 -232424 -660073 -1662759 -2526588
41390 -2526588 -2552051 -1864843 -1133067 -758077 -643923 -573379 -455312 -234807 136206 565537
41380 565537 850367 912110 876294 899458 1057942 1398010 1878025 2212523 2028550 1320911
41370A320911p72851m18983o6435J24897K85432K46907l86227j326278j475659
41361b468286k83852J255818J645173O44293o34895j174070r05225k51056M39670
41352a732430Q96744R56436P40561M40755j866n60075p06110n5478P16689N03568
41342A198794o33555j425679j137319l73449J52142N82707J094868J137228L24527
41333I20264o79984j022335p63579l67276J82905Q53360R17028k886q64858n09812
41323a337173M24643L81786n67378p51674L69959J247278O54735m60565n76902
41314f15291J24652L39852k34323o72414m34891k9659R741j10371K8104L79507
41304a215093O17263O34570N65624M74467K66346q8713l95132m38590l37963m44549
$$ plain form
41370 1320911 548060 129077 62642 187539 472971 719878 333651 -992627 -2468286
41361 -2468286 -2752138 -1496320 148853 793146 158251 -1015819 -1921044 -2172100 -1732430
41352 -1732430 -835686 120750 861311 1302066 1300200 740125 34015 -21463 695226 1198794
41342 1198794 565239 -860440 -1997759 -2371208 -2219066 -1636359 -541491 595737 920264
41333 920264 240280 -782055 -1545634 -1912910 -1730005 -876645 40383 37497 -827361 -1337173
41323 -1337173 -912530 -530744 -1098122 -1849796 -1479837 -232559 422176 -38389 -615291
41314 -615291 -490639 -150787 -385110 -1057524 -1492415 -1522074 -1512333 -1622704 -1594600 -1215093
41304 -1215093 -597830 36740 602364 1076831 1343177 1254464 859332 420742 82779 -361770
41294c61770p32778n98970L22270J351409J380990L15237p36836q85273m45676
41285c91397j58072l8142L65273R34260R76406K83508m24220l93999J75263M11227
41275A740107p9669p14253p25616j65275K35785Q6806k55273l58434k55345p3132
41265e64299K95662P19633O02888k28289r21439o91270r0384j96907q41874q49305
41255b765584K0327O84937N21838K14952L40346L80650r8751m35030q789N35111
41245f09993L26513j88268L3273Q24701R85490J22987q05117q82468k77759K75433
41235a95208L65789R3846j61747q5038J85744J58131k47306m18824J1712M46886
41225A53985K00723l55498l58747J73295M56079J99281j97643n42839r21162r63087
$$ plain form
41294 -361770 -1094548 -1693518 -1371248 -19839 1361151 1676388 939552 54279 -391397
41285 -391397 -549469 -587611 -222338 711922 1688328 1971836 1547616 1153617 1328880 1740107
41275 1740107 1660438 946185 220569 55294 291079 377885 122612 -235822 -491167 -564299
41265 -564299 -268637 450996 1053884 825595 -95844 -787114 -877498 -1074405 -1916279 -2765584
41255 -2765584 -2745257 -2060320 -1538482 -1323530 -983184 -602534 -701285 -1136315 -1145104 -609993
41245 -609993 -283480 -471748 -438475 386226 1371716 1494703 689586 -192882 -470641 -195208
41235 -195208 170581 264427 102680 17642 203386 361517 114211 -304613 -292901 153985
41225 153985 354708 -790 -359537 -186242 269837 469118 271475 -271364 -1192526 -2155613
41215b155613j92699Q18757Q63594n0224m88430K40210R09215K26407j140125
41206i68908j530000o70800J37116J4908m56182l66727K31831O01555L98006L6342
41196b572859J08560O76405J176733J029561L29851k19944j55748J94477K34888
41187H01924k3557k1420M28212P51262M21684j87846k82725J10114N1389q48959
41177A200078j536499q38251O89641J297020M54636m38633k10920L98826J32042
41168A147940o84360p44766P0597O00870L30104k9185l3046k05782p97842j086740
41158a432210o08207o6922j95278n03886q1269R04652J405724R13697m8007o81795
41148c93501o10329Q885O02414N94058N1782l22001j16442K64304L15482J53199
$$ plain form
41215 -2155613 -2348312 -1529555 -665961 -716185 -1204615 -964405 -55190 171217 -968908
41206 -968908 -2498908 -3169708 -3032592 -3017684 -3473866 -3840593 -3608762 -3007207 -2609201 -2572859
41196 -2572859 -2464299 -1787894 -611161 418400 748251 528307 372559 567036 801924
41187 801924 778367 756947 1185159 1936421 2358105 2170259 1887534 1997648 2049037 1200078
41177 1200078 -336421 -1174672 -485031 811989 1266625 827992 617072 1015898 1147940
41168 1147940 463580 -281186 -210589 390281 720385 691200 658154 452372 -345470 -1432210
41158 -1432210 -2040417 -2107339 -2302617 -2806503 -2887772 -1983120 -577396 336301 288294 -393501
41148 -393501 -1003830 -994945 -392531 201527 253309 -68692 -185134 79170 394652 547851
41138E47851P2556o3161l76617m17771J86420Q81181Q06331N7533m89933m92541
41128G11849m33793o17454p19794n07577k26505r91M52638J131976J380227P38518
41118A909094k38277n75635r0725M85065N17496J34323j98769l48224m65627n00927
41108F27794k05496L10311M47516j13632p94647p76845j73431P8490m00267q28784
41098a828991l96433N88038J191591J045573M53882k92561r84835j127298l43729
41089a694763Q17080J237054N87245k79004n14780k71508j62201k65524k00357
41080g46758R3625K34204N5864p2166K07946O38948O03871l2813o47506o27787
41070b92572k06916j43829o19837r53455n91328J06779M46067L63037L04334M03406
$$ plain form
41138 547851 620407 557246 180629 -237142 -50722 830459 1636790 1694323 1204390 711849
41128 711849 278056 -339398 -1059192 -1566769 -1793274 -1794265 -1341627 -209651 1170576 1909094
41118 1909094 1670817 1095182 1004457 1489522 2007018 2141341 1942572 1594348 1128721 627794
41108 627794 422298 732609 1180125 1066493 271846 -504999 -678430 -599940 -1000207 -1828991
41098 -1828991 -2225424 -1637386 -445795 599778 1053660 761099 -223736 -1351034 -1694763
41089 -1694763 -877683 359371 946616 667612 152832 -118676 -280877 -546401 -746758
41080 -746758 -653133 -418929 -363065 -435231 -227285 411663 1015534 982721 335215 -292572
41070 -292572 -499488 -643317 -1263154 -2216609 -2807937 -2701158 -2255091 -1892054 -1587720 -1184314
41060a184314L79176J79088J30496L52009M97868K78649j15440l15791k55690
41051e3949j60401k02094l12995l03336j21889K5038p5648k76116k04441J41493
41041a544338K95068M4818j52942J09840M49085K45531l19101m93247j40221O1389
41031a444118k72525o17868l53834L39410P90600P07971L68392J35015J09722
41022b37235K01744L17046M24424M71763L07831j46364o11436o22775j78626J06451
41012C2823j81252n95650m37295K22238O45031M19926j46924n37393m66549M4573
41002a000472N99343O20289O9889l16578m9055L00014M3885l40876M4651Q44335
40992H15425Q36644o3243o21604l05659j7107l46543n51837l3447M94257K85026
$$ plain form
41060 -1184314 -805138 -626050 -495554 -143545 354323 632972 517532 201741 -53949
41051 -53949 -214350 -416444 -729439 -1032775 -1154664 -1129626 -1205274 -1481390 -1685831 -1544338
41041 -1544338 -1249270 -1204452 -1357394 -1247554 -798469 -552938 -872039 -1365286 -1505507 -1444118
41031 -1444118 -1716643 -2334511 -2688345 -2348935 -1558335 -850364 -481972 -346957 -237235
41022 -237235 -35491 281555 705979 1177742 1485573 1339209 727773 104998 -73628 32823
41012 32823 -148429 -744079 -1181374 -959136 -314105 105821 -41103 -578496 -1045045 -1000472
41002 -1000472 -401129 219160 289049 -27529 -76584 223430 267315 -73561 -28910 815425
40992 815425 1652069 1588826 967222 661563 644456 297913 -253924 -287371 206886 491912
40982D91912j00489J72564P51717P83624L15980o4840l30312o87182p91006l51646
40972A90322O7638q3805l00527M9739M42633J23651l44805M8492Q74676Q79971
40962A947985J26605k20760k4797k06534o80408l17068P43701Q84014k32788q20752
40952A199198P7953Q58192M0479j153174q38990L39809L19036r40167j461477
40943a559141m63101O47265P19649L68314M51766O59486M41184J12277J14051
40934A491750O9143n00379j125144r56175o3743N97753M38940j22864l29871j8983
40924e19573K85059J17199k65414j97189L88658O82308P7723q49959j041157l90826
40914a713171K27822K84371J25826J12236O9703j00801m3958L75882O54121L82196
$$ plain form
40982 491912 391423 563987 1315704 2099328 2415308 2350468 2020156 1332974 541968 190322
40972 190322 257960 174155 -126372 -76633 366000 489651 144846 193338 1068014 1947985
40962 1947985 2074590 1853830 1829033 1622499 942091 625023 1368724 2252738 2019950 1199198
40952 1199198 1277151 2135343 2175822 1022648 183658 523467 842503 -97664 -1559141
40943 -1559141 -2022242 -1374977 -655328 -287014 164752 824238 1265422 1377699 1491750
40934 1491750 1560893 1060514 -64630 -1020805 -1084548 -486795 -47855 -170719 -500590 -519573
40924 -519573 -234514 -117315 -382729 -579918 -191260 491048 568771 -281188 -1322345 -1713171
40914 -1713171 -1485349 -1200978 -1075152 -962916 -893213 -994014 -1037972 -662090 -7969 374227
40904C74227j20813l63583l57036k86165o1041K85906L17713q9830l17327J7960
40894e99989K64564j90652o55942j31026Q47346Q14044k49548p48290J23O94766
40884D5396K59833m00007o2929O30140K60365q67366j094272n3328P91277M68964
40874b1927j99694j95141J51357N6667k81069j76768K45595K70073k03062n40163
40864h94132l51931J07711M69278N97585M45051O3215k36853j55075J77015L90731
40854F12595M05646L92152L40706J16208j44507j69858m8757r8444k59235j74738
40844I71768P3396o1204o60332r85776m60396M44701P97886M03605q8978j37713
40834B96957J15440K39465R5446j13575j45345N6622L15195L24141q4901o94540
$$ plain form
40904 374227 253414 -110169 -467205 -753370 -814411 -528505 -210792 -300622 -617949 -599989
40894 -599989 -335425 -526077 -1182019 -1313045 -465699 348345 98797 -649493 -649370 45396
40884 45396 305229 -94778 -157707 472433 732798 -134568 -1228840 -1282168 -490891 -21927
40874 -21927 -221621 -416762 -265405 -208738 -489807 -666575 -420980 -150907 -353969 -894132
40864 -894132 -1246063 -1138352 -669074 -71489 373562 436777 199924 44849 221864 612595
40854 612595 1018241 1410393 1751099 1867307 1722800 1552942 1504185 1405741 1146506 971768
40844 971768 1045164 983960 323628 -662148 -1122544 -677843 120043 523648 434670 296957
40834 296957 412397 651862 747308 633733 488388 545010 860205 1184346 1099445 404905
40824D04905j003970o98974j6762M63447M42739K06648J85310L33234K36208j66058
40814C86727l67397k0578M86472N48160J68232j71430k61923k68316k25114m4315
40804B30518K0214l83944r15324p55633J21717O86027L04280k98068j91305L27008
40794h54510L52588o9340j06574L30056L85903k50740p34711l71785L37875N54512
40784d26726L09389J74744K28140J06328j80365k19803Q1429L39250K62160p7670
40774E96876n06055q26503o98170K9486Q23038Q68987J41263m46756k16963M06309
40764A71512N58277Q7313m00152m27519j26818J07130P4534j40551k96995j92511
40754e85780J22024L62351L36579J31279j02571l22733m41054l24684j46250l00166
$$ plain form
40824 404905 -599065 -1298039 -1314801 -851354 -408615 -201967 -16657 316577 552785 386727
40814 386727 19330 -1248 485224 1033384 1201616 1030186 768263 499947 274833 230518
40804 230518 250732 -133212 -1048536 -1804169 -1682452 -996425 -692145 -990213 -1181518 -854510
40794 -854510 -501922 -571262 -677836 -347780 38123 -212617 -947328 -1319113 -981238 -426726
40784 -426726 -117337 57407 285547 391875 211510 -8293 73136 412386 674546 596876
40774 596876 90821 -735682 -1433852 -1404366 -581328 287659 428922 -17834 -234797 171512
40764 171512 729789 817102 416950 -10569 -137387 -30257 44277 -96274 -393269 -585780
40754 -585780 -463756 -101405 235174 366453 263882 -58851 -499905 -824589 -970839 -1271005
40744a271005o42849l70052P44556J541551Q61971o02320j060889j88599M65790
40735e21846o339m60243K73688J268392Q66276o44007j389198o72842K61502L60604
40725f64013J26344L35835O83958N06971m4589l94055m74372n20068m23424k7748
40715h95161L22988K31171m3427K1551L29836L27912r2397m66452m74303k46560
40705i84842J2530K13132K15033n0329k95032j59991K12361L31576Q9261j26404
40695e42705p7295N2994J20036K45064M17229L66372P7008l7839K09721L97821
40685A228406J63885j56119q7452J20918j12081n98269m94802L28642Q49661K98853
40675A541642o33317p17968O4464N67134J88701l80610l82727j15793k59409o89622
$$ plain form
40744 -1271005 -1913854 -2283906 -1539350 2201 864172 261852 -799037 -987636 -521846
40735 -521846 -528185 -988428 -714740 553652 1419928 775921 -613277 -1286119 -1024617 -664013
40725 -664013 -537669 -201834 482124 989095 944506 550451 76079 -443989 -867413 -895161
40715 -895161 -572173 -341002 -384429 -362878 -33042 294870 202473 -263979 -738282 -984842
40705 -984842 -972312 -759180 -544147 -594476 -889508 -1049499 -837138 -505562 -416301 -542705
40695 -542705 -620000 -567006 -446970 -201906 215323 581695 658703 620864 830585 1228406
40685 1228406 1392291 1236172 1148720 1269638 1157557 559288 64486 393128 1242789 1541642
40675 1541642 908325 190357 254821 821955 1010656 630046 247319 131526 -127883 -817505
40665h17505p23218k23934K87367M93060N41516M75304R0805n23194r06897q31922
40655b138618m69160Q3207Q01742J209194O71449m94701j057316m88622K57453
40646a625372K08352j96992j5585N52024N62854l428k16344K18685N12899J37535
40636A34628m01320m85126k27860J4466K35071M11779K11387l90184p08645j65784
40626a371588Q18533J258487P26886l06002j031763r18720n0742Q54470J037615
40617A017176N49583J78005L16623M18701m6406o64334p30444l85616l05436n08033
40607a60181l49522L09036P86447O24365J97842k5628j66032m31780n13163o2489
40597B08895N85361P82637M57712O2650k27793o26175j034902r31118k06216M68367
$$ plain form
40665 -817505 -1540723 -1764657 -1477290 -984230 -442714 32590 123395 -399799 -1306696 -2138618
40655 -2138618 -2607778 -2524571 -1722829 -513635 157814 -336887 -1394203 -1882825 -1625372
40646 -1625372 -1417020 -1614012 -1629597 -1077573 -514719 -518147 -734491 -515806 -2907 134628
40636 134628 -266692 -751818 -979678 -965212 -730141 -318362 -106975 -497159 -1205804 -1371588
40626 -1371588 -553055 705432 1432318 1126316 94553 -824167 -874909 -20439 1017176
40617 1017176 1566759 1744764 2061387 2480088 2433682 1769348 1038904 653288 347852 -160181
40607 -160181 -509703 -200667 585780 1210145 1407987 1382359 1216327 784547 271384 208895
40597 208895 794256 1576893 2034605 2097255 1869462 1243287 208385 -722733 -928949 -460582
40587d60582N37704L59977N53119Q94410O08482l35828j015990q50825l90123
40578i9656l77647o06580l41519M57348J022870Q08403O2794o02998p47563k53650
40568f78198N31670Q48234K85411n06690n09353K28059O41319L21179J46945P14715
40558B023291J128726L59963r04261j088821j35514L54220m15968j206451o61023
40549e45838O42589J106412M05696l24631l57884k19009m56033o41091k27477
40540f17266L12693P7610p91788j090988j65205J106204J352211L80804o76905
40531a12630p90835j39250L28760R1529m74234o88944l24489L05908P88134R29682
40521h6369P06976J58252n10062q61670n66103J50950O36367N34936J81622N8849
$$ plain form
40587 -460582 77122 437099 990218 1884628 2493110 2157282 1141292 290467 -99656
40578 -99656 -477303 -1083883 -1425402 -968054 54816 863219 926013 323015 -424548 -678198
40568 -678198 -146528 701706 987117 480427 -28926 199133 840452 1161631 1308576 2023291
40558 2023291 3152017 3511980 2607719 1518898 1383384 1737604 1321636 115185 -545838
40549 -545838 96751 1203163 1608859 1284228 926344 707335 251302 -389789 -617266
40540 -617266 -304573 -226963 -1018751 -2109739 -2274944 -1168740 183471 564275 -112630
40531 -112630 -903465 -1042715 -713955 -622426 -1096660 -1785604 -2110093 -1804185 -1016051 -86369
40521 -86369 620607 778859 268797 -592873 -1158976 -1008026 -371659 163277 344899 403748
40511D03748P4107k35788q39303j035039l54167P15930J253653R68377L93789
40502A345307R7091P8454L5829j15143k31215k71868l45027m35238l43186n286
40492a90282L08259K96372K5062k01445l17415n29829p92414o18809K47718J209061
40482e63722J327299M63057n27456q42130n77176l06091k00004K5102M71103Q14687
40472H4669P35317K88871k10799m74598l66934L7450M52049N93257M57523K55199
40462A852004O4148k42612o60633q83203o39859n9040M71266O84407N36579J08956
40452A232013l55444m77656j41892K08024N8149l98557m36244J47380O76131N78534
40442A090438J89049P4806M3200m29674j047566q93305J46016J017581Q78629
$$ plain form
40511 403748 477855 242067 -597236 -1632275 -1986442 -1270512 -16859 951518 1345307
40502 1345307 1442398 1520852 1556681 1441538 1210323 938455 593428 158190 -184996 -190282
40492 -190282 117977 414349 439411 237966 -79449 -609278 -1401692 -2020501 -1772783 -563722
40482 -563722 763577 1226634 699178 -142952 -720128 -1026219 -1226223 -1201121 -730018 84669
40472 84669 819986 1108857 898058 423460 56526 93976 546025 1139282 1596805 1852004
40462 1852004 1916152 1673540 1012907 129704 -510155 -569195 -97929 586478 1123057 1232013
40452 1232013 876569 398913 257021 465045 523194 124637 -311607 -164227 511904 1090438
40442 1090438 1279487 1354293 1397493 967819 -79747 -973052 -827036 190545 1069174
40433A069174J13610m24457n27887m71538l21883n7384N1923j42147k13964J85967
40423g38586N40240J22326p41066r44233j53100P52705R32390N08814K4415k74793
40413B9112k84500J20352O44674N79652k24297r04535o89845k4495Q5918m46361
40403a114325p28741k32285N42708Q94421P79969N22464J46085m91152j119037
40394g99893j162597n13455K18244M47926L04948K57125L14857J32621j83952
40385i84176m7034O27923J048422O10060j70855l74706M4609L64460K27208n0552
40375A295359k02999l36635m81056m33111j60119J12353K47180K19125q7036n96682
40365d23621p61956k14257M79450M88938N995m9680M53694O80651K64520j69766
$$ plain form
40433 1069174 1182784 758327 230440 -241098 -562981 -620365 -568442 -710589 -924553 -738586
40423 -738586 -198346 -76020 -817086 -1761319 -1914419 -1161714 -229324 279490 303905 29112
40413 29112 -255388 -135036 509638 1089290 864993 -39542 -729387 -753882 -667964 -1114325
40403 -1114325 -1843066 -2075351 -1532643 -638222 141747 664211 810296 319144 -799893
40394 -799893 -1962490 -2475945 -2257701 -1809775 -1504827 -1247702 -932845 -800224 -984176
40385 -984176 -1031210 -403287 645135 1255195 1084340 709634 754243 1118703 1345911 1295359
40375 1295359 1092360 755725 274669 -158442 -318561 -206208 40972 260097 173061 -423621
40365 -423621 -1185577 -1399834 -920384 -431446 -425451 -475131 -21437 659214 923734 753968
40355G53968j81537j39394k99314l10381q8186j24453m07665j48763P48780J084384
40345H87439J21825j062538j043320k3829P33346P37679M19189N1978l28914l91241
40335A01614M0206L73451O0759m14880l33243j1828j93840o17080m08023L84578
40325a018286Q52715O68117L48174K02930N4221j09255j59427l28842p47305p94157
40315a031115L2551R59721Q61680K2775l46560p6319l2667l25787j99327K33717
40305I8669p1705j058785j237971o5071R70898N71656m47088n69886J79472O29852
40295i99959L58598K4741J62433N54817O94532L34648l05343o69912m54803o3297
40285c63545l6265j74778O6454M69588K96562l82039o78982l22627J2962j4113
$$ plain form
40355 753968 572431 433037 133723 -176658 -264844 -389297 -796962 -945725 -196945 887439
40345 887439 1009264 -53274 -1096594 -1120423 -387077 350602 769791 821769 492855 101614
40335 101614 141820 515271 576030 161150 -172093 -183921 -377761 -994841 -1402864 -1018286
40325 -1018286 -165571 502546 850720 1053650 1107871 998616 839189 510347 -236958 -1031115
40315 -1031115 -998564 -38843 822837 845612 499052 422733 390066 64279 -135048 98669
40305 98669 26964 -1031821 -2269792 -2334863 -1363965 -792309 -1239397 -1809283 -1629811 -999959
40295 -999959 -641361 -616620 -454187 100630 795162 1129810 824467 154555 -300248 -363545
40285 -363545 -399810 -574588 -508134 -38546 258016 -124023 -803005 -1125632 -1112670 -1126783
40275a126783K9678K76030K53643k6320M1469L28602n7468r80821j004714K94259
40265a972425J267187N60728p74967q58408L61624J364867J253840M53654k65807
40256A390293m46566n9463K84786j94981j191360j357298k55860P86343O17219
40247d26887p4130j05241K74914J27502m05084m97287j58524O409K7772K94977
40237i35579N42811L23825R139J49986L62741L4589m20964k75806J04422o6581
40227a71417m08068M9031J015154J206749L68451l91480l47151K4177J05085n6032
40217A394499j73862j36904O4600K18603o9341o54204p09747n765M39456q7951
40207B79384o86736l01825M07204J90442n58940m62941M56807R00301N16356J81188
$$ plain form
40275 -1126783 -1097105 -821075 -567432 -593752 -552283 -223681 -281149 -1261970 -2266684 -1972425
40265 -1972425 -705238 -144510 -919477 -1777885 -1416261 -51394 1202446 1656100 1390293
40256 1390293 943727 884264 1169050 974069 -217291 -1574589 -1830449 -1044106 -426887
40247 -426887 -501017 -606258 -331344 -203842 -608926 -1106213 -1264737 -1258328 -1230556 -935579
40237 -935579 -392768 -68943 -59804 90182 452923 487512 66548 -209258 -104836 -171417
40227 -171417 -579485 -530454 484700 1691449 2059900 1668420 1321269 1345446 1450531 1394499
40217 1394499 1220637 1083733 1148333 1366936 1297595 643391 -66356 -72121 367335 279384
40207 279384 -407352 -709177 -301973 -111531 -670471 -1133412 -676605 223696 740052 921240
40197I21240J83350o0021m77483l08609L01215L73540j09645j89521J48784j48154
40187F34696j092763j274497j65684Q93807P64426O9576j16439J49499K45544
40178A08165R4985l0569k7505J77685N46406N64815j38734q41139n19943M52850
40168C87016P44212J74368j22300K49820M20237R2194J58003Q89046J159535K63588
40158D415719r12889j323726j098556p42358k41318L22637M27384M7000j42748
40149G51145K540j70348o96448o38338K74793R76742P09794J08258m6356J6304
40139A288086j66876m12680m16684k46626Q0064N86176P78261K16379m03758j20831
40129A181511M61748n8069j311952j396329P3493J282197J073508L67126J05157
$$ plain form
40197 921240 1104590 1044569 567086 258477 559692 933232 823587 634066 782850 634696
40187 634696 -458067 -1732564 -1898248 -1004441 -240015 -170439 -286878 -137379 108165
40178 108165 203150 172581 145076 322761 869167 1433982 1295248 454109 -65834 387016
40168 387016 1131228 1305596 1183296 1433116 1853353 1945547 2103550 2992596 4152131 4415719
40158 4415719 3502830 2179104 1080548 338190 96872 419509 846893 893893 751145
40149 751145 753685 583337 -113111 -751449 -476656 500086 1209880 1318138 1271782 1288086
40139 1288086 1121210 708530 291846 45220 125284 711460 1489721 1706100 1302342 1181511
40129 1181511 1643259 1585190 273238 -1123091 -1049598 232599 1306107 1673233 1778390
40120A778390p9382l90285j61074N39481N87084j46984m32168J10j7348o13424
40110A064400m05115P22611J014192o387n32377K44162O99482n6116n11091K25675
40100B459436O72372r1941o63755j80904O2875m28098m1543J467441J721015J651
40090D978549r59485K55448J260196O69082Q91343L074699M101310K299429J060746
40081A7631317K535206L280606J249455R69089N486766R981960J1592211J7911402
40073G0638012L3362589M2974735K6472885j1354204m0655933m1390360k4394159
40066E5653565j1592516q694170p386715l850571j881398k490754k179557l99134
40058A7178750j50990j676896k222715j470219j528020k236115j572923O566K95329
$$ plain form
40120 1778390 1699008 1308723 1147649 1687130 2274214 2127230 1695062 1695172 1677824 1064400
40110 1064400 659285 1381896 2396088 2389701 1857324 2101486 2800968 2744852 2233761 2459436
40100 2459436 3131808 3039867 2376112 2195208 2258083 1829985 1788442 3255883 4976898 4978549
40090 4978549 4019064 4274512 5534708 6203790 7095133 10169832 14271142 16570571 17631317
40081 17631317 20166523 23447129 24696584 25665673 31152439 41134399 52726610 70638012
40073 70638012 104000601 146975336 173448221 162094017 121438084 80047724 55653565
40066 55653565 44061049 35366879 27980164 24129593 22248195 19757441 17577884 17178750
40058 17178750 17027760 15350864 13128149 11657930 10129910 7893795 6320872 6327438 6622767
40049F622767l99622o4556Q16554J45165j443851j330297M44163J243336L12659
40040F346318m95040l62094m13871r01117o41799M34066Q97614K88477k96755
40031D855799k47135j09159j82219j28664P8042J44220J08034K8705l05803o14768
40021C627052j87654O26498N41233l87335n45497M49248J043783O17252M02720
40012F187300P25214L91789k78133O23350K654435L123829K194014K968689N141724
40003B3732211M503889Q46197m60570K368087M555951M669624Q287724J6629172
39995F5132285K2808021K7409784M3633845P1653864Q0556428M0042483l2814906
39988C18421804q3248954q0138014m6685682k2598296j7314013j5000707p804915
$$ plain form
40049 6622767 6223145 6158589 6975143 7120308 5676457 4346160 4790323 6033659 6346318
40040 6346318 5851278 5489184 5075313 4174196 3532397 3966463 4864077 5152554 4855799
40031 4855799 4608664 4499505 4317286 4188622 4266664 4410884 4518918 4547623 4241820 3627052
40021 3627052 3439398 4065896 4607129 4219794 3674297 4123545 5167328 5784580 6187300
40012 6187300 6912514 7304303 7026170 7649520 10303955 13427784 15621798 18590487 23732211
40003 23732211 28236100 29082297 28621727 30989814 35545765 40215389 48503113 65132285
39995 65132285 87940306 115350090 158983935 230637799 311194227 351236710 318421804
39988 318421804 235172850 155034836 108349154 85750858 68436845 53436138 45631223
39981D5631223k665742k902247k990842r80284j419461m927677o179662l557338
39973B0007970j530657k224670k632722j338365p86050j654345j449880R3991
39965H485272J12765j766807k387319p66196L29109l34506n43064O82470J170134
39956D981858r5099r90120k14304N49917K888o63661m56699k36092m20386k3580
39946B434722R07152P92079n41245j249683o67337k36150m83358j23198R46947
39937A779929R32743m49877r91300K46192J207319L99038p47797p51087n18475
39928A106685j028945j168112K8172J231338J044389L67554M60400N27054n59368
39919B009167j765395j450163j70401K81552k75530n52858q3034M57317P05522
$$ plain form
39981 45631223 42965481 40063234 37072392 36092108 34672647 29744970 23565308 20007970
39973 20007970 18477313 16252643 13619921 12281556 11495506 9841161 8391281 8485272
39965 8485272 8598037 6831230 4443911 3677715 4006824 3672318 3129254 3811724 4981858
39956 4981858 4886759 3896639 3682335 4232252 4235140 3571479 3114780 2878688 2458302 2434722
39946 2434722 3341874 4133953 3592708 2343025 1675688 1439538 956180 832982 1779929
39937 1779929 2712672 2262795 1271495 1517687 2725006 3124044 2376247 1625160 1106685
39928 1106685 77740 -1090372 -1062200 169138 1213527 1581081 2041481 2568535 2009167
39919 2009167 243772 -1206391 -1376792 -1095240 -1370770 -1923628 -2006662 -1549345 -843823
39910h43823Q17393O40305K3267m62049k53344K14525K59857J35517M69860J074235
39900B075743J267602R19454L59068k45115p17425o93513k76434k05350p21216
39891A762814j016968n10219J41417Q6206m21097o08901m02348j94058J4662M12803
39881g35689P79635P92644N38009K06837k16195n53034l82130J74029L60132k7677
39871I36561j88322L73788R21454N80214l55523r36537p90466k24373L36297N05512
39861A158605J37639k40742O9928P04483M81306o85144j311701n01940O18628
39852D31062O04107k34997o18382k95762k637m3084j45793l01325o22661p06486
39842a935958j47147O07350Q30201O23141N47115M93069p3562r24875j118814
$$ plain form
39910 -843823 -26430 613875 637142 175093 -78251 136274 396131 531648 1001508 2075743
39900 2075743 3343345 4262799 4621867 4376752 3659327 2965814 2689380 2484030 1762814
39891 1762814 745846 235627 377044 463250 42153 -566748 -969096 -1163154 -1148492 -735689
39881 -735689 43946 836590 1374599 1581436 1365241 812207 430077 604106 964238 936561
39871 936561 748239 1122027 2043481 2623695 2268172 1331635 541169 316796 653093 1158605
39861 1158605 1296244 1055502 1125430 1829913 2311219 1626075 314374 -187566 431062
39852 431062 1035169 800172 181790 -113972 -116609 -159693 -305486 -606811 -1229472 -1935958
39842 -1935958 -2083105 -1475755 -645554 -22413 524702 1017771 944209 19334 -1099480
39833a099480k93294Q18867J256117P35975k47792q58477n97388J63239N82843
39824D60610M45840L42644N53242N09398j64589q42637p98438k90320l9313j44009
39814C2428j91617J21L43970P36109Q64777L18052o55625j138003p54359j71544
39804f15691M3539J46637K90134q057p35188q99197j10483N31492K20419j32198
39794a268593M11509R62430L33139o72712m87969M97341N97306k73228o06400
39785e07177m0087J84269l14167l48015N23458R67678K6701j317802j644916q98902
39775c368960P8736P06068P04944N5040n34305j45519R02515J253123N57785J6352
39765B25779L34256N84284m4529p24143l52897O18494R36596L60196l65810p31911
$$ plain form
39833 -1099480 -1392774 -573907 682210 1418185 1170393 311916 -285472 -122233 460610
39824 460610 906450 1249094 1802336 2311734 2147145 1304508 506070 215750 176437 32428
39814 32428 -159189 -159068 184902 921011 1785788 2103840 1448215 310212 -444147 -615691
39804 -615691 -572152 -425515 -135381 -143438 -878626 -1777823 -1888306 -1356814 -1136395 -1268593
39794 -1268593 -857084 105346 438485 -234227 -722196 -224855 372451 99223 -507177
39785 -507177 -547264 -362995 -677162 -1025177 -501719 465959 492660 -825142 -2470058 -3368960
39775 -3368960 -3290224 -2584156 -1879212 -1824172 -2358477 -2503996 -1601481 -348358 209427 225779
39765 225779 560035 1144319 1099790 375647 22750 641244 1577840 1938036 1572226 840315
39755H40315o90574k34642L57735M02657k47521p15310l28614L19512L84297J26338
39745B14193K54321N67848M02997o9298j84605m9955k56045o12780m47535K228
39735a78631j38310o93944m72701O88175J328086M94123p57048r46318l05681
39726i82249j29009n79314n21406M95559J366366J012170p3899n93214k27722
39717b32718J77986M8973j73743O7025N21154N98724K81744j9935k08284m33910
39707F27016m83561P308P18179P93984L5543p50482q62716m86248l0513N46786
39697A15296J191117J249924L52511o90523p89548j08622K39430r6455l16215
39688A146915Q4332M87875K25997l34505m35321j33006j26377o01962r36376n98334
$$ plain form
39755 840315 149741 -84901 272834 675491 427970 -287340 -615954 -296442 87855 214193
39745 214193 468514 1036362 1439359 1370061 1185456 1135501 879456 266676 -180859 -178631
39735 -178631 -316941 -1010885 -1483586 -795411 532675 1026798 269750 -676568 -982249
39726 -982249 -1111258 -1690572 -2211978 -1716419 -350053 662117 588218 -4996 -232718
39717 -232718 -54732 -5759 -179502 -112477 408677 1007401 1289145 1269210 1060926 627016
39707 627016 143455 150763 868942 1662926 1698469 947987 85271 -400977 -431490 115296
39697 115296 1306413 2556337 2908848 2218325 1428777 1320155 1559585 1463130 1146915
39688 1146915 1231247 1719122 1945119 1610614 1175293 1042287 915910 313948 -622428 -1220762
39678a220762J43826N84466L69117k28329o45735n27995J1062N05090N39812J15541
39668c53907l65270m74007j39333L11366M86963L27183J46277K50972N62657P17865
39658A470766N31386K19556R8611J75996J62646j50003o30197r20793p60795k30710
39648c3537K57709K81678j63541n93595n31844m8555L66081M34360L33022K67943
39638E69721J62155l3858o8186K19422M88866L33345m6380j17470J23281J61689
39628A792585j31973k85908j04804n7612l80549m53964K78906J243424J364045
39619C264150N38778k84959m54072k83211k70974l39823j88826Q4869J33617j08051
39609B091498l68195m24355l37050l07467l76589k99671J52482O97658O23857
$$ plain form
39678 -1220762 -1076936 -492470 -123353 -351682 -997417 -1525412 -1514350 -1009260 -469448 -353907
39668 -353907 -719177 -1193184 -1332517 -1021151 -534188 -207005 -60728 190244 752901 1470766
39658 1470766 2002152 2221708 2320319 2496315 2658961 2508958 1878761 957968 197173 -33537
39648 -33537 224172 505850 342309 -251286 -783130 -831685 -465604 -31244 301778 569721
39638 569721 731876 698018 629832 849254 1338120 1671465 1625085 1507615 1630896 1792585
39628 1792585 1660612 1374704 1269900 1212288 831739 377775 656681 1900105 3264150
39619 3264150 3802928 3517969 3063897 2780686 2509712 2169889 1981063 2065932 2199549 2091498
39609 2091498 1723303 1298948 961898 654431 277842 -21829 130653 828311 1452168
39600A452168l15331j299001j233324j31572Q20771P20714k4855m15950j79964
39591f06344J01379j5901k68878k10950J18413L47290L76525M45008O09407N70891
39581A466840K00184j35061j03729K8984j69865n50764o33487m42689l92721m07890
39571a140198N788P24759R72833N82213L15484N17947M97983j25111n46079j40455
39561A665164L20681m0167o08935l19217M48499N17713q0151l67353k97203o24694
39551F14337j085135n75674P17621J225282M12191m39378l63394N7748J88509
39542G52107L53254N92957J32697r37434j136962O2099R89538K97727p87484m38564
39532a20065Q35279J147459J94203p23742j001497j098466j006659k63359O61903
$$ plain form
39600 1452168 1136837 -162164 -1395488 -1527060 -706289 14425 -10430 -426380 -606344
39591 -606344 -504965 -520866 -789744 -1000694 -882281 -534991 -158466 286542 895949 1466840
39581 1466840 1667024 1531963 1428234 1457218 1287353 736589 103102 -339587 -732308 -1140198
39571 -1140198 -1134410 -409651 563182 1145395 1460879 1978826 2476809 2351698 1805619 1665164
39561 1665164 1985845 1945678 1336743 1017526 1466025 1983738 1903587 1536234 1239031 614337
39551 614337 -470798 -1046472 -328851 896431 1308622 869244 505850 563598 752107
39542 752107 1105361 1698318 1831015 893581 -243381 -181282 808256 1105983 318499 -120065
39532 -120065 715214 1862673 2056876 1333134 331637 -766829 -1773488 -2036847 -1374944
39523a374944P61671K28246J49823N21996K81897n89675p93777Q8189P90044L41089
39513D04559n91624r84055p99497m06367J59980O79400N88652K3514j4821P81658
39503a58601J328954P57964k76859p32859o74517o74368n76996J4693O46005N70481
39493B23897J9608j74824K8253o4910n26565n56530K31433J108559J154933L55149
39483A799003n13887p46003k71073L78747N32316q402p43030r77575n54437L0717
39473a073624K14945l0047k00574J18591O55284P10810J90582l2074O70902J446117
39463B670912Q84549q01138j669138o27456R18287R18295n48732j526825r00250
39454f81496L51330P46527J28956n44298n54971j9844N10043N81829J16583n20581
$$ plain form
39523 -1374944 -613273 -385027 -235204 286792 568689 -20986 -814763 -726574 63470 404559
39513 404559 -187065 -1171120 -1970617 -2376984 -2217004 -1537604 -948952 -925438 -940259 -158601
39503 -158601 1170353 1928317 1651458 918599 244082 -430286 -1007282 -992589 -346584 223897
39493 223897 243505 68681 96934 32024 -494541 -1051071 -819638 288921 1443854 1799003
39483 1799003 1285116 539113 268040 646787 1179103 1170701 427671 -549904 -1104341 -1073624
39473 -1073624 -858679 -888726 -1089300 -970709 -315425 395385 585967 553893 1224795 2670912
39463 2670912 3555461 2754323 1085185 457729 1376016 2294311 1745579 218754 -681496
39454 -681496 -330166 416361 545317 1019 -553952 -573796 -63753 518076 634659 114078
39444A14078p67313l77823L19580P73484P78860O09931O03122P10896N73867M5430
39434C384112n10475o17217l01878o0555j87542m15589l53047n0478Q1894j64684
39424H04541m87701l71135K88389Q88866O80879k55705r23218o24554R1980K60698
39414C53040p3728j03690K45425J80703m48313p31607k95717r1188p19569j122485
39404b807129k11279J088204J027327k10192p17461K00839J094508P80691J979
39395B47487j50169L773k76530n50686l0600P19268M65488o12713j029821k32738
39385a447241O56360O70988L10799L95229O61711L98706k35689n11914l54902
39376E44047l19179m97697l76467J46383M34609J05347l18166j76772L77357O89875
$$ plain form
39444 114078 -653235 -1031058 -711478 62006 840866 1450797 2053919 2764815 3338682 3384112
39434 3384112 2873637 2256420 1954542 1893987 1706445 1290856 937809 887331 969225 804541
39424 804541 316840 -54295 234094 1122960 1803839 1548134 624916 362 92342 353040
39414 353040 279312 175622 421047 601750 153437 -578170 -873887 -965075 -1684644 -2807129
39404 -2807129 -3018408 -1930204 -902877 -1113069 -1830530 -1629691 -535183 245508 247487
39395 247487 97318 101091 -175439 -726125 -756725 -37457 428031 -184682 -1214503 -1447241
39385 -1447241 -790881 -119893 190906 586135 1247846 1646552 1410863 898949 544047
39376 544047 224868 -272829 -649296 -502913 -68304 37043 -281123 -457895 -80538 609337
39366F09337N45382K82014J18496j11407n07339q05171p12928k98868J36036M21989
39356c22459N82339O22835M65654J27395j98567l59701m45721n87117o06753j84380
39346i06475N26672Q18612K97317m56991n88605j54683Q907m00899p11167l83090
39336a950402J49472K36154K5639Q1344L79075M13005J09457p9570J8088L3589
39326e84149k65481n26747k62523N06847J190002J131078K88666n09454l22500
39317F45739O62455J108384J92083j188931j531838o51063L30904O24793M49238
39308F41764J81736j28497k87444L8978O07229P27373L31113O7415J38821j708
39298B316780n00341o90174k96244k2906l26002n98012l19055l6053k77248m18799
$$ plain form
39366 609337 1154719 1436733 1555229 1443822 936483 131312 -581616 -880484 -744448 -322459
39356 -322459 259880 882715 1348369 1475764 1277197 917496 471775 -115342 -722095 -906475
39346 -906475 -379803 438809 736126 279135 -309470 -464153 -455246 -856145 -1567312 -1950402
39336 -1950402 -1800930 -1564776 -1539137 -1457793 -1078718 -665713 -556256 -635826 -617738 -584149
39326 -584149 -849630 -1376377 -1638900 -1132053 57949 1189027 1477693 968239 645739
39317 645739 1308194 2416578 2608661 1419730 -112108 -763171 -432267 192526 641764
39308 641764 823500 695003 407559 446537 1053766 1781139 2112252 2179667 2318488 2316780
39298 2316780 1816439 1126265 830021 807115 481113 -116899 -435954 -472007 -749255 -1168054
39288a168054K29803R77786P14571j85282l24327N53192J217764Q30878o0179
39279B786152o34728q30858q94152p76124m38858j36147j5530R8184K96506L99504
39269a46051L12009J50276k8364j83829n7416M50575P67359K61529o16464o76135
39259B33489L10487J109944O62052n21370j156629q23808j74447J29054N7447
39250a73781o2508M681K27943L48806J62145j52968j90555J02522K90580L3498
39240E90363m82248q45796q58854n29317L1044N13603N59491K33318M2905K57143
39230d88348N29587M64988K12786J36409J88155O1938k11380l01295j62743j24425
39220C05672l12470l94366j12105K33740J64410k49754m29658j10849K50104J40273
$$ plain form
39288 -1168054 -938251 39535 754106 568824 244497 797689 2015453 2846331 2786152
39279 2786152 2151424 1320566 426414 -349710 -788568 -924715 -940245 -842061 -545555 -146051
39269 -146051 165958 316234 287870 104041 46625 497200 1264559 1526088 909624 233489
39259 233489 543976 1653920 2315972 1794602 637973 -185835 -360282 -231228 -173781
39250 -173781 -236289 -231608 -3665 345141 507286 354318 163763 266285 556865 590363
39240 590363 108115 -737681 -1596535 -2125852 -2094808 -1581205 -1021714 -788396 -745491 -488348
39230 -488348 41239 506227 719013 855422 1043577 1105515 894135 592840 430097 305672
39220 305672 -6798 -401164 -513269 -279529 -115119 -364873 -794531 -905380 -655276 -515003
39210e15003k41156k95803O2526L40694K92829K13915K67651J59204k05683l46304
39200b67130M8746N41953O34163N04883M66659K39677m53210j066798r45557m75215
39190g71829m77655p28391k72693Q34225J359329O85414l50084p47842m79768
39181i49294K1728N34194P88924M53267j89408l68126J8988K68234J77516L86350
39171A142373R80650J006991P2401p95444p66553n01251p76078r84712l18605
39162i40228N68603N80190O3827Q9955M80251K59156l75560l51532K07637P8019
39152F60318q22886j139146l62269L60439K81370K30185Q88787J395760P80101
39143B272659l82715r13640p42292n61001m85045j69311K50184L64161K87970
$$ plain form
39210 -515003 -756159 -1051962 -989436 -648742 -355913 -141998 125653 284857 79174 -267130
39200 -267130 -218384 323569 957732 1462615 1929274 2168951 1715741 648943 -296614 -771829
39190 -771829 -1249484 -1977875 -2250568 -1416343 -57014 628400 278316 -469526 -949294
39181 -949294 -927566 -393372 395552 848819 659411 291285 310273 578507 756023 1142373
39171 1142373 2123023 3130014 3202415 2406971 1640418 1139167 363089 -621623 -940228
39162 -940228 -371625 208565 272392 362347 842598 1101754 726194 374662 582299 660318
39152 660318 -162568 -1301714 -1663983 -1303544 -1022174 -791989 96798 1492558 2272659
39143 2272659 1889944 976304 234012 -326989 -812034 -981345 -731161 -367000 -79030
39134g9030L64966L93324j7081n90593o95648l18526k604K5107J305M9407R2227
39123g77146K25565N79149Q76541O71611j956o17574p06998j57374P49895J282864
39113B124577P16729o43179j399709p05741N04916P51731K4362m69159k47194
39104F57333J1443o6100o820K86095Q9587p44701j106098k01703J078181J348343
39094A345560O13852n5206k32448m01138p50126q22870m33688m376J95426L68985
39084a76029N56216M14156q3609l96706k24402K9473J008N667L98637P69574M65509
39073A759494l22280p04192l20120J96700J47551l23649n38388k10296K57342
39064e7838L30900r747k53255L5939O41404Q66299L60937m10968p51224n98513
$$ plain form
39134 -79030 285936 679260 662179 71586 -624062 -942588 -945192 -920085 -918780 -869373 -777146
39123 -777146 -551581 27568 904109 1575720 1573764 956190 249192 91818 841713 2124577
39113 2124577 2841306 2198127 798418 92677 597593 1349324 1373686 904527 657333
39104 657333 668776 602676 595856 881951 971538 226837 -879261 -1080964 -2783 1345560
39094 1345560 1959412 1904206 1671758 1270620 520494 -302376 -736064 -740440 -545014 -176029
39084 -176029 380187 794343 710734 314028 89626 119099 120107 125774 524411 1293985 1759494
39073 1759494 1437214 733022 412902 609602 757153 433504 -104884 -315180 -57838
39064 -57838 273062 263315 10060 45999 687403 1553702 1914639 1503671 752447 153934
39054A53934m54964n17873l92585J63928P03087O92310L40247K79247N47014M99066
39044B013411j25102o39372l51440L23218L31260n08828j160428p91522N7102
39035h51701K89225j35098j96715N76114J319852J042074k929p39885o88729k83071
39025C29137J4186J62288J12360k99223p93230o84956J00938O42780K15588n88786
39015g88918o33722J66956Q31503P90802M95171L70543Q5220o04315j022295m41344
39005g50399O05218Q28655l4972q41973o42836J49938O03880N38636L26552J6942
38995G99641n01692q21790m42625K37001L09741j95294k62290M49067R40000M38159
38985I49918l36878l15038K93166N37528L35697L63590O41727M72768k20282o62450
$$ plain form
39054 153934 -301030 -818903 -1211488 -1047560 -344473 347837 688084 967331 1514345 2013411
39044 2013411 1888309 1248937 897497 1220715 1551975 1043147 -117281 -908803 -851701
39035 -851701 -562476 -697574 -894289 -318175 1001677 2043751 2040822 1300937 612208 329137
39025 329137 343323 505611 617971 318748 -474482 -1159438 -1058500 -415720 -200132 -788918
39015 -788918 -1422640 -1255684 -424181 366621 861792 1232335 1317555 713240 -309055 -750399
39005 -750399 -145181 683474 648502 -193471 -836307 -686369 -82489 456147 782699 799641
38995 799641 297949 -523841 -966466 -729465 -419724 -615018 -877308 -428241 511759 949918
38985 949918 613040 298002 591168 1128696 1464393 1827983 2469710 2942478 2722196 2059746
38975B059746n14222l27312m33383l92533N4819M39378M49059M63754O55958M61945
38965B917209l51118r41626n83005J19424J76263k03669p6849N65171P65493J67505
38955B554798m63564m42522k8949J56041o3027m21709n84751m05350j31529k25157
38945e5719o19440n25800M13956J226697P94258l56687o35864K62994R15670L90816
38935A810881m10081l56106J25401n0723p13435o96926K49894R90085N92417m53208
38925A088199r55645m42955M80814R28417N85640j55435p14717q42380o12651
38916f40713j25043M88645Q43184N29877k85920q56984o65868J3606N43814O48172
38906D92770N19614M50749N58208P09543O34678L07709J78427O38855J272287
$$ plain form
38975 2059746 1545524 1218212 784829 392296 447115 886493 1335552 1799306 2455264 2917209
38965 2917209 2566091 1624465 1041460 1160884 1337147 1133478 1056629 1621800 2387293 2554798
38955 2554798 2091234 1648712 1619763 1775804 1712777 1291068 706317 300967 169438 -55719
38945 -55719 -675159 -1200959 -787003 439694 1233952 877265 241401 504395 1420065 1810881
38935 1810881 1400800 1044694 1170095 1119372 405937 -290989 -41095 948990 1541407 1088199
38925 1088199 132554 -310401 170413 1098830 1684470 1529035 814318 -28062 -640713
38916 -640713 -765756 -277111 566073 1095950 810030 -46954 -712822 -699216 -155402 492770
38906 492770 1012384 1463133 2021341 2730884 3365562 3673271 3851698 4490553 5762840
38897E762840J202771L46376l19421p4110N56720O13171j1356o68358r19550p75454
38887E713629l15566K32440K74647n35985j552373j713398q87564K3853L70593
38878A610276M21510N53518N05172p2920p96279q77951j68077N77308N39982k56836
38868B035703r83374r07062k02546K59706j6485n20940m25878K78664P71095N27463
38858H16346L289l6161M57063P88902M17309m07119r42266p67695k11296M7255
38848A65627k53999p01253p35329k60248L84175Q33932Q62776L68371m09643p82505
38838e28096k35188P70666J117568L93318n03655m92787K96635P80494M06402
38829B005357k28357l59784r0226m2216l32396m52791j30569K36343K10902k6649
$$ plain form
38897 5762840 6965611 7311987 6992566 6918456 7475176 8088347 8076991 7408633 6489083 5713629
38887 5713629 5398063 5630503 5905150 5369165 3816792 2103394 1215830 1239683 1610276
38878 1610276 2031786 2585304 3090476 3017556 2221277 1343326 1175249 1752557 2292539 2035703
38868 2035703 1052329 145267 -57279 202427 185942 -334998 -760876 -482212 288883 816346
38858 816346 819635 783474 1240537 2029439 2446748 2039629 1097363 329668 118372 165627
38848 165627 -88372 -789625 -1524954 -1785202 -1401027 -567095 295681 664052 254409 -528096
38838 -528096 -763284 7382 1124950 1518268 1014613 521826 818461 1598955 2005357
38829 2005357 1777000 1417216 1326990 1284774 952378 499587 369018 605361 816263 789614
38819G89614j6897K28320K52247j29741n51751o07080l09574N8123K74319K46511
38809B34091L2143p3310K42741Q19811J036058N46698k30636o23406m70162j03968
38799A410060J82770K84910R0766l87904p46796n34055M5650K07251m12848j157528
38789a017724j072640q1132Q91967R96207M03168n258K16159N49781K92001m02950
38779G69579o72573j32110N62803N89325L2157l07327J4766O14137Q29629L91867
38769B692253m60847j214520j376315q28122o753M44607K96350j02925k80570
38760h36842r8956K42364M61737L83105L9754k95117k92943Q5303M76828M77103
38750F42336J21456j28105K4624K63823O2226n01431p22834k54676L19205K97867
$$ plain form
38819 789614 772717 1001037 1253284 1123543 571792 -35288 -344862 -286739 -12420 234091
38809 234091 266234 192924 435665 1255476 2291534 2838232 2607596 1984190 1514028 1410060
38799 1410060 1592830 1877740 1968506 1580602 833806 299751 345401 552652 139804 -1017724
38789 -1017724 -2090364 -2171496 -1279529 -283322 119846 114588 330747 880528 1172529 769579
38779 769579 97006 -35104 527699 1117024 1149181 841854 856620 1470757 2300386 2692253
38769 2692253 2231406 1016886 -359429 -1187551 -1194304 -749697 -453347 -556272 -836842
38760 -836842 -935798 -693434 -231697 151408 191162 -103955 -396898 -311595 165233 642336
38750 642336 763792 635687 660311 924134 986360 484929 -237905 -492581 -173376 124491
38740A24491j25500k64282o0589j5773j36516Q8509N67800N16159j68766m99288
38730B6245N5266O39582M13227j01904p6026J38172j85775o17560l12499K89624
38720B68352J48554l74536m6746Q22880N79426q50230j406900j29277J141661
38711A53184O40265n74125n49398L29386K38207q31664j082284M2751J042328
38702e91350Q76236L46814L44886L98079j20908o54968l95189L43268O60816L65233
38692A572917r1845m29362n55474k80107K78157M68951M03m11223l9535O48335
38682A161217O59789J4056l58310r7975J87552L5834k96379n23683p29547q35206
38672g82652m91978J73889M73566J84447p0938J21341L18784J44465K9697L23195
$$ plain form
38740 124491 -1009 -265291 -325880 -341653 -478169 -389660 178140 694299 525533 26245
38730 26245 81511 721093 1134320 1032416 956390 1094562 908787 291227 -21272 268352
38720 268352 416906 42370 -4376 818504 1397930 547700 -859200 -988477 153184
38711 153184 793449 219324 -330074 -688 237519 -594145 -1676429 -1633678 -591350
38702 -591350 284886 631700 976586 1374665 1253757 598789 203600 546868 1207684 1572917
38692 1572917 1481072 1051710 496236 216129 494286 963237 963640 552417 512882 1161217
38682 1161217 1821006 1835062 1476752 1378777 1566329 1602163 1305784 782101 52554 -782652
38672 -782652 -1274630 -1100741 -627175 -442728 -513666 -392325 -73541 70924 100621 423816
38662D23816M49624j16950p21044m84183J33203K4798o31490o05037K55179O84071
38652e88013J24742l50438P5921N77872J96362m41532j92103O47782Q39592J84593
38642A074778l37081k06829Q5504J20803P6126O3859r7195l02617k10013K184
38632B69519k24971p61816p43334R8074Q71028P41797M1823l45666j87776M0474
38622b00848l2091k87441m10034k54212L9581J97979J37253M4066Q084j59693
38612i17356m53176l98312K20172P28063L95984l60738m96719Q8077M69828K08878
38602e15299j03542O255K12786J82206J14908J26626l7234k98773j44843L85004
38592g1906N27760L5995l87270l62297m52938q88644q34897J63468J083679Q68247
$$ plain form
38662 423816 873440 756490 35446 -448737 -315534 -290736 -922226 -1527263 -1272084 -588013
38652 -588013 -463271 -813709 -737788 -159916 36446 -405086 -597189 50593 890185 1074778
38642 1074778 737697 530868 616372 737175 813301 877160 779965 477348 267335 269519
38632 269519 44548 -717268 -1460602 -1362528 -491500 250297 292120 -53546 -241322 -200848
38622 -200848 -232939 -520380 -930414 -1184626 -1145045 -947066 -809813 -765747 -757663 -917356
38612 -917356 -1370532 -1768844 -1548672 -820609 -424625 -785363 -1282082 -1194005 -724177 -515299
38602 -515299 -618841 -612586 -399800 -217594 -102686 23940 -13294 -312067 -456910 -71906
38592 -71906 455854 491849 104579 -257718 -710656 -1599300 -2434197 -2270729 -1187050 -318803
38582c18803O8168j44951J56860O8242m60442o72325l74074k7064K56385O71242
38572g76762R34949O42856J57191Q7958K02500n4085l52472n5715L78841L1942
38562A197203p01209n86366K79073N24294j28231m33793J404r6928j221191j720495
38552b886239l15311J545574J616539J56655n81746K97409J323891J048413j34715
38543B070470r86160j052090o66524j28830M15501O81551M53190j0623j90548
38534E85937L7636K38373K8348l53027l63725J1126J70446j85930n08760j97997
38524e37573M20882N31505J4426m92419o15683n86143n50943l12638J21843M43021
38514a563722O23022Q90039J027067N31641l55519p23818l98137k58607o87179
$$ plain form
38582 -318803 -250635 -395586 -238726 -170484 -630926 -1303251 -1677325 -1704389 -1448004 -776762
38572 -776762 158187 801043 958234 1046192 1248692 1194607 842135 786420 1165261 1197203
38562 1197203 495994 -90372 188701 712995 584764 150971 152375 55447 -1165744 -2886239
38552 -2886239 -3201550 -1655976 -39437 117218 -464528 -167119 1156772 2205185 2070470
38543 2070470 1084310 32220 -634304 -763134 -347633 333918 787108 776485 585937
38534 585937 623573 861946 890294 537267 173542 184668 355114 169184 -339576 -537573
38524 -537573 -116691 414814 429240 -63179 -678862 -1265005 -1815948 -2128586 -2006743 -1563722
38514 -1563722 -940700 -50661 976406 1508047 1152528 428710 30573 -228034 -915213
38505i15213p76572J48188J193339J099629Q1339o12518m97326j59789p6102j30575
38495f45600j65460j42632J26209O46644Q28829K15551n72499n30479J87509M08144
38485C56216k88259r18044n46810M25193R14726N44269r1669k41708K39968P70834
38475A164716N89483l51449j121409q35469J50078O27651J39806m71866l22755
38466d31214L59469P39020N23513Q8947k35887m59616n99726n37388k71841n558
38456h30281J40464K84510N13080O05061K68365l42295o14051j84298N18801P55111
38446A114467M03588K8393J8289J23181k7790m20325q74838j282482j346669o45900
38436b910086O03944J378867J029216K02927o5526K11804K38806j72604m02423
$$ plain form
38505 -915213 -1691785 -1543597 -350258 749371 830710 218192 -279134 -438923 -515025 -645600
38495 -645600 -811060 -953692 -827483 -180839 647990 863541 291042 -239437 -51928 356216
38485 356216 67957 -850087 -1396897 -971704 -56978 487291 395622 153914 393882 1164716
38475 1164716 1754199 1402750 281341 -554128 -404050 223601 363407 -108459 -431214
38466 -431214 -71745 667275 1190788 1279735 1043848 584232 -15494 -552882 -824723 -830281
38456 -830281 -689817 -405307 107773 712834 981199 638904 24853 -159445 359356 1114467
38446 1114467 1518055 1546448 1564737 1687918 1660128 1239803 364965 -917517 -2264186 -2910086
38436 -2910086 -2306142 -927275 101941 304868 239342 451146 689952 517348 114925
38427A14925j44662J77056K25152J82933J98469J05961j03491j86959j88609m02703
38417b1928o58505m21559J65064K23008m53397q11614k2930J188908J513918Q08196
38407A509161J6223k74989k95913l00201k02289l0445l310o4010N2923K33949
38397F41099P3255l67829n01841p5816M76031P23757P22018N80596J57072m86448
38387A941894q86830q53106p90442q77595n44943N07126J341974Q78565l43375
38378C73268p03303J55075Q02314K38229o55635o78391j87103k17559n56224j76421
38368a605750P85997J066527L20948l41546j92743J39868P1129P8822N00373N43762
38358A367387l62148j203202p09314N98377J089604L82318l77380m38802k55092
$$ plain form
38427 114925 -29737 147319 372471 555404 753873 859834 756343 569384 380775 -21928
38417 -21928 -680433 -1101992 -936928 -713920 -1167317 -1978931 -2001861 -812953 700965 1509161
38407 1509161 1525384 1250395 954482 654281 451992 421547 418237 354227 407150 641099
38397 641099 714354 346525 -155316 -231132 244899 968656 1690674 2271270 2428342 1941894
38387 1941894 1055064 201958 -588484 -1466079 -2011022 -1503896 -161922 716643 373268
38378 373268 -330035 -174960 627354 865583 209948 -468443 -655546 -873105 -1429329 -1605750
38368 -1605750 -819753 246774 567722 226176 33433 173301 244430 323252 823625 1367387
38358 1367387 1005239 -197963 -907277 -308900 780704 1163022 785642 346840 91748
38349I1748k78897k77622j62873l22545o98285n96385R4840N22851K78595J54834
38339a193739P29153J167503M98965o48085q39417N025N27758l585p39447o56658
38329a152527N8302N58717N55844L53702J17051k19718m89160l57001Q4358K62457
38319b27975j23386o08159n16060J36862O33227M81244L5175k9897L37876N15073
38309F33980J22484l79142l04095K46081M44625q1386n94392k19858O77940Q13763
38299A360000j95393j114532p55381K97962N43851k35983p91151l98783K20224
38290a069186L35733L07665N40106M73571l35139j016156n21119O32009J042933
38281C90417M83479m0792o1386j06971l86065l63506R9028L80969K32722J98989
$$ plain form
38349 91748 -187149 -464771 -627644 -950189 -1648474 -2244859 -2150019 -1627168 -1348573 -1193739
38339 -1193739 -464586 702917 1201882 553797 -285620 -280595 247163 243578 -495869 -1152527
38329 -1152527 -1094225 -535508 20336 374038 491089 271371 -217789 -574790 -490432 -227975
38319 -227975 -351361 -959520 -1475580 -1338718 -705491 -224247 -189072 -218969 118907 633980
38309 633980 756464 377322 73227 319308 763933 682547 88155 -131703 546237 1360000
38299 1360000 1164607 50075 -705306 -407344 136507 -99476 -890627 -1289410 -1069186
38290 -1069186 -733453 -425788 114318 587889 252750 -763406 -1284525 -652516 390417
38281 390417 873896 833104 771718 664747 278682 -84824 14204 395173 627895 826884
38271H26884N28735O56877K12092l39486m83904l18168r8018J06094Q9876l06856
38261H74126n83277j31141N26827K96311n52010n47678M83491Q54243k48842j262544
38251b90494p08759N00181P84862M64821P16648J120597L86978j140528j814633
38242A9673j215432m51801j18693K24422O14175N12595J41890L11887Q12983O18720
38232A470419k04738m88539k5380J37126k51524j87929N00305N73762l28556p52327
38222D42619J04590P90793p2662j373384j138506M64601J499584J010679j50440
38213A577874q69317q06019j39989N98242O59299l6992m74739J24453J000358
38204A633170Q86637q6402o62271l78122l5357k56000o33135n48974o9793K61019
$$ plain form
38271 826884 1355619 2012496 2224588 1885102 1401198 1083030 985012 1091106 1180982 874126
38261 874126 290849 159708 686535 982846 430836 -116842 366649 1220892 972050 -290494
38251 -290494 -999253 -499072 285790 750611 1467259 2587856 2974834 1834306 19673
38242 19673 -1195759 -1647560 -1766253 -1541831 -927656 -415061 -273171 38716 851699 1470419
38232 1470419 1265681 777142 751762 888888 637364 449435 949740 1523502 1194946 442619
38222 442619 547209 1338002 1265340 -108044 -1246550 -781949 717635 1728314 1577874
38213 1577874 708557 -97462 -237451 360791 1020090 983098 508359 632812 1633170
38204 1633170 2519807 2433405 1771134 1393012 1357655 1101655 468520 -80454 -150247 110772
38194A10772J06722l06487l62275K18325P62561L45693p18198j004075n0989Q13668
38184h4283N29775m3586K33628O75726J7987j124208j101536n5530L14777k91276
38174i28526l69567N27796Q81610l5701p07500N1194R89569N22168o01281o00360
38164b70598M37226R23972M22411J1317K05408K74185j96725n53440k86764J45610
38154A112602J66214j20281l80367n91761p38763n55978J6677N27420N05987K6230
38144c2020m21415m43075n0335L87956N07244L57654K91817L42189R1357n47115
38134D84257q85569l40832N98264R36197M80951p8387k37919j12181J08184L79490
38124A332455M57883N6179n33914o41501j89482J61087Q567k74537k50202m2279
$$ plain form
38194 110772 217494 -88993 -451268 -232943 529618 875311 157113 -846962 -897951 -84283
38184 -84283 445492 401906 635534 1311260 1329247 205039 -896497 -952027 -637250 -928526
38174 -928526 -1298093 -770297 111313 75612 -631888 -580694 408875 931043 329762 -270598
38164 -270598 166628 1090600 1513011 1524328 1729736 2003921 1807196 1253756 966992 1112602
38154 1112602 1278816 1158535 778168 186407 -552356 -1108334 -1091657 -564237 -58250 -32020
38144 -32020 -453435 -896510 -946845 -558889 -51645 306009 597826 940015 1031372 484257
38134 484257 -401312 -742144 -143880 792317 1273268 1194881 956962 844781 952965 1332455
38124 1332455 1790338 1846517 1312603 671102 481620 642707 651274 376737 126535 84256
38114H4256L6888j4577m8909j7707J36770M30833N76327K61738k32493l12445
38104I00681o6705k30961r20137j232561n72461M03151P46216M57903J32408q498
38094c90964j582L63318J103510J550984J175611N44419N40120Q96135N30948
38085F312499p30928j792584j784186j046260l73985n7843l912j51502l63920
38076G379l56946q0190J42982N9195k19788m52531m73143j53836M31975Q23117
38066b71786O29700J68975P7084K74069K2044q16455j341779q46017J46664N98370
38056a359131K82100j41765r0577L79768Q28981Q83682N14286O6997q5493O254
38046A285102j3269k20988l10027j44233J112r1854k67792l14596k22914j0532
$$ plain form
38114 84256 121144 106567 57658 39951 176721 607554 1183881 1445619 1213126 900681
38104 900681 833976 603015 -317122 -1549683 -2122144 -1718993 -972777 -514874 -382466 -390964
38094 -390964 -392546 -29228 1074282 2625266 3800877 4345296 4885416 5781551 6312499
38085 6312499 5581571 3788987 2004801 958541 584556 526713 522801 371299 7379
38076 7379 -349567 -429757 -286775 -227580 -447368 -899899 -1373042 -1526878 -1094903 -271786
38066 -271786 357914 526889 603973 878042 900086 83631 -1258148 -2104165 -1957501 -1359131
38056 -1359131 -1077031 -1218796 -1309373 -929605 -100624 783058 1297344 1364341 1278848 1285102
38046 1285102 1271833 1050845 740818 596585 597697 505843 238051 -76545 -299459 -309991
38036c09991L03197M67012K32481j00457M3682N82310P87001M03538M303k8317
38026B384759k7067j94229j67012N5036k54896j250728j817132j121205J1696
38017b380778L70687K01545M73552R75331O90894k64971o87442k28759J97180
38008f52761J06040R7316M84492O21750J26626l78063l42498j40469k64003n18029
37998h59599n47185l85679m3399O28105J239104R72070p2830o05228R4021J043904
37988A463284R96291J60700m21557m87243m86323m72556j85285R2874j46563o01334
37978h7712m42118L56753Q58817M74639k94888o21439l08800J98200L75410O2469
37968E71331m02091m82762p0439L32565K52005j67971m49583l50325J16813Q27031
$$ plain form
38036 -309991 -6794 460218 692699 592242 635924 1218234 2005235 2408773 2413076 2384759
38026 2384759 2357692 2163463 1996451 2051487 1796591 545863 -1271269 -2392474 -2380778
38017 -2380778 -2010091 -1808546 -1334994 -359663 331231 66260 -621182 -849941 -652761
38008 -652761 -546721 -449405 35087 656837 783463 405400 62902 -77567 -341570 -859599
37998 -859599 -1406784 -1792463 -1835862 -1207757 31347 1003417 930587 325359 419380 1463284
37988 1463284 2459575 2620275 2198718 1711475 1225152 752596 567311 660185 513622 -87712
37978 -87712 -529830 -173077 685740 1160379 865491 244052 -64748 133452 508862 571331
37968 571331 169240 -313522 -383961 -51396 200609 32638 -416945 -767270 -650457 176574
37958A76574J353030J100887J29437o16537m76786m1381k49631r26335j080095
37949f30837m33728K64917M36622L11918K52527J85965l7740k84319l63037k42780
37939e40492L7922L45439M05045J60450J4538K56333M92249K28195k58617l61472
37929G79590j99464l27828n64575j93078O30212Q51595J86120l59337j23943J78350
37919H57642j96213o76126l78392L14742L45301k95897o01853j62160L29727K77993
37909a85236j7674l0337K28004M35101M43811K37069j93629o29494o24144n3648
37899c90177N58523N95101J05316k84658j68774K33936N10833N65602M82060J43707
37889B351469n94652j410898j665489j187671m80483O1819O15004J219747J235245
$$ plain form
37958 176574 1529604 2630491 2759928 2143391 1666605 1625224 1375593 449258 -630837
37949 -630837 -1064565 -799648 -363026 -51108 201419 387384 349644 65325 -297712 -540492
37939 -540492 -502570 -157131 247914 408364 422902 679235 1171484 1399679 1141062 779590
37929 779590 580126 252298 -312277 -505355 124857 976452 1162572 803235 679292 857642
37919 857642 661429 -14697 -393089 -78347 266954 -28943 -630796 -792956 -463229 -185236
37909 -185236 -202910 -233247 -5243 429858 873669 1110738 917109 287615 -336529 -390177
37899 -390177 168346 763447 868763 584105 415331 649267 1160100 1725702 2207762 2351469
37889 2351469 1756817 345919 -1319570 -2507241 -2987724 -2925905 -2310901 -1091154 144091
37880A44091K67077p81595o19856N57660J197614N68650k93725k81047K26358
37871I85227K80211m1268j2348L32876L14856j18000l18327j11722l9238l11198
37861I61069m42647j74390Q7251Q4386J65126M84787N04258j03813o82103m75994
37851D07930J60368K77249k30040n79453m05868j78894j92892o5232L74786N28374
37841I6328k2125o53680n61512j6452J11492j96032j34702M52996O84211L9586
37831a99890p45994p58373j84442J37274m9433l11644l11388m9141M21387R08368
37821a143276R38310L28205k83785j40210N37801Q50269N29690J68470Q4749j85435
37811A684788r34732j535544j189932n3780Q80323R03543K92728r9697J54160
$$ plain form
37880 144091 411168 -370427 -990283 -432623 764991 1333641 1039916 758869 985227
37871 985227 1265438 1224170 1211822 1544698 1859554 1741554 1423227 1311505 1272267 961069
37861 961069 518422 344032 431283 515669 680795 1165582 1669840 1566027 883924 407930
37851 407930 568298 845547 615507 36054 -369814 -548708 -741600 -806832 -432046 96328
37841 96328 74203 -579477 -1140989 -1157441 -1045949 -1241981 -1376683 -923687 -239476 -199890
37831 -199890 -945884 -1704257 -1888699 -1751425 -1800858 -2112502 -2423890 -2473031 -2051644 -1143276
37821 -1143276 -204966 123239 -160546 -300756 237045 1087314 1617004 1785474 1870223 1684788
37811 1684788 750056 -785488 -1975420 -2029200 -1148877 -245334 47394 -52303 101857
37802A01857N43687K87605m87147p34572K9930Q50401O06619l56621q20502n34056
37792e12799k97192l70905j54420M09942N01328p8409l88356M0223L46165q9588
37782e94011m41233J12887Q08892M79457m79466p45911j65876K12118o5976l90554
37772a269673l63878k94456l09057p4404L86092N35117K15390p8990l522K56114
37762a001267M94089O82201O17126J04483m55009m21801P2491K52050p9150k76832
37752a1619J0155L07686K17232L6160O0660k1427n22635j062780j006546k99183
37742b292297M93343P83648M45004q6069j73932K92732O90483N36656K46505L92690
37732A328763N90131Q7458p46232p54727R1075M27740m18942j324658j046854
$$ plain form
37802 101857 645544 933149 446002 -288570 -258640 591761 1198380 841759 21257 -512799
37792 -512799 -809991 -1180896 -1335316 -925374 -424046 -502455 -890811 -850588 -504423 -594011
37782 -594011 -1035244 -922357 -113465 365992 -113474 -859385 -1025261 -813143 -879119 -1269673
37772 -1269673 -1633551 -1928007 -2237064 -2311468 -1925376 -1390259 -1174869 -1253859 -1257381 -1001267
37762 -1001267 -507178 175023 792149 896632 441623 19822 92313 344363 265213 -11619
37752 -11619 -1464 306222 523454 559614 620274 598847 76212 -986568 -1993114 -2292297
37742 -2292297 -1798954 -1015306 -570302 -656371 -830303 -537571 152912 689568 936073 1328763
37732 1328763 1918894 2006352 1260120 505393 596468 1024208 605266 -719392 -1766246
37723a766246L0520O84518N39380O2978m19297p51252n32313L34158J028484O83596
37713a05474l26233p91831k61181N07931O63838K04282k54578k10100K76772O26920
37703C30346L32083l74095p21600m08877N9363K32119K89066M16429L22769p3915
37693D03688j75267L57581Q10961M11560m03545o43141k77390q7036k79503l28135
37683b10227r2990m1699k65892k35846K48042O63209N81142K26193J324K24J33376
37672A006856K46973O9607m53284q03238m45554K97602N69802J65834k71649k57556
37662A25393J7763K22624K50279q322n65873r47963o07494J97942O49847N17350
37652a48454K90392J83883m8369k42933J32724Q22288Q12615l9564n51044Q449
$$ plain form
37723 -1766246 -1735726 -1051208 -511828 -448850 -868147 -1619399 -2151712 -1817554 -789070 -105474
37713 -105474 -431707 -1223538 -1484719 -976788 -312950 -108668 -363246 -573346 -296574 330346
37703 330346 662429 288334 -433266 -842143 -782780 -550661 -261595 154834 477603 403688
37693 403688 228421 586002 1396963 1808523 1404978 761837 484447 397411 117908 -210227
37683 -210227 -303217 -344916 -610808 -846654 -598612 64597 645739 871932 873256 873480 1006856
37672 1006856 1253829 1323436 870152 66914 -378640 -81038 488764 654598 382949 125393
37662 125393 143156 365780 616059 607737 41864 -906099 -1513593 -1315651 -665804 -148454
37652 -148454 141938 325821 277452 34519 167243 989531 1802146 1762582 1211538 1219987
37642A219987P69537O63027l7716m69933n71272p05338o77450k19783J69304k6210
37632A14153l03894J6769M46004Q3796o68564n63674M61396J107812O68539j28128
37622A234209m63972m31120l47381j56442P3081K909k35943p8219L65964K56697
37612B19783m98025q19317j27391O63086O14861J77267J33235J41540m09536r14839
37602h19336m21348N31580N55959l08900o14258J31784P83363O10749L72625O14406
37592A436624M75262o72425j700501j278061j4446N06374J91415K53943Q87073
37583H5258R37198M5663o11024k62400K74982J26664k42218j17391J12783j58731
37573A90784m43285j5482N99302L80021l94581n38443P3092L80247j2975l13990
$$ plain form
37642 1219987 1989524 2652551 2614835 2144902 1573630 868292 190842 -28941 140363 114153
37632 114153 -189741 -172972 273032 356828 -311736 -875410 -414014 693798 1362337 1234209
37622 1234209 770237 339117 -8264 -164706 -91625 -88716 -324659 -402878 -36914 219783
37612 219783 -278242 -1097559 -1224950 -561864 52997 230264 363499 505039 95503 -819336
37602 -819336 -1240684 -709104 -153145 -462045 -1076303 -944519 -161156 449593 822218 1436624
37592 1436624 1911886 1239461 -461040 -1739101 -1753547 -1247173 -1055758 -801815 85258
37583 85258 1022456 1068119 457095 194695 469677 596341 354123 236732 349515 190784
37573 190784 -252501 -267983 331319 711340 316759 -221684 -148592 231655 218680 -95310
37563i5310q8750O4186j99063l42105j78263m05734j132647j157283J86347J564713
37553a783909J368573Q5634n24584p8304K12220k37341n83852k12113K69123K30462
37543a254091N7756K92779O12590M04685k28509o87149o88800l71995N6282L77646
37533a428806M01957K56734K83574M37043K70721k37754m47274j5128N02921N02421
37523E26409K08118J20401J27832j13821l61514j57744K74706L41758Q3166K0046
37513A069357J26551j19016o38223o84471r7837K98182m0428n44373m94126r3016
37503a217400P3787M3239J66999K55021j03757o04029m93772K37014P39829N00199
37493d02870n4240l12341j81082K00873P65927J177805Q70807l8433m92201J45251
$$ plain form
37563 -95310 -184060 -119874 -318937 -661042 -839305 -1245039 -2377686 -3534969 -3348622 -1783909
37553 -1783909 -415336 -329702 -854286 -932590 -720370 -957711 -1541563 -1753676 -1484553 -1254091
37543 -1254091 -1196335 -903556 -290966 113719 -114790 -801939 -1490739 -1862734 -1806452 -1428806
37533 -1428806 -1026849 -770115 -486541 -49498 221223 -16531 -463805 -478933 23988 526409
37523 526409 734527 854928 982760 868939 507425 349681 624387 966145 1049311 1069357
37513 1069357 1195908 1076892 438669 -245802 -343639 -45457 -85885 -630258 -1124384 -1217400
37503 -1217400 -1143613 -1100374 -933375 -678354 -782111 -1386140 -1879912 -1642898 -903069 -402870
37493 -402870 -457110 -769451 -950533 -749660 16267 1194072 2064879 2026446 1534245 1679496
37483A679496R73556P16400l29074o35555K35824Q87762J48787j191531j581585
37474I04080q78583k21198j41760l5605M61064P35890K81189l71499m27565K6555
37464C32568K83256N1138l45886n62656n05089j84934K27739L61964R9186j08554
37454c51268J41571M64989J98895m52954n51078J71310P98389N11434k56724m99252
37444A75312k8999M38263L76173J0951j88925r9438O3325J3446l75956q66234
37434d82082r27848l21055M54095O47823J98512k04030n6312L54670M50103J25899
37424B39775k12805j68282K81641P63577P56680Q4320p50578r94892n17950O6240
37414d52274K69548K82672L97282L70319j29403p72448q68210k88858M16151P46537
$$ plain form
37483 1679496 2653052 3369452 3040378 2404823 2640647 3528409 3677196 2485665 904080
37474 904080 25497 -195701 -337461 -373066 87998 823888 1105077 733578 306013 332568
37464 332568 615824 666962 321076 -241580 -746669 -931603 -703864 -341900 -242714 -351268
37454 -351268 -209697 255292 454187 1233 -549845 -378535 419854 931288 674564 175312
37444 175312 146313 584576 960749 971700 782775 683337 746662 760108 384152 -482082
37434 -482082 -1409930 -1730985 -1276890 -629067 -430555 -634585 -690897 -336227 113876 239775
37424 239775 26970 -141312 140329 903906 1660586 1744906 994328 -564 -518514 -452274
37414 -452274 -182726 99946 497228 867547 738144 -34304 -902514 -1191372 -775221 -28684
37404b8684O34567K15571k81281m86019k38494P1281L855k15359o4308L54671
37394c4200N02726L93576M84643O05046R9507p80824q92392o4788L73406k92402
37384C94298q55824j39820R56418Q73739p7640l65410J99574M50502J22474J29689
37374A688000N56555L89500m07313n42817K67577N90729k20841p77438j34076
37365A409876L76672n34963j629031j062392M45079P41333k10573m31124O24549
37356b70574J219048L43828o61849l94726M84383N39931k81417r11451p58918
37347f91745j27683L99219L61925k68601p92117m20101N09709P83459R8801l91265
37337e38399J46666R19842P59243j60818p44916n06111J64433P61802R39667M73160
$$ plain form
37404 -28684 605883 821454 540173 54154 -184340 -113059 -109204 -324563 -388871 -34200
37394 -34200 468526 862102 1346745 1951791 2051298 1270474 378082 313294 686700 394298
37384 394298 -461526 -601346 355072 1228811 1151171 785761 985335 1435837 1558311 1688000
37374 1688000 2244555 2634055 2226742 1683925 1951502 2542231 2321390 1543952 1409876
37365 1409876 1786548 1251585 -377446 -1439838 -994759 -253426 -463999 -895123 -270574
37356 -270574 948474 1292302 630453 235727 720110 1260041 978624 67173 -691745
37347 -691745 -819428 -420209 -58284 -326885 -1119002 -1539103 -1029394 -245935 -147134 -538399
37337 -538399 -391733 528109 1287352 1126534 381618 -124493 39940 801742 1741409 2214569
37327B214569l36967o56063j68731L37349R6918m88628o11981l90833m65701o90797
37317a160865l22659O33568J273091J013370J65995o91957j164467r22514K3408
37308a153030Q86972P38854k67898r79480o95483Q1294M93338L17878r3465l33921
37298a004941j70445L36324P59355O69429J53152l07733m17093j96484K96418
37289A17982R00697J134371O21045k80098p96888o86474l57848j24572P6641K35246
37279H40102J58072j01647k42433k11024k11922k18244L451L85774O02431N72052
37269A576612L93996n3411p77239j131510m98166N68463Q66692K59086k21909
37260I82614j45560l18416j153560j617523p02620Q93445J552178P39964n74497
$$ plain form
37327 2214569 1877602 1221539 1052808 1390157 1487075 998447 386466 -4367 -470068 -1160865
37317 -1160865 -1483524 -849956 423135 1436505 1602500 910543 -253924 -1176438 -1153030
37308 -1153030 -266058 472796 204898 -774582 -1470065 -1388771 -895433 -577555 -671020 -1004941
37298 -1004941 -1175386 -839062 -79707 589722 742874 435141 18048 -178436 117982
37289 117982 1018679 2153050 2774095 2493997 1697109 1010635 652787 528215 604856 840102
37279 840102 998174 896527 654094 443070 231148 12904 16355 402129 1004560 1576612
37269 1576612 1970608 1917197 1139958 8448 -489718 78745 945437 1204523 982614
37260 982614 837054 518638 -634922 -2252445 -2955065 -2061620 -509442 230522 -343975
37251c43975j194701p52542K42341Q92499O62377m4362l37160R236L82668M26029
37241e7590N01242P47762N98048j76206p66671m29753L79808P19436L97932k03205
37231A710803q81809j384691j096206Q3921J091880R24330O4407l03127m8188
37222A61320M0142k11280j93782K29878M90770L91426L50122M27141J06013o88722
37212A103028j211108q84117n7208M98890M09699j10953n16307l93716L5609J40746
37202i85437r8073J07744R59566J291389K24138j117372r74889L74491R66913
37193G48470J00902p89036n19352K34933L83937O8010j2998J58657K21784J80157
37183G75464J20866j18032m35250l38682J85901M50464J62229j00092K5057N3834
$$ plain form
37251 -343975 -1538676 -2291218 -2048877 -1156378 -494001 -538363 -875523 -866287 -483619 -57590
37241 -57590 443652 1191414 1789462 1613256 846585 416832 796640 1516076 1914008 1710803
37231 1710803 828994 -555697 -1651903 -1567982 -476102 448228 512635 209508 161320
37222 161320 201462 -9818 -203600 26278 517048 908474 1258596 1685737 1791750 1103028
37212 1103028 -108080 -992197 -1049405 -550515 -140816 -251769 -768076 -1161792 -1126183 -985437
37202 -985437 -1083510 -975766 -16200 1275189 1499327 381955 -592934 -218443 748470
37193 748470 849372 60336 -459016 -224083 159854 227864 214866 373523 595307 775464
37183 775464 896330 778298 343048 4366 190267 640731 802960 702868 727925 781759
37173G81759l20653n44667k15154J57926J25745J08801M51051O21357K43633m0034
37163A369764K50232L59906l76294j045023m66548O80557P10824m27613j066499
37154a0694l93814M94539M73804p3140k14889R0754K50758O4238j45820p0812
37144D64924L21553Q25458J088347Q67913K65828m46132j087670j437183j164493
37135c01455l21554M07258M64373J60319J26801L47956L61300J16182q5478k61964
37125A013738o16368r19182p69682l03429P2429L97892Q28592R20322K46333n12912
37115C57733k68995P30330J077563K64646o48924p31184l59754k29390k59388
37106f7363j25866P926m2268j2253K19259K41773j36589m20430k56325n3517j96721
$$ plain form
37173 781759 461106 -83561 -298715 -140789 -15044 93757 544808 1166165 1409798 1369764
37163 1369764 1619996 1979902 1603608 558585 92037 772594 1483418 1055805 -10694
37154 -10694 -404508 90031 563835 490695 275806 366560 617318 681556 535736 464924
37144 464924 786477 1611935 2700282 3568195 3834023 3387891 2300221 863038 -301455
37135 -301455 -623009 -215751 248622 408941 535742 883698 1244998 1361180 1275702 1013738
37125 1013738 397370 -521812 -1291494 -1594923 -1522494 -1124602 -296010 624312 870645 357733
37115 357733 88738 819068 1896631 2161277 1512353 781169 421415 192025 -67363
37106 -67363 -193229 -185303 -227571 -239824 -20565 221208 84619 -335811 -592136 -645653 -842374
$$ [...]
##END NTUPLES=NMR SPECTRUM
##END=
