##TITLE=31Pdec_BAU-23PH
 CHCl3, 24 sc
 23.3.2020
##JCAMPDX= 6.0         $$ Bruker NMR JCAMP-DX V2.0
##DATA TYPE= NMR SPECTRUM
##DATA CLASS= NTUPLES
##ORIGIN= UXNMR, Bruker Analytische Messtechnik GmbH
##OWNER= root
$$ XWIN-NMR		Version 3.5
$$ Mon Mar 23 14:19:08 2020 Russian Standard Time (UT+4h)  she@DPX200
##.OBSERVE FREQUENCY= 81.013821
##.OBSERVE NUCLEUS= ^31P
##.ACQUISITION MODE= SIMULTANEOUS
##.ACQUISITION SCHEME= undefined
##.AVERAGES= 24
##.DIGITISER RES= 17
##SPECTROMETER/DATA SYSTEM= spect
##.PULSE SEQUENCE= zgpg30
##.SOLVENT NAME= DMSO
##.SHIFT REFERENCE= (INTERNAL, DMSO, 0, 182.463)
##AUDIT TRAIL= $$ (NUMBER, WHEN, WHO, WHERE, WHAT)
$$ ##TITLE= Audit trail, XWIN-NMR		Version 3.5
$$ ##JCAMPDX= 5.01
$$ ##ORIGIN= Bruker BioSpin GmbH
$$ ##OWNER= she
$$ F:/spectra/data/she/nmr/P31/1/pdata/1/auditp.txt
$$ ##AUDIT TRAIL=  $$ (NUMBER, WHEN, WHO, WHERE, WHAT)
(   1,<2020-03-23 14:17:29.53 +0400>,<she>,<DPX200>,
      <created by zg, POWCHK disabled, PULCHK disabled
       configuration hash MD5:
       00 E9 B6 7A A2 85 ED C7 34 08 36 98 17 FE 4E 26
       data hash MD5: 32K
       70 50 D4 46 95 5D DA A7 46 67 66 2C C5 99 2F 40>)
(   2,<2020-03-23 14:18:01.17 +0400>,<she>,<DPX200>,
      <Start of raw data processing
       efp BC_mod = 2 LB = 1 FT_mod = 6 PKNL = 1 PHC0 = -1328.113 PHC1 = 94.40169 SI = 64K 
       data hash MD5: 64K
       7E 0E B1 AB 44 D7 D3 11 6B AB 58 AB 11 31 6F 84>)
(   3,<2020-03-23 14:18:32.56 +0400>,<she>,<DPX200>,
      <pk PHC0 = 33.17768 PHC1 = -53.6 
       data hash MD5: 64K
       97 D0 A1 9F 33 A6 A5 47 D6 9B CC 1A 2D BC EF 4B>)
$$ ##END=
$$ 
$$ hash MD5
$$ 03 D9 B5 16 37 5A 32 FD 28 6D 3F E1 10 06 46 47
##$RELAX= 
##$RELAX= 
##$RELAX= 
##$RELAX= 
##$RELAX= 
##$RELAX= 
##$RELAX= 
##$RELAX= 
$$ Bruker specific parameters
$$ --------------------------
##$DU= <F:/spectra>
##$EXPNO= 1
##$NAME= <P31>
##$PROCNO= 1
##$TYPE= <nmr>
##$USER= <she>
##$AMP= (0..31)
100 100 100 100 100 100 100 100 100 100 100 100 100 100 100 100 100 100 
100 100 100 100 100 100 100 100 100 100 100 100 100 100 
##$AQSEQ= 0
##$AQ_mod= 1
##$AUNM= <au_zg>
##$AUTOPOS= <>
##$BF1= 81.014009
##$BF2= 200.13
##$BF3= 200.13
##$BF4= 200.13
##$BF5= 200.13
##$BF6= 200.13
##$BF7= 200.13
##$BF8= 200.13
##$BYTORDA= 1
##$CFDGTYP= 0
##$CFRGTYP= 5
##$CHEMSTR= <none>
##$CNST= (0..31)
1 1 145 1 1 1 1 1 1 1 1 1 1 1 1 1 1 1 1 1 1 1 1 1 1 1 1 1 1 1 1 1 
##$CPDPRG= <waltz16>
##$CPDPRG1= <>
##$CPDPRG2= <waltz16>
##$CPDPRG3= <>
##$CPDPRG4= <mlev>
##$CPDPRG5= <mlev>
##$CPDPRG6= <mlev>
##$CPDPRG7= <mlev>
##$CPDPRG8= <mlev>
##$CPDPRGB= <>
##$CPDPRGT= <>
##$D= (0..31)
0 1 0 0 0 0 0 0 0 0 0 0.03 2e-05 3e-06 0 0 0 0 0 0 0 0 0 0 0 0 0 0 0 0 
0 0 
##$DATE= 1584958648
##$DBL= (0..7)
120 120 120 11 120 120 24 19 
##$DBP= (0..7)
150 150 150 150 150 150 150 150 
##$DBP07= 0
##$DBPNAM0= <>
##$DBPNAM1= <>
##$DBPNAM2= <>
##$DBPNAM3= <>
##$DBPNAM4= <>
##$DBPNAM5= <>
##$DBPNAM6= <>
##$DBPNAM7= <>
##$DBPOAL= (0..7)
0.5 0.5 0.5 0.5 0.5 0.5 0.5 0.5 
##$DBPOFFS= (0..7)
0 0 0 0 0 0 0 0 
$$ [...]
##$SUBNAM2= <"">
##$SUBNAM3= <"">
##$SUBNAM4= <"">
##$SUBNAM5= <"">
##$SUBNAM6= <"">
##$SUBNAM7= <"">
##$SUBNAM8= <"">
##$SUBNAM9= <"">
##$SW= 369.568048894756
##$SWIBOX= (0..15)
0 1 3 0 0 0 0 0 0 0 0 0 0 0 0 0 
##$SW_h= 29940.119760479
##$TD= 32768
##$TD0= 1
##$TE= 0
##$TE2= 300
##$TE3= 300
##$TEG= 300
##$TL= (0..7)
0 120 53 12 22 120 120 120 
##$TP= (0..7)
150 150 150 150 150 150 150 150 
##$TP07= 0
##$TPNAME0= <>
##$TPNAME1= <>
##$TPNAME2= <>
##$TPNAME3= <>
##$TPNAME4= <>
##$TPNAME5= <>
##$TPNAME6= <>
##$TPNAME7= <>
##$TPOAL= (0..7)
0.5 0.5 0.5 0.5 0.5 0.5 0.5 0.5 
##$TPOFFS= (0..7)
0 0 0 0 0 0 0 0 
##$TUNHIN= 0
##$TUNHOUT= 0
##$TUNXOUT= 0
##$USERA1= <user>
##$USERA2= <user>
##$USERA3= <user>
##$USERA4= <user>
##$USERA5= <user>
##$V9= 5
##$VALIST= <valist>
##$VCLIST= <CCCCCCCCCCCCCCC>
##$VD= 0
##$VDLIST= <DDDDDDDDDDDDDDD>
##$VPLIST= <PPPPPPPPPPPPPPP>
##$VTLIST= <TTTTTTTTTTTTTTT>
##$WBST= 1024
##$WBSW= 4
##$XGAIN= (0..3)
0 0 0 0 
##$XL= 0
##$YL= 0
##$YMAX_a= 19122
##$YMIN_a= -17422
##$ZGOPTNS= <>
##$ZL1= 120
##$ZL2= 120
##$ZL3= 120
##$ZL4= 120
##$ABSF1= 0
##$ABSF2= 0
##$ABSG= 0
##$ABSL= 0
##$ALPHA= 0
##$AQORDER= 0
##$ASSFAC= 0
##$ASSFACI= 0
##$ASSFACX= 0
##$ASSWID= 0
##$AUNMP= <proc_1d>
##$AZFE= 0.1
##$AZFW= 0.5
##$BCFW= 0
##$BC_mod= 2
##$BYTORDP= 0
##$COROFFS= 0
##$CY= -3
##$DATMOD= 1
##$DC= 0
##$DFILT= <>
##$DTYPP= 0
##$F1P= 0
##$F2P= 0
##$FCOR= 1
##$FTSIZE= 65536
##$FT_mod= 6
##$GAMMA= 0
##$GB= 0
##$INTBC= 1
##$INTSCL= 5.30512e-09
##$ISEN= 30
##$LB= 1
##$LEV0= 0
##$LPBIN= 0
##$MAXI= 10000
##$MC2= 0
##$MEAN= 0
##$ME_mod= 0
##$MI= 50
##$NCOEF= 0
##$NC_proc= -6
##$NLEV= 6
##$NOISF1= 182.463
##$NOISF2= 159.3651
##$NSP= 0
##$NTH_PI= 0
##$NZP= 0
##$OFFSET= 182.463
##$PC= 4
##$PHC0= -1294.935
##$PHC1= 40.80169
##$PH_mod= 1
##$PKNL= yes
##$PPARMOD= 0
##$PSCAL= 0
##$PSIGN= 0
##$REVERSE= no
##$SF= 81.0140089999434
##$SI= 65536
##$SIGF1= 159.3651
##$SIGF2= -187.1042
##$SINO= 113.3802
##$SIOLD= 16384
##$SREGLST= <1H.CDCl3>
##$SSB= 0
##$STSI= 65536
##$STSR= 0
##$SW_p= 29940.119760479
##$SYMM= 0
##$S_DEV= 0
##$TDeff= 32768
##$TDoff= 0
##$TI= <>
##$TILT= no
##$TM1= 0
##$TM2= 0
##$TOPLEV= 0
##$USERP1= <user>
##$USERP2= <user>
##$USERP3= <user>
##$USERP4= <user>
##$USERP5= <user>
##$WDW= 1
##$XDIM= 65536
##$YMAX_p= 318446359
##$YMIN_p= -24581993
$$ End of Bruker specific parameters
$$ ---------------------------------
##NTUPLES= NMR SPECTRUM
##VAR_NAME=  FREQUENCY,     SPECTRUM/REAL,   SPECTRUM/IMAG
##SYMBOL=    X,             R,               I
##VAR_TYPE=  INDEPENDENT,   DEPENDENT,       DEPENDENT
##VAR_FORM=  AFFN,          ASDF,            ASDF
##VAR_DIM=   65536,         65536,           65536
##UNITS=     HZ,            ARBITRARY UNITS, ARBITRARY UNITS
##FACTOR=    0.456856943014862, 1,           1
##FIRST=     14782.0589164792, 0,            0
##LAST=      -15158.0608439998, 0,           0
##MIN=       -15158.0608439998, -24581993,   0
##MAX=       14782.0589164792, 318446359,    0
$$ Real data points
##PAGE= N=1
##DATA TABLE= (X++(R..R)), XYDATA
$$ [...]
$$ plain form
42675 3116660 4491254 5962885 6333208 5055588 3463115 3258633 4096435 4075191 2560030
42666 2560030 1018893 765888 1273838 1347532 816960 235295 -263028 -907320 -1628126
42657 -1628126 -2252591 -3006074 -4103850 -5083979 -5214546 -4465131 -3515069 -2840124 -2313240
42648 -2313240 -1775910 -1519100 -1896367 -2643964 -2871775 -1812612 473843 3165050 5334206
42639 5334206 6408497 6126579 4555674 2453091 1182616 1589766 2929874 3481415 2474703
42630 2474703 1032818 878093 2338058 4019540 4439981 3615516 2798968 2865953 3446128
42621 3446128 3760195 3710347 3556272 2951856 1313808 -833653 -1977905 -1517269 -606426
42612 -606426 -511019 -1010367 -1193649 -929361 -485273 520363 2432560 4318727 4871276
$$ packed form
42675C116660J374594J471631L70323j277620j592473k04482Q37802k1244j515161
42666B560030j541137k53005N07950P3694n30572n81665m98323o44292p20806
42657a628126o24465p53483j097776r80129j30567P49415R50062O74945N26884
42648b313240N37330K56810l77267p47597k27811J059163K286455K691207K169156
42639E334206J074291k81918j570905k102583j270475M07150J340108N51541j006712
42630B474703j441885j54725J459965J681482M20441q24465q16548O6985N80175
42621C446128L14067m9848j54075o04416j638048k147461j144252M60636R10843
42612f06426R5407m99348j83282K64288M44088J005636J912197J886167N52549
$$ plain form
42603 4871276 4326976 4041871 4255885 3851574 2480700 1276581 953052 754416 78886
42594 78886 -257591 580930 1913170 2533957 2367986 2013719 1425947 317016 -689718
42585 -689718 -678348 -19747 -90814 -1357798 -2786021 -3334233 -3094530 -2595482 -1785446 -365217
42575 -365217 1232328 1885576 970025 -816493 -2106095 -2238864 -1607169 -637973 801890
42566 801890 2446427 2894825 1098726 -1666696 -2775386 -1460110 294894 575826 -117060
42557 -117060 -246308 257509 209609 -752602 -1615457 -1373607 -112956 1176348 1371543
42548 1371543 186403 -1180126 -977821 944629 2633847 2357261 666707 -640452
42540 -640452 -741774 43795 1420893 3083638 4080923 3631179 2339086 1479532 1404692
$$ packed form
42603D871276n44300k85105K14014m04311j370874j204119l23529j98636o75530
42594G8886l36477Q38521J332240O20787j65971l54267n87772j108931j006734
42585f89718J1370O58601p1067j266984j428223n48212K39703M99048Q10036J420229
42575c65217J597545O53248r15551j786518j289602j32769O31695R69196J439863
42566H01890J644537M48398j796099k765422j108690J315276J755004K80932o92886
42557a17060j29248N03817m7900r62211q62855K41850J260651J289304J95195
42548A371543j185140j366529K02305J922450J689218k76586j690554j307159
42540f40452j01322P85569J377098J662745R97285m49744j292093q59554p4840
$$ plain form
42531 1404692 1694412 2282538 3088379 3084307 1384717 -940758 -1750342 -547053 1055923
42522 1055923 1477320 396394 -1865388 -4470399 -5678856 -4234383 -1350726 416165
42514 416165 412909 147850 266189 -348290 -1911852 -2747975 -2115245 -1670278 -2580818 -3357323
42504 -3357323 -2464682 -1198019 -1721903 -3690271 -5108345 -5398948 -5279262 -4599968 -2905319
42495 -2905319 -1517728 -2275027 -4220756 -4215964 -1307141 1896888 2960379 2566811 2646437
42486 2646437 3430228 3837555 3500702 2838945 1840403 211063 -1485952 -1990985 -839181
42477 -839181 931005 1832237 1510817 1065879 1601472 2565625 2202381 34206 -1963809
42468 -1963809 -1668981 303021 1356071 303836 -1499955 -2481972 -2646839 -2509569 -1801537
$$ packed form
42531A404692K89720N88126Q05841m072j699590k325475q09584J203289J602976
42522A055923M21397j080926k261782k605011j208457J444473K883657J766891
42514D16165l256k65059J18339o14479j563562q36123O32730M44967r10540p76505
42504c357323Q92641J266663n23884j968368j418074k90603J19686O79294J694649
42495b905319J387591p57299j945729M792K908823L204029J063491l93568P9626
42486B646437P83791M07327l36853o61757r98542j629340j697015n05033J151804
42477h39181J770186R01232l21420m44938N35593R64153l63244k168175j998015
42468a963809K94828J972002J053050j052235j803791r82017j64867J37270P08032
$$ plain form
42459 -1801537 -337736 877672 659794 -720408 -1849798 -1815634 -845521 336231 1105481
42450 1105481 1139946 642832 288369 591734 1436161 2316770 2724664 2276623 1027051
42441 1027051 -279089 -950443 -1390370 -2457359 -3678973 -3466898 -1705690 -639122 -1955785
42432 -1955785 -4174656 -4524956 -2654178 -707815 -121575 -207926 1835 301372 183448
42423 183448 -310935 -1231830 -2873948 -4541403 -4453887 -2019755 698659 1060180 -1056623
42414 -1056623 -3320240 -3826127 -2838819 -1716899 -1155924 -859600 -305760 602119 1403293
42405 1403293 1401028 288579 -1467419 -3006101 -3817316 -3973258 -3731892 -3161886 -2172526
42396 -2172526 -784513 636729 1493643 1567415 1472560 1970826 2679938 2207067 104595
$$ packed form
42459a801537J463801J215408k17878j380202j129390L4164R70113J181752P69250
42450A105481L4465m97114l54463L03365Q44427Q80609M07894m48041j249572
42441A027051j306140o71354m39927j066989j221614K12075J761208J066568j316663
42432a955785k218871l50300J870778J946363N86240q6351K09761K99537j17924
42423A83448m94383r20895j642118j667455Q7516K434132K718414L61521k116803
42414a056623k263617n05887R87308J121920N60975K96324N53840R07879Q01174
42405A403293k265j112449j755998j538682q11215j55942K41366N70006R89360
42396b172526J388013J421242Q56914P3772r4855M98266P09112m72871k102472
$$ plain form
42387 104595 -2029905 -2328871 -1032647 70750 316789 816957 2237105 3472137 3342251
42378 3342251 2368107 1749629 1521921 1013410 442400 581710 1184075 1247911 759762 659833
42368 659833 1001556 813168 171642 572198 2284445 3092551 1250845 -1593183 -2352114
42359 -2352114 -608818 1254854 1649824 1281430 922494 5404 -1667708 -2770932 -2389496
42350 -2389496 -1653944 -1915054 -2444739 -1692650 1632 937172 943669 1655077 3640491
42341 3640491 5194967 4782686 3169964 2110811 2084013 2463757 3010051 3881705 4674071
42332 4674071 4673008 3885472 2891022 1933149 1081004 933850 1959138 3240460 3189672 1689384
42322 1689384 284924 -61814 -44320 -240238 224802 1977306 3498724 2688663 -79390
$$ packed form
42387A04595k134500k98966J296224J103397K46039N00168J420148J235032j29886
42378C342251r74144o18478k27708n08511n71010J39310O02365O3836m88149r9929
42368F59833L41723j88388o41526M00556J712247Q08106j841706k844028p58931
42359b352114J743296J863672L94970l68394l58936r17090j673112j103224L81436
42350b389496P35552k61110n29685P52089J694282R35540O497P11408J985414
42341C640491J554476m12281j612722j059153k6798L79744N46294Q71654P92366
42332D674071j063p87536r94450r57873q52145j47154J025288J281322n0788j500288
42322A689384j404460l46738J7494j95918M65040J752504J521418q10061k768053
$$ plain form
42313 -79390 -2167982 -2013427 -724131 -14157 -81966 -367615 -1095408 -2699201 -4396803
42304 -4396803 -4801715 -3878909 -3054776 -3134466 -3169499 -1961484 90975 1470966 1523719
42295 1523719 1115940 1251320 1715951 1499695 217927 -1361896 -2167785 -1834728 -808581
42286 -808581 226124 805633 788524 308419 -365133 -1047823 -1660723 -1953197 -1467701 -121691
42276 -121691 1321739 1835562 1234080 288787 -316290 -616040 -745804 -351321 774678
42267 774678 1902740 2056811 1394828 1012315 1192236 807441 -900778 -2717600 -2696594
42258 -2696594 -758712 1075527 1216491 205462 -588342 -914678 -1323550 -1656852 -1199318
42249 -1199318 -120914 568853 638032 917311 1625912 1799773 1147514 1122537 2836754
$$ packed form
42313g9390k088592J54555J289296P09974o7809k85649p27793j603793j697602
42304d396803m04912R22806Q24133p9690l5033J208015K052459J379991N2753
42295A523719m07779J35380M64631k16256j281768j579823q05889L33057J026147
42286h08581J034705N79509j7109m80105o73552o82690o12900k92474M85496J346010
42276a21691J443430N13823o01482r45293o05077k99750j29764L94483J125999
42267G74678J128062J54071o61983l82513J79921l84795j708219j816822K1006
42258b696594J937882J834239J40964j011029p93804l26336m08872l33302M57534
42249a199318J078404O89767O9179K79279P08601J73861o52259k4977J714217
$$ plain form
42240 2836754 4866361 4774115 2423348 185591 -126255 923255 1803754 1842292 1203477
42231 1203477 279223 -287938 69107 936636 1194230 637855 364241 1022724 1772586
42222 1772586 1745514 1494896 1946929 2742845 2828814 2157862 1595957 1417311 1045398 290528
42212 290528 -89412 718038 2594293 4444678 5001848 4038131 2886421 3018916 3913352
42203 3913352 3520129 1407118 -135501 598826 1873884 990601 -1491587 -2622226 -1742662
42194 -1742662 -1407317 -3123919 -4879571 -4204977 -1594621 742206 1941694 2517877 2486938
42185 2486938 1415814 -98133 -674396 78613 1144501 1440762 713668 -784184 -2578977
42176 -2578977 -3808833 -3489914 -1332956 1807478 4334780 4929304 3652059 2083917
$$ packed form
42240B836754K029607r2246k350767k237757l11846J049510Q80499L8538o38815
42231A203477r24254n67161L57045Q67529K57594n56375k73614O58483P49862
42222A772586k7072k50618M52033P95916Q5969o70952n61905j78646l71913p54870
42212B90528l79940Q07450J876255J850385N57170r63717j151710J32495Q94436
42203C913352l93223k113011j542619P34327J275058q83283k482188j130639Q79564
42194a742662L35345j716602j755652O74594K610356K336827J199488N76183l0939
42185B486938j071124j513947n76263P53009J065888K96261p27094j497852j794793
42176b578977j229856L18919K156958L140434K527302N94524j277245j568142
$$ plain form
42168 2083917 1770447 2431254 2463563 1341587 428685 916373 2078404 2409416 1556614
42159 1556614 168615 -1284062 -2390539 -2281760 -607112 1433855 2367594 2402479 2754655
42150 2754655 3360773 2941880 1430992 573920 1442934 2779398 2799688 1633800 838327
42141 838327 1093237 1559378 1393336 896085 886819 1574834 2501621 3320415 4109940 4809799
42131 4809799 4800081 3553545 1612991 331803 431214 1233587 1506755 614792 -1291467
42122 -1291467 -3504725 -4809520 -4118774 -1783640 334010 856504 420947 466157 1165859
42113 1165859 1592131 1339936 733447 -172361 -1416438 -2224276 -1792717 -909318 -1147926
42104 -1147926 -2284252 -2280464 -370934 1603703 1866398 1091574 834118 907969 -18474
$$ packed form
42168B083917l13470O60807L2309j121976r12902M87688J162031L31012q52802
42159A556614j387999j452677j106477J08779J674648K040967R33739L4885L52176
42150B754655O06118m18893j510888q57072Q69014J336464K0290j165888p95473
42141H38327K54910M66141j66042m97251r266O88015R26787Q18794P89525O99859
42131D809799r718j246536j940554j281188R9411Q02373K73168q91963j906259
42122a291467k213258j304795O90746K335134K117650N22494m35557M5210O99702
42113A165859M26272k52195o06489r05808j244077q07838M31559Q83399k38608
42104a147926j136326L788J909530J974637K62695p74824k57456P3851r26443
$$ plain form
42095 -18474 -1970513 -3438630 -3380969 -2253642 -1183305 -994204 -1751978 -2477640 -1839743
42086 -1839743 -60308 571128 -1582252 -4800420 -5666191 -3284058 -138847 1377535
42078 1377535 1428642 1134907 441403 -1024299 -2270165 -1846191 62030 1852090 2565057
42069 2565057 2502248 1989080 907427 -320347 -544259 647742 2029557 1962483 135087
42060 135087 -2320849 -4049381 -4445614 -3846013 -3217474 -3400295 -4275687 -4866552 -4475129
42051 -4475129 -3385168 -2233914 -1257494 -619843 -862893 -2176505 -3544680 -3585351 -2240429
42042 -2240429 -801362 -196603 -104803 57518 170558 -136992 -789316 -1503472 -2159553
42033 -2159553 -2522035 -2209973 -1422046 -1061963 -1555452 -2126940 -1923429 -1302846 -1195064
$$ packed form
42095a8474j952039j468117N7661J127327J070337J89101p57774p25662O37897
42086a839743J779435O31436k153380l218168q65771K382133L145211J516382
42078A377535N1107k93735o93504j465702j245866M23974J908221J790060P12967
42069B565057o2809n13168j081653j227774k23912J192001J381815o7074j827396
42060A35087k455936j728532l96233N99601O28539j82821q75392n90865L91423
42051d475129J089961J151254R76420O37651k43050j313612j368175m0671J344922
42042b240429J439067O04759R1800J62321J13040l07550o52324p14156o56081
42033b159553l62482L12062P87927L60083m93489n71488K03511O20583J07782
$$ plain form
42024 -1195064 -1623341 -1789265 -1393251 -940334 -754200 -486132 288712 1537870 2820585
42015 2820585 3432802 2765979 1131772 -81109 138766 1058346 1170273 295604 -398739
42006 -398739 -442929 -785391 -2009948 -2978632 -2128485 429988 2841169 3370147 2025619
41997 2025619 457359 235812 1028755 867120 -1219588 -3440477 -3279792 -903734 1091756
41988 1091756 1359658 1278872 2101334 2631133 1214900 -1424938 -3162732 -3402146 -3244088
41979 -3244088 -3244697 -2822469 -1814850 -978411 -690410 -475224 -150358 -329760 -1406375 -2909963
41969 -2909963 -4146257 -4694257 -4184764 -2553149 -693407 200502 300643 1086299 3088831
41960 3088831 4771790 4513519 2837068 1578498 1392309 1294579 483098 -641489 -1487127
$$ packed form
42024a195064m28277j65924L96014M52917J86134K68068P74844J249158J282715
42015B820585O12217o66823j634207j212881K19875R19580J11927q74669o94343
42006c98739m4190l42462j224557r68684Q50147K558473K411181N28978j344528
41997B025619j568260k21547P92943j61635k086708k220889J60685K376058J995490
41988A091756K67902q0786Q22462N29799j416233k639838j737794k39414J58058
41979c244088o09M22228J007619Q36439K88001K15186L24866j79402j076615j503588
41969b909963j236294n48000N09493J631615J859742Q93909J00141P85656K002532
41960C088831J682959k58271j676451j258570j86189r7730q11481j124587q45638
$$ plain form
41951 -1487127 -2170338 -2784818 -2627205 -1124516 849328 1665666 1033652 398288 839613
41942 839613 1563493 1351505 689675 1039565 2283610 2601409 1288977 59768 541055
41933 541055 1850566 2138725 1547176 1729229 2795140 2837506 979325 -862052 -332026
41924 -332026 2307879 4628622 4989960 4022856 3313093 3430735 3528667 2636129 1085282
41915 1085282 307667 965787 1805246 1221841 -308644 -676447 750512 1943797 1032592
41906 1032592 -966742 -1630791 -483391 818563 1255788 1492185 1932081 1656375 264486
41897 264486 -724475 225865 2221533 2936988 1688536 8649 -793912 -1071647 -1418231
41888 -1418231 -1319855 -232156 1052402 1384940 1021219 1121707 1814715 2134845 1884490
$$ packed form
41951a487127o83211o14480J57613J502689J973844Q16338o32014o35364M41325
41942H39613P23880k11988o61830L49890J244045L17799j312432j229209M81287
41933E41055J309511K88159n91549J82053J065911M2366j858181j841377N30026
41924c32026K639905K320743L61338r67104p09763J17642R7932q92538j550847
41915A085282p77615O58120Q39459n83405j530485l67803J426959J193285r11205
41906A032592j999334o64049J147400J301954M37225K36397M39896k75706j391889
41897B64486r88961R50340J995668P15455j248452j679887q02561k77735l46584
41888a418231R8376J087699J284558L32538l63721J00488O93008L20130k50355
$$ plain form
41879 1884490 2070020 2995568 3276785 1726053 -709583 -2050372 -1805328 -1247395 -1401506
41870 -1401506 -1889101 -1866189 -1139075 -48608 996805 1513593 1112449 132514 -370915
41861 -370915 227051 1289344 1696061 1233751 697392 675329 785542 347141 -563482 -1149227
41851 -1149227 -932917 -408946 -536177 -1809784 -3934071 -6077181 -7177334 -6388066 -3852168
41842 -3852168 -982498 627835 708209 314445 384330 899667 1470077 1897604 1924344 1307460
41832 1307460 549631 623839 1408007 1420259 -48724 -1592309 -1655594 -862112 -776111 -1087202
41822 -1087202 -96812 2136176 3343827 2252672 268891 -903661 -1503976 -2318302 -2694038
41813 -2694038 -1753825 -521978 -790329 -2265192 -2810661 -1644965 -495845 -976512 -2272729
$$ packed form
41879A884490J85530R25548K81217j550732k435636j340789K45044N57933j54111
41870a401506m87595K2912P27114J090467J045413N16788m01144r79935n03429
41861c70915N97966J062293M06717m62310n36359k2063J10213m38401r10623n85745
41851a149227K16310N23971j27231j273607k124287k143110j100153P89268K535898
41842c852168K869670J610333Q0374l93764O9885N15337N70410M27527K6740o16884
41832A307460p57829P4208P84168J2252j468983j543585o3285P93482Q6001l11091
41822a087202R90390K232988J207651j091155j983781j172552o00315q14326l75736
41813b694038R40213J231847k68351j474863n45469J165696J149120m80667j296217
$$ plain form
41804 -2272729 -2416570 -921093 916165 1853088 1869439 1628203 1564130 1628254 1447564 628977
41794 628977 -741742 -1854107 -1798428 -559959 917007 1762878 1942357 1856125 1651794
41785 1651794 1288134 889337 533165 -11809 -754559 -986791 -126672 1092117 1275393
41776 1275393 319516 -372224 34559 677390 610726 390701 967338 1889098 1937157 1008432
41766 1008432 41802 -570828 -1144904 -1491764 -985298 104862 690873 496064 414708
41757 414708 1026342 1918858 2719940 3589234 4378666 4520475 4089028 3710129 3091445 1170705
41747 1170705 -1671286 -3194106 -2107598 171949 1737279 2644715 3609604 3733408 1830627
41738 1830627 -677142 -697586 2434893 5750718 6148437 3662870 630019 -1116678 -1389875
$$ packed form
41804b272729j43841J495477J837258R36923J6351k41236o4073O4124j80690q18587
41794F28977j370719j112365N5679J238469J476966Q45871J79479q6232k04331
41785A651794l63660l98797l56172n44974p42750k32232Q60119J218789J83276
41776A275393r55877o91740M06783O42831o6664k20025N76637R21760M8059r28725
41766A008432r66630o12630n74076l46860N06466J090160N86011j94809q1356
41757D14708O11634Q92516Q01082Q69294P89432J41809m31447l78899o18684j920740
41747A170705k841991j522820J086508K279547J565330R07436R64889J23804j902781
41738A830627k507769k0444L132479L315825L97719k485567l032851j746697k73197
$$ plain form
41729 -1389875 -961852 -731857 -1173996 -1911291 -2009861 -1054853 324181 1263951 1646727
41720 1646727 1910455 2185638 2124102 1535175 714177 -65019 -1035635 -2483412 -3925483
41711 -3925483 -4340066 -3421758 -2031159 -1005366 -166811 851410 1567553 1564470 1800553
41702 1800553 3361288 5105480 4551423 1566006 -797948 -182849 2008570 2754264 1270077
41693 1270077 -748932 -1656504 -1079718 519224 1951305 1657135 -529219 -2525676 -2298485
41684 -2298485 -398017 1171641 1811617 2388057 3161775 3595622 3782410 4127906 3973853
41675 3973853 2553010 983393 1059022 2214665 2203983 958797 1035327 3504526 6057423
41666 6057423 6406078 5204746 4129890 3225502 1939292 984712 1185044 1768629 1611002
$$ packed form
41729a389875M28023K29995m42139p37295r8570R55008J379034R39770L82776
41720A646727K63728K75183o1536n88927q20998p79196r70616j447777j442071
41711c925483m14583R18308J390599J025793Q38555J018221P16143l083K36083
41702A800553J560735J744192n54057k985417k363954O15099K191419P45694j484187
41693A270077k019009r07572N76786J598942J432081k94170k186354j996457K27191
41684b298485J900468J569658O39976N76440P73718M33847J86788L45496j54053
41675C973853j420843j569617P5629J155643j0682j245186P6530K469199K552897
41666F057423L48655j201332j074856r04388j286210r54580K00332N83585j57627
$$ plain form
41657 1611002 1052351 870418 664719 -21442 -212533 907710 2034107 1584683 626072
41648 626072 1461561 3758722 4770209 3561779 2386019 3030117 4077275 3211238 675316
41639 675316 -1188319 -1082670 -38349 283982 -382890 -834041 -56014 1299050 1519457
41630 1519457 107361 -1285476 -969605 427551 982388 379443 82833 588133 471940
41621 471940 -1067380 -2484888 -2032105 -377422 448791 -65626 -663642 -507112 -31758
41612 -31758 284465 469991 182001 -1197377 -2990863 -3138186 -755787 2142989 2746449
41603 2746449 776941 -1511352 -2407164 -2420208 -2702284 -3213481 -3297962 -3146982 -3564158
41594 -3564158 -4565816 -5098057 -4173776 -1850443 770718 2217403 1765393 367041 -90224
$$ packed form
41657A611002n58651j81933k05699o86161j91091J120243J126397m49424r58611
41648F26072Q35489K297161J011487j208430j175760O44098J047158q66037k535922
41639F75316j863635J05649J044321L22331o66872m51151P78027J355064K20407
41630A519457j412096j392837L15871J397156N54837o02945k96610N05300j16193
41621D71940j539320j417508M52783J654683Q26213n14417n98016J56530M75354
41612c1758L16223J85526k87990j379378j793486j47323K382399K898776O03460
41603B746449j969508k288293q95812j3044k82076n11197q4481J50980m17176
41594c564158j001658n32241R24281K323333K621161J446685m52010j398352m57265
$$ plain form
41585 -90224 884220 1462918 -83529 -2701816 -3783414 -2795227 -1882485 -2569684 -3679052
41576 -3679052 -3372385 -1713822 -9806 1211464 2221361 2947463 3140260 3070995 2845901
41567 2845901 1633710 -1084916 -3963150 -4919785 -3618967 -1521407 276135 1753979
41559 1753979 2620892 2009343 -10949 -2088552 -3420504 -4640261 -6091159 -6455719 -4320692
41550 -4320692 -409276 2922313 4155621 3762179 3165319 3305951 4053505 4404268 3435918
41541 3435918 1584920 641070 1769871 3804952 4376325 2701441 371772 -778109
41533 -778109 -636805 -181509 249989 1096527 2308642 2970416 2452472 1332195 768590
41524 768590 1232778 2143066 2617360 2424623 2282957 3172258 5062523 6415894 5581162
$$ packed form
41585i0224R74444N78698j546447k618287j081598R88187R12742o87199j109368
41576c679052L06667J658563J704016J221270J009897P26102J92797o9265k25094
41567B845901j212191k718626k878234r56635J300818K097560J797542J477844
41559A753979Q66913o11549k020292k077603j331952j219757j450898l64560K135027
41550d320692L911416L331589J233308l93442n96860J40632P47554L50763r68350
41541C435918j850998r43850J128801K035081N71373j674884k329669j149881
41533g78109J41304M55296M31498Q46538J212115O61774n17944j120277n63605
41524G68590M64188R10288M74294j92737j41666Q89301J890265J353371q34732
$$ plain form
41515 5581162 2892010 656996 530024 1552724 1610152 251410 -1096209 -1451659 -1427025
41506 -1427025 -1847952 -2550570 -3105798 -3582305 -3812855 -2943482 -786184 1121426 1042946
41497 1042946 -701486 -2113700 -2011249 -1129670 -741467 -1155769 -1817513 -2105175 -1672484
41488 -1672484 -551701 703969 1291153 849381 -225523 -1181394 -1451517 -883242 267585
41479 267585 1508745 2411627 2731667 2270326 947171 -813225 -2091019 -2166300 -1080370
41470 -1080370 500638 1617614 1320749 -526380 -2481655 -2519314 -451988 1460319 1204237
41461 1204237 -368023 -715058 1032286 3117566 3501124 2039466 138099 -853856 -540316
41452 -540316 589215 1661151 2034844 1632119 783799 33263 12225 821845 1369472
$$ packed form
41515E581162k689152k235014j26972J022700N7428j358742j347619l55450K4634
41506a427025m20927p02618n55228m76507k30550Q69373K157298J907610p8480
41497A042946j744432j412214J02451Q81579L88203m14302o61744k87662M32691
41488a672484J120783J255670N87184m41772j074904r55871k70123N68275J150827
41479B67585J241160R02882L20040m61341j323155j760396j277794p5281J085930
41470a080370J581008J116976k96865j847129j955275l7659K067326J912307k56082
41461A204237j572260l47035J747344K085280L83558j461658j901367r91955L13540
41452e40316J129531J071936L73693m02725q48320p50536k1038Q09620N47627
$$ plain form
41443 1369472 244319 -2285289 -4167632 -4147309 -3307677 -3070160 -2985531 -2076502 -1192399
41434 -1192399 -1833186 -3217288 -2951728 -700766 1117530 855918 -168898 116696 1814477
41425 1814477 3550333 4387578 4256106 3500291 2846472 2968038 3471995 3198299 1950657
41416 1950657 842041 485459 161538 -552337 -743227 214016 1203067 793511 -716698
41407 -716698 -1870592 -2013833 -1568161 -860838 176140 1311924 1906016 1568450 590237
41398 590237 -175498 110711 1317071 2086159 1401518 297814 753048 2772981 4129432
41389 4129432 3462032 1984223 1303600 1241647 1021970 1026529 1702363 1916373 340000 -2082061
41379 -2082061 -2802321 -737994 2558829 4735148 4764866 3435442 2398431 2506519 2788640
$$ packed form
41443A369472j125153k529608j882343K0323Q39632K37517Q4629R09029Q84103
41434a192399o40787j384102K65560K250962J818296k61612j024816K85594J697781
41425A814477J735856Q37245j31472p55815o53819J21566N03957k73696j247642
41416A950657j108616l56582l23921p13875j90890R57243R89051m09556j510209
41407g16698j153894j43241M45672P07323J036978J135784N94092l37566r78213
41398E90237p65735K86209J206360P69088o84641j103704M55234K019933J356451
41389D129432o67400j477809o80623o1953k19677M559O75834K14010j576373k422061
41379b082061p20260K064327L296823K176319K9718j329424j037011J08088K82121
$$ plain form
41370 2788640 1679108 -632446 -2279223 -2453969 -2414110 -3010884 -3106452 -1735733 -3692
41361 -3692 841479 1474176 2634250 2908383 880982 -1794078 -2239448 -451692 1128892
41352 1128892 1441872 1385876 1131338 -28184 -1236210 -651036 1195229 1648924 131405
41343 131405 -930774 -240263 371829 -545764 -1453781 -662583 579877 67271 -1984069
41334 -1984069 -3612002 -3889246 -3207238 -1924872 -463508 205186 -278951 -892357 -935782
41325 -935782 -1385196 -3015701 -4348304 -3403382 -759605 1126763 1304606 1118146 1623319
41316 1623319 2047192 1375816 143801 -240265 614203 1573399 1378090 251923 -225811
41307 -225811 968462 2950806 4049859 3802430 2894270 1631077 -29653 -1180194 -672731
$$ packed form
41370B788640j109532k311554j646777j74746L9859n96774r5568J370719J732041
41361c692Q45171O32697J160074K74133k027401k675060m45370J787756J580584
41352A128892L12980n5996k54538j159522j208026N85174J846265M53695j517519
41343A31405j062179O90511O12092r17593r08017P91198J242460n12606k051340
41334a984069j627933k77244O82008J282366J461364O68694m84137o13406m3425
41325i35782m49414j630505j332603R44922K643777J886368J77843j86460N05173
41316A623319M23873o71376j232015l84066Q54468R59196j95309j126167m77734
41307b25811J194273J982344J099053k47429r08160j263193j660730j150541N07463
$$ plain form
41298 -672731 608612 317497 -1788412 -3023742 -1670736 457730 970533 400167 648363
41289 648363 1600660 1787181 1313744 1558439 2531266 2931093 2526314 2265923 2212081 1534302
41279 1534302 553310 682522 2107873 3408715 3760918 3776020 3885804 3611701 2821928
41270 2821928 2168051 1918980 1754276 1845967 2612343 3338849 2810137 1479010 1072250
41261 1072250 1737208 1747689 661040 403816 2020816 3549738 2863397 891321 47580
41252 47580 724006 1392071 1361941 1403842 1950532 2432865 2394176 1959251 1266851 539113
41242 539113 515762 1681841 3185895 3596076 2672892 1469704 852345 888132 1450431
41233 1450431 2244640 2318388 850685 -1357638 -2380310 -1514876 -18331 935840 1762452
$$ packed form
41298f72731J281343k91115k105909j235330J353006K128466N12803n70366K48196
41289F48363R52297J86521m73437K44695R72827L99827m04779k60391n3842o77779
41279A534302r80992J29212J425351J300842L52203J5102J09784k74103p89773
41270B821928o53877k49071j64704R1691P66376P26506n28712j331127m06760
41261A072250O64958J0481j086649k57224J617000J528922o86341j972076q43741
41252D7580O76426O68065l0130M1901N46690M82333l8689m34925o92400p27738
41242E39113k3351J166079J504054M10181r23184j203188o17359L5787N62299
41233A450431P94209P3748j467703k208323j022672Q65434J496545R54171Q26612
$$ plain form
41224 1762452 3060582 3894849 2995387 1157672 708021 2292373 3723171 2917803 823164
41215 823164 3211 937563 1558499 691257 96337 1940823 5537761 8183945 8516108
41206 8516108 7341185 5554881 3274918 1272746 1160073 3073488 4678931 3794651
41198 3794651 1023362 -1377347 -2304940 -2230166 -1691666 -959790 -736602 -1572734 -2661696
41189 -2661696 -2636933 -1623647 -1162351 -1950411 -3007013 -3382883 -3324234 -3165305 -2372211
41180 -2372211 -628941 1071892 1482793 709542 -100736 -253776 70279 476019 652946
41171 652946 350038 -187131 -69389 1119378 2323239 2093243 583296 -551284 -365611
41162 -365611 334615 560490 679636 1538961 2756879 2986217 1719533 -67532 -1128049
$$ packed form
41224A762452J298130Q34267q99462j837715m49651J584352J430798q05368k094639
41215H23164q19953R34352O20936q67242n94920J844486L596938K646184L32163
41206H516108j174923j786304k279963k002172j12673J913415J605443q84280
41198C794651k771289k400709r27593P4774N38500P31876K23188q36132j088962
41189b661696K4763J013286M61296p88060j056602l75870N8649J58929P93094
41180b372211J743270J700833M10901p73251q10278j53040L24055M05740J76927
41171F52946l02908n37169J17742J188767J203861k29996j509947j134580J85673
41162c65611P00226K25875J19146Q59325J217918K29338j266684j787065j060517
$$ plain form
41153 -1128049 -1054604 -65679 1506924 3058070 3626804 2691141 936736 -292093 -368673
41144 -368673 137198 434998 640147 1650743 3924375 6545819 7702958 6294241 3149084
41135 3149084 506957 83941 1602935 3226596 3338046 1896975 308480 143155 1742745
41126 1742745 3760317 4218404 2406543 -304656 -1883775 -1786362 -1182881 -1061219 -913219
41117 -913219 180379 1809545 2544375 1891947 991888 1005538 1553052 1416676 382867
41108 382867 -430067 -50002 1274698 2657493 3534453 3619096 2530300 271237 -2138309
41099 -2138309 -3352186 -3147025 -2512480 -2132101 -1569865 -447503 358362 -297619 -1909551
41090 -1909551 -2502069 -1040268 1177812 2117074 1431131 533300 517391 946964 936375
$$ packed form
41153a128049P3445R88925J572603J551146N68734r35663j754405j228829p6580
41144c68673N05871K97800K05149J010596K273632K621444J157139j408717l145157
41135C149084k642127m23016J518994J623661J11450j441071j588495j65325J599590
41126A742745K017572M58087j811861k711199j579119R7413O03481J21662J48000
41117i13219J093598J629166P34830o52428r00059J3650N47514j36376j033809
41108C82867q12934L80065J324700J382795Q76960Q4643j088796k259063k409546
41099b138309j213877K05161O34545L80379N62236J122362Q05865o55981j611932
41090a909551n92518J461801K218080R39262o85943q97831j5909M29573j0589
$$ plain form
41081 936375 589945 657610 1189855 1408923 881994 -4255 -882509 -1798261 -2347151 -1475463
41071 -1475463 857150 2596499 1617712 -1388242 -3503296 -3183637 -1848615 -1491325 -2164161
41062 -2164161 -2611385 -2121022 -751222 1194940 2830659 2856814 1335069 347204 1443506
41053 1443506 3288218 3514638 2177012 1342367 1684107 1784408 896682 53424 -128943
41044 -128943 -517289 -1422897 -1603095 -585816 -83817 -1419001 -3084237 -2800876 -900741
41035 -900741 340984 19544 -741518 -1051264 -1217203 -1453544 -1355268 -933442 -798983 -1044120
41025 -1044120 -1097994 -845983 -748545 -754250 -360027 33245 -809684 -2992851 -4754566 -4433158
41015 -4433158 -2376152 -309991 494061 -50646 -1212122 -1969063 -1731192 -984933 -765848
$$ packed form
41081I36375l46430O7665N32245K19068n26929q86249q78254r15752n48890Q71688
41071a475463K332613J739349r78787l005954k115054L19659J335022L57290o72836
41062b164161m47224M90363J369800J946162J635719K6155j521745r87865J096302
41053A443506J844712K26420j337626q34645L41740J00301q87726q43258j82367
41044a28943l88346r05608j80198J017279N01999j335184j665236K83361J900135
41035i00741J241725l21440p61062l09746j65939k36341R8276M21826J34459k45137
41025a044120n3874K52011R7438n705L94223L93272q42929k183167j761715L21408
41015d433158K057006K066161Q04052n44707j161476p56941K37871P46259K19085
$$ plain form
41006 -765848 -1301194 -1841652 -1947898 -1931547 -1687020 -354648 2012129 3592297 2908142
40997 2908142 1088650 592896 1957273 3229846 2749898 1199795 381368 878150 1660597
40988 1660597 1593423 718548 55693 364389 1178182 1232401 16046 -1400188 -1536962
40979 -1536962 -327019 802164 607704 -805249 -2488428 -3581295 -3543620 -2256354 -441299
40970 -441299 555916 82065 -931949 -929972 510998 2257950 2826304 1695586 -338603
40961 -338603 -1728674 -1355808 325245 1503711 927053 -599959 -1287828 -682028 85166
40952 85166 327968 753035 1810057 2362593 1156303 -1141067 -2622181 -2467889 -1419487
40943 -1419487 -247286 909738 1740376 1735763 1246599 1233370 1525274 701432 -1565728
$$ packed form
41006g65848n35346n40458j06246J6351K44527J332372K366777J580168o84155
40997B908142j819492m95754J364377J272573m79948j550103q18427M96782P82447
40988A660597o7174q74875o62855L08696Q13793N4219j216355j416234j36774
40979a536962J209943J129183j94460j412953j683179j092867L7675J287266J815055
40970d41299R97215m73851j014014J977J440970J746952N68354j130718k034189
40961c38603j390071L72866J681053J178466n76658j527012o87869O05800P67194
40952H5166K42802M25067J057022N52536j206290k297370j481114J54292J048402
40943a419487J172201J157024Q30638m613m89164j3229K91904q23842k267160
$$ plain form
40934 -1565728 -3393076 -3024208 -1206258 88441 469467 1115227 2454068 3528904 3654157
40925 3654157 3236845 2772703 2343371 2338533 3314913 4716566 5095748 4239949 3705004 4295973
40915 4295973 4404725 2364848 -544510 -1431582 147009 1512328 697375 -913061 -901481
40906 -901481 642612 1575322 1009317 314677 723089 1643035 2069156 2260416 2800891
40897 2800891 2950872 1532188 -846553 -2073301 -1311021 -94718 -44147 -673326 -401810
40888 -401810 1109171 2705824 3375179 3197145 2907123 3195456 4145656 4822470 3945050
40879 3945050 1630601 -223825 -212818 658321 540388 -464420 -698264 236102 930824
40870 930824 510621 -346962 -1052283 -1848087 -2310162 -1139884 1438334 2970986 1999268
$$ packed form
40934a565728j827348L68868J817950J294699L81026O45760J338841J074836J25253
40925C654157m17312m64142m29332m838R76380J401653L79182q55799n34945N90969
40915D295973J08752k039877k909358q87072J578591J365319q14953j610436J1580
40906i01481J544093R32710n66005o94640M08412R19946M26121J91260N40475
40897B800891J49981j418684k378741j226748P62280J216303N0571o29179K71516
40888d01810J510981J596653O69355j78034k90022K88333R50200O76814q77420
40879C945050k314449j854426J1007Q71139j17933j004808k33844R34366O94722
40870I30824m20203q57583p05321p95804m62075J170278K578218J532652r71718
$$ plain form
40861 1999268 337527 273612 960964 -7397 -2369131 -3341036 -1918239 -278860 -190870
40852 -190870 -451906 677038 2323516 2225758 220782 -1375499 -824613 1019756 2139532
40843 2139532 1865524 1322511 1714266 2792093 3236778 2266320 391076 -1480230 -3082265
40834 -3082265 -4481733 -5240735 -4725786 -3127840 -1389807 -104194 778131 1148580 595363
40825 595363 -678926 -1721739 -2114282 -2583230 -3672214 -4514340 -3847712 -1893393 -276153
40816 -276153 -66730 -640393 -679884 195369 1116533 1083099 129471 -720041 -619952 216312
40806 216312 1024002 1560690 2090904 2469766 2156499 1368069 1253405 2317263 3491656
40797 3491656 3584409 2927441 2531372 2186459 824944 -1340314 -2564945 -1933467 -741843
$$ packed form
40861A999268j661741o3915O87352r68361k361734r71905J422797J639379Q7990
40852a90870k61036J128944J646478r7758k004976j596281N50886J844369J119776
40843B139532k74008n43013L91755J077827M44685r70458j875244j871306j602035
40834c082265j399468p59002N14949J597946J738033J285613Q82325L70449n53217
40825E95363j274289j042813l92543m68948j088984q42126O66628J954319J617240
40816b76153K09423n73663l9491Q75253R21164l3434r53628q49512J00089Q36264
40806B16312Q07690N36688N30214L78862l13267p88430j14664J063858J174393
40797C491656R2753o56968l96069l44913j361515k165258j224631O31478J191624
$$ plain form
40788 -741843 -719609 -1727728 -2186568 -1342692 -160360 -10257 -1179650 -2830519 -3988489
40779 -3988489 -4329836 -4127977 -3622598 -2665966 -1178431 268721 834749 413113 -245733
40770 -245733 -511599 -422820 -157678 257232 362958 -695369 -2786530 -4187297 -3393270
40761 -3393270 -1103934 635432 909942 379673 -430121 -1686805 -2902089 -2723811 -918587
40752 -918587 777572 899239 266093 442786 1082036 552669 -1092942 -1698483 -69776
40743 -69776 2022331 1912065 -677744 -3385122 -3903743 -2171049 17635 954309 429425
40734 429425 -475670 -718730 -255822 334365 799331 1303908 1734996 1601826 806719 -48041
40724 -48041 -391213 -248187 142989 674483 949860 216917 -1554316 -3023691 -2865716
$$ packed form
40788g41843K2234j008119m58840Q43876J182332J50103j169393j650869j157970
40779c988489l41347K01859N05379R56632J487535J447152N66028m21636o58846
40770b45733k65866Q8779K65142M14910J05726j058327k091161j400767P94027
40761c393270K289336J739366K74510n30269q09794j256684j215284J78278J805224
40752i18587J696159J21667o33146J76693O39250n29367j645611o05541J628707
40743f9776K092107j10266k589809k707378n18621J732694K188684R36674n24884
40734D29425r05095k43060M62908N90187M64966N04577M31088j33170p95107q54760
40724d8041l43172J43026L91176N31494K75377p32943j771233j469375J57975
$$ plain form
40715 -2865716 -1629224 -1210349 -2356960 -3709747 -3758202 -2775683 -1935034 -1210393 499955
40706 499955 3196807 5117078 4935925 3651475 3199780 3715828 3468609 1524707 -831844
40697 -831844 -1862841 -1490763 -804718 -264229 458423 1232308 1317422 590561 -50837 142851
40687 142851 842862 1169384 672913 -387711 -1335174 -1605643 -1429345 -1836243 -3333846
40678 -3333846 -4784571 -4584985 -2951094 -1818311 -2166392 -2746875 -2134881 -790193 -32998
40669 -32998 20202 209641 687014 840701 499918 20674 -543614 -1190651 -1145935 419310
40659 419310 2871159 4533126 4726738 4273171 3871461 3209990 1989455 649561 -388621
40650 -388621 -1182988 -1544592 -939489 308732 806095 -105949 -1216443 -1002408 397311
$$ packed form
40715b865716J236492M18875j146611j352787m8455R82519Q40649P24641J710348
40706D99955K696852J920271j81153j284450m51695N16048k47219j943902k356551
40697h31844j030997L72078O86045N40489P22652P73885Q5114p26861o41398J93688
40687A42851P00011L26522m96471j060624r47463k70469J76298m06898j497603
40678c333846j450725J99586J633891J132783l48081n80483O11994J344688P57195
40669c2998N3200J89439M77373J53687l40783m79244n64288o47037M4716J565245
40659D19310K451849J661967J93612m53567m01710o61471j220535j339894j038182
40650c88621p94367l61604O05103J248221M97363r12044j110494K14035J399719
$$ plain form
40641 397311 1646821 2013838 1784048 1423066 1298587 1818739 2863740 3386565 2544660
40632 2544660 995876 122787 194569 318778 14254 -389722 -899839 -1969355 -3075387
40623 -3075387 -2660999 -454920 1321781 484534 -1974207 -2879341 -1090860 792788 -242949
40614 -242949 -3629986 -5844488 -4790615 -2192745 -1064180 -1860622 -2407063 -1299239 205266
40605 205266 291920 -704675 -996352 -86046 776150 886531 1214235 2566673 3973559
40596 3973559 4047562 3052364 2249928 1745633 599734 -978094 -1300605 305905 2153076
40587 2153076 2405343 1550338 1328177 1979569 2207034 1589701 1219900 1595359 1589105 435993
40577 435993 -629371 -46896 1660000 2661215 2549136 2700434 3902065 5147953 5280378
$$ packed form
40641C97311J249510L67017k29790l60982j24479N20152J045001N22825q41905
40632B544660j548784q73089P1782J24209l04524m03976n10117j069516j106032
40623c075387M14388K206079J776701q37247k458741r05134J788481J883648j035737
40614b42949l387037k214502J053873K597870J128565p96442n46441J107824J504505
40605B05266Q6654r96595k91677R10306Q62196J10381L27704J352438J406886
40596C973559P4003r95198q02436n04295j145899j577828l22511J606510J847171
40587B153076K52267q55005k22161O51392K27465o17333l69801L75459o254j153112
40577D35993j065364N82475J706896J001215j12079J51298J201631J245888J32425
$$ plain form
40568 5280378 4578664 3965656 3581224 3051279 2556308 2683845 3465828 4277462 4539502
40559 4539502 4023272 2771902 1304429 567179 954229 1588097 1348097 475910 269126
40550 269126 1127390 1860023 1316800 -40166 -708563 177311 2114460 3734983 3764561
40541 3764561 2051486 29144 -436619 859264 2125352 1879008 828561 578340 1208602
40532 1208602 1505771 1214278 1379953 2260791 2583234 1645463 757542 1439500 3168211
40523 3168211 4173092 3818558 2961412 2429984 2424247 3085364 4288530 4976307 4074771
40514 4074771 2166116 926217 754827 460205 -316369 -87834 2061504 4535453 5209298
40505 5209298 4374536 3997169 4531251 4303777 2236311 -431033 -1844478 -1864620 -1722957
$$ packed form
40568E280378p01714o13008l84432n29945m94971J27537P81983Q11634K62040
40559D539502n16230j251370j467473p37250L87050O33868k40000q72187k06784
40550B69126Q58264P32633n43223j356966o68397Q85874J937149J620523K9578
40541C764561j713075k022342m65763J295883J266088k46344j050447k50221O30262
40532A208602K97169k91493J65675Q80838L22443r37771q87921O81958J728711
40523C168211J004881l54534q57146n31428n737O61117J203166O87777r01536
40514D074771j908655j239899j71390k94622p76574K28535K149338K473949O73845
40505E209298q34762l77367N34082k27474k067466k667344j413445k0142J41663
$$ plain form
40496 -1722957 -1895816 -1396091 594471 3053437 3822256 2126689 -213753 -751730 703992
40487 703992 2083515 1901444 903382 423509 358235 -214328 -1315914 -2196657 -2579133
40478 -2579133 -2532665 -1572770 740850 3494447 5028192 4867819 3930476 2912033 1718193
40469 1718193 436124 -557336 -1593696 -3314260 -4932353 -4493934 -1614743 1441136
40461 1441136 2378222 1441716 441927 338630 945448 2026739 3210648 3390304 1771350
40452 1771350 -540798 -1307353 220604 2359114 2987805 1825583 374244 68169 930746
40443 930746 1965843 2484535 2675546 2840168 2639928 1705285 635345 448848 1005463
40434 1005463 936462 -526090 -2446425 -3300694 -2543554 -771160 972126 1737574 1234960
$$ packed form
40496a722957j72859M99725J990562K458966P68819j695567k340442n37977J455722
40487G03992J379523j82071r98062m79873o5274n72563j101586q80743l82476
40478b579133M6468R59895K313620K753597J533745j60373r37343j018443j193840
40469A718193j282069r93460j036360j720564j618093M38419K879191L055879
40461A441136R37086r36506r99789j03297O06818J081291J183909J79656j618954
40452A771350k312148p66555J527957K138510O28691j162222j451339l06075Q62577
40443I30746J035097N18692J91011J64622k00240r34643j069940j86497N56615
40434A005463o9001j462552j920335q54269P57140J772394J743286P65448n02614
$$ plain form
40425 1234960 195979 -393953 -485851 -650474 -788730 -427969 -210570 -1315116 -3041904
40416 -3041904 -2982484 -466894 2136556 2785127 2441800 2788189 3251925 2526391 1428437
40407 1428437 1642587 2750822 3182537 3224446 4207384 5322585 4461379 2166740 1433039
40398 1433039 3006074 4074308 2745744 862521 725962 1567803 1305402 -164222 -1551140
40389 -1551140 -2555374 -3539405 -3875623 -2671031 -583260 742892 662360 -290007 -1610782
40380 -1610782 -2968284 -3714438 -3517032 -3045255 -2981405 -2890789 -2043685 -664981 628330
40371 628330 1736024 2259987 933840 -2405754 -5217342 -4816234 -2127883 -597241 -1393494
40362 -1393494 -2175094 -1157128 162610 -242408 -1533026 -1444934 98017 1053788 523804
$$ packed form
40425A234960j038981n89932r1898j64623j38256L60761K17399j104546j726788
40416c041904N9420K515590K603450O48571l43327L46389M63736p25534j097954
40407A428437K14150J108235M31715M1909R82938J115201q61206k294639p33701
40398A433039J573035J068234j328564j883223j36559Q41841k62401j469624j386918
40389a551140j004234r84031l36218J204592K087771J326152q0532r52367j320775
40380a610782j357502p46154J97406M71777O3850R0616Q47104J378704J293311
40371F28330J107694N23963j326147l339594k811588M01108K688351J530642p96253
40362a393494p81600J017966J319738m05018j290618Q8092J542951R55771n29984
$$ plain form
40353 523804 -145191 282081 1252068 1723457 1708133 1610768 1156912 108461 -760535 -674782
40343 -674782 -291801 -710124 -1396676 -809173 889901 1709230 979420 519887 1441516
40334 1441516 1907512 163187 -1935466 -1277595 1563094 2966360 1715531 477613
40326 477613 1178045 2176091 1554165 334996 285705 826321 592852 289304 1296264
40317 1296264 2715445 2604234 1388276 1229941 2292381 2431013 880911 -324631 552607
40308 552607 2473417 3287204 2437942 1036016 265947 522090 1414259 2112667 2175177
40299 2175177 2078557 2324396 2371245 1511612 467711 693435 2160250 3302789 3208805
40290 3208805 2373793 1275889 -31975 -718056 410101 2670548 3705466 2841966 2255825
$$ packed form
40353E23804o68995M27272R69987M71389j5324r7365m53856j048451q68996Q5753
40343f74782L82981m18323o86552N87503J699074Q19329p29810m59533R21629
40334A441516M65996j744325k098653O57871K840689J403266j250829j237918
40326D77613P00432R98046o21926j219169m9291N40616k33469l03548J006960
40317A296264J419181j11211j215958j58335J062440J38632j550102j205542Q77238
40308E52607J920810Q13787q49262j401926p70069K56143Q92169O98408O2510
40299B175177r6620K45839M6849q59633j043901K25724J466815J142539r3984
40290C208805q35012j097904j307864o86081J128157K260447J034918q63500n86141
$$ plain form
40281 2255825 3511027 4930936 4248411 2232700 1414528 2254350 2958832 2589499 2001690
40272 2001690 1715866 1058652 -128011 -767009 -239482 630633 970418 998130 1102348
40263 1102348 1004594 703743 1166714 2963925 4975029 5639552 5037656 4546256 4667141
40254 4667141 4482310 3449964 2536624 2873869 4034574 4500711 3582840 2170308 1610450
40245 1610450 2382273 3897589 5104351 5169524 4035649 2543013 1695185 1669709 1910054
40236 1910054 2228215 3117581 4592368 5475846 4679825 2763142 1263046 681662 185434
40227 185434 -689478 -1240235 -932385 -424142 -450138 -519889 208440 1252531 1237197 -25672
40217 -25672 -1062005 -749948 116866 -71 -1226354 -2174854 -1833534 -680424 255389
$$ packed form
40281B255825J255202J419909o82525k015711q18172Q39822P04482l69333n87809
40272B001690k85824o57214j186663o38998N27527Q70115L39785K7712J04218
40263A102348r7754l00851M62971J797211K011104O64523o01896m91400J20885
40254D667141j84831j032346r13340L37245J160705M66137r17871j412532n59858
40245A610450P71823J515316J206762O5173j133875j492636q47828k5476K40345
40236A910054L18161Q89366J474787Q83478p96021j916683j500096n81384m96228
40227A85434q74912n50757L07850N08243k5996o9751P28329J044091j5334j262869
40217b5672j036333L12057Q66814j16937j226283r48500L41320J153110R35813
$$ plain form
40208 255389 669918 870233 1017976 1201767 1849295 3117342 3960049 2908371 171383
40199 171383 -1985846 -1676986 450271 2261954 2748133 2589694 2530017 2494671 2462635 2945724
40189 2945724 3925014 4175392 2607997 -23797 -1635061 -1122894 455823 1294919 929452
40180 929452 371364 431461 809937 1155762 2054748 3943390 5612567 5259500 3063587
40171 3063587 1209362 936796 1157634 809657 835309 2255207 3706800 3105125 1049248
40162 1049248 235129 1555978 3006601 2808197 1538528 451272 -389270 -1178860 -1169791
40153 -1169791 175198 1850545 2491655 2240640 2223605 2612687 2402130 1085529 -347445
40144 -347445 -415714 1124894 2789052 2853873 1486371 819021 2254572 4311491 4322588
$$ packed form
40208B55389M14529K00315J47743J83791O47528J268047Q42707j051678k736988
40199A71383k157229L08860K127257J811683M86179j58439n9677l5346l2036M83089
40189B945724R79290K50378j567395k631794j611264N12167J578717Q39096l65467
40180I29452n58088O0097L78476L45825Q98986J888642J669177l53067k195913
40171C063587j854225k72566K20838l47977K5652J419898J451593o01675k055877
40162A049248q14119J320849J450623j98404j269669j087256q40542p89590R069
40153a169791J344989J675347O41110k51015j7035L89082k10557j316601j432974
40144c47445o8269J540608J664158O4821j367502o67350J435551K056919J1097
$$ plain form
40135 4322588 1878188 -921297 -2472988 -3100918 -3262882 -2400849 -471294 1153619 1510860
40126 1510860 1371081 1632858 1829038 1490026 1538681 2728974 3890681 3493364 2073619
40117 2073619 1346219 1579165 1606625 975353 369659 164223 81635 84791 256892 104535
40107 104535 -673350 -1137092 -307675 982759 1079399 67175 -399382 294876 1132866
40098 1132866 1586944 2433177 3999229 5343878 5858468 6158765 6609958 6374819 4920956
40089 4920956 3373678 3287756 4728188 6358449 6867730 5747028 3376046 1066818 432883
40080 432883 1873527 3910224 4641635 3744133 2575496 2365368 2784106 2606876 1623228
40071 1623228 1235615 2607031 4709454 5397122 4405439 3752233 4636437 5662599 5277810
$$ packed form
40135D322588k444400k799485j551691o27930j61964Q62033J929555J624913L57241
40126A510860j39779K61777J96180l39012M8655J190293J161707l97317j419745
40117B073619p27400K32946K7460o31272o05694k05436q2588L156J72101j52357
40107A04535p77885m63742Q29417J290434R6640j012224m66557O94258Q37990
40098A132866M54078Q46233J566052J344649N14590L00297M51193k35139j453863
40089D920956j547278q5922J440432J630261N09281j120702k370982k309228o33935
40080D32883J440644K036697P31411q97502j168637k10128M18738j77230r83648
40071A623228l87613J371416K102423O87668r91683o53206Q84204J026162l84789
$$ plain form
40062 5277810 4246368 3966796 3918497 3163136 3157121 6041002 10588726 13137898 12928835
40053 12928835 13356602 16843798 21331893 23520451 23215905 22413901 21825827 20536159 18075514
40044 18075514 14907453 11503196 8454431 6839846 7022928 7630398 7084572 5722940
40036 5722940 5173283 6025805 7311392 7985783 7812702 6965690 5768098 4771156 4316817
40027 4316817 4128374 3928304 4141527 5242101 6652136 7137247 6336055 5244009 4997981
40018 4997981 5616680 6238002 6412131 6658774 7355012 7486212 5647414 2572982 1244791
40009 1244791 3372130 6931799 8713975 8273149 7435235 6806247 5330130 3045375 1607264
40000 1607264 1760596 2616332 3658880 5059850 5887216 4888802 3476576 4722536 8518235
$$ packed form
40062E277810j031442k79572m8299p55361o015K883881M547724K549172k09063
40053A2928835M27767L487196M488095K188558l04546q02004n88074j289668k460645
40044A8075514l168061l404257l048765j614585J83082O07470n45826j361632
40036E722940n49657Q52522J285587O74391j73081q47012j197592r96942m54339
40027D316817j88443k00070K13223J100574J410035M85111q01192j092046k46028
40018D997981O18699O21322J74129K46643O96238J31200j838798l074432j328191
40009A244791K127339L559669J782176m40826q37914o28988j476117k284755j438111
40000A607264J53332Q55736J042548J400970Q27366r98414j412226J245960L795699
$$ plain form
39991 8518235 11078496 10508950 9369117 10023958 11150303 11235851 11941099 14890117 18234704
39982 18234704 19810610 21032031 24208666 28506634 32120660 36053806 42097628 49384633
39974 49384633 56519752 64595844 74694269 85911878 99723820 121086374 149057869
39967 149057869 172320804 183884988 195717591 225366227 268826242 301772253 311326241
39960 311326241 311214226 316734035 318446359 295047455 244679605 188196131 143925957
39953 143925957 113010910 89855241 73466880 63724940 56290288 47711126 40132231
39946 40132231 36314153 34371276 31226597 27246353 23763338 19558024 13596230 8418794
39938 8418794 7018574 8308059 8979614 8256010 7759451 7984326 7858840 7039710 6114526
$$ packed form
39991H518235K560261n69546j139833O54841J126345Q5548P05248K949018L344587
39982A8234704J575906J221421L176635M297968L614026L933146O043822P287005
39974D9384633P135119Q076092J0098425J1217609J3811942K1362554K7971495
39967A49057869K3262935J1564184J1832603K9648636M3460015L2946011R553988
39960C11326241j12015N519809J712324k3398904n0367850n6483474m4270174
39953A43925957l0915047k3155669j6388361r741940p434652q579162p578895
39946D0132231l818078j942877l144679l980244l483015m205314n961794n177436
39938H418794j400220J289485O71555p23604m96559K24875j25486q19130r25184
$$ plain form
39929 6114526 5025678 3378495 1829416 1314666 1363248 881868 177861 536106 2055526
39920 2055526 3435228 3812550 3526123 3106806 2630139 2109249 1670046 1281120 831278
39911 831278 332504 -253076 -923959 -1118320 -103611 1641792 2426880 1468846 34694
39902 34694 -438600 -343173 -864059 -1919375 -2619130 -3060689 -3961571 -4858234 -4465487 -2915729
39892 -2915729 -1977300 -2606095 -3672613 -3732331 -2883043 -2100539 -1675371 -1220503 -620117
39883 -620117 -54595 617044 1682912 2855725 3402707 3094358 2483507 2049569 1592276
39874 1592276 913156 657257 1619534 3204079 3624318 2243462 782796 1103642 2497917
39865 2497917 2775668 1744476 1551956 3131359 4475081 3686538 1838099 928106 528060
$$ packed form
39929F114526j088848j647183j549079n14750M8582m81380p04007L58245J519420
39920B055526J379702L77322k86427m19317m76667n20890m39203l88926m49842
39911H31278m98774n85580o70883j94361J014709J745403P85088r58034j434152
39902C4694m73294R5427n20886j055316o99755m41559r00882q96663L92747J549758
39892b915729R38429o28795j066518n9718Q49288P82504M25168M54868O00386
39883f20117N65522O71639J065868J172813N46982l08349o10851m33938m57293
39874A592276o79120k55899R62277J584545M20239j380856j460666L20846J394275
39865B497917K77751j031192j92520J579403J343722p88543j848439r09993m00046
$$ plain form
39856 528060 -1085768 -3353194 -3802836 -1985504 -348472 -561495 -1360258 -1061443 -51594
39847 -51594 639771 1361430 2643866 3402514 2303908 33852 -1580056 -1946732 -1496793
39838 -1496793 -7512 2653522 4697707 3969169 1468854 698526 2750387 4577405
39830 4577405 3504797 1148910 766456 2424809 3427329 2713032 2078032 2900912 4097941
39821 4097941 4180399 3473032 3047081 2726885 1598917 -125398 -1113773 -704224 316563
39812 316563 883597 842185 630867 325372 -400847 -1430003 -1875244 -1006894 670252
39803 670252 1769261 1580288 838885 663861 1154629 1503615 1182503 432388 -277941
39794 -277941 -718893 -891345 -1047120 -1599918 -2470479 -2703368 -1504413 356598 1063609
$$ packed form
39856E28060j613828k267426m49642J817332J637032k13023p98763K98815J009849
39847e1594O91365P21659J282436P58648j098606k270056j613908l66676M49939
39838a496793J489281K661034K044185p28538k500315p70328K051861J827018
39830D577405j072608k355887l82454J658353J002520p14297o35000Q22880J197029
39821D097941Q2458p07367m25951l20196j127968j724315r88375M09549J020787
39812C16563N67034m1412k11318l05495p26219j029156m45241Q68350J677146
39803F70252J099009j88973p41403j75024M90768L48986l21112p50115p10329
39794b77941m40952j72452j55775n52798q70561k32889J198955J861011P07011
$$ plain form
39785 1063609 -64035 -1683267 -2121002 -1289756 -402751 -315974 -796330 -1198140 -1284263
39776 -1284263 -1278902 -1315886 -1011361 122727 1680158 2320495 1395985 170951 370125
39767 370125 1740941 2411273 1749793 1234817 1860076 2355364 1275037 -433934 -659406
39758 -659406 754104 1834379 1263988 -197155 -1224850 -1545234 -1572626 -1377686 -670833
39749 -670833 518976 1534487 1547026 526986 -281528 476863 2365587 3292418 2128935
39740 2128935 235255 -494588 -88526 233801 291437 775908 1444511 1320607 512841
39731 512841 100945 258740 199574 -28695 428315 1240419 949721 -487046 -1210412 -268736
39721 -268736 1016674 1437209 1661305 2320068 2278641 645518 -1020869 -621678 1358580
$$ packed form
39785A063609j127644j619232m37735Q31246Q87005Q6777m80356m01810q6123
39776a284263N361l6984L04525J134088J557431O40337r24510j225034J99174
39767C70125J370816O70332o61480n14976O25259M95288j080327j708971k25472
39758f59406J413510J080275n70391j461143j027695l20384k7392J94940P06853
39749f70833J189809J015511J2539j020040q08514P58391J888724R26831j163483
39740B128935j893680p29843M06062L22327N7636M84471O68603j23904q07766
39731E12841m11896J57795n9166k28269M57010Q12104k90698j436767p23366R41676
39721b68736J285410M20535K24096O58763m1427j633123j666387L99191J980258
$$ plain form
39712 1358580 2696013 2704818 2590240 2879349 2613431 1310344 -7626 -254294 438973
39703 438973 1236868 1455304 742174 -680336 -1822088 -1804763 -1009232 -611623 -1076424
39694 -1076424 -1915114 -2707760 -3313346 -3196318 -1801873 179485 1048710 36748 -1800087
39685 -1800087 -2934460 -2865903 -2017765 -953458 -117463 231416 210712 90620 -189504
39676 -189504 -833053 -1585613 -1933893 -1860694 -1753680 -1642931 -1253068 -708055 -362354 -48834
39666 -48834 557663 951845 341755 -808224 -1136962 -551603 -572867 -1920012 -3161839
39657 -3161839 -2707409 -958772 598861 1418839 1742699 1271338 -481163 -2818965 -4234479
39648 -4234479 -4197071 -3547063 -3062468 -2573612 -1682958 -618088 -101101 -762417 -2657316
$$ packed form
39712A358580J337433Q805j14578K89109k65918j303087j317970k46668O93267
39703D38973P97895K18436p13130j422510j141752J7325P95531L97609m64801
39694a076424q38690p92646o05586J17028J394445J981358Q69225j011962j836835
39685a800087j134373O8557Q48138J064307Q35995L48879k0704j20092k80124
39676a89504o43549p52560l48280P3199J07014J10749L89863N45013L45701L13520
39666d8834O06497L94182o10090j149979l28738N85359k1264j347145j241827
39657c161839M54430J748637J557633Q19978L23860m71361j752501k337802j415514
39648d234479L7408O50008M84595M88856Q90654J064870N16987o61316j894899
$$ plain form
39639 -2657316 -4943049 -6225878 -5839823 -4700041 -4275810 -4754738 -4869493 -3618014 -1533175
39630 -1533175 -4420 221159 -428446 -1077649 -1376044 -1660632 -2191832 -2571406 -2412699
39621 -2412699 -2362245 -3443596 -5131410 -5321298 -3086033 -330708 648122 320828 805035
39612 805035 2171552 2278510 538120 -716886 170134 1453183 804664 -806432 -599065
39603 -599065 1497126 2615282 1360206 -231318 -87175 818655 428560 -963272 -1318639
39594 -1318639 -147531 882965 612048 -134950 -214258 95817 -143012 -909940 -1268537
39585 -1268537 -652435 529693 1388417 1276691 228618 -1051201 -1833106 -2115635 -2428712
39576 -2428712 -2862106 -2826547 -1939725 -558643 787350 1822041 2132658 1256940 -310648
$$ packed form
39639b657316k285733j282829L86055J139782M24231m78928j14755J251479K084839
39630a533175J528755K25579o49605o49203k98395k84588n31200l79574J58707
39621b412699N0454j081351j687814j89888K235265K755325R78830l27294M84207
39612H05035J366517J06958j740390j255006Q87020J283049o48519j611096K07367
39603e99065K096191J118156j255076j591524J44143R05830l90095j391832l55367
39594a318639J171108J030496k70917p46998p9308L10075k38829p66928l58597
39585a268537O16102J182128Q58724j11726j048073j279819p81905k82529l13077
39576b428712m33394L5559Q86822J381082J345993J034691L10617q75718j567588
$$ plain form
39567 -310648 -1145348 -707001 -178184 -479860 -547722 802923 2191223 1169925 -1718245
39558 -1718245 -2982796 -1103609 998311 83982 -2653068 -3301698 -804284 1701894
39550 1701894 1256831 -1316754 -3031518 -2518259 -968642 72705 648597 1873672 4020662
39541 4020662 5694081 5235802 2827535 609419 383325 1670263 2541210 1960979 628681
39532 628681 -252721 -244666 303033 810794 878751 596641 556261 1204146 2185378 2691245
39522 2691245 2390671 1626041 816770 162139 -162514 -77891 129765 112474 14807 238909
39512 238909 742832 1141258 1409765 1813569 2187116 2068974 1596087 1385979 1354504 632893
39502 632893 -897659 -1918926 -1232471 658614 2235738 2688741 2269676 1519045 1042945
$$ packed form
39567c10648q34700M38347N28817l01676o7862J350645J388300j021298k888170
39558a718245j264551J879187K101920r14329k737050o48630K497414K506178
39550A701894m45063k573585j714764N13259J549617J041347N75892J225075K146990
39541D020662J673419m58279k408267k218116k26094J286938Q70947n80231j332298
39532F28681q81402Q055N47699N07761O7957k82110m0380O47885R81232N05867
39522B691245l00574p64630q09271o54631l24653Q4623K07656j7291r7667K24102
39512B38909N03923L98426K68507M03804L73547j18142m72887k10108l1475p21611
39502F32893j530552j021267O86455J891085J577124M53003m19065p50631m76100
$$ plain form
39493 1042945 1616490 3384024 5026021 4816825 2773640 859221 646064 1570142 2084911
39484 2084911 1837979 1743580 2164570 2141272 819834 -1092905 -1978932 -1157185 445411
39475 445411 1319849 592665 -1580498 -4116447 -5450182 -4670785 -2561817 -886802 -304139
39466 -304139 249844 1578974 2566456 1591110 -945539 -2823411 -2661622 -1230484 -70936
39457 -70936 52308 -862814 -2410557 -3599012 -3271373 -1345460 973214 2582874 3429040
39448 3429040 3842748 3846282 3498065 3008333 2104349 311354 -1666869 -2124529 -724174
39439 -724174 588418 170628 -999384 -1008502 29482 453332 -191581 -792379 -764331 -604033
39429 -604033 -346138 654771 2074667 2493591 1510986 492753 528583 1002487 970403
$$ packed form
39493A042945N73545J767534J641997k09196k043185j914419k13157R24078N14769
39484B084911k46932r4399M20990k3298j321438j912739q86027Q21747J602596
39475D45411Q74438p27184k173163k535949j333735P79397K108968J675015N82663
39466c04139N53983J329130R87482r75346k536649j877872J61789J431138J159548
39457g0936J23244r15122j547743j188455L27639J925913K318674J609660Q46166
39448C429040M13708L534l48217m89732r03984j792995j978223m57660J400355
39439g24174J312592m17790j170012r118J037984M23850o44913o00798K8048J60298
39429f04033K57895J000909J419896M18924r82605j018233L5830M73904l2084
$$ plain form
39420 970403 693061 835199 1165837 1101624 814338 829782 1032311 883235 283658 -334496
39410 -334496 -426518 433885 2160287 3790715 4327341 4133272 4406521 4981703 4161173
39401 4161173 1499726 -870313 -1039829 -38208 -11532 -844277 -758745 406258 973084
39392 973084 453156 360539 1393307 1990522 853253 -820959 -1115005 -261124 -167937
39383 -167937 -1645199 -3461932 -3986687 -2730471 -341927 2051788 3429017 3453935 2652282
39374 2652282 1763768 1070702 616021 647500 1229121 1670339 1116606 -229258 -1126192
39365 -1126192 -763168 283090 855764 598873 139111 122339 538528 988073 1166586
39356 1166586 914549 181564 -716643 -1104015 -668281 58449 555216 1416817 3582365
$$ packed form
39420I70403k77342J42138L30638o4213k87286J5444K02529j49076n99577o18154
39410c34496r2022Q60403J726402J630428N36626j94069K73249N75182q20530
39401D161173k661447k370039j69516J001621K6676q32745Q5532J165003N66826
39392I73084n19928r2617J032768N97215j137269j674212k94046Q53881R3187
39383a67937j477262j816733n24755J256216K388544K393715J377229K4918q01653
39374B652282q88514o93066m54681L1479N81621M41218n53733j345864q96934
39365a126192L63024J046258N72674k56891m59762j6772M16189M49545J78513
39356A166586k52037p32985q98207l87372M35734P26730M96767Q61601K165548
$$ plain form
39347 3582365 6320149 7290834 5462543 2878100 2200481 3221212 3459393 1944142 466777
39338 466777 663353 1692430 1874507 1224464 893049 957784 408489 -885614 -1651189
39329 -1651189 -932859 658258 1814602 1999509 1688753 1593435 1963181 2424982 2355688
39320 2355688 1614696 947785 1357105 2899153 4320334 4162370 2278189 93521 -823809
39311 -823809 -410579 2811 -442531 -922153 -111959 1866165 3551082 3996809 3498563
39302 3498563 2496500 1033837 -334057 -460117 704628 1449861 411993 -1538887
39294 -1538887 -2678424 -2875593 -3236255 -3884218 -3781308 -2680849 -1682729 -1553999 -1774054
39285 -1774054 -1614918 -1065856 -292475 814738 2095732 2965540 3188435 3044511 2494333
$$ packed form
39347C582365K737784R70685j828291k584443o77619J020731K38181j515251j477365
39338D66777J96576J029077J82077o50043l31415O4735n49295j294103p65575
39329a651189P18330J591117J156344J84907l10756r5318L69746M61801o9294
39320B355688p40992o66911M09320J542048J421181j57964j884181k184668r17330
39311h23809M13230M13390m45342m79622Q10194J978124J684917M45727m98246
39302C498563j002063j462663j367894j26060J164745P45233j037868j950880
39294a538887j139537j97169l60662o47963J02910J100459R98120J28730k20055
39285a774054J59136N49062P73381J107213J280994Q69808K22895j43924n50178
$$ plain form
39276 2494333 1138898 -599583 -1274817 -84181 1970374 3228328 3139879 2409921 1948073
39267 1948073 2162208 2793434 3036517 2283149 998029 273322 345226 366335 -95465 -360835
39257 -360835 38395 387623 -63824 -872028 -1238171 -1351833 -1901024 -2778182 -3245751 -3040200
39247 -3040200 -2523240 -2086860 -2028139 -2488511 -2905926 -2266529 -669502 255837 -425107
39238 -425107 -1182959 79442 2929665 4767485 4042017 1652130 -721215 -2194705 -2542532
39229 -2542532 -1907376 -967477 -360696 139564 931858 1370767 588950 -694476 -827669
39220 -827669 292435 1121415 1017065 996441 1525225 1569604 654789 -80892 36870 -30844
39210 -30844 -872890 -1059031 525957 2389796 2577093 1884509 2576797 4595230 5475979
$$ packed form
39276B494333j355435j738481o75234J190636K054555J257954q8449p29958m61848
39267A948073K14135O31226K43083p53368j285120p24707P1904K1109m61800k65370
39257c60835L99230L49228m51447q08204l66143j13662n49191q77158m67569K05551
39247c040200N16960M36380N8721m60372m17415O39397J597027R25339o80944
39238d25107p57852J262401K850223J837820p25468k389887k373345j473490l47827
39229b542532O35156R39899O06781N00260P92294M38909p81817j283426j33193
39220h27669J120104Q28980j04350k0624N28784M4379r14815p35681J17762o7714
39210c0844q42046j86141J584988J863839J87297o92584O92288K018433Q80749
$$ plain form
39201 5475979 3960024 1555337 268165 561421 1881999 3581198 4780690 4615848
39193 4615848 3190713 1478039 143570 -686637 -738213 55667 655969 -81128 -1383358
39184 -1383358 -1176236 885714 2637235 2350179 950922 323504 671883 754156 -110166
39175 -110166 -1369329 -2069278 -1631174 -349466 420374 -605052 -2811418 -4007215 -3195378
39166 -3195378 -1823941 -1392755 -1196726 97548 1770606 1882072 274233 -1186151 -1351715
39157 -1351715 -1059263 -1373714 -2060180 -2307928 -1814321 -669803 833254 1851738 1452801
39148 1452801 -41665 -1053217 -673329 188078 204551 -536638 -888363 -353857 378719
39139 378719 485686 -5335 -341263 91157 1021248 1432475 683479 -594004 -1174579
$$ packed form
39201E475979j515955k404687j287172K93256J320578J699199J199492j64842
39193D615848j425135j712674j334469q30207n1576P93880O00302p37097j302230
39184a383358K07122K061950J751521k87056j399257o27418L48379Q2273q64322
39175a10166j259163o99949M38104J281708P69840j025426k206366j195797Q11837
39166c195378J371437M31186J96029J294274J673058J11466j607839j460384j65564
39157a351715K92452l14451o86466k47748M93607J144518J503057J018484l98937
39148A452801j494466j011552L79888Q61407J6473p41189l51725N34506P32576
39139C78719J06967m91021l35928M32420R30091M11227p48996j277483n80575
$$ plain form
39130 -1174579 -764661 -206390 -124088 -219717 -179584 -292979 -534325 53521 2047868 4295006
39120 4295006 4998134 3910437 2402921 1509830 1069228 858474 1232932 2036931 2027455
39111 2027455 445122 -1485200 -1810403 -418551 793329 495082 -440110 -512524 78981
39102 78981 -152835 -1512060 -2386593 -1499764 84197 204717 -1549373 -3330970 -3458524
39093 -3458524 -2373145 -1723739 -2242273 -3210409 -3588274 -2920815 -1336984 576657 1880168
39084 1880168 1972927 1387442 1284877 1862648 1876158 301832 -1962097 -2855764 -1597358
39075 -1597358 353663 1022264 42776 -1354787 -2034151 -1979132 -1771040 -1750350 -1925233
39066 -1925233 -2216237 -2431807 -2283485 -1739872 -1150426 -749992 -294544 481418 1295177
$$ packed form
39130a174579M09918N58271Q2302r5629M0133j13395k41346N87846J994347K247138
39120D295006P03128j087697j507516q93091m40602k10754L74458Q03999r476
39111B027455j582333j930322l25203J391852J211880k98247r35192p2414N91505
39102G8981k31816j359225q74533Q86829J583961J20520j754090j781597j27554
39093c458524J085379O49406n18534r68136l77865O67459J583831J913641J303511
39084A880168R2759n85485j02565N77771J3510j574326k263929q93667J258406
39075a597358J951021O68601r79488j397563o79364N5019K08092K0690j74883
39066a925233k91004k15570J48322N43613N89446M00434M55448P75962Q13759
$$ plain form
39057 1295177 1622362 1405721 1039444 796203 697174 766373 906282 722735 94915 -302381
39047 -302381 127833 674383 83095 -1338391 -1697858 -126368 1888459 2661385 2588295
39038 2588295 3014536 3870451 4099361 3775524 3842524 3922773 2513465 -178499 -1616337
39029 -1616337 -221545 2303714 3327303 2760513 2536537 3352463 3773692 2562477 326560
39020 326560 -1575123 -2633041 -3155942 -3472047 -3733017 -3942182 -3696684 -2425842 -430411
39011 -430411 776500 -72525 -2309115 -3819052 -3404887 -2066803 -1508696 -1827752 -1479341
39002 -1479341 427573 2656807 3289536 2168189 1003923 1056957 1628940 1321215 114496
38993 114496 -601884 98193 1508197 2220363 1816520 1234129 1461281 2217520 2350227
$$ packed form
39057A295177L27185k16641l66277k43241r9029O9199J39909j83547o27820l97296
39047c02381M30214N46550n91288j421486l59467J571490K014827P72926p3090
39038B588295M26241Q55915K28910l23837O7000Q0249j409308k691964j437838
39029a616337J394792K525259J023589n66790k23976Q15926M21229j211215k235917
39020C26560j901683j057918n22901l16105k60970k09165K45498J270842J995431
39011d30411J206911q49025k236590j509937M14165J338084N58107l19056L48411
39002a479341J906914K229234O32729j121347j164266N3034N71983l07725j206719
38993A14496p16380P00077J410004P12166m03843n82391K27152P56239J32707
$$ plain form
38984 2350227 1562304 1105595 2131350 3738183 3694567 1261388 -1690274 -2882078 -2128456
38975 -2128456 -950487 -423422 -391068 -432205 -539803 -813990 -1274489 -2060879 -3186424
38966 -3186424 -4073383 -3989500 -3035659 -2088380 -1634809 -1261437 -515180 267733 364041 -357873
38956 -357873 -1130579 -942643 447992 2089292 2681558 2026778 1226405 1136619 1248103
38947 1248103 738344 -3725 53284 836957 1173314 508344 -431340 -750823 -192410 1126983
38937 1126983 2694889 3383161 2548975 1383583 1642960 2869945 2743733 764023 -533794
38928 -533794 684495 2551866 2151233 -264336 -1941745 -1657405 -730053 -296167 154236
38919 154236 1216398 2382998 2980896 2994065 2567455 1796146 1197739 1277406 1533022 1095818
$$ packed form
38984B350227p87923m56709J025755J606833m3616k433179k951662j191804P53622
38975b128456J177969N27065L2354m1137j07598k74187m60499p86390j125545
38966c186424q86959Q3883R53841R47279M53571L73372P46257P82913R6308p21914
38956c57873p72706J87936J390635J641300N92266o54780q00373q9786J11484
38947A248103n09759p42069N7009P83673L36357o64970r39684l19483N58413J319393
38937A126983J567906O88272q34186j165392K59377J226985j26212j979710j297817
38928e33794J218289J867371m00633k415569j677409K84340R27352M33886M50403
38919A54236J062162J166600N97898J3169m26610p71309n98407P9667K55616m37204
$$ plain form
38909 1095818 416075 927248 2802554 4453913 4674044 3988187 3455686 3396462 3731968
38900 3731968 4283093 4269212 2868105 756251 -372853 -321906 -673493 -1839257 -1916259
38891 -1916259 137706 2192514 1806350 -158622 -1062998 -453589 25814 -75447 417154
38882 417154 1566554 1855643 922582 398824 1229149 2208046 2160697 1758259 1980486 2317648
38872 2317648 1867016 1070284 1004289 1723503 2444544 2721905 2484713 1613114 449066
38863 449066 35835 812223 1671802 1387648 432498 216439 902703 1255894 616131 -105585
38853 -105585 373727 2266861 4615743 6076102 5822607 4244707 2748930 2425278 2979352
38844 2979352 3277743 2597302 961259 -1136719 -2648839 -2288893 12479 2419013 3110052
$$ packed form
38909A095818o79743N11173J875306J651359K20131o85857n32501n9224L35506
38900C731968N51125j3881j401107k111854j129104N0947l51587j165764p7002
38891a916259K053965K054808l86164j964972r04376O09409M79403j01261M92601
38882D17154J149400K89089r33061n23758Q30325R78897m7349m02438K22227L37162
38872B317648m50632p96732o5995P19214P21041K77361k37192q71599j164048
38863D49066m13231P76388Q59579k84154r55150k16059O86264L53191o39763p21716
38853a05585M79312J893134K348882J460359k53495j577900j495777l23652N54074
38844B979352K98391o80441j636043k097978j512120L59946K301372K406534O91039
$$ plain form
38835 3110052 2532948 2461748 3195255 3432925 2936277 3185468 4577592 4950783 2475062
38826 2475062 -1318151 -3248766 -2525125 -1223508 -1001214 -1245561 -885039 -364095 -748752
38817 -748752 -1779164 -1984214 -564545 1604839 2935811 2676544 1408999 285481 -5400
38808 -5400 462916 1336972 2426463 3586261 4474060 4704735 4121798 2779025 924916
38799 924916 -774005 -1380026 -531432 1046335 2286645 2795928 2678318 1790760 74357
38790 74357 -1524580 -1619551 -244311 820135 223402 -1203526 -1668240 -788378 254831
38781 254831 606598 630267 825744 966749 829783 958293 1942835 3393872 4401904
38772 4401904 4805116 5222512 5827151 5901506 4978600 3830956 3730370 4938812 6409920
$$ packed form
38835C110052n77104p1200P33507K37670m96648K49191J392124L73191k475721
38826B475062l793213j930615P23641J301617K22294k44347L60522N20944l84657
38817g48752j030412k05050J419669K169384J330972k59267j267545j123518k90881
38808e400M68316Q74056J089491J159798Q87799K30675n82937j342773j854109
38799I24916j698921o06021Q48594J577767J240310N09283j17610q87558j716403
38790G4357j598937r4971J375240J064446n96733j426928m64714Q79862J043209
38781B54831L51767K3669J95477J41005j36966J28510R84542J451037J008032
38772D401904M03212M17396O04639P4355r22906j147644j00586J208442J471108
$$ plain form
38763 6409920 6892581 5953890 4053341 2104969 956249 772572 810912 278809 -456877
38754 -456877 -140878 1546391 3118447 2990266 1668474 1270882 2801463 4780769 5010021
38745 5010021 3116883 781862 -299159 -94683 205540 -75670 -230700 789378 2697400
38736 2697400 3849740 3229620 1908751 1764653 2945619 3581232 2248439 -178937 -1730915
38727 -1730915 -1719439 -1106357 -852064 -808904 -307701 919679 2707467 4766202 6510344
38718 6510344 6911297 5297187 2547592 888842 1762143 3974907 4766675 3010626 598676
38709 598676 34760 1352789 2420771 1856860 363132 -772436 -1126376 -784736 150020
38700 150020 1078994 1036707 15308 -790072 -682533 -310358 -113509 665341 2226953
$$ packed form
38763F409920M82661r38691j900549j948372j148720j83677L8340n32103p35686
38754d56877L15999J687269J572056j28181j321792l97592J530581J979306K29252
38745E010021j893138k335021j081021K04476L00223k81210j55030J020078J908022
38736B697400J152340o20120j320869j44098J180966O35613j332793k427376j551978
38727a730915J1476O13082K54293M3160N01203J227380J787788K058735J744142
38718F510344M00953j614110k749595j658750Q73301K212764P91768j756049k411950
38709E98676n63916J318029J067982n63911j493728j135568l53940L41640R34756
38700A50020R28974m2287j021399q05380J07539L72175J96849P78850J561612
$$ plain form
38691 2226953 2895834 1362642 -737209 -582445 1967199 4312686 4700700 3799622 2745291
38682 2745291 1857508 1638277 2776278 4388517 4336519 2290123 536309 596030 1000972
38673 1000972 -79388 -1869959 -2540888 -2160010 -1931652 -1705007 -614349 608853 441743
38664 441743 -694550 -914254 38606 614067 534952 1442838 3674548 4834253 3060752
38655 3060752 -66015 -1548373 -686516 822314 1613824 1840492 2014512 2127522 2010758
38646 2010758 1660941 1135408 668804 722272 1379404 1918427 1527400 278399 -1005453
38637 -1005453 -1569518 -1050060 553147 2615219 3899000 3481179 1623289 -587941 -2188182
38628 -2188182 -2642312 -1801751 -249673 729119 410952 -251843 373218 2406442 4041056
$$ packed form
38691B226953O68881j533192k099851J54764K549644K345487L88014r01078j054331
38682B745291q87783k19231J138001J612239n1998k046396j753814N9721M04942
38673A000972j080360j790571o70929L80878K28358K26645J090658J223202j67110
38664D41743j136293k19704R52860N75461p9115R07886K231710J159705j773501
38655C060752l126767j482358Q61857J508830P91510K26668J74020J13010j16764
38646B010758l49817n25533m66604N3468O57132N39023l91027j249001j283852
38637a005453n64065N19458J603207K062072J283781m17821j857890k211230j600241
38628b188182m54130Q40561J552078R78792l18167o62795O25061K033224J634614
$$ plain form
38619 4041056 3625520 1588662 -120954 -182524 913391 1709189 1463592 848967 1041066
38610 1041066 2315312 3765476 4361744 3947321 3093746 2373883 2056636 2169619 2440579
38601 2440579 2361302 1701003 846691 321938 131903 -66124 -336511 -479338 -578643 -1009816
38591 -1009816 -1798975 -2370956 -2090584 -829607 992446 2599354 3120653 2211812 692781
38582 692781 129206 1265345 3011476 3481250 2091954 202842 -512874 110516 935787
38573 935787 1159092 996574 801443 449432 46047 384002 1791011 3015045 2373811
38564 2373811 -10902 -2082496 -2102327 -270378 1931515 3083512 2405168 161553 -1999279
38555 -1999279 -2173633 -421361 977545 243242 -1754868 -2941630 -2771149 -2322340 -2268061
$$ packed form
38619D041056m15536k036858j709616o1570J095915P95798k45597o14625J92099
38610A041066J274246J450164N96268m14423q53575p19863l17247J12983K70960
38601B440579p9277o60299q54312n24753j90035j98027k70387j42827r9305m31173
38591a009816p89159n71981K80372J260977J822053J606908N21299r08841j519031
38582F92781n63575J136139J746131M69774j389296j889112p15716O23390Q25271
38573I35787K23305j62518j95131l52011m03385L37955J407009J224034o41234
38564B373811k384713k071594j9831J831949K201893J151997o78344k243615k160832
38555a999279j74354J752272J398906p34303j998110j186762J70481M48809N4279
$$ plain form
38546 -2268061 -2156978 -1574583 -787184 -161639 73706 -503741 -2072124 -3727091 -4096964
38537 -4096964 -3017310 -1739862 -1302479 -1549590 -1949509 -2436658 -3054409 -3546696 -3735361
38528 -3735361 -3718111 -3455888 -2828850 -2256872 -2385591 -2832868 -2206164 47066 2632127
38519 2632127 3960983 4038065 4023660 4481328 4949367 4942614 4534193 4043222 3827905 4326278
38509 4326278 5643939 7008929 7176135 5649423 3300410 1603074 1262693 1611796 1431189
38500 1431189 455037 -173525 656878 2286191 2675902 782549 -2005802 -3213860 -1795836
38491 -1795836 926083 2572454 1796976 -617184 -2542017 -2541943 -1125748 176781 619836
38482 619836 598605 599809 691842 920949 1301288 1528645 1647277 2631149 4862820 6353168
$$ packed form
38546b268061J11083N82395P87399O25545K35345n77447j568383j654967l69873
38537d096964J079654J277448M37383k47111l99919m87149o17751m92287j88665
38528c735361J7250K62223O27038N71978j28719m47277O26704K253230K585061
38519B632127J328856P7082j4405M57668M68039o753m08421m90971k15317M98373
38509D326278J317661J364990J67206j526712k349013j697336l40381L49103j80607
38500A431189r76152o28562Q30403J629313L89711j893353k788351j208058J418024
38491a795836K721919J646371p75478k414160j924833P4J416195J302529M43055
38482F19836k1231J204R2033K29107L80339K27357J18632R83872K231671J490348
$$ plain form
38472 6353168 4609068 581926 -1653623 -142350 2444551 3056696 2482756 2906192 3487558
38463 3487558 1831572 -1323899 -2638497 -1230075 324865 473171 722218 2129334
38455 2129334 3026519 2095095 1033308 1868991 3623946 4096817 3495959 3750466 5099516
38446 5099516 5878807 5403103 4814814 4899146 4881304 3834085 1975033 152849 -1053436
38437 -1053436 -1526268 -1611197 -1895613 -2364461 -2107311 -661155 812808 767583 -623811
38428 -623811 -1755946 -1799774 -1424621 -1352486 -1387226 -1052017 -229065 939298 1972225 2040353
38418 2040353 1009474 166729 599892 1171249 -117700 -2712111 -3598662 -1539061 856072
38409 856072 652563 -1466948 -2554162 -1550111 -114738 199372 -260171 -354420 339755
$$ packed form
38472F353168j744100m027142k235549J511273K586901O12145n73940M23436N81366
38463C487558j655986l155471j314598J408422J554940J48306K49047J407116
38455B129334Q97185r31424j061787Q35683J754955M72871o00858K54507J349050
38446E099516P79291m75704n88289Q4332j7842j047219j859052j822184j206285
38437a053436m72832q4929k84416m68848K57150J446156J473963m5225j391394
38428f23811j132135m3828L75153P2135l4740L35209Q22952J168363J032927O8128
38418B040353j030879q42745M33163N71357j288949k594411q86551K059601K395133
38409H56072k03509k119511j087214J004051J435373L14110m59543r4249O94175
$$ plain form
38400 339755 1388904 1962122 1377838 -79033 -1095602 -895964 -495234 -1331981 -2983391
38391 -2983391 -3578564 -2422869 -790982 90226 423458 763771 949399 841764 923304
38382 923304 1255734 900433 -559911 -1808793 -1331891 443199 1769067 1893417 1509961
38373 1509961 1248520 1110955 1318942 2252860 3307345 3208464 1972249 1239772 1921935
38364 1921935 2746102 2221864 1002392 814517 1661565 1863738 942947 714513 2650381
38355 2650381 5363091 6025976 3893304 1179370 250866 890104 962882 -713989 -3054518
38346 -3054518 -4304525 -4102965 -3309548 -2317233 -652381 1610736 3182665 3101117 2199930
38337 2199930 1960423 2267410 1582360 -555325 -2495863 -2573665 -1262675 -340095 -511077
$$ packed form
38400C39755J049149N73218n84284j456871j016569J99638M00730q36747j651410
38391b983391n95173J155695J631887Q81208L33232L40313J85628j07635Q1540
38382I23304L32430l55301j460344j248882M76902J775090J325868J24350l83456
38373A509961k61441j37565K07987R33918J054485r8881j236215p32477O82163
38364A921935Q24167n24238j219472j87875Q47048K02173r20791k28434J935868
38355B650381K712710O62885k132672k713934r28504O39238P2778j676871k340529
38346c054518j250007K01560P93417R92315J664852K263117J571929q1548r01187
38337B199930k39507L06987o85050k137685j940538p7802J310990R22580j70982
$$ plain form
38328 -511077 -902697 -716433 -366182 -708835 -1777391 -2682363 -2560784 -1404082 16736
38319 16736 990563 1519344 1928943 2027125 1350197 395339 606461 2365044 3852859 3170017
38309 3170017 1093690 194634 1301907 2584866 2549638 2102193 2576788 3375495 3265908
38300 3265908 2863522 3700585 5314055 5521562 3815920 2390159 2996174 4518798 4796248
38291 4796248 3485119 1824571 646270 79885 434570 1751729 2881711 2594092 1508224
38282 1508224 1429876 2697747 3688843 3282582 2345533 2122560 2439420 2410816 1972394 1734721
38272 1734721 1945491 2399321 2861925 2999501 2536993 2011433 2495607 3938563 4879332
38263 4879332 4694225 4775829 6041208 6647393 4412329 655102 -1083922 4852 1221899
$$ packed form
38328e11077l91620J86264L50251l42653j068556r04972J21579J156702J420818
38319A6736R73827N28781M09599R8182o76928r54858K11122J758583J487815o82842
38309C170017k076327q99056J107273J282959l5228m47445M74595P98707j09587
38300C265908m02386Q37063J613470K07507j705642j425761O06015J522624K77450
38291D796248j311129j660548j178301n66385L54685J317159J129982k87619j085868
38282A508224p8348J267871R91096m06261r37049k22973L16860k8604m38422k37673
38272A734721K10770M53830M62604J37576m62508n25560M84174J442956R40769
38263D879332j85107Q1604J265379O06185k235064l757227j739024J088774J217047
$$ plain form
38254 1221899 1001428 1197395 3233335 4869483 3434131 370216 -523485 1453628 3195093
38245 3195093 2465032 550493 -326985 88242 809954 1415788 1850851 1701168 943824
38236 943824 571536 1308737 2278925 1990638 319626 -1320596 -1558079 -199860 1905509
38227 1905509 3536521 3882540 3218908 2631491 2714095 2918139 2624716 2296083 2754482
38218 2754482 3676229 3865871 3111108 2724912 3686351 4995373 4823753 3109438 1946746
38209 1946746 2908480 4772559 4960359 3007311 1273765 1739562 3386294 3908295 3048560
38200 3048560 2512107 2915683 2822186 1245042 -675320 -1450106 -1294566 -1240535 -1330570 -1036477
38190 -1036477 -627751 -668324 -698860 111470 1287421 1442615 308875 -861040 -914085
$$ packed form
38254A221899k20471J95967K035940J636148j435352l063915q93701J977113J741465
38245C195093p30061j914539q77478M15227P21712O05834M35063j49683p57344
38236I43824l72288P37201R70188k88287j671012j640222k37483J358219K105369
38227A905509J631012L46019o63632n87417Q2604K04044k93423l28633M58399
38218B754482R21747J89642p54763l86196R61439J309022j71620j714315j162692
38209A946746R61734J864079J87800j953048j733546M65797J646732N22001q59735
38200C048560n36453M03576r3497j577144j920362p74786J55540N4031r0035K94093
38190a036477M08726m0573l0536Q10330J175951J55194j133740j169915n3045
$$ plain form
38181 -914085 303353 2540720 5296654 7313942 7370730 5978332 5054041 5501566 6368005
38172 6368005 6809041 7335387 8241989 8384277 7038217 5864423 7129723 10412845 12945477
38163 12945477 13307964 13019602 13849548 15085033 14713808 12509821 10536528 10622631 12438777
38154 12438777 14440165 15873723 17092322 18281527 18893219 18630765 18248696 18728510 20014958
38145 20014958 21213129 21822822 22078507 22176662 21990778 21666953 21670798 21923889 21671211 20715007
38135 20715007 20120749 21003983 22975458 24381981 23866988 21304587 17587736 14045649
38127 14045649 11779009 10949598 10747550 10351118 9717988 9214730 8898783 8549816 7990254
38118 7990254 6997573 5452066 4047145 4118616 5944883 7833099 7923611 6450656 5090497
$$ packed form
38181i14085J217438K237367K755934K017288N6788j392398r24291M47525Q66439
38172F368005M41036N26346R06602J42288j346060j173794J265300L283122K532632
38163A2945477L62487k88362Q29946J235485l71225k203987j973293Q6103J816146
38154A2438777K001388J433558J218599J189205O11692k62454l82069M79814J286448
38145B0014958J198171O09693K55685R8155j85884l23825L845K53091k52678r56204
38135B0715007n94258Q83234J971475J406523n14993k562401l716851l542087
38127A4045649k266640q29411k02048l96432o33130n03258l15947l48967n59562
38118G990254r92681j545507j404921P1471J826267J888216R0512j472955j360159
$$ plain form
38109 5090497 4489335 3879655 3033875 2917270 3911960 4833445 4554833 3550200 2928396
38100 2928396 2780883 2460061 1873114 1470350 1270176 815333 377 -757400 -1117188
38091 -1117188 -1038617 -497448 501764 1633473 2351520 2301164 1500203 366113 -240110
38082 -240110 545651 2592132 4459537 4627172 3019788 1024242 111238 648773 1792664
38073 1792664 2226026 1275164 -357351 -1202406 -631235 501875 1097964 1125966 1166451
38064 1166451 1243160 992020 688268 1125440 2424594 3712232 4070542 3238746 1474866
38055 1474866 -533811 -1652989 -1072867 667884 2108342 2484622 2242442 1854206 1088085
38046 1088085 -138776 -1116683 -1266954 -1018846 -978553 -797653 165767 1377146 1416427
$$ packed form
38109E090497o01162o09680q45780j16605R94690R21485k78612j004633o21804
38100B928396j47513l20822n86947m02764k00174m54843q14956p57777l59788
38091a117188P8571N41169R99212J131709P18047n0356q00961j134090o06223
38082b40110P85761K046481J867405J67635j607384j995546r13004N37535J143891
38073A792664M33362r50862j632515q45055N71171J133110N96089K8002M0485
38064A166451P6709k51140l03752M37172J299154J287638L58310q31796j763880
38055A474866k008677j119178N80122J740751J440458L76280k42180l88236p66121
38046A088085j226861r77907j50271K48108M0293J80900R63420J211379L9281
$$ plain form
38037 1416427 -100062 -1717075 -1640244 423070 3179752 5090592 5504678 4821985 3952040
38028 3952040 3513446 3305075 2678416 1657625 1417816 3037347 5706654 6962676 5381160
38019 5381160 2605710 1731243 3652752 6037734 6321069 4722540 3468484 3808499 5004236
38010 5004236 5930978 6373081 6586466 6640546 6537104 6235416 5399510 3923891 2777779
38001 2777779 3231607 4901647 5719921 4491114 2420674 1263912 963802 286881 -933613
37992 -933613 -1589072 -1089830 -133051 396690 393245 318738 712469 1852341 3262675 3732032
37982 3732032 2539427 486993 -1008183 -1567035 -1745826 -1683026 -1090586 -449578 -729807
37973 -729807 -1621895 -1505183 127211 1480199 733736 -1372943 -2416663 -1319499 566541
$$ packed form
38037A416427j516489j617013P6831K063314K756682J910840M14086o82693q69945
38028C952040m38594k08371o26659j020791k39809J619531K669307J256022j581516
38019E381160k775450q74467J921509K384982K83335j598529j254056L40015J195737
38010E004236R26742M42103K13385N4080j03442l01688q35906j475619j146112
38001B777779M53828J670040Q18274j228807k070440j156762l00110o76921j220494
37992i33613o55459M99242R56779N29741l445p4507L93731J139872J410334M69357
37982C732032j192605k052434j495176n58852j78791O2800N92440O41008k80229
37973g29807q92088J16712J632394J352988p46463k106679j043720J097164J886040
$$ plain form
37964 566541 1284210 305582 -1342271 -2317111 -2041454 -865254 487216 1447447 1644633
37955 1644633 923484 -213496 -613324 229855 1101168 371520 -1616446 -2758119 -2076098
37946 -2076098 -931668 -637828 -399095 1066564 3092337 3959746 3478813 2875980 2512573
37937 2512573 1581174 33625 -1042525 -1289629 -1610619 -2294459 -2241596 -880774 596451
37928 596451 941470 533284 251445 -80911 -694229 -429720 1768225 4458202 4902209
37919 4902209 2772522 730533 773925 1802431 1809476 911866 652728 1309530 1712485
37910 1712485 1371352 1000415 810625 -3427 -1457090 -1984500 -568430 1431795 1929209
37901 1929209 862940 -191755 -714993 -1722592 -3406679 -4201716 -3138146 -1652249
$$ packed form
37964E66541P17669r78628j647853r74840K75657J176200J352470R60231J97186
37955A644633p21149j136980l99828Q43179Q71313p29648j987966j141673O82021
37946b076098J144430K93840K38733J465659K025773Q67409m80933o02833l63407
37937B512573r31399j547549j076150k47104l20990o83840N2863J360822J477225
37928E96451L45019m08186k81839l32356o13318K64509K197945K689977M44007
37919D902209k129687k041989M3392J028506P045q97610k59138O56802M02955
37910A712485l41133l70937j89790q14052j453663n27410J416070K000225M97414
37901A929209j066269j054695n23238j007599j684087p95037J063570J485897
$$ plain form
37893 -1652249 -1683874 -2910501 -3368430 -2309600 -915170 -310432 -346162 -529982 -783702
37884 -783702 -794943 156195 1953246 3152578 2635412 1144937 309788 542260 749480
37875 749480 -66167 -1655935 -2916455 -2900769 -1561662 29410 410244 -754379 -2067266
37866 -2067266 -1959576 -684915 89286 -323311 -715559 66573 1261237 1253854 -34393
37857 -34393 -1008471 -643397 251407 429328 -56661 -281264 -4751 186207 102498 310768
37847 310768 1082500 1820115 1920068 1568188 1236506 937857 476298 -39113 -481382 -1112112
37837 -1112112 -2143303 -3225492 -3877942 -4053004 -3812249 -3031294 -2056902 -1868891 -2558829
37828 -2558829 -2432177 -156270 2669206 2981537 341584 -2392525 -2902290 -1901526 -927770
$$ packed form
37893a652249l1625j226627m57929J058830J394430O04738l5730j83820k53720
37884g83702j1241R51138J797051J199332n17166j490475q35149K32472K07220
37875G49480q15647j589768j260520J5686J339107J591072L80834j164623j312887
37866b067266J07690J274661P74201m12597l92248P82132J194664p383j288247
37857c4393r74078L65074Q94804J77921m85989k24603K76513J90958q3709K08270
37847C10768P71732P37615R9953l51880l31682k98649m61559n15411m42269o30730
37837a112112j031191j082189o52450j75062K40755P80955R74392J88011o89938
37828b558829J26652K275907K825476L12331k639953k734109n09765J000764R73756
$$ plain form
37819 -927770 247827 2323240 4160309 3955140 2025899 492054 432900 1013612 1310019
37810 1310019 1438097 1754910 2266191 3050400 4223495 5355378 5813569 5635440 5200011
37801 5200011 4351274 2959864 1965362 2377837 3386133 3078100 1141418 -774623 -1571138
37792 -1571138 -1785261 -1765582 -744408 1362189 3020031 3142620 2570375 2252666 1505575
37783 1505575 -360084 -2055398 -1847007 -132867 1344034 2045383 2498919 2368995 938290
37774 938290 -762339 -655970 1293545 2788542 2459257 1459506 1144701 1068207 301736
37765 301736 -887952 -1867994 -2777751 -3622877 -3486283 -2007794 -580381 -576836 -1234971
37756 -1234971 -877629 437790 1190492 894930 529425 554997 311500 -336157 -443345
$$ packed form
37819i27770J175597K075413J837069k05169j929241j533845n9154N80712K96407
37810A310019J28078L16813N11281P84209J173095J131883M58191j78129m35429
37801E200011q48737j391410r94502M12475J008296l08033j936682j916041p96515
37792a571138k14123J9679J021174K106597J657842J22589n72245l17709p47091
37783A505575j865659j695314K08391J714140J476901P01349M53536j29924j430705
37774I38290j700629J06369J949515J494997l29285r99751l14805p6494p66471
37765C01736j189688r80042r09757q45126J36594J478489J427413L545o58135
37756a234971L57342J315419P52702k95562l65505K5572k43497o47657j07188
$$ plain form
37747 -443345 344286 1054683 1061187 1107471 1730895 2000867 1156749 454253 1696504 4413478
37737 4413478 6196752 5819360 4495256 3796577 3779281 3763791 3702732 3848947 3934476 3643008
37727 3643008 3315908 3319050 3227640 2558282 1859468 2007424 2662930 2561774 1342772 19534
37717 19534 -490549 -255332 440470 1548576 2463958 2023562 202929 -1197849 -742669
37708 -742669 487897 296910 -1474389 -2710389 -2005648 -423751 252727 -159290 -522188
37699 -522188 -192539 412962 741073 762501 722464 772561 912517 992738 777657 192268
37689 192268 -587053 -1410643 -2280908 -2977848 -2859388 -1467310 737822 2585206 3138191
37680 3138191 2248185 356570 -1841851 -3548708 -4149752 -3678070 -2874863 -2535579 -2697568
$$ packed form
37747d43345P87631P10397O504M6284O23424K69972q44118p02496J242251K716974
37737D413478J783274l77392j324104o98679j7296j5490o1059J46215Q5529k91468
37727C643008l27100L142r1410o69358o98814J47956O55506j01156j219002j323238
37717A9534n10083K35217O95802J108106R15382m40396j820633j400778M55180
37708g42669J230566j90987j771299j236000P04741J581897O76478m12017l62898
37699e22188L29649O05501L28111K1428m0037N0097J39956Q0221k15081n85389
37689A92268p79321q23590q70265o96940J18460J392078K205132J847384N52985
37680C138191q90006j891615k198421j706857o01044M71682Q03207L39284j61989
$$ plain form
37671 -2697568 -2543901 -1283477 751064 2063600 1434723 -586225 -2135077 -2206455 -1775262
37662 -1775262 -2189103 -3031685 -2686554 -922615 436375 26018 -1016457 -677903 937832
37653 937832 1743334 768088 -409716 14241 1532365 2248907 1649416 1090564 1618299
37644 1618299 2564616 2714296 1910895 865975 46407 -449491 -281354 935040 2707353
37635 2707353 3671883 2967671 1287210 99035 -113652 -376278 -1744030 -3654819 -4390198
37626 -4390198 -3294179 -1844225 -1868983 -3069111 -3239308 -1066143 2163867 4094187 3874908
37617 3874908 2611773 1724291 1587722 1615490 1051422 -281176 -1588242 -1661039 -341166
37608 -341166 864358 438673 -992960 -1209744 626695 2612630 2502982 685650 -418849
$$ packed form
37671b697568J53667J260424K034541J312536o28877k020948j548852p1378M31193
37662a775262m13841q42582L45131J763939J358990m10357j042475L38554J615735
37653I37832Q05502r75246j177804M23957J518124P16542n99491n58852N27735
37644A618299R46317J49680q03401j044920q19568m95898J68137J216394J772313
37635B707353R64530p04212j680461j188175k12687k62626j367752j910789p35379
37626d390198J096019J449954k4758j200128j70197K173165L230010J930320k19279
37617C874908j263135q87482j36569K7768n64068j332598j307066p2797J319873
37608c41166J205524m25685j431633k16784J836439J985935j09648j817332j104499
$$ plain form
37599 -418849 318986 1322396 632564 -1410024 -2767513 -2494858 -1761181 -1926507 -2616642
37590 -2616642 -2416166 -937102 672622 1222025 766435 222892 185301 398726 205558
37581 205558 -611634 -1377496 -1122541 136298 1121351 845178 10954 -9695 716976 806425
37571 806425 -244438 -1365007 -1711267 -1686566 -1584485 -797562 602664 999903 -630109
37562 -630109 -2937967 -4085927 -4215900 -4247781 -3494123 -980487 1619098 1360208 -1539903
37553 -1539903 -3515605 -2590444 -832758 -747597 -1728920 -1806026 -857852 -3078 751645
37544 751645 2070171 3356412 3261078 1698993 -203016 -1732422 -2746223 -2734213 -1319083
37535 -1319083 565189 1500823 1544403 2039146 3438116 4518667 3960512 1797061 -854878
$$ packed form
37599d18849P37835J003410o89832k042588j357489K72655P33677j65326o90135
37590b616642K00476J479064J609724N49403m55590n43543l7591K13425j93168
37581B05558q17192p65862K54955J258839R85053k76173q34224k0649P26671Q9449
37571H06425j050863j120569l46260K4701J02081P86923J400226L97239j630012
37562f30109k307858j147960j29973l1881P53658K513636K599585k58890k900111
37553a539903j975702R25161J757686Q5161r81323p7106R48174Q54774P54723
37544G51645J318526J286241r5334j562085j902009j529406j013801J2010J415130
37535a319083J884272R35634M3580M94743J398970J080551n58155k163451k651939
$$ plain form
37526 -854878 -2845732 -3771664 -4175752 -4741399 -5031195 -3871985 -1567919 -433755 -1801040
37517 -1801040 -3651154 -3126997 -628596 885102 423237 223889 1956737 4080450 4301699
37508 4301699 2897467 1949883 2360827 3250354 3753847 3876190 3605441 2493802 632745
37499 632745 -711250 -244322 1585314 2655814 1589418 -268527 -305175 1856044 3626805
37490 3626805 2869519 648091 -653241 -676517 -776437 -1323784 -1566852 -1765016 -3005762
37481 -3005762 -4719321 -4778200 -2756222 -945898 -1171088 -2486341 -3151111 -3110303 -3146176
37472 -3146176 -3078264 -2372478 -1479214 -1140307 -1159057 -1014310 -900696 -1139889 -1407104 -1483934
37462 -1483934 -1833993 -2507754 -2565256 -1607722 -711328 -719823 -899744 -582824 -682233 -1868197
$$ packed form
37526h54878j990854r25932m04088n65647k89796J159210K304066J134164j367285
37517a801040j850114N24157K498401J513698m61865j99348J732848K123713K21249
37508D301699j404232r47584M10944Q89527N03493J22343k70749j111639j861057
37499F32745j343995M66928J829636J070500j066396j857945l6648K161219J770761
37490C626805p57286k221428j301332k3276r9920n47347k43068j98164j240746
37481c005762j713559n8879K021978J810324k25190j315253o64770M0808l5873
37472c146176O7912P05786Q93264L38907j8750J44747J13614k39193k67215p6830
37462a483934l50059o73761n7502R57534Q96394q495j79921L16920r9409j185964
$$ plain form
37452 -1868197 -2652493 -1497685 212568 -179707 -2531047 -4020571 -3258666 -1804905 -1297815
37443 -1297815 -1399447 -1266949 -1037355 -928221 -497014 265506 435357 -417030 -1453512
37434 -1453512 -1911661 -2089551 -2354092 -2320460 -1705478 -923826 -223617 620732 1153926 176843
37424 176843 -2217729 -3916535 -3408232 -2015676 -1963520 -3073320 -3203810 -1597813 157519
37415 157519 745139 903211 1753812 2676190 2135020 49414 -1911841 -2387682 -1707167
37406 -1707167 -980440 -651242 -495030 -420539 -446867 -172679 817231 2014173 2361438 1780735
37396 1780735 1444081 2139143 3185384 3444987 2593742 892935 -1314205 -3170268 -3476335
37387 -3476335 -2350821 -1675807 -2574612 -3454649 -2258689 166586 1074725 -167104 -1345467
$$ packed form
37452a868197p84296J154808J710253l92275k351340j489524P61905J453761N07090
37443a297815j01632J32498K29594J09134M31207P62520J69851q52387j036482
37434a453512m58149j77890k64541L3632O14982P81652P00209Q44349N33194r77083
37424A76843k394572j698806N08303J392556N2156j109800j30490J605997J755332
37415A57519N87620J58072Q50601R22378n41170k085606j961255m75841O80515
37406a707167P26727L29198J56212P4491k6328K74188R89910J196942L47265n80703
37396A780735l36654O95062J046241K59603q51245j700807k207140j856063l06067
37387c476335J125514O75014q98805q80037J195960K425275R08139j241829j178363
$$ plain form
37378 -1345467 -815486 569496 1444025 1726786 1599941 658309 -779306 -1201275 -50413
37369 -50413 1087438 770415 -159355 -202477 236702 -338439 -1959964 -3219871 -3384036
37360 -3384036 -2840999 -1765595 -51426 1391899 945444 -1550732 -4091584 -4646954 -3301853
37351 -3301853 -1700260 -880452 -343193 788657 2250486 2788602 1883113 712416 772088
37342 772088 1917078 2722296 2597211 2270627 2044625 1124659 -596120 -1553218 -550271
37333 -550271 1240564 1677763 378592 -1247546 -2158509 -2484220 -2394005 -1500896 360219
37324 360219 2543813 3972931 3839710 2281055 674748 551571 1652491 1921904 191275
37315 191275 -2135426 -3141919 -3082685 -3488943 -4427577 -4564817 -3681272 -3197555 -3920556
$$ packed form
37378a345467N29981J384982Q74529K82761j26845r41632j437615m21969J150862
37369e0413J137851l17023r29770m3122M39179n75141j621525j259907j64165
37360c384036N43037J075404J714169J443325m46455k496176k540852n55370J345101
37351c301853J601593Q19808N37259J131850J461829N38116r05489j170697N9672
37342G72088J144990Q05218j25085l26584k26002r19966j720779r57098J002947
37333e50271J790835M37199j299171j626138r10963l25711R0215Q93109J861115
37324C60219K183594J429118j33221j558655j606307j23177J100920K69413j730629
37315A91275k326701j006493N9234m06258r38634j37240Q83545M83717p23001
$$ plain form
37306 -3920556 -4796873 -4384229 -2513113 -210575 1189882 886437 -541609 -1300753 -371388
37297 -371388 1014880 1015153 -233878 -1171536 -1456020 -2064464 -2875526 -2407687 -412391 1404455
37287 1404455 2013254 2400757 3278912 3444141 1895385 -33074 -383491 718823 1725699
37278 1725699 2113318 2463540 2740360 2254304 1174393 555374 743102 929303 488404
37269 488404 -171030 -362123 -106575 -99558 -903924 -2153318 -2567267 -1258058 824059
37260 824059 1518015 -17651 -2160318 -2818268 -1793899 -372042 654204 1408005 1850496
37251 1850496 1546953 548712 -396858 -668512 -276089 380902 789211 565899 -87041
37242 -87041 -428094 -95300 459576 932869 1867203 3527768 4711955 3937179 1631545
$$ packed form
37306c920556q76317M12644J871116K302538J400457l03445j428046p59144R29365
37297c71388J386268K73j249031r37658k84484o08444q11062M67839J995296J816846
37287A404455O08799L87503Q78155J65229j548756j928459l50417J102314J006876
37278A725699L87619L50222K76820m86056j079911o19019J87728J86201m40899
37269D88404o59434j91093K55548P017q04366j249394m13949J309209K082117
37260H24059O93956j535666k142667o57950J024369J421857J026246P53801M42491
37251A850496l03543r98241r45570k71654L92423O56991M08309k23312o52940
37242h7041l41053L32794N54876M73293R34334J660565J184187p74776k305634
$$ plain form
37233 1631545 -106005 -93901 632114 437330 -851801 -1983418 -1839238 -556747 617876
$$ packed form
37233A631545j737550J2104P26015j94784j289131j131617J44180J282491J174623
$$ [...]
##END NTUPLES=NMR SPECTRUM
##END=
