##TITLE=31Pdec_BAU-1.10
 CDCl3, 124 sc
 10.1.2020
##JCAMPDX= 6.0         $$ Bruker NMR JCAMP-DX V2.0
##DATA TYPE= NMR SPECTRUM
##DATA CLASS= NTUPLES
##ORIGIN= UXNMR, Bruker Analytische Messtechnik GmbH
##OWNER= root
$$ XWIN-NMR		Version 3.5
$$ Fri Jan 10 15:41:51 2020 Russian Standard Time (UT+4h)  she@DPX200
##.OBSERVE FREQUENCY= 81.013821
##.OBSERVE NUCLEUS= ^31P
##.ACQUISITION MODE= SIMULTANEOUS
##.ACQUISITION SCHEME= undefined
##.AVERAGES= 124
##.DIGITISER RES= 17
##SPECTROMETER/DATA SYSTEM= spect
##.PULSE SEQUENCE= zgpg30
##.SOLVENT NAME= CDCl3
##.SHIFT REFERENCE= (INTERNAL, CDCl3, 0, 182.463)
##AUDIT TRAIL= $$ (NUMBER, WHEN, WHO, WHERE, WHAT)
$$ ##TITLE= Audit trail, XWIN-NMR		Version 3.5
$$ ##JCAMPDX= 5.01
$$ ##ORIGIN= Bruker BioSpin GmbH
$$ ##OWNER= she
$$ F:/spectra/data/she/nmr/P31/1/pdata/1/auditp.txt
$$ ##AUDIT TRAIL=  $$ (NUMBER, WHEN, WHO, WHERE, WHAT)
(   1,<2020-01-10 15:35:43.03 +0400>,<she>,<DPX200>,
      <continue with go, POWCHK disabled, PULCHK disabled
       configuration hash MD5:
       00 E9 B6 7A A2 85 ED C7 34 08 36 98 17 FE 4E 26
       data hash MD5: 32K
       19 08 2E 5D A3 23 E4 D1 16 97 35 FB 12 5B 36 F9>)
(   2,<2020-01-10 15:41:25.73 +0400>,<she>,<DPX200>,
      <Start of raw data processing
       efp BC_mod = 2 LB = 1 FT_mod = 6 PKNL = 1 PHC0 = -1713.191 PHC1 = 138.0012 SI = 64K 
       data hash MD5: 64K
       6E 65 9A A9 B0 19 57 87 9C 64 36 79 10 AB ED 68>)
$$ ##END=
$$ 
$$ hash MD5
$$ B2 E8 E7 EE 36 95 71 29 81 2E F1 05 71 9E 3A 7A
##$RELAX= 
##$RELAX= 
##$RELAX= 
##$RELAX= 
##$RELAX= 
##$RELAX= 
##$RELAX= 
##$RELAX= 
$$ Bruker specific parameters
$$ --------------------------
##$DU= <F:/spectra>
##$EXPNO= 1
##$NAME= <P31>
##$PROCNO= 1
##$TYPE= <nmr>
##$USER= <she>
##$AMP= (0..31)
100 100 100 100 100 100 100 100 100 100 100 100 100 100 100 100 100 100 
100 100 100 100 100 100 100 100 100 100 100 100 100 100 
##$AQSEQ= 0
##$AQ_mod= 1
##$AUNM= <au_zg>
##$AUTOPOS= <>
##$BF1= 81.014009
##$BF2= 200.13
##$BF3= 200.13
##$BF4= 200.13
##$BF5= 200.13
##$BF6= 200.13
##$BF7= 200.13
##$BF8= 200.13
##$BYTORDA= 1
##$CFDGTYP= 0
##$CFRGTYP= 5
##$CHEMSTR= <none>
##$CNST= (0..31)
1 1 145 1 1 1 1 1 1 1 1 1 1 1 1 1 1 1 1 1 1 1 1 1 1 1 1 1 1 1 1 1 
##$CPDPRG= <waltz16>
##$CPDPRG1= <>
##$CPDPRG2= <waltz16>
##$CPDPRG3= <>
##$CPDPRG4= <mlev>
##$CPDPRG5= <mlev>
##$CPDPRG6= <mlev>
##$CPDPRG7= <mlev>
##$CPDPRG8= <mlev>
##$CPDPRGB= <>
##$CPDPRGT= <>
##$D= (0..31)
0 1 0 0 0 0 0 0 0 0 0 0.03 2e-05 3e-06 0 0 0 0 0 0 0 0 0 0 0 0 0 0 0 0 
0 0 
##$DATE= 1578655959
##$DBL= (0..7)
120 120 120 11 120 120 24 19 
##$DBP= (0..7)
150 150 150 150 150 150 150 150 
##$DBP07= 0
##$DBPNAM0= <>
##$DBPNAM1= <>
##$DBPNAM2= <>
##$DBPNAM3= <>
##$DBPNAM4= <>
##$DBPNAM5= <>
##$DBPNAM6= <>
##$DBPNAM7= <>
##$DBPOAL= (0..7)
0.5 0.5 0.5 0.5 0.5 0.5 0.5 0.5 
##$DBPOFFS= (0..7)
0 0 0 0 0 0 0 0 
##$DE= 6
##$DECBNUC= <off>
##$DECIM= 4
##$DECNUC= <off>
##$DECSTAT= 4
##$DIGMOD= 1
##$DIGTYP= 9
##$DL= (0..7)
0 0 52 120 120 21 21 25 
##$DP= (0..7)
$$ [...]
##$SUBNAM2= <"">
##$SUBNAM3= <"">
##$SUBNAM4= <"">
##$SUBNAM5= <"">
##$SUBNAM6= <"">
##$SUBNAM7= <"">
##$SUBNAM8= <"">
##$SUBNAM9= <"">
##$SW= 369.568048894756
##$SWIBOX= (0..15)
0 1 3 0 0 0 0 0 0 0 0 0 0 0 0 0 
##$SW_h= 29940.119760479
##$TD= 32768
##$TD0= 1
##$TE= 0
##$TE2= 300
##$TE3= 300
##$TEG= 300
##$TL= (0..7)
0 120 53 12 22 120 120 120 
##$TP= (0..7)
150 150 150 150 150 150 150 150 
##$TP07= 0
##$TPNAME0= <>
##$TPNAME1= <>
##$TPNAME2= <>
##$TPNAME3= <>
##$TPNAME4= <>
##$TPNAME5= <>
##$TPNAME6= <>
##$TPNAME7= <>
##$TPOAL= (0..7)
0.5 0.5 0.5 0.5 0.5 0.5 0.5 0.5 
##$TPOFFS= (0..7)
0 0 0 0 0 0 0 0 
##$TUNHIN= 0
##$TUNHOUT= 0
##$TUNXOUT= 0
##$USERA1= <user>
##$USERA2= <user>
##$USERA3= <user>
##$USERA4= <user>
##$USERA5= <user>
##$V9= 5
##$VALIST= <valist>
##$VCLIST= <CCCCCCCCCCCCCCC>
##$VD= 0
##$VDLIST= <DDDDDDDDDDDDDDD>
##$VPLIST= <PPPPPPPPPPPPPPP>
##$VTLIST= <TTTTTTTTTTTTTTT>
##$WBST= 1024
##$WBSW= 4
##$XGAIN= (0..3)
0 0 0 0 
##$XL= 0
##$YL= 0
##$YMAX_a= 16523
##$YMIN_a= -25475
##$ZGOPTNS= <>
##$ZL1= 120
##$ZL2= 120
##$ZL3= 120
##$ZL4= 120
##$ABSF1= 0
##$ABSF2= 0
##$ABSG= 0
##$ABSL= 0
##$ALPHA= 0
##$AQORDER= 0
##$ASSFAC= 0
##$ASSFACI= 0
##$ASSFACX= 0
##$ASSWID= 0
##$AUNMP= <proc_1d>
##$AZFE= 0.1
##$AZFW= 0.5
##$BCFW= 0
##$BC_mod= 2
##$BYTORDP= 0
##$COROFFS= 0
##$CY= -3
##$DATMOD= 1
##$DC= 0
##$DFILT= <>
##$DTYPP= 0
##$F1P= 0
##$F2P= 0
##$FCOR= 1
##$FTSIZE= 65536
##$FT_mod= 6
##$GAMMA= 0
##$GB= 0
##$INTBC= 1
##$INTSCL= 5.30512e-09
##$ISEN= 30
##$LB= 1
##$LEV0= 0
##$LPBIN= 0
##$MAXI= 10000
##$MC2= 0
##$MEAN= 0
##$ME_mod= 0
##$MI= 50
##$NCOEF= 0
##$NC_proc= -9
##$NLEV= 6
##$NOISF1= 182.463
##$NOISF2= 159.3651
##$NSP= 0
##$NTH_PI= 0
##$NZP= 0
##$OFFSET= 182.463
##$PC= 4
##$PHC0= -1713.191
##$PHC1= 138.0012
##$PH_mod= 1
##$PKNL= yes
##$PPARMOD= 0
##$PSCAL= 0
##$PSIGN= 0
##$REVERSE= no
##$SF= 81.0140089999434
##$SI= 65536
##$SIGF1= 159.3651
##$SIGF2= -187.1042
##$SINO= 113.3802
##$SIOLD= 16384
##$SREGLST= <1H.CDCl3>
##$SSB= 0
##$STSI= 65536
##$STSR= 0
##$SW_p= 29940.119760479
##$SYMM= 0
##$S_DEV= 0
##$TDeff= 32768
##$TDoff= 0
##$TI= <>
##$TILT= no
##$TM1= 0
##$TM2= 0
##$TOPLEV= 0
##$USERP1= <user>
##$USERP2= <user>
##$USERP3= <user>
##$USERP4= <user>
##$USERP5= <user>
##$WDW= 1
##$XDIM= 65536
##$YMAX_p= 183760524
##$YMIN_p= -280008888
$$ End of Bruker specific parameters
$$ ---------------------------------
##NTUPLES= NMR SPECTRUM
##VAR_NAME=  FREQUENCY,     SPECTRUM/REAL,   SPECTRUM/IMAG
##SYMBOL=    X,             R,               I
##VAR_TYPE=  INDEPENDENT,   DEPENDENT,       DEPENDENT
##VAR_FORM=  AFFN,          ASDF,            ASDF
##VAR_DIM=   65536,         65536,           65536
##UNITS=     HZ,            ARBITRARY UNITS, ARBITRARY UNITS
##FACTOR=    0.456856943014862, 1,           1
##FIRST=     14782.0589164792, 0,            0
##LAST=      -15158.0608439998, 0,           0
##MIN=       -15158.0608439998, -280008888,  0
##MAX=       14782.0589164792, 183760524,    0
$$ Real data points
##PAGE= N=1
##DATA TABLE= (X++(R..R)), XYDATA
$$ [...]
##PAGE= N=2
##DATA TABLE= (X++(I..I)), XYDATA
4630a0239582J6296636j5045217j9132352l667643o370139k4681167k0883009
$$ -10239582 6057054 -8988163 -28120515 -31788158 -38158297 -62839464 -83722473
4623h3722473J0306516L0158676J8010948j88033Q3902O018400J524624L02702
$$ -83722473 -73415957 -43257281 -25246333 -25434366 -25350464 -19332064 -17807440 -17504738
4615a7504738J4488691K1063561k420992l1148893k5054744O853321K0671428
$$ -17504738 -3016047 18047514 15626522 -15522371 -40577115 -33723794 -13052366
4608a3052366R021010O988356K3812817K4065309n941856k7023557j2878387J937382
$$ -13052366 -4031356 2957000 26769817 50835126 44893270 17869713 4991326 6928708
4600F928708j8041372m3111008k5901625J5670244K4961070n07807q596894J7246253
$$ 6928708 -11112664 -54223672 -80125297 -64455053 -39493983 -40001790 -48598684 -31352431
4592c1352431L3500052J4643241o210479L73994J1399869j340008k0650152j9462672
$$ -31352431 2147621 16790862 10580383 10954377 22354246 21014238 364086 -19098586
4584a9098586r480743j1935284j1214082J4944618M2418400K9493556j3879310
$$ -19098586 -28579329 -40514613 -51728695 -36784077 5634323 35127879 21248569
4577B1248569l6884340k3969158r806024j4319865j3683954Q013596K4701838
$$ 21248569 -15635771 -39604929 -49410953 -63730818 -77414772 -69401176 -44699338
4570d4699338J3569170k269104Q449125K9912610K1966674j3334764k8672224
$$ -44699338 -31130168 -33399272 -24950147 4962463 26929137 13594373 -15077851
4563a5077851R07189M0977185M3539166P019550k9655857l9630890l1155869k0533257
$$ -15077851 -14170662 26806523 70345689 77365239 47709382 8078492 -23077377 -43610634
4555d3610634o517821J6575375L6248864L2361988P636412j0140262j758851J9818070
$$ -43610634 -50128455 -33553080 2695784 35057772 42694184 32553922 30795071 50613141
4547E0613141K7418350J3102851n372899p937973N505197J6339183P692901j6905674
$$ 50613141 78031491 91134342 85761443 77823470 83328667 99667850 107360751 90455077
4539I0455077l6863633l8137816k7911050j9405383j0863882N026837J6839788
$$ 90455077 53591444 15453628 -12457422 -31862805 -42726687 -37699850 -20860062
4532b0860062L743860k6996027l7706192r534804K7244823L1771054N750572j4311689
$$ -20860062 -17116202 -44112229 -81818421 -91353225 -64108402 -32337348 -26586776 -40898465
4524d0898465p883206J0234297J7789655J1077340J095246j527515M458446Q754610
$$ -40898465 -48781671 -38547374 -20757719 -9680379 -8585133 -10112648 -5654202 3100408
4516C100408m24843j7572320k1292231m785440R785349M588642k490419J3538034
$$ 3100408 2675565 -14896755 -36188986 -40974426 -31189077 -26600435 -29090854 -15552820
4508a5552820L7153069K9390186r044279l1106664j1130920J6950536J1306362
$$ -15552820 21600249 50990435 41946156 10839492 -291428 16659108 27965470
4501B7965470j6640220k3652713m53304J8330546P437358j6136847k2304724q624376
$$ 27965470 11325250 -12327463 -12780767 5549779 12987137 -3149710 -25454434 -34078810
4493c4078810L088012K63531o277005j342456J3182266K1926578J5950511J999202
$$ -34078810 -30990798 -30727267 -37004272 -38346728 -25164462 -3237884 12712627 14711829
4485A4711829p324952o236153K635254J3135144J8692863J5049224L702765r418331
$$ 14711829 7386877 1150724 3785978 16921122 35613985 50663209 54365974 44947643
4477D4947643j9221189k2224538j5129075o07495Q874191N807083L445976J7957160
$$ 44947643 25726454 3501916 -11627159 -12234654 -3360463 2446620 5892596 23849756
4469B3849756L4624565J8774798k9616269o1442638l9885841Q399761L1386975
$$ 23849756 58474321 77249119 47632850 -13809788 -53695629 -45295868 -13908893
4462a3908893K0475406P133309N621067n26j4538836j7448322J696944K4482331
$$ -13908893 6566513 13699822 19320889 19320363 4781527 -12666795 -10969851 13512480
4454A3512480L0653076K0017145R94053j9191332k7843108j5032923N635036Q950922
$$ 13512480 44165556 64182701 65176754 45985422 18142314 3109391 8744427 17695349
4446A7695349m171536p568733N882134J1657280l653995j8320953j1554804M003854
$$ 17695349 13523813 5955080 11837214 23494494 19840499 1519546 -10035258 -6031404
4438f031404O419368k088469o889221o445551n952295k942209K796690K657007
$$ -6031404 387964 -1700505 -8589726 -15035277 -20987572 -23929781 -21133091 -18476084
4430a8476084j367668P850969K9336938L1290990k746656l8335505l3447877r360
$$ -18476084 -19843752 -11992783 17344155 48635145 45888489 7552984 -25894893 -25904253
4422b5904253J4798564j131770j2884763K345962K1853260J5915840p892504j7956491
$$ -25904253 -11105689 -12237459 -25122222 -22776260 -923000 14992840 7100336 -10856155
4414a0856155k371921J7623363J5440763r353057l0787265k6354399j911457J8481854
$$ -10856155 -13228076 4395287 19836050 10482993 -20304272 -46658671 -48570128 -30088274
4406c0088274K1553959J2031522k754561j6012566j3306214J1625494L2249097
$$ -30088274 -8534315 3497207 742646 -15269920 -28576134 -16950640 15298457
4399A5298457J4603112k5348337l0693633J2142870M3385957J6627499k8357692
$$ 15298457 29901569 4553232 -26140401 -13997531 29388426 46015925 17658233
4392A7658233k7467559Q864653J9624373n993880k0403100n140351L024251j4642261
$$ 17658233 -9809326 -944673 18679700 12685820 -7717280 -12857631 -9833380 -24475641
4384b4475641k3279809K108146L0301345K4307069k127179j3219267n669640n85485
$$ -24475641 -47755450 -45647304 -15345959 8961110 6833931 -6385336 -12054976 -12640461
4376a2640461l717644m788325q3795R088133K4579863L7601351K6485560r535370
$$ -12640461 -16358105 -21146430 -21230225 -12142092 12437771 50039122 76524682 66989312
4368F6989312l5456439k5269134j364743L55687j4303798j3304181M864180J1719050
$$ 66989312 31532873 6263739 4898996 5254683 -9049115 -22353296 -17489116 -5770066
4360e770066K060318K750285K0274059K1028253j5267762n4826442n1507686r671785
$$ -5770066 -3709748 -959463 19314596 40342849 25075087 -29751355 -81259041 -90930826
4352i0930826K4875711K6647744J2989216O531418N371251m4500n570109o263034
$$ -90930826 -66055115 -39407371 -26418155 -19886737 -14515486 -14559986 -20130095 -26393129
4344b6393129j2181414k8911003l4961538o881737L6927979M9210845J7384533
$$ -26393129 -38574543 -67485546 -102447084 -109328821 -72400842 -23189997 -5805464
4337e805464j6678980j5658255L903638O181381n822675k925058J4549973J5944879
$$ -5805464 -22484444 -38142699 -34239061 -28057680 -33880355 -36805413 -22255440 -6310561
4329f310561n987512k0680294q334859J1466818J4376728N261022k87098l112132
$$ -6310561 -12298073 -32978367 -41313226 -29846408 -15469680 -10208658 -10495756 -13607888
4321a3607888q253603o669074P041609J4660012k049574k7250938k6526809N391637
$$ -13607888 -21861491 -28530565 -21488956 -6828944 -8878518 -36129456 -62656265 -57264628
4313e7264628L4755462L0917033K464669j5882226m063806K2503940L1828636
$$ -57264628 -22509166 8407867 10872536 -5009690 -9073496 13430444 45259080
4306D5259080J1851508j6645842k6955366j8658871j1141169j1122707p166041
$$ 45259080 57110588 40464746 13509380 -5149491 -16290660 -27413367 -34579408
4299c4579408K470805J276449j5704881k6441589j3959017M618010L350792j1185417
$$ -34579408 -32108603 -30832154 -46537035 -72978624 -86937641 -82319631 -78968839 -90154256
4291i0154256r559342J4736195L4747879K8647764Q387078Q87394J3224505K6771633
$$ -90154256 -99713598 -84977403 -50229524 -21581760 -13194682 -12307288 917217 27688850
4283B7688850K1559425q76266k0516332k2603002j3243754o846632m320091L623834
$$ 27688850 49248275 48372009 27855677 5252675 -7991079 -14837711 -19157802 -15533968
4275a5533968J4347771J3405059R04678l014825R993832J9215416O547411j1794793
$$ -15533968 -1186197 12218862 13123540 10108715 20102547 39317963 45865374 34070581
4267C4070581q108659J3662074K3475253R781419o735684o818504J615607l34055
$$ 34070581 25961922 39623996 63099249 72880668 66144984 59326480 60942087 60608032
4259F0608032j5262619k7909893k3960217m875551J2969218J3764811l38739j1344528
$$ 60608032 45345413 17435520 -6524697 -11400248 1568970 15333781 14995042 3650514
4251C650514q774589k583105m838473r070083k355319R458501P455260j0250574
$$ 3650514 -5124075 -7707180 -12545653 -21615736 -23971055 -14512554 -7057294 -17307868
4243a7307868k2197314j2584337O564400J0350992q029794k7872933k2833339
$$ -17307868 -39505182 -52089519 -45525119 -35174127 -43203921 -71076854 -93910193
4236i3910193Q770272L9086882M2176587K5928208J7918539K1090912Q652062
$$ -93910193 -85139921 -46053039 -3876452 22051756 39970295 61061207 69713269
4229F9713269k7405545n1730237l2952328Q002535K7903765K1197008J3458959
$$ 69713269 42307724 -9422513 -42374841 -34372306 -6468541 14728467 28187426
4222B8187426R328797p528539k6891214j5588688K1877211L6170487P582386j8624484
$$ 28187426 37516223 29987684 3096470 -12492218 9384993 45555480 53137866 34513382
4214C4513382k825474K4295665J1131882l1156486m6300684j9262503Q470861
$$ 34513382 31687908 55983573 67115455 35958969 -10341715 -29604218 -21133357
4207b1133357R058869K959451J1461838J9390302Q550952n835099j580097J0788320
$$ -21133357 -12074488 -9115037 2346801 21737103 30288055 24452956 22872859 33661179
4199C3661179O080519j1602296j4602211L042221J5700468O013971r706067p232202
$$ 33661179 39741698 28139402 13537191 16579412 32279880 38293851 28587784 21355582
4191B1355582J0616984J8543757J280623k8493346m2759411k5515969Q821102
$$ 21355582 31972566 50516323 51796946 23303600 -19455811 -44971780 -36150678
4184c6150678K5431855O307185k3813227k3638836R969360L4037219J7478073
$$ -36150678 -10718823 -4411638 -28224865 -51863701 -41894341 -7857122 9620951
4177I620951j5087477k0195193J296990J0956932m231987j4314732Q98140J8094016
$$ 9620951 -5466526 -25661719 -24364729 -13407797 -17639784 -31954516 -31056376 -12962360
4169a2962360R097085j5012118k4132827j4018666l696680q10706L188577J0037976
$$ -12962360 -3865275 -18877393 -43010220 -57028886 -60725566 -61536272 -58347695 -48309719
4161d8309719J2102297J0083564J1346104J2281658K656091j3585191k0963397
$$ -48309719 -36207422 -26123858 -14777754 -2496096 159995 -13425196 -34388593
4154c4388593j4597547j541218J6115596L7745770M7212371K6344501j2022346
$$ -34388593 -48986140 -50527358 -34411762 3334008 50546379 76890880 64868534
4147F4868534l1217819j7580450M769810J2937503J1329449P789132n495463k6886965
$$ 64868534 33650715 16070265 20840075 33777578 45107027 52896159 47400696 20513731
4139B0513731k9140617K290447L4795814K6754722j0376112k4229473M468406
$$ 20513731 -8626886 -6336439 28459375 55214097 44837985 20608512 25076918
4132B5076918L5066922K5452502j1187468k9099453j2805575Q169716N140514
$$ 25076918 60143840 85596342 74408874 45309421 32503846 40673562 45814076
4125D5814076j2163405j5542388k565001M21656j8091469l0195776o249359L5939663
$$ 45814076 33650671 18108283 15543282 15964938 -2126531 -32322307 -38571666 -2632003
4117b632003M8035192J7125105j5946002j5505995J442553l99171j7251671j7439418
$$ -2632003 45403189 62528294 46582292 31076297 32518850 32119679 14868008 -2571410
4109b571410K212841R854135q847557k6110284j3522735J7144291L2379025K0023755
$$ -2571410 -358569 9495566 648009 -25462275 -38985010 -21840719 10538306 30562061
4101C0562061k886743j4993516q824383Q838953K2669844J9660781L270337q185512
$$ 30562061 27675318 12681802 3857419 12696372 35366216 55026997 58297334 50111822
4093E0111822l868688O153401P006533o44562o546441q814799j3138267j9381303
$$ 50111822 46243134 52396535 59403068 58758506 52212065 43397266 30258999 10877696
4085A0877696k1676438j8432747j1164633J651308J6981370K0131499L051678
$$ 10877696 -10798742 -29231489 -40396122 -38744814 -21763444 -1631945 1419733
4078A419733j4259579l389397K8992844M1678352J3133802k7121156l7885514
$$ 1419733 -12839846 -16229243 12763601 54441953 67575755 40454599 2569085
4071B569085j8802274j954773l615006r996900p226236n65937P34242j213386
$$ 2569085 -16233189 -18187962 -21802968 -31799868 -39026104 -39592041 -38857799 -40071185
4063d0071185n21736K028857K881344J611568j152547m937624o904695m337657
$$ -40071185 -40592921 -38564064 -35682720 -34071152 -35223699 -40161323 -47066018 -51403675
4055e1403675J005759O854636J4343175K0359110J4386354m194461j5040174j500842
$$ -51403675 -50397916 -43543280 -29200105 -8840995 5545359 1350898 -13689276 -15190118
4047a5190118K1418984K6049471J2391986K632048O22740r338628k3376311j7606302
$$ -15190118 6228866 32278337 44670323 47302371 47925111 38586483 15210172 -2396130
4039b396130M608930P257497j9193785l5727334j7210445N157116j701663j5836364
$$ -2396130 2212800 9470297 -9723488 -45450822 -62661267 -57504151 -59205814 -75042178
4031g5042178k646428K0105052J3978552q145955k023406K9858603M2608736K7053729
$$ -75042178 -77688606 -57583554 -43605002 -51750957 -53774363 -23915760 18692976 45746705
4023D5746705J9737525K9278862J7167787k9459126o4853155n2949317j9459978
$$ 45746705 65484230 94763092 111930879 82471753 17618598 -35330719 -54790697
4016e4790697m111452l491845M352061J5198361J4856650J0539243J1994428P352055
$$ -54790697 -58902149 -62393994 -58041933 -42843572 -27986922 -17447679 -5453251 1898804
4008A898804j0628299k0429751o133540J0302869N353721l919926P018163J9500686
$$ 1898804 -8729495 -29159246 -35292786 -24989917 -19636196 -23556122 -16537959 2962727
4000B962727J36289l6660038m3348521r563960K7356364L9390183L2337739J3749926
$$ 2962727 3099016 -33561022 -76909543 -86473503 -59117139 -19726956 12610783 26360709
3992B6360709j8646084m9203861m7652625j5110009Q642585J025903j1266976
$$ 26360709 7714625 -41489236 -89141861 -104251870 -95609285 -94583382 -105850358
3985a05850358M213599L6985032N2254104L9309051J7234754L522516j129618
$$ -105850358 -101636759 -64651727 -12397623 26911428 44146182 47668698 46539080
3978D6539080j305795J586677M789064K936053m214508p871249P05130J6239380
$$ 46539080 45233285 46819962 51609026 54545079 50330571 42459322 43164452 59403832
3970E9403832J9780431O81165k4511149k8527901r935755M619426K92725o486867
$$ 59403832 79184263 79865428 55354279 26826378 16890623 21510049 21802774 15315907
3962A5315907r55179L660675m636609o305514J7387535M0750061K4109798k0719018
$$ 15315907 14360728 18021403 13384794 7079280 24466815 65216876 89326674 68607656
3954F8607656l9794167j3835712J6564786J2566255j3694794k7068842j5489598
$$ 68607656 28813489 14977777 31542563 44108818 30414024 3345182 -12144416
3947a2144416R007322L0095000L2725906J1328030j4890546j6915105L549633
$$ -12144416 -3137094 26957906 59683812 71011842 56121296 39206191 42755824
3940D2755824J3037951m217326k4188185k3734114j2775151p382541j180263J2538967
$$ 42755824 55793775 51576449 27388264 3654150 -9121001 -16503542 -17683805 -5144838
3932e144838J8067988M636024p635010P80609J2599333J276707k3377020l1497254
$$ -5144838 12923150 17559174 9924164 10704773 23304106 24580813 1203793 -30293461
3924c0293461k0538833j0530079l330099J4831508L5585055L2418757M541409
$$ -30293461 -50832294 -61362373 -64692472 -49860964 -14275909 18142848 22684257
3917B2684257j7827916j6945725n995044J44246K725653K979231j927736j462132
$$ 22684257 4856341 -12089384 -18084428 -17940182 -15214529 -12235298 -14163034 -15625166
3909a5625166J8313113M0823723L0199692j2027095l8826647k4730264k957856
$$ -15625166 2687947 43511670 73711362 61684267 22857620 -1872644 -4830500
3902d830500q700981k2786890j0879095J2087403P448830j4860883p256847L2259840
$$ -4830500 -13531481 -36318371 -47197466 -35110063 -27661233 -42522116 -49778963 -17519123
3894a7519123M5327508N05484n2517618m8338687O722906M8908007M0271724K550237
$$ -17519123 27808385 28313869 -24203749 -72542436 -65819530 -16911523 23360201 25910438
3886B5910438k4338178k5670183j1636090K361679P216263L855629l44035k871155
$$ 25910438 1572260 -24097923 -35734013 -33372334 -26156071 -22300442 -22644477 -25515632
3878b5515632p884722j1350522J171194K8062147L9324663J3982017k2683429
$$ -25515632 -33400354 -44750876 -43579682 -15517535 23807128 37789145 15105716
3871A5105716k8934235o456870M367759j1052669k0862656j419755K5016149K8002606
$$ 15105716 -13828519 -20285389 -15917630 -26970299 -47832955 -49252710 -24236561 3766045
3863C766045J2933584J726703m452952j4134820j8086990m553025J2537189J1369552
$$ 3766045 16699629 18426332 13973380 -161440 -18248430 -22801455 -10264266 1105286
3855A105286k311448o630472q39964j463227r268138j0784545o593639o846046
$$ 1105286 -1206162 -7836634 -8676598 -10139825 -19407963 -30192508 -36786147 -43632193
3847d3632193m423858J3157294K9560159J7019804j1166139r792316K6271193
$$ -43632193 -48056051 -34898757 -5338598 11681206 515067 -9277249 16993944
3840A6993944M4442784J0989314l4654466l4436763Q243591L9043382K6130013
$$ 16993944 61436728 72426042 37771576 3334813 11578404 50621786 76751799
3833G6751799j0899026l7241303l8335383k0535131P49139J1039385Q490608N603118
$$ 76751799 65852773 28611470 -9723913 -30259044 -29509905 -18470520 -9979912 -4376794
3825d376794J1649262J9300376J6550455L411005j1855766k3642547k7558116
$$ -4376794 7272468 26572844 43123299 46534304 34678538 11035991 -16522125
3818a6522125j8839093j555856J1109505J4130712J6469892K2350676K1678391
$$ -16522125 -35361218 -36917074 -25807569 -11676857 4793035 27143711 48822102
3811D8822102Q520863o746926j4285762j7106178j6060887k591888J9789635K8340950
$$ 48822102 57342965 50596039 36310277 19204099 3143212 551324 20340959 48681909
3803D8681909J2794474p051879j3904856j8162623k6974166j7229069K4544524
$$ 48681909 61476383 54424504 40519648 22357025 -4617141 -21846210 2698314
3796B698314N9640999M1012248j3455932m1065658k3854695o351627j7503974
$$ 2698314 62339313 103351561 89895629 48829971 24975276 18623649 1119675
3789A119675k7874570o359638K5465739K8448140M297119j5303178j7491821j3375968
$$ 1119675 -26754895 -33114533 -7648794 20799346 25096465 9793287 -7698534 -21074502
3781b1074502p561982N896552K2249667K7709729K2073875J8109571J7595964
$$ -21074502 -28636484 -22739932 -490265 27219464 49293339 67402910 84998874
3774H4998874P799782j4450989l2572930l1334027j5656052r25086N368554M102951
$$ 84998874 92798656 78347667 45774737 14440710 -1215342 -2140428 3228126 7331077
3766G331077m371237j7718671k4615321j4051836O903500J7479600J0556284K843980
$$ 7331077 2959840 -14758831 -39374152 -53425988 -46522488 -29042888 -18486604 -15642624
3758a5642624Q290726J5039147O133866p729220j854531J9007340K1273606o149198
$$ -15642624 -7351898 7687249 13821115 6091895 4237364 23244704 44518310 38369112
3750C8369112l1351963k6247375o474622j525173q684741o246549N030985P428180
$$ 38369112 7017149 -19230226 -25704848 -27230021 -35914762 -42161311 -37130326 -29702146
3742b9702146K491239O509512J4507367M950243j7963696k2782361r5426K0369338
$$ -29702146 -27210907 -20701395 -6194028 -1243785 -19207481 -41989842 -42085268 -21715930
3734b1715930J6507890P143784J7330586L4765162K8008217n070172l3316074
$$ -21715930 -5208040 1935744 19266330 54031492 82039709 76969537 43653463
3727D3653463l3089064j2637076M996494P692752r89466j1320613j4303267m309438
$$ 43653463 10564399 -2072677 2923817 10616569 9627103 -1693510 -15996777 -20306215
3719b0306215J6162113L2307292K5731100l276274k6559282j6222589J7253288
$$ -20306215 -4144102 28163190 53894290 50618016 24058734 7836145 25089433
3712B5089433L3977220J7900197k082702J258724J1089297k990239l2281134m1865857
$$ 25089433 59066653 76966850 74884148 76142872 87232169 84241930 51960796 10094939
3704A0094939k5430387r963956q725385o604383M303049J0056367M612221K655546
$$ 10094939 -15335448 -25299404 -34024789 -40629172 -36326123 -26269756 -21657535 -19001989
3696a9001989J1430990J7482304J2813751Q450051J0697941Q577652l840305j5586691
$$ -19001989 -7570999 9911305 22725056 31175107 41873048 50450700 46610395 31023704
3688C1023704j8507931j5760751m961579J9060632L8469335K3334578j9797811
$$ 31023704 12515773 -3244978 -8206557 10854075 49323410 72657988 52860177
3681E2860177m5158365k9436257j276802Q706107R150627J5244430J4299889l182351
$$ 52860177 7701812 -21734445 -23011247 -14305140 -5154513 10089917 24389806 21207455
3673B1207455j3116791L292545J9853242N285101k2477582k4765892l949292P635730
$$ 21207455 8090664 11383209 31236451 36521552 14043970 -10721922 -14671214 -7035484
3665g035484L691073L512928Q017586J667437r758552o949523L623400N64093
$$ -7035484 -3344411 168517 8186103 9853540 94988 -6854535 -3231135 -2667042
3657b667042q856767n51219J6134442Q508142j9179371k5668028O69593K3488452
$$ -2667042 -11523809 -12075028 4059414 12567556 -6611815 -32279843 -31610250 -8121798
3649h121798J7427379p10049j2225132k1351294k3904825M84381M1251058M8304375
$$ -8121798 9305581 8595532 -3629600 -24980894 -48885719 -48401338 -7150280 41154095
3641D1154095K381462m5125233l8316822Q979867M1114405L5608450J2891620
$$ 41154095 43535557 -1589676 -39906498 -30926631 10187774 45796224 58687844
3634E8687844p084393j9209533j7893118k335093J1023557Q603194J750625M248521
$$ 58687844 51603451 32393918 14500800 12165707 23189264 31792458 33543083 37791604
3626C7791604L403039j6719171l7776414k8522176L794787J9888342O045319q970726
$$ 37791604 41194643 24475472 -13300942 -41823118 -38028331 -18139989 -12094670 -21065396
3618b1065396o58088J7644442J9797386L299313j3052132j4538958k596156J1494336
$$ -21065396 -21723484 -4079042 15718344 19017657 5965525 -8573433 -11169589 324747
3610C24747J8649794J9700134J9992921J6306903L15855j9939353k0177588M190419
$$ 324747 18974541 38674675 58667596 74974499 75290354 55351001 35173413 39363832
3602C9363832K1089602L607019k7045636k9833684m061154J3602279P733866P36004
$$ 39363832 60453434 64060453 37014817 7181133 3119979 16722258 24456124 25192128
3594B5192128N911415M102050j6033455k9108496j0320953K2683163L3699342
$$ 25192128 31103543 35205593 19172138 -9936358 -20257311 2425852 36125194
3587C6125194J8301320K683758J201208J950397o819992j8818775k2378858j5275377
$$ 36125194 54426514 57110272 58311480 60261877 53441885 34623110 12244252 -3031125
3579c031125k436406J0190564J6596798J4303055Q565955N463887J335519j1266389
$$ -3031125 -5467531 4723033 21319831 35622886 44188841 49652728 50988247 39721858
3571C9721858k6666822k7266913p393974J3870819J3422142p341770k5327717
$$ 39721858 13055036 -14211877 -21605851 -7735032 5687110 -1654660 -26982377
3564b6982377k5616842j6480614j0880105n569018R571836K8681840L3019576
$$ -26982377 -52599219 -69079833 -79959938 -85528956 -75957120 -47275280 -14255704
3557a4255704J7716711J71935l310348M195474J1623510J4976816J1513021n404078
$$ -14255704 3461007 3632942 322594 4518068 16141578 31118394 42631415 37227337
3549C7227337l0804956m1384490k3191865M855294J5623895J1228829J1405263
$$ 37227337 6422381 -34962109 -58153974 -53298680 -37674785 -26445956 -15040693
3542a5040693J4827324M534350j1952498o088253K1487089L1685792L499530l2991075
$$ -15040693 -213369 4320981 -7631517 -13719770 7767319 39453111 42952641 9961566
3534I961566l9905052j8779601O856682K7050780L7750593K5855946n841803k2850232
$$ 9961566 -29943486 -48723087 -41866405 -14815625 22934968 48790914 42949111 20098879
3526B0098879m233867J7071843l8527l5751057l3647064J3176401N0090320L8574751
$$ 20098879 15865012 32936855 32898328 -2852729 -36499793 -23323392 26766928 65341679
3518F5341679K45045k5922794k8622545j4203955R044577K1524640L880434k6286774
$$ 65341679 65586724 39663930 11041385 -3162570 5882007 27406647 31287081 5000307
3510E000307k5593159J0776112L5098430J8076237q636240r720071k920546j7442270
$$ 5000307 -20592852 -9816740 25281690 43357927 34721687 25001616 22081070 4638800
3502D638800l2345433q667704L9050795N6891762K8532596q823912k2288184j5360588
$$ 4638800 -27706633 -36374337 2676458 59568220 88100816 79276904 56988720 41628132
3494D1628132k998896O762280M143164j5742214l5490784l3293512j5570043l822161
$$ 41628132 38629236 45391516 49534680 33792466 -1698318 -34991830 -50561873 -54384034
3486e4384034J918329J2897313J7370455n17058j7752188r7595L1645937K2553892
$$ -54384034 -52465705 -39568392 -22197937 -22714995 -40467183 -40564778 -8918841 13635051
3478A3635051k4635115m4433907j2338589J5294976k505741k2481497N755099
$$ 13635051 -11000064 -55433971 -67772560 -52477584 -54983325 -77464822 -71709723
3471g1709723N1200981N2999393J8311200L39967P063078K384067j7597353k0299438
$$ -71709723 -20508742 32490651 50801851 51141818 58204896 60588963 42991610 22692172
3463B2692172n054430p655489k9376605k6037312J4082731M0316499J6088842
$$ 22692172 17637742 9982253 -19394352 -45431664 -31348933 8967566 25056408
3456B5056408k3931984k8701498m197002Q316278M67402o2807J6940153K6567969
$$ 25056408 1124424 -27577074 -31774076 -23457798 -22990396 -23053203 -6113050 20454919
3448B0454919P451481k7836467m8130664l5977452j307750K8760264L3092741
$$ 20454919 27906400 69933 -48060731 -84038183 -85345933 -56585669 -23492928
3441b3492928J5032107l032220n397778K023069N228268K096928J067672M675747
$$ -23492928 -8460821 -11493041 -16890819 -14867750 -9639482 -7542554 -6474882 -1799135
3433a799135M050452p732028k1531277j8072200P884538L3938779L1545976J881799
$$ -1799135 2251317 -5480711 -27011988 -45084188 -37199650 -3260871 28285105 30166904
3425C0166904k3548119k3263136j0303609n746922o263260K349067J3960717J0590884
$$ 30166904 6618785 -16644351 -26947960 -32694882 -38958142 -36609075 -22648358 -12057474
3417a2057474m584534r057995M678400J9529905J9844980P157060j0085150k2468948
$$ -12057474 -16642008 -25700003 -21021603 -1491698 18353282 25510342 15425192 -7043756
3409g043756j6438053J1930236L8671261L1372091q105533m1510389l9905183
$$ -7043756 -23481809 -11551573 27119688 58491779 50386246 8875857 -31029326
3402c1029326j2100570J5410711K5495855J4112969r855361k3367070j0373800
$$ -31029326 -43129896 -27719185 -2223330 11889639 2034278 -21332792 -31706592
3395c1706592J1394637R003049j6439939k7726767o193391K2604401L0072077
$$ -31706592 -20311955 -11308906 -27748845 -55475612 -61669003 -39064602 -8992525
3388h992525K0118545P098212j0296257l0802372l4753818j3276245R518775R820050
$$ -8992525 11126020 18224232 7927975 -22874397 -57628215 -70904460 -61385685 -51565635
3380e1565635j343313k830259k30004p233355j0803198Q045232L2365146K7803338
$$ -51565635 -52908948 -55739207 -55969211 -63202566 -74005764 -65960532 -33595386 -5792048
3372e792048k266492j8299644l122523J5653221R621653j2639286k3516209j1814232
$$ -5792048 -8058540 -26358184 -29480707 -13827486 -4205833 -16845119 -40361328 -52175560
3364e2175560J0362385K2817670J3779927q003329j7534145j788853K0131355
$$ -52175560 -41813175 -18995505 -5215578 -13218907 -30753052 -32541905 -12410550
3357a2410550K0726085L162844m025453J0128532K4581438J8966357p42160j7330560
$$ -12410550 8315535 11478379 7452926 17581458 42162896 61129253 60387093 43056533
3349D3056533k4801035k5324018j8626566o737117O19337k683657p910443j529090
$$ 43056533 18255498 -7068520 -25695086 -32432203 -31812866 -34496523 -42406966 -43936056
3341d3936056J5535258K6838686K0226977L623610m232645J616549N336313n636377
$$ -43936056 -28400798 -1562112 18664865 22288475 18055830 19672379 25008692 19372315
3333A9372315j8710632j3621072L812277P956744n737373j3216931l320562L535428
$$ 19372315 661683 -12959389 -9147112 -1190368 -6927741 -20144672 -23465234 -19929806
3325a9929806m655554m110114K3348239M7784976K8711430k0250096m5541062
$$ -19929806 -24585360 -28695474 -5347235 42437741 71149171 50899075 5358013
3318E358013k6891898L087443J3010426Q287303N492229N407367M352991N801493
$$ 5358013 -21533885 -18446442 -5436016 2851287 8343516 13750883 18103874 23905367
3310B3905367Q234784K365155j0760067j8174518j6539172j4803505j3044387
$$ 23905367 32140151 34505306 23745239 5570721 -10968451 -25771956 -38816343
3303c8816343k735431R863534R083702K466241J4651453L9924927L8491912j797965
$$ -38816343 -41551774 -31688240 -22604538 -20138297 -5486844 34438083 72929995 71132030
3295G1132030l6894019k7372093L513202P344864j7169824k8782126q061014K1568552
$$ 71132030 34238011 6865918 10379120 17723984 554160 -28227966 -36288980 -14720428
3287a4720428L4324850K9512060J5209285o217915k7747944l4949289k4234968
$$ -14720428 19604422 49116482 64325767 58107852 30359908 -4589381 -28824349
3280b8824349r890124n486407q776422r346990j457045J3807447K9783929L5056776
$$ -28824349 -38714473 -44200880 -52977302 -62324292 -63781337 -49973890 -20189961 14866815
3272A4866815K2234139p08304j5348799j2261430K86235Q780504Q989610N046227
$$ 14866815 37100954 36392650 21043851 8782421 9068656 17849160 26838770 31884997
3264C1884997N735o887119j4785621j7864668j0550933L948269J3823795J0753285
$$ 31884997 31890732 25003613 10217992 -7646676 -18197609 -14249340 -425545 10327740
3256A0327740r0363o594572m797107j251182m52862K236819J1260415J9709523
$$ 10327740 10237377 3642805 -1154302 -2405484 -2858346 -621527 10638888 30348411
3248C0348411J3615672j1389321l9228505m3461045j4739880K2408538L1333486
$$ 30348411 43964083 32574762 -6653743 -50114788 -64854668 -42446130 -11112644
3241a1112644O358487j8806037j4755842O809258J6110093R857437P137875R696712
$$ -11112644 -4754157 -23560194 -38316036 -31506778 -15396685 -5539248 1598627 11295339
3233A1295339j370292k7124366m0366216k4824633P02651J1711038J0423938J2622230
$$ 11295339 9925047 -17199319 -57565535 -82390168 -81687517 -69976479 -59552541 -46930311
3225d6930311J9095072J8428187P961773l454123q120496n615948j557993l930698
$$ -46930311 -27835239 -9407052 -1445279 -4899402 -13019898 -18635846 -20193839 -24124537
3217b4124537j2563448j2873259O094374K8812002K8403173N863155r671983m126686
$$ -24124537 -36687985 -49561244 -43466870 -14654868 13748305 19611460 9939477 5812791
3209E812791N384673N918631R154565K0687805J9831389n672584l0113975k3299457
$$ 5812791 11197464 17116095 26270660 46958465 66789854 61117270 31003295 7703838
3201G703838M715128J9649717R460904j0051431k2666699k1153501k917354J9983827
$$ 7703838 12418966 32068683 41529587 31478156 8811457 -12342044 -15259398 4724429
3193D724429K0106371j1663343m4617537m4488452j7403682O703044J8130962
$$ 4724429 24830800 13167457 -31450080 -75938532 -93342214 -86639170 -68508208
3186f8508208K6387631L1047281K6014562K0174501K1296680J2622373j9313967
$$ -68508208 -42120577 -11073296 14941266 35115767 56412447 69034820 49720853
3179D9720853m7667578l7515832m256597O537771q798525j1492482P999947J4278972
$$ 49720853 2053275 -35462557 -39719154 -33181383 -41979908 -53472390 -45472443 -31193471
3171c1193471n627074j5763165M377395K0590666K538176k1891044j1721382K0127443
$$ -31193471 -36820545 -52583710 -48206315 -27615649 -25077473 -46968517 -58689899 -38562456
3163c8562456K9329464R070932o745101L98896J2778069J1109550l629o067000
$$ -38562456 -9232992 -162060 -6907161 -6508265 6269804 17379354 17375725 11308725
3155A1308725k702907K861943Q57020r309137j2929576M160758K9672823L2702807
$$ 11308725 8605818 11467761 12324781 3015644 -9913932 -5753174 23919649 56622456
3147E6622456O822343j5840525r326522Q540788N769937j3898206j8756077J864826
$$ 56622456 63444799 47604274 38277752 46818540 52588477 38690271 19934194 21799020
3139B1799020K3631246K1484431l084433l0390428m2433066l2834388q379953
$$ 21799020 45430266 66914697 63830264 33439836 -8993230 -41827618 -50207571
3132e0207571J7023175L3340483L6310432K1259356r747366l3890256k4345336
$$ -50207571 -33184396 156087 36466519 57725875 47978509 14088253 -10257083
3125a0257083J0266995K8612913J1983647j1580292j6384183j7555292l0492292
$$ -10257083 9912 28622825 40606472 29026180 12641997 -4913295 -35405587
3118c5405587k8123806J4209877N7839879M3878911j3933093m2051008j4959843
$$ -35405587 -63529393 -49319516 8520363 52399274 38466181 -3584827 -18544670
3111a8544670J3358909J249365k0267255j0902952J0088057M586074j5113384
$$ -18544670 -5185761 -3936396 -24203651 -35106603 -25018546 -20432472 -35545856
3104c5545856j0247933J5936780K5999126J1904696J368276M463627P33226j5463372
$$ -35545856 -45793789 -29857009 -3857883 8046813 9415089 13878716 14611942 -851430
3096h51430j9544371m40861J5160353J631988k7415945l9271107k3740103J529980
$$ -851430 -20395801 -20836662 -5676309 -4044321 -31460266 -70731373 -94471476 -92941496
3088i2941496J5337960J0531597k791384m492075J4144823L3177457K4711984
$$ -92941496 -77603536 -67071939 -69863323 -74355398 -60210575 -27033118 -2321134
3081b321134o010262k2938033j0437490M948551n00730r935559O14046J6526818
$$ -2321134 -8331396 -31269429 -41706919 -36758368 -37259098 -47194657 -46580611 -30053793
3073c0053793Q707037j3041755j2642076J2334077K6515546J5417728N250890
$$ -30053793 -21346756 -34388511 -47030587 -34696510 -8180964 7236764 12487654
3066A2487654J2198322J3258166j0367400l5700370l2124506o759949J3116718
$$ 12487654 24685976 37944142 27576742 -8123628 -40248134 -47008083 -33891365
3059c3891365K0970276K4606437J8666312l118575k2682057j9117049n360584
$$ -33891365 -12921089 11685348 30351660 27233085 4551028 -14566021 -19926605
3052a9926605q793781k2769577j5043639J6991301L7455519K3806017o018118
$$ -19926605 -28720386 -51489963 -66533602 -49542301 -12086782 11719235 5701117
3045E701117k5618221k8262496j5552072J0102488L1288162K4947406j651673
$$ 5701117 -19917104 -48179600 -63731672 -53629184 -22341022 2606384 954711
3038I54711j4270654l085378K727184j2444247k0880774L97292K6722031K4332767
$$ 954711 -13315943 -16401321 -13674137 -26118384 -46999158 -46601866 -19879835 4452932
3030D452932L281989n393304j769345n412866j0055067M906067K7603335K4495241
$$ 4452932 7734921 2341617 572272 -4840594 -14895661 -9989594 17613741 42108982
3022D2108982l729352k0765145j2681973m619428j0573339r221304J1760390K5279601
$$ 42108982 38379630 17614485 4932512 313084 -10260255 -19481559 -7721169 17558432
3014A7558432O390459k2969204k2172855R967502L4148542K3192788o361970j7790160
$$ 17558432 23948891 979687 -21193168 -11225666 22922876 46115664 39753694 21963534
3006B1963534K632255K9967421K7313326j0210299m4109723l6152611K920312
$$ 21963534 24595789 54563210 81876536 71666237 27556514 -8596097 -5675785
2999e675785K7494779J6882113m753169j1400507p900812p350866n573706J397295
$$ -5675785 21818994 38701107 33947938 22547431 14646619 7295753 1722047 3119342
2991C119342M62263j2207657j1335917J8942569M5817853K6812682k1818008l9993090
$$ 3119342 3581605 -8626052 -19961969 -1019400 44798453 71611135 49793127 9800037
2983I800037q901707K3525552J5888076j0308075j4422172k148210p784820l0260845
$$ 9800037 898330 24423882 40311958 30003883 15581711 13433501 5648681 -24612164
2975b4612164l1504110J701261L3241097K7806590k843442k2106376j7823607
$$ -24612164 -56116274 -54415013 -21173916 6632674 3789232 -18317144 -36140751
2968c6140751q083458p756092j0522180m195398J0946893K3139214K1425199O016956
$$ -36140751 -44224209 -51980301 -62502481 -66697879 -55750986 -32611772 -11186573 -5169617
2960e169617r505508r575291M478873J3020090M220175o063296M541310K8314010
$$ -5169617 -14675125 -24250416 -19771543 -6751453 -2531278 -8594574 -4053264 24260746
2952B4260746L2226708K770141l3505399m3718033k6816686n880084L716124L108236
$$ 24260746 56487454 59257595 25752196 -17965837 -44782523 -50662607 -46946483 -43838247
2944d3838247k398897o988809j864570J3916096K3805089J1382400j4397733k7875123
$$ -43838247 -46237144 -53225953 -55090523 -41174427 -17369338 -5986938 -20384671 -48259794
2936d8259794j9861319n167239L882572J2204147K4088017K8894900J7089648
$$ -48259794 -68121113 -73288352 -69405780 -57201633 -33113616 -4218716 12870932
2929A2870932j197394o914689M340127J9063142K1748153P516598j4937785k6414519
$$ 12870932 11673538 4758849 9098976 28162118 49910271 57426869 42489084 16074565
2921A6074565j1478568K0338310L5286622J1950103k6384493l3962528j299687
$$ 16074565 4595997 24934307 60220929 72171032 45786539 11824011 10524324
2914A0524324K6731504O002419m5958871o7021611k8365628K8882898M7101400
$$ 10524324 37255828 43258247 -2700624 -69722235 -98087863 -69204965 -22103565
2907b2103565K1702813n582759r542863m986959p217635m587859J3232400K7958111
$$ -22103565 -400752 -5983511 -15526374 -20513333 -27730968 -32318827 -19086427 8871684
2899H871684J8778494k957188j1692411o583407m561867n591985K849142J2212936
$$ 8871684 27650178 24692990 13000579 6417172 1855305 -3736680 -887538 11325398
2891A1325398J62527k5212599k4989405J3308701M9175631M0056787l995038l7853114
$$ 11325398 11487925 -13724674 -38714079 -25405378 23770253 63827040 59832002 21978888
2883B1978888l6760289j3600022P027825J2054403L821759m075453J071338J4714694
$$ 21978888 -14781401 -28381423 -21353598 -9299195 -5477436 -9552889 -8481551 6233143
2875F233143J8717292P391697l004342J045693J0882461J1368079J345016j2392146
$$ 6233143 24950435 32342132 29337790 30383483 41265944 52634023 53979039 41586893
2867D1586893k5690301l0513624j6802534N485213Q058866j3923286k5829588
$$ 41586893 15896592 -14617032 -31419566 -25934353 -17875487 -31798773 -57628361
2860e7628361l777565K3911161J8838119n362289n493464J9830781K9544361Q777173
$$ -57628361 -61405926 -37494765 -18656646 -24018935 -29512399 -9681618 19862743 28639916
2852B8639916j0811487p611113q81466q600648j5928221p989496J992104K739891
$$ 28639916 17828429 10217316 9335850 735202 -15193019 -23182515 -21190411 -18450520
2844a8450520J0266045L3716368M5146393J8399764k3932970l9479530k6276931
$$ -18450520 -8184475 25531893 70678286 89078050 65145080 25665550 -611381
2837f11381j6069940j7925432r369304J6559838L3760435K2050846n263597k3965289
$$ -611381 -16681321 -34606753 -43976057 -27416219 6344216 28395062 23131465 -833824
2829h33824k6696688j8296325l158590J1863488J7220925J2773480Q495150P945783
$$ -833824 -27530512 -45826837 -48985427 -37121939 -19901014 -7127534 1367616 9313399
2821I313399L855478n891764j2167781r341251k830190J625639K893329j882133
$$ 9313399 13168877 7277113 -4890668 -14231919 -17062109 -15436470 -12543141 -14425274
2813a4425274j1293253q215288K0673628N0234810L4106102k7690806p0127837
$$ -14425274 -25718527 -33933815 -13260187 36974623 71080725 43389919 -26737918
2806b6737918m0081172L1465754O7485165L9832533r968727l6268692l5471564
$$ -26737918 -66819090 -35353336 32131829 71964362 61995635 25726943 -9744621
2799i744621k3555347n967388J3754524K2273678J3108645l84970l151175K233732
$$ -9744621 -33299968 -39267356 -25512832 -3239154 9869491 9484521 6333346 8567078
2791H567078M506443O1495q270147j7012305j9656276j1112098K04646L73966
$$ 8567078 13073521 13135016 4864869 -12147436 -31803712 -42915810 -42711164 -42337198
2783d2337198m816715O436628L3246761M1271053R232134l4772927m7749194k6946645
$$ -42337198 -47153913 -40717285 -7470524 33800529 43032663 8259736 -39489458 -66436103
2775f6436103m064160L549051N937589J0796789J1903416Q841639J0669344J5016941
$$ -66436103 -70500263 -66951212 -61013623 -50216834 -38313418 -29471779 -18802435 -3785494
2767c785494Q340104o775504r207499O265749J5974704L278200j3398909q260862
$$ -3785494 4554610 -2220894 -11428393 -5162644 10812060 14090260 691351 -7569511
2759g569511J0767784J2397320j1060387k9609035j5124042J9238661L2573057
$$ -7569511 3198273 15595593 4535206 -25073829 -40197871 -20959210 11613847
2752A1613847P136793k7533083l0621742j620129K2053716J7600129J684751o186638
$$ 11613847 18750640 -8782443 -39404185 -41024314 -18970598 -1370469 314282 -5872356
2744e872356j4749133l1704834l2311965L326836M0878906K9543392j7201587
$$ -5872356 -20621489 -52326323 -84638288 -81311452 -40432546 -10889154 -28090741
2737b8090741l3348950J073351L0626332J3756773j5065793q346374J7960442
$$ -28090741 -61439691 -60366340 -29740008 -15983235 -31049028 -39395402 -21434960
2730b1434960J9257748k010338r424292J076357K126413r631398j0900296n42593
$$ -21434960 -2177212 -4187550 -13611842 -12535485 -10409072 -20040470 -30940766 -31483359
2722c1483359k297198j6577334j4993864R498146K8041568K2378636R333507O326216
$$ -31483359 -33780557 -50357891 -65351755 -55853609 -27812041 -5433405 3900102 10226318
2714A0226318O050917K79211j006199R195834J8720555J5485957K708544j3754731
$$ 10226318 16277235 16556446 15550247 24746081 43466636 58952593 61661137 47906406
2706D7906406l1182653l7716228k1245769L162751N701220r847228o158784K5077978
$$ 47906406 16723753 -20992475 -42238244 -39075493 -33374273 -43221501 -49380285 -24302307
2698b4302307M0816908J1940824k6865380k7746470J2987J1729526j717958r596414
$$ -24302307 16514601 28455425 1590045 -26156425 -26143438 -14413912 -16131870 -25728284
2690b5728284K104403J3671607J1619659P665078J1022711J2558746O031133P48366
$$ -25728284 -23623881 -9952274 1667385 9332463 20355174 32913920 38945053 39693419
2682C9693419L376612O553853M002140L06586j719207p979588j9385106k4530691
$$ 39693419 43070031 49623884 53626024 53932610 52213403 44233815 24848709 318018
2674C18018j5310158l76731N773500J435707k037985L254637J0032251L322911
$$ 318018 -14992140 -15368871 -9595371 -8159664 -10197649 -6943012 3089239 6412150
2666F412150j9158397l7797113l0348148o15290K2960289K1087195M633947l743878
$$ 6412150 -12746247 -50543360 -80891508 -81506798 -58546509 -37459314 -32825367 -36569245
2658c6569245L030285J5034440J9927737J1305582o232903j4742193m26633K1243776
$$ -36569245 -33538960 -18504520 1423217 12728799 6495896 -8246297 -8672930 12570846
2650A2570846J8398536j0564383k8403818j1749420J5307805K1398313J2618111
$$ 12570846 30969382 20404999 -7998819 -19748239 -4440434 16957879 29575990
2643B9575990Q713876L692984j2396886j8311849O140835L3053427K3300405m753484
$$ 29575990 38289866 41982850 29585964 11274115 17414950 50468377 73768782 69015298
2635F9015298k393094K1863646J0276151m2304494o7055131k6158361K7642233
$$ 69015298 66622204 88485850 98762001 56457507 -10597624 -36755985 -9113752
2628i113752L4359378J1132246N353897J2765845L1637k5471438k8681090r814721
$$ -9113752 25245626 36377872 41731769 54497614 54529251 29057813 376723 -9437998
2620i437998M86050l528411j870114O372216M832665q85453P583010J8709152
$$ -9437998 -8951948 -12480359 -14350473 -7978257 -3145592 -4031045 3551965 22261117
2612B2261117N912040j7803158j1814461K1666363L2651441J856820k7610702
$$ 22261117 28173157 10369999 -1444462 20221901 52873342 54730162 27119460
2605B7119460j8803363O110819J0533270m06464l714176m035497j4660251j9090671
$$ 27119460 8316097 14426916 24960186 24553722 20839546 16804049 2143798 -16946873
2597a6946873L866333L2545697K5929710j0339749k6042929l20694K7133777J5745711
$$ -16946873 -13080540 19465157 45394867 35055118 9012189 8691495 35825272 51570983
2589E1570983j8000757k9166283j0519979K724680r625225k2313784m916576K9063804
$$ 51570983 33570226 4403943 -6116036 -3391356 -13016581 -35330365 -40246941 -11183137
2581a1183137L8230046J2265627j2983528p912043Q683784J542632k4427201l1120562
$$ -11183137 27046909 39312536 26329008 18416965 27100749 28643381 4216180 -26904382
2573b6904382o481375J7407107J4094453J35964M214121K1954215K6053830Q372254
$$ -26904382 -33385757 -15978650 -1884197 -1748233 2465888 24420103 50473933 58846187
2565E8846187j2725276k1960123k2571075k1851620j8278201p218117J0279664
$$ 58846187 46120911 24160788 1589713 -20261907 -38540108 -45758225 -35478561
2558c5478561K6836433L2086816J9636290l280896j7717547j2137021M108336
$$ -35478561 -8642128 23444688 43080978 39800082 22082535 9945514 14053850
2551A4053850J2660107O589114o695007j6035215j3535396R99387J5612117J5480032
$$ 14053850 26713957 33303071 26608064 10572849 -2962547 -1963160 13648957 29128989
2543B9128989L618755n21879P544190M850616k2924723m9836097m0109834l59366
$$ 29128989 32747744 32225865 39770055 44620671 21695948 -28140149 -68249983 -68609349
2535f8609349K7592116K3057933O771238K654414P585939P643295Q17330p286723
$$ -68609349 -41017233 -17959300 -11188062 -8533648 -947709 6695586 7512916 226193
2527B26193j2530863r693495J893444P085318q171383k5688067j1660969K5284989
$$ 226193 -12304670 -21998165 -20104721 -13019403 -21190786 -46878853 -58539822 -33254833
2519c3254833K9601230k2895287p5825273o0008002J0869213N7231753L8735009
$$ -33254833 -3653603 -26548890 -102374163 -162382165 -151512952 -94281199 -55546190
2512e5546190l129858j3545590O219721J7978846O148876q845112n073138J4065992
$$ -55546190 -58676048 -72221638 -66001917 -48023071 -41874195 -50719307 -55792445 -41726453
2504d1726453K6713793J7175650n969705j6591731j661214J8890302J5684305
$$ -41726453 -15012660 2162990 -3806715 -20398446 -22059660 -3169358 12514947
2497A2514947r814619k6744798j7573956J607408R376428N929571J095677l943716
$$ 12514947 2700328 -24044470 -41618426 -40011018 -30634590 -24705019 -23609342 -27553058
2489b7553058q079811j886135J4353154K0586413N291193j1148554n383226R531419
$$ -27553058 -35632869 -37519004 -23165850 -2579437 2711756 -8436798 -13820024 -4288605
2481d288605L422351j9382793k1943206Q638621L9137987L6744102J0709370q859219
$$ -4288605 -866254 -20249047 -42192253 -33553632 5584355 42328457 53037827 44178608
2473D4178608j2059850r784183r440878j0240545j2044433j1312872J861572K4999038
$$ 44178608 32118758 22334575 12893697 2653152 -9391281 -20704153 -18842581 6156457
2465F156457L2015132L350914l8206281m7344508j4674934J8022280J1053939
$$ 6156457 38171589 41522503 3316222 -44028286 -58703220 -40680940 -29627001
2458b9627001k2672548l6001935p646820L2228270L8270248K339848l7485039
$$ -29627001 -52299549 -88301484 -95948304 -63720034 -25449786 -23109938 -60594977
2451f0594977m0166468o999828K4697706K9986070K1855616K1666821K3268268
$$ -60594977 -100761445 -107761273 -83063567 -53077497 -31221881 -9555060 13713208
2444A3713208O861227k2590910l7297228k6024411o575179N209337J4448839K5976730
$$ 13713208 20574435 -2016475 -39313703 -65338114 -71913293 -66703956 -52255117 -26278387
2436b6278387K7507645J0165315j1116538j5224264j665155J4767192K5181108
$$ -26278387 1229258 11394573 278035 -14946229 -16611384 -1844192 23336916
2429B3336916K8053473K0164292J885111j6159926k5206854k9125785l1956316
$$ 23336916 51390389 71554681 73439792 57279866 32073012 2947227 -29009089
2422b9009089k7106022j2939006m289576r872930j3249325P80893J5957082R973606
$$ -29009089 -56115111 -69054117 -73343693 -83216623 -96465948 -95685055 -79727973 -69754367
2414f9754367k755328R461641L9213291M4379962J2420094k0661587k5678364
$$ -69754367 -72509695 -63048054 -23834763 20545199 32965293 12303706 -13374658
2407a3374658j4399012l492506J3157545L1920615K1280833k7014163o2976402
$$ -13374658 -27773670 -31266176 -18108631 13811984 35092817 8078654 -54897748
2400e4897748l9743636J4219693L3350982R257045p499339N667305J3925409n875963
$$ -54897748 -94641384 -80421691 -47070709 -37813664 -45313003 -39645698 -25720289 -31596252
2392c1596252k2654102o217630J9057192J4497251q256283n991662K6871809M9387721
$$ -31596252 -54250354 -60467984 -41410792 -26913541 -35169824 -41161486 -14289677 35098044
2384C5098044L3897700L51162j7155972j2321106k832966k148977q788569j4818888
$$ 35098044 68995744 69346906 52190934 39869828 37036862 34887885 26099316 11280428
2376A1280428j4617669r356739p572303j5761447k5531481j9140057N781597K6221884
$$ 11280428 -3337241 -12693980 -20266283 -36027730 -61559211 -80699268 -74917671 -48695787
2368d8695787J9896433l747007j2891128N623999K9243297L0417655J1696544
$$ -48695787 -28799354 -32546361 -45437489 -39813490 -10570193 19847462 31544006
2361C1544006k510181j061655M159052K550316N26758N809187J0559905K727188
$$ 31544006 29033825 27972170 32131222 34681538 35208296 41017483 51577388 54304576
2353E4304576j3820587k3267064j8369947o145651M658658J1058425J1427654
$$ 54304576 40483989 17216925 -1153022 -7298673 -2640015 8418410 19846064
2346A9846064M452313n268542r508207p597515p517619j1588612r095811Q350742
$$ 19846064 24298377 19029835 9521628 1924113 -5593506 -17182118 -26277929 -17927187
2338a7927187K8471916K7408507J016283k3042558j6156402J1757772K0028815
$$ -17927187 10544729 37953236 38969519 15926961 -229441 11528331 31557146
2331C1557146r369025m2735378l5628917P830844M0417000L4522416J2718714
$$ 31557146 22188121 -20547257 -56176174 -48345330 -7928330 26594086 39312800
2324C9312800P871952J8020893J8346499M94287k0501917k8921693k0844440j394615
$$ 39312800 47184752 65205645 83552144 84046431 63544514 34622821 13778381 12383766
2316A2383766J5897684J4883387l879454j7741332r772521P461288J0898764p73518
$$ 12383766 28281450 43164837 39285383 21544051 11771530 19232818 30131582 29358064
2308B9358064j1359842j3641005j2041993p331371R27044M000834l713910r862446
$$ 29358064 17998222 4357217 -7684776 -15016147 -14089103 -10088269 -13802179 -23664625
2300b3664625k024747R533137R741418O947395J5198283K0938322K507967k5739358
$$ -23664625 -25689372 -16156235 -6414817 532578 15730861 36669183 39177150 13437792
2292A3437792k8681916o518097O158116k226292p940089j141341K19180n009499
$$ 13437792 -15244124 -21762221 -15604105 -17830397 -25770486 -26911827 -26692647 -31702146
2284c1702146O852091L1918397L0736415l872506k3992024l240047J6437190m328625
$$ -31702146 -24850055 7068342 37804757 33932251 9940227 6700180 23137370 18808745
2276A8808745l4687538k8069079k93644O433227R23407J6794828L5822762J2418393
$$ 18808745 -15878793 -43947872 -44241516 -37808289 -36884882 -20090054 15732708 28151101
2268B8151101l7304287m6528868n12316M1048669L5655888Q426950n856636j1236418
$$ 28151101 -9153186 -55682054 -56194370 -15145701 20510187 28937137 23080501 11844083
2260A1844083j7468702j2044640O184545J0937664n889578j4341378M99790P950825
$$ 11844083 -5624619 -17669259 -11484714 -547050 -6436628 -20778006 -20278216 -12327391
2252a2327391j3893190l3985218j7086433J7471765K7585892J1917424l50117
$$ -12327391 -26220581 -60205799 -77292232 -59820467 -32234575 -20317151 -20667268
2245b0667268r69097r86822M269654K3450982L4399845Q142586l5758061m4170962
$$ -20667268 -21636365 -22623187 -18353533 5097449 39497294 47639880 11881819 -32289143
2237c2289143o688992K5404080J0986062k5749869l3556194j468530L7133757
$$ -32289143 -38978135 -13574055 -2587993 -28337862 -61894056 -63362586 -26228829
2230b6228829N1970540M2130520K1081396j116578j6421095j6547613l453376
$$ -26228829 25741711 67872231 88953627 87837049 71415954 54868341 51414965
2223E1414965N299017n789453k7731613l4451004j6385907N983014J0566635K266862
$$ 51414965 56713982 50924529 23192916 -11258088 -27643995 -21660981 -11094346 -8827484
2215h827484q29104L158845M705329O452360J5792811K0833571N013683j6799005
$$ -8827484 -9656588 -6497743 -1792414 4659946 20452757 41286328 46300011 29501006
2207B9501006j3001513J0802678J3477387j4968872l2778971j3888130R134564
$$ 29501006 16499493 27302171 40779558 25810686 -6968285 -20856415 -11721851
2200a1721851K749374r224813R106114L5898927K3452963j9757540l8208602j4114577
$$ -11721851 -8972477 -18197290 -9091176 26807751 50260714 30503174 -7705428 -21820005
2192b1820005J3277905J4894248M280315m952805k0249185l2600804j0513482
$$ -21820005 -8542100 6352148 10632463 5679658 -14569527 -47170331 -57683813
2185e7683813M1935498O7827120L3292325j8007174k6649739j641759M584780
$$ -57683813 -15748315 52078805 85371130 67363956 40714217 39072458 43657238
2178D3657238j7066410k5565731m278103J2223398j901545k2462938j8075085
$$ 43657238 26590828 1025097 -3253006 8970392 7068847 -15394091 -33469176
2171c3469176n52706r35882j6415649j6935519K929670J4541672L171966o497465
$$ -33469176 -34021882 -34957764 -51373413 -68308932 -65379262 -50837590 -47665624 -54163089
2163e4163089R703245L3857180L0129393k742080l1676719l6635493k7424189
$$ -54163089 -44459844 -10602664 19526729 16784649 -14892070 -51527563 -78951752
2156g8951752j2303838J5221553M5874025M5906414M999546l4004315k6551436
$$ -78951752 -91255590 -76034037 -30160012 15746402 20745948 -13258367 -39809803
2149c9809803J0712572K5041083L552766j6787080j1592533J958192N549569P363090
$$ -39809803 -29097231 -4056148 -503382 -17290462 -28882995 -26924803 -21375234 -14012144
2141a4012144J2684616M031005k4507701m2213940k0311006K4003420M9791435
$$ -14012144 -1327528 2703477 -21804224 -64018164 -84329170 -60325750 -10534315
2134a0534315M3997760K4858722O898528q603355j5351737l626855J8349030K7151153
$$ -10534315 33463445 58322167 65220695 56617340 41265603 37638748 55987778 83138931
2126H3138931J2203709j3914282l2573687l2405016j0665258J9570899K7599449
$$ 83138931 95342640 81428358 48854671 16449655 5784397 25355296 52954745
2119E2954745n243786n1706974n9191043j3311093M0428653N1181680K0396245
$$ 52954745 47710959 -3996015 -63187058 -76498151 -36069498 15112182 35508427
2112C5508427j1326755j9037784j2543389q042623n292083K128050J0894352J2345589
$$ 35508427 24181672 5143888 -7399501 -15442124 -20734207 -18606157 -7711805 4633784
2104D633784N416386k174312k882370L627447R888046O409083q265873k3618603
$$ 4633784 10050170 7875858 4993488 8620935 18508981 24918064 16652191 -6966412
2096f966412k8383950k4584362k2107651j9350185k389148K9729439N1659825
$$ -6966412 -35350362 -59934724 -82042375 -101392560 -103781708 -74052269 -22392444
2089b2392444L8027734k798677l5651856l7081956j3972523J3214012K8885398
$$ -22392444 15635290 12836613 -22815243 -59897199 -73869722 -60655710 -31770312
2082c1770312K3897241r73925k5870345k4487716K524594K2130171J0515417j3766409
$$ -31770312 -7873071 -8846996 -34717341 -59205057 -56680463 -34550292 -24034875 -37801284
2074c7801284j5354130R643594L0589866K3169433m154439k3766126j6238031
$$ -37801284 -53155414 -43511820 -12921954 10247479 6093040 -17673086 -33911117
2067c3911117J3901312L9193363L0806655r825567m6870112m8413025k0229771
$$ -33911117 -20009805 19183558 49990213 40164646 -6705466 -55118491 -75348262
2060g5348262J0043858K7999253L3739074K4500677L173632p706702P702772K6196512
$$ -75348262 -65304404 -37305151 -3566077 20934600 24108232 16401530 24104302 50300814
2052E0300814J4770559j3713775j6686317N979002O582018k9895342n2521352
$$ 50300814 65071373 51357598 34671281 40650283 47232301 17336959 -35184393
2045c5184393k1780467K5497831L1061924J000058j2887121L606035J4766761
$$ -35184393 -56964860 -31467029 -405105 594953 -12292168 -8686133 6080628
2038F080628l39273j9161555j7464030j330664J3102194K1974628K4342813J4369204
$$ 6080628 5741355 -13420200 -30884230 -32214894 -19112700 2861928 27204741 41573945
2030D1573945m864936j6618659r957876O302291J3870140K036631k3305777l9643874
$$ 41573945 36709009 20090350 10132474 16434765 30304905 32341536 9035759 -30608115
2022c0608115k5092544J2332510L4537088J9294581p854231j0791365L332186
$$ -30608115 -55700659 -43368149 -8831061 10463520 2609289 -8182076 -4849890
2015d849890J21673k2250187k9337272o751609K0007787K9724970L0957413L0482115
$$ -4849890 -4728217 -26978404 -56315676 -63067285 -43059498 -13334528 17622885 48105000
2007D8105000J4184152j9976385m2767996l2761041q847159Q45560q00784L830021
$$ 48105000 62289152 42312767 -455229 -33216270 -42063429 -41217869 -42018653 -38188632
1999c8188632J2263621J1851129P514611J0888605J4791208N922393p957234r740411
$$ -38188632 -25925011 -14073882 -6559271 4329334 19120542 25042935 17085701 7345290
1991G345290j523227L983073Q886087J9388369K2379366N664178r203776O078785
$$ 7345290 5822063 9805136 18691223 38079592 60458958 66123136 56919360 62998145
1983F2998145L1577041J7180140l7340641o7384514l0289350L1841505M6988300
$$ 62998145 94575186 111755326 74414685 7030171 -23259179 8582326 55570626
1976E5570626M001001m4342657n2005988k1725941J4448042K8285413J2193957
$$ 55570626 59571627 15228970 -36777018 -58502959 -44054917 -15769504 -3575547
1969c575547j4877668k0650194L928627K7492389J6877136j4911980k4730156
$$ -3575547 -18453215 -39103409 -35174782 -7682393 9194743 -5717237 -30447393
1962c0447393l58129K3562961J6615365p705234j7677934p826296J538643k645694
$$ -30447393 -30805522 -7242561 9372804 1667570 -16010364 -23836660 -22298017 -24943711
1954b4943711j2557111j5184935p913094J592699L950915j910308m254155R751491
$$ -24943711 -37500822 -52685757 -60598851 -59006152 -55055237 -56965545 -61219700 -51468209
1946e1468209L4066740M4954898K9302947K350773j2391644j1715519q893588
$$ -51468209 -17401469 27553429 56856376 59207149 46815505 35099986 26206398
1939B6206398r672542q548685n026311n667113q910362m484881P811663J3950671
$$ 26206398 16533856 7985171 2958860 -2708253 -11618615 -16103496 -8291833 5658838
1931E658838P221543K23347N143113J3047573O428437j3159286k4379289j4029590
$$ 5658838 12880381 13103728 18246841 31294414 37722851 24563565 184276 -13845314
1923a3845314N370301J1040068l134366k1451858k6035805j4696151K739119J8428907
$$ -13845314 -8475013 2565055 -569311 -22021169 -48056974 -62753125 -60014006 -41585099
1915d1585099K8755283K7566878J1628743n524066k565383J7346898K0689699
$$ -41585099 -12829816 14737062 26365805 20841739 18276356 35623254 56312953
1908E6312953j2393039n2412602n4015480j7684867J1352280O190170j0780278
$$ 56312953 43919914 -8492688 -62508168 -80193035 -68840755 -62650585 -73430863
1901g3430863q807252Q472586J7984982J2088417q52853j3348695j7795500m380175
$$ -73430863 -82238115 -73765529 -55780547 -43692130 -44544983 -57893678 -75689178 -80069353
1893h0069353K1281351L3169287J7105387n899956q734235L906886R737668O714938
$$ -80069353 -58788002 -25618715 -8513328 -14413284 -23147519 -19240633 -9502965 -2788027
1885b788027Q745150J3923324P728530o899094j2178948n721873K17025O661355
$$ -2788027 5957123 19880447 27608977 20709883 8530935 2809062 3026087 9687442
1877I687442K3653381L8967049K6362706r779364l3102586k7516276j5870987
$$ 9687442 33340823 72307872 98670578 88891214 55788628 28272352 12401365
1870A2401365j4774809q788664J0917268J9924960J444312j7981975q118059J4513880
$$ 12401365 -2373444 -11162108 -244840 19680120 21124432 3142457 -4975602 9538278
1862I538278J2987380j2003592k8828342k5639504j5065027R79339K7832298M4053730
$$ 9538278 22525658 10522066 -18306276 -43945780 -59010807 -58031468 -30199170 13854560
1854A3854560J8281671l3561072n3985533k2868310J1637635N295379j7770165
$$ 13854560 32136231 -1424841 -55410374 -78278684 -66641049 -61345670 -79115835
1847g9115835q099627L0478423M9095464K7504954m126799j6709791j5614203
$$ -79115835 -87215462 -56737039 -7641575 19863379 15736580 -973211 -16587414
1840a6587414j2888672j683028K0717000L0313852N531983l3167355m1581249
$$ -16587414 -29476086 -31159114 -10442114 19871738 25403721 -7763634 -49344883
1833d9344883r500899K3903143K0108982j1342996k8451481r242212K6397610
$$ -49344883 -58845782 -34942639 -14833657 -26176653 -54628134 -63870346 -37472736
1826c7472736M4682471L4287284J0942765n591856j1381823j6128072k6560410
$$ -37472736 7209735 41497019 52439784 46847928 35466105 19338033 -7222377
1819g222377l6168580l2576643j2898874J1642134K6466467K6021860J5473515
$$ -7222377 -43390957 -75967600 -88866474 -77224340 -50757873 -24736013 -9262498
1812i262498M117799j505084j158737R99857L080058P373079J1973397P309276
$$ -9262498 -5144699 -6649783 -7808520 -6808663 -3728605 3644474 15617871 22927147
1804B2927147q459119j7348903l227005J7278462J1245100j8346859k8058699
$$ 22927147 14468028 -2880875 -6107880 11170582 22415682 4068823 -23989876
1797b3989876K013669L1881581J9062052j4975381j7890636J0632083J9633023
$$ -23989876 -21976207 9905374 28967426 13992045 -3898591 6733492 26366515
1790B6366515j0729700l8838496k7572451L832684J7417560J0904091O092468
$$ 26366515 15636815 -23201681 -50774132 -46941448 -29523888 -18619797 -12527329
1783a2527329P887870L767851j0448267k6464049l4713528k6685069p90513K4592847
$$ -12527329 -4639459 -871608 -11319875 -37783924 -72497452 -99182521 -99973034 -75380187
1775g5380187K4590874M508144k505216J3232438K0395272p77713k3013132j7023394
$$ -75380187 -50789313 -46281169 -48786385 -35553947 -15158675 -15936388 -38949520 -55972914
1767e5972914R74390K175382l760370P428837K3384387J4757737r518926j4084459
$$ -55972914 -54998524 -52823142 -56583512 -49154675 -25770288 -11012551 -20531477 -34615936
1759c4615936M858729J8654755J6575826J2444987O798074j0488204k2967973
$$ -34615936 -29757207 -11102452 5473374 17918361 24716435 14228231 -8739742
1752h739742l386913L1189688L1816847o587130l3495639k0413891R73651j438620
$$ -8739742 -12126655 19063033 50879880 44292750 10797111 -9616780 -8643129 -10081749
1744a0081749j1713461n562369M524795k286907j4845905j1258489M769119J6561884
$$ -10081749 -21795210 -27357579 -22832784 -25119691 -39965596 -51224085 -46454966 -29893082
1736b9893082K0747881J8416975M499936j3540965j3365138N355504J0877515
$$ -29893082 -9145201 9271774 13771710 230745 -13134393 -7778889 3098626
1729C098626j1912199l3710808k5840987j222479J5525417K4912444L0165693
$$ 3098626 -8813573 -42524381 -68365368 -69587847 -54062430 -29149986 1015707
1722A015707J4439283k2980450m1788622j4084534K6671485L3520553J4633517
$$ 1015707 15454990 -7525460 -49314082 -63398616 -36727131 -3206578 11426939
1715A1426939P376153J1275585R55271j4803441n193632K2557037L0767257J3001954
$$ 11426939 18803092 30078677 31033948 16230507 11036875 33593912 64361169 77363123
1707G7363123l218683r568689k1260099l3039692k3897210l922421l360943j5090142
$$ 77363123 74144440 64575751 43315652 10275960 -13621250 -17543671 -20904614 -35994756
1699c5994756k863364K9917564L5962400k080079m4985088n3961408k8683094
$$ -35994756 -38858120 -8940556 27021844 24941765 -20043323 -74004731 -102687825
1692a02687825J2428986L9462559O927200q9041495j53405313p9897868Q8955940
$$ -102687825 -90258839 -50796280 -43869080 -132910575 -286315888 -366213756 -277257816
1685b77257816J83868269J24613790J8082005j0345871J6009884O995598l2156961
$$ -277257816 -93389547 31224243 49306248 38960377 54970261 61965859 29808898
1678B9808898l0071220J1619457K2854637j1784582l6601813k6368308j4248590
$$ 29808898 -262322 11357135 34211772 22427190 -14174623 -40542931 -54791521
1671e4791521j5486869n647589J5387861J2603937j6332609k8788132q137219
$$ -54791521 -70278390 -75925979 -60538118 -47934181 -64266790 -93054922 -101192141
1664a01192141J3437681J6872198K1343049L2810392K7577542N900592L225938
$$ -101192141 -87754460 -70882262 -49539213 -16728821 10848721 16749313 19975251
1657A9975251K5377145K9647657k636567k9758801j7769549O110041N134800p230976
$$ 19975251 45352396 75000053 72363486 42604685 24835136 30945177 36079977 28849001
1649B8849001m15253J6756749J4360621r318316l1184614l5539119j8845738J3330190
$$ 28849001 28433748 45190497 59551118 50232802 19048188 -16490931 -35336669 -22006479
1641b2006479L5418686J8977789k0673020l1747652j88208K6834189J7102007
$$ -22006479 13412207 32389996 11716976 -20030676 -20218884 6615305 23717312
1634B3717312K936706J7568863L2817539J1228211k2665603k2523019J181057
$$ 23717312 26654018 44222881 77040420 88268631 65603028 43080009 44261066
1627D4261066M686440j1651476j2970473K74627l823039k3771626k5083986k838772
$$ 44261066 48947506 37296030 24325557 24600184 20777145 -2994481 -28078467 -30917239
1619c0917239J2914611J3403170J8098726K5615974J3277013j1123783j2605853
$$ -30917239 -18002628 -4599458 13499268 39115242 52392255 41268472 28662619
1612B8662619R572996J8314192M239058j608290Q350806J589140k8237744l8307082
$$ 28662619 38235615 56549807 60788865 59180575 67531381 69120521 40882777 2575695
1604B575695q582548J8312463M877815k1997331k0045484J003910M678856j1370750
$$ 2575695 -6006853 12305610 17183425 -4813906 -24859390 -23855480 -19176624 -30547374
1596c0547374k2517929k1475902j7265191r412508L550844Q438928k02365k084933
$$ -30547374 -53065303 -74541205 -91806396 -101218904 -97668060 -89229132 -89431497 -91516430
1588i1516430J6203434L2476734K2400882j94347p226079L38223M122948K679227
$$ -91516430 -75312996 -42836262 -20435380 -20629727 -27855806 -27517583 -23394635 -20715408
1580b0715408K997544j189984j1193491o980194J7079941K6857835p33628k9258046
$$ -20715408 -17717864 -18907848 -30101339 -37081533 -20001592 6856243 6122615 -23135431
1572b3135431j4758197J8277461J3064493k3202451k8131679J1970841L8284200
$$ -23135431 -37893628 -19616167 -6551674 -29754125 -57885804 -45914963 -7630763
1565g630763J4696403j9707254k1684880q667666j3247764k0847648j256317L0129795
$$ -7630763 7065640 -12641614 -34326494 -42994160 -56241924 -77089572 -78345889 -48216094
1557d8216094L3360368R009084m628251O761906J6245908K886475j9083549k8547525
$$ -48216094 -14855726 -5846642 -10474893 -3712987 12532921 15419396 -3664153 -32211678
1549c2211678k7173926k5189040j7735778L584512K5688680K4242649L92866j4904147
$$ -32211678 -59385604 -84574644 -102310422 -98725910 -73037230 -48794581 -48401715 -63305862
1541f3305862l924120J1500251P625658K730864K6138511N3787714K8536441m4267072
$$ -63305862 -67229982 -55729731 -48104073 -45373209 -19234698 34553016 63089457 18822385
1533A8822385q1203080l5896899K5275252J8738899k9812251l0660903K4050052
$$ 18822385 -62380695 -98277594 -73002342 -54263443 -84075694 -114736597 -90686545
1526i0686545N0196380R402492l3763378k0069239J8484744K5949734J0177608
$$ -90686545 -40490165 -31087673 -64851051 -84920290 -66435546 -40485812 -30308204
1519c0308204P430824R585189j0860390l6568262k8371979O402287K4596662J5201889
$$ -30308204 -22877380 -13292191 -24152581 -60720843 -89092822 -82690535 -58093873 -42891984
1511d2891984O181127R682192P768945p556260k1539405k6072555k6465269j8291977
$$ -42891984 -36710857 -27028665 -19259720 -26815980 -48355385 -74427940 -100893209 -119185186
1503a19185186Q158303L9116484M6513541K8683373J0801818L411140o431198
$$ -119185186 -111026883 -71910399 -25396858 3286515 14088333 17499473 11068275
1496A1068275j9909255j8607008q86675Q389237j698585r192555K412794J5709352
$$ 11068275 -8840980 -27447988 -28334663 -19945426 -21644011 -30836566 -28423772 -12714420
1488a2714420J0162078l356068l371309N958817O302189K3266N245381K1150256
$$ -12714420 -2552342 -5908410 -9279719 -3320902 2981287 3004553 8249934 29400190
1480B9400190K5903131J2404774J564864Q846210J6899511M85296l1741254m4774820
$$ 29400190 55303321 67708095 69272959 78119169 95018680 95503976 63762722 18987902
1472A8987902k8004511j2459558k2702753l4915674j2259828L1513686M4043718
$$ 18987902 -9016609 -21476167 -44178920 -79094594 -91354422 -59840736 -15797018
1465a5797018J2033476j6151216k855884K4482275K2106867r75770n174221J0916971
$$ -15797018 -3763542 -19914758 -22770642 1711633 23818500 22842730 17668509 28585480
1457B8585480J2857842p057861j7856525l594825J3533832J2766519O38573j3206295
$$ 28585480 41443322 34385461 16528936 12934111 26467943 39234462 39873035 26666740
1449B6666740l1361188m6846412l9055711q074381J6109909J5495866P279715
$$ 26666740 -4694448 -51540860 -90596571 -98670952 -82561043 -67065177 -59785462
1442e9785462Q333577O893769p513137j4944528M021874L0072736L0241912O333800
$$ -59785462 -51451885 -44558116 -52071253 -67015781 -62993907 -32921171 -2679259 3654541
1434C654541j2604258j4435817r480675j200255J4912909K6588382J3681071j3909604
$$ 3654541 -8949717 -23385534 -32866209 -34066464 -19153555 7434827 21115898 7206294
1426G206294j9518484Q221061L4552153K5627190o829675k7784936k7393553k2250519
$$ 7206294 -12312190 -4091129 30461024 56088214 49258539 21473603 -5919950 -28170469
1418b8170469j9156623p253384J2371931J7497691j129387j6886420L17897L8946822
$$ -28170469 -47327092 -54580476 -42208545 -24710854 -25840241 -42726661 -42408764 -3461942
1410c461942N6246651L1766790j1398664m0786337m6485165l2094662q08226L2043593
$$ -3461942 52784709 84551499 73152835 32366498 -14118667 -46213329 -47021555 -14977962
1402a4977962L6723139N811249k3774921j5255118J4352824J9020533o582678
$$ -14977962 21745177 27556426 3781505 -11473613 2879211 21899744 15317066
1395A5317066k2753530j0435008K871518m979305j5075427o387615N736471K27842
$$ 15317066 -7436464 -17871472 -14999954 -19979259 -35054686 -41442301 -35705830 -35477988
1387c5477988q926438K796564K5106884K8070288J0365884k550869j781173k382572
$$ -35477988 -44404426 -41607862 -16500978 11569310 21935194 19384325 17603152 15220580
1379A5220580q802310n952952R816825J9532708J1133506k865931q007460q331466
$$ 15220580 6418270 465318 10282143 29814851 40948357 38082426 30074966 21743500
1371B1743500j1888775j2870366l255684R702196J3188010Q315740M687695O21292
$$ 21743500 9854725 -3015641 -6271325 3430871 16618881 24934621 29622316 30243608
1363C0243608j3334665l0368613k7106004J082587K1352127K820930l2883938
$$ 30243608 16908943 -13459670 -40565674 -39483087 -18130960 -15310030 -48193968
1356d8193968l1985726J4028743M6406477J8484514l3833892m1205712n57414
$$ -48193968 -80179694 -66150951 -19744474 -1259960 -35093852 -76299564 -76856978
1349g6856978K6780473J2413235l103209J3084811L1445628J6157368j1956615
$$ -76856978 -50076505 -37663270 -40766479 -27681668 3763960 19921328 7964713
1342G964713j4447490j392589o324438j9965756o207259K7940833L6698043J0503553
$$ 7964713 -6482777 -7875366 -14199804 -34165560 -40372819 -12431986 24266057 34769610
1334C4769610q031522O143735K4238995J5988247m248347r341117m078798r044595
$$ 34769610 26738088 32881823 57120818 73109065 68860718 59519601 55440803 46396208
1326D6396208k2308606k4412829q510619J4238674K8663933K1948519r416702
$$ 46396208 24087602 -325227 -8835846 5402828 34066761 56015280 46598578
1319D6598578m5614606n2314398k0012355J7803198K1840157p182440l3812375
$$ 46598578 983972 -51330426 -71342781 -53539583 -31699426 -38881866 -72694241
1312g2694241l0220939l68975L0624543L9400408K2102231k272339j1418878n925977
$$ -72694241 -102915180 -103284155 -72659612 -33259204 -11156973 -13429312 -24848190 -30774167
1304c0774167n403781j5654738j7319017K705058K6191683K7164419Q863080k247757
$$ -30774167 -36177948 -51832686 -69151703 -66446645 -40254962 -13090543 -4227463 -6475220
1296f475220N568077J5288955O352812j8450753l5511607k5147683P547408L5854249
$$ -6475220 -907143 14381812 20734624 2283871 -33227736 -58375419 -50828011 -14973762
1288a4973762L7372620J5696729p852747j9457439k0098462j2805586Q20909J1459704
$$ -14973762 22398858 38095587 30242840 10785401 -9313061 -22118647 -21297738 -9838034
1280i838034P682163n337662r734165j760690L473706j398928n966174n853746
$$ -9838034 -2155871 -7493533 -17227698 -18988388 -15514682 -16913610 -22879784 -28733530
1272b8733530j2525020k6914599k7527809k634723K6934462L6918792L1759600
$$ -28733530 -41258550 -68173149 -95700958 -98335681 -71401219 -34482427 -2722827
1265b722827K6573122J7836473j597853j6533922r554754N789017L988350r635133
$$ -2722827 23850295 41686768 40088915 23554993 14000239 19789256 23777606 14142473
1257A4142473q539146Q469479J5177942J755801j3282093j7422209j7439505j3877262
$$ 14142473 5603327 14072806 29250748 31006549 17724456 302247 -17137258 -31014520
1249c1014520L321194K4785326K2155111o545158k4266024p116080J9893762K2270552
$$ -31014520 -27693326 -2908000 19247111 12701953 -11564071 -18680151 1213611 23484163
1241B3484163N120238m328132j918863l728255j2163702j4725852q320310P27189
$$ 23484163 28604401 24276269 22357406 18629151 6465449 -8260403 -16580713 -15853524
1233a5853524J2456651K4539103J8774186j3912910m3607347l1880481J0015647
$$ -15853524 -3396873 21142230 39916416 26003506 -17603841 -49484322 -39468675
1226c9468675L1395031J4870847k327782O331394J3332724j1187409m0385242
$$ -39468675 -8073644 6797203 4469421 10800815 24133539 12946130 -27439112
1219b7439112k7365435J8288228L8612301R595883k8263138l1046329n907437
$$ -27439112 -54804547 -36516319 2095982 11691865 -16571273 -47617602 -53525039
1212e3525039J3012669J3528378O860032M54893n531037o190797J001365L910325
$$ -53525039 -40512370 -26983992 -20123960 -19669067 -25200104 -31390901 -30389536 -26479211
1204b6479211r070538k6090679k3828966p45121K0494352K4673355J9694762J6656753
$$ -26479211 -35549749 -61640428 -85469394 -86214515 -65720163 -41046808 -21352046 -4695293
1196d695293J2473042K098350n792346N24222J5233788J8340917J200949j9778110
$$ -4695293 7777749 9876099 4083753 4607975 19841763 38182680 39383629 19605519
1188A9605519k0946775p70675J6377321J0686383n898795n712077J3915348K5419241
$$ 19605519 -1341256 -2111931 14265390 24951773 19052978 13340901 27256249 52675490
1180E2675490J2659904m122156j300218R768124K467120k0330977l1676553k4721276
$$ 52675490 65335394 61213238 59913020 69681144 72148264 51817287 20140734 -4580542
1172d580542j8787909k0403548j2116541J0708410K3233346P380251j9623018
$$ -4580542 -23368451 -43771999 -55888540 -45180130 -21946784 -14566533 -34189551
1165c4189551k9760428j7594949N181525K8219398M0515987L0702267O343866
$$ -34189551 -63949979 -81544928 -76363403 -48144005 -7628018 23074249 29418115
1158B9418115o551071R656J688182j6961657l1602647j5136009J6095069K5699709
$$ 29418115 22867044 22876700 24564882 7603225 -23999422 -39135431 -23040362 2659347
1150B659347J1350091J271203P131446J5022631J7210208J8841328J5972856k15181
$$ 2659347 14009438 15280641 22412087 37434718 54644926 73486254 89459110 89243929
1142H9243929j8611978j9769535j0738211j3834879k1659990m248857L2809831
$$ 89243929 70631951 50862416 40124205 26289326 4629336 380479 33190310
1135C3190310M2053856L649544l9501800m2065422j6774759k898792l739834M668544
$$ 33190310 75244166 78893710 39391910 -2673512 -19448271 -22347063 -26086897 -21418353
1127b1418353K0651151J6363318j2130934l1684880j7583628J4021307L0560447
$$ -21418353 -767202 15596116 3465182 -28219698 -45803326 -31782019 -1221572
1120a221572K1969543L386808r191463j3120409j2862994j0287927n152361r22445
$$ -1221572 20747971 24134779 14943316 1822907 -11040087 -21328014 -26480375 -27402820
1112b7402820k725000p710868n793294L806934O865471k835168n905488J6079187
$$ -27402820 -30127820 -37838688 -43631982 -39825048 -32959577 -35794745 -41700233 -25621046
1104b5621046M3473197L7126595m011148l5301037k6841702j058114O763063l816660
$$ -25621046 17852151 54978746 50967598 15666561 -11175141 -12233255 -5470192 -9286852
1096i286852j3250192j7601688j9557761o452082K7119454N0911410L2918348
$$ -9286852 -22537044 -40138732 -59696493 -66148575 -39029121 11882289 44800637
1089D4800637o956002j8465662N378242J9238795k892527k9672331k4245306K501688
$$ 44800637 37844635 19378973 24757215 43996010 41103483 11431152 -12814154 -10312466
1081a0312466J6813202J2717535P790554O465433j679508j5403437j9892791r010951
$$ -10312466 6500736 19218271 27008825 33474258 31794750 16391313 -3501478 -12512429
1073a2512429R165122K5211148L1411135J9834520m523861j7202428l020696J5384433
$$ -12512429 -3347307 21863841 53274976 73109496 68585635 51383207 48362511 63746944
1065F3746944M375819k8083167l8324562j1465835J3115768j511782l5029691
$$ 63746944 68122763 40039596 1715034 -9750801 3364967 1853185 -33176506
1058c3176506l8114437R39501M4951264N5498521K8784908j1320811l5562626
$$ -33176506 -71290943 -70351442 -25400178 30098343 58883251 47562440 11999814
1051A1999814k8065606j097328J3034160R97429j0527452N723651L0775428K5440493
$$ 11999814 -16065792 -17163120 -4128960 -3131531 -13658983 -7935332 22840096 48280589
1043D8280589n105729j5941478N677521K0632009N084815j0997826p4053J3180942
$$ 48280589 43174860 27233382 32910903 53542912 58627727 47629901 47555848 60736790
1035F0736790k352237k6401872k3028515m619161o043830j6356788K616595L9173586
$$ 60736790 58384553 31982681 8954166 4335005 -1708825 -18065613 -15449018 23724568
1027B3724568L8152219j0230991m9061263l8694388q031714O10898j0415627j8491645
$$ 23724568 61876787 51645796 2584533 -36109855 -44141569 -43530671 -53946298 -72437943
1019g2437943k1193654k1996597j0383687J4382549K9628095K4452446J7355915
$$ -72437943 -93631597 -115628194 -126011881 -111629332 -82001237 -57548791 -40192876
1012d0192876J6502896J051192k9812229l3510961R182207M5605123K3085235
$$ -40192876 -23689980 -22638788 -52451017 -85961978 -76779771 -31174648 -8089413
1005h089413k3378393j9049111L3806795N6634717J2303073m3366707m5839520
$$ -8089413 -31467806 -50516917 -16710122 39924595 52227668 8860961 -36978559
998c6978559n690710K0242320P614740j5588813j3368406J5021859L5760960K1505980
$$ -36978559 -42669269 -22426949 -14812209 -30401022 -43769428 -28747569 7013391 28519371
990B8519371j0626562j7540513Q657610K7133415J3479636K98622J7395304L0968999
$$ 28519371 17892809 352296 9009906 36143321 49622957 49921579 67316883 98285882
982I8285882k200285n0865385m9992454p635154Q872030j0327538l968142M1555815
$$ 98285882 96085597 45220212 -4772242 -12407396 -3535366 -13862904 -17831046 23724769
974B3724769N3434134n981171o3755173m5257134R725959J5671135k3541817l2854709
$$ 23724769 77158903 71177732 7422559 -37834575 -28108616 -12437481 -35979298 -68834007
966f8834007P596113L9144807K3618018q325758j8657604j2114866p215791l417257
$$ -68834007 -61237894 -22093087 1524931 -6800827 -25458431 -37573297 -44789088 -48206345
958d8206345L101277M805345J62818m30737L952530K123463l848303L163855K3423511
$$ -48206345 -45105068 -40299723 -40136905 -40567642 -36615112 -34491649 -38339952 -35176097 -11752586
949a1752586L1740361J2223509j8315843l2439034k2048928J309143K1725755
$$ -11752586 19987775 32211284 13895441 -18543593 -40592521 -39283378 -17557623
942a7557623K7764033J8076086L955873j215281M624590J5442281K6605152L0890973
$$ -17557623 10206410 28282496 32238369 31023088 35647678 51089959 77695111 108586084
934A08586084J6215739j5944996m0195538l5666920j5935310q138170j1489399
$$ 108586084 124801823 108856827 68661289 32994369 17059059 8920889 -2568510
927b568510m066128J4913747K1000191M158631j6155458k0770029j1858120l22494
$$ -2568510 -6634638 8279109 29279300 33437931 17282473 -3487556 -15345676 -15668170
919a5668170O300717J974981j0730851j4137268J100962J3798256L125524r607669
$$ -15668170 -9367453 -7392472 -18123323 -32260591 -31159629 -17361373 -14235849 -23843518
911b3843518P788320L3403737J4254676m0555759n5548279k318202M8166426K9987045
$$ -23843518 -16055198 17348539 31603215 -8952544 -64500823 -66819025 -18652599 11334446
903A1334446j9406634k4727881R859487K1820408q03117j1926217P54248k610724
$$ 11334446 -8072188 -32800069 -22940582 -1120174 -1923291 -13849508 -13095260 -15705984
895a5705984l1342974l8666107l602622K7806789J8733438J690190J7549661M2337041
$$ -15705984 -47048958 -85715065 -89317687 -61510898 -42777460 -41087270 -23537609 18799432
887A8799432K9587016q196122k0467654k395267K683117j9804835l3642350j5677477
$$ 18799432 48386448 40190326 19722672 17327405 20010522 205687 -33436663 -49114140
879d9114140Q337559J0011208o96908l828605m604159j3048945j5931853r7324
$$ -49114140 -40776581 -30765373 -31462281 -35290886 -39895045 -52943990 -68875843 -68973167
871f8973167J5748902N616884j8588464j9162846J3066386M5832106M9662120
$$ -68973167 -53224265 -47607381 -66195845 -85358691 -72292305 -26460199 23201921
864B3201921K9948230Q430231n747464j5798757k3072723k4416464j6849870k90285
$$ 23201921 53150151 61580382 55832918 40034161 16961438 -7455026 -24304896 -24595181
856b4595181J8052702K3413478R176833q481759p063609J0256467J6797640K18699
$$ -24595181 -6542479 16870999 26047832 17566073 10502464 20758931 37556571 37775270
848C7775270k1192084k7411082k1492276j3249201J828433K7860702M6897725
$$ 37775270 16583186 -10827896 -32320172 -45569373 -43740940 -15880238 31017487
841C1017487L5623055l34344k8407400k6786456o881210M011557n966342k1474684
$$ 31017487 66640542 66306198 37898798 11112342 4231132 8242689 2276347 -19198337
833a9198337j7599767R005219L0340237J9425772j0859707k1449021j475422J7845747
$$ -19198337 -36798104 -27792885 2547352 21973124 11113417 -10335604 -11811026 6034721
825F034721J3317405K218535M463659M795928j4584458l1417716j6474964J0201556
$$ 6034721 19352126 21570661 26034320 30830248 16245790 -15171926 -31646890 -21445334
817b1445334O484795j8206222j2801454K8635311M8526611J3528690l1925739
$$ -21445334 -14960539 -33166761 -45968215 -17332904 31193707 44722397 12796658
810A2796658l1732089M040480K5859132J8300350N063527k00822o857892j8643596
$$ 12796658 -18935431 -14894951 10964181 29264531 34328058 34127236 27269344 8625748
802H625748k5662834k2866557j2549469N804484K6531137K8790624K480499k5512117
$$ 8625748 -17037086 -39903643 -52453112 -46648628 -20117491 8673133 11153632 -14358485
794a4358485k0486367Q819033J9140811n999532l4914570l4906625j1863537J0116748
$$ -14358485 -34844852 -26025819 -6885008 -12884540 -47799110 -82705735 -94569272 -84452524
786h4452524K2816879K8708049K2239689J261182j4141908j515911K6139188K8451956
$$ -84452524 -61635645 -32927596 -10687907 -9426725 -23568633 -25084544 1054644 29506600
778B9506600p269853m1272586l0851869J0052713K8737582Q181645j0051839R665804
$$ 29506600 22236747 -19035839 -49887708 -39834995 -11097413 -2915768 -12967607 -3301803
770c301803M1915832L9081315K779067k3474853k2804900k0552136k8562316k2187771
$$ -3301803 38614029 77695344 80474411 56999558 34194658 13642522 -14919794 -37107565
762c7107565Q695706K9214201J0891722j9849422k0880479K648537J3623892L902997
$$ -37107565 -28411859 802342 11694064 -8155358 -29035837 -26387300 -12763408 -8860411
754h860411j649647O416374J0533845K887897k642247p0632j123714q710492r168449
$$ -8860411 -10510058 -4093684 6440161 9328058 6685811 6615179 5491465 -3219027 -12387476
745a2387476O88806N103783k149375n265132N503538J5290566Q927572m337780
$$ -12387476 -11698670 -6594887 -8744262 -14009394 -8505856 6784710 15712282 11374502
737A1374502p095322j498595k946532j2553159j2605349Q173407L4305110L6414941
$$ 11374502 4279180 2780585 -165947 -12719106 -25324455 -17151048 17154062 53569003
729E3569003O492643k6111511k5950041K016541J6532587j886478k1827307r933221
$$ 53569003 60061646 33950135 8000094 10016635 26549222 24662744 2835437 -7097784
721g097784J5170673J1614174j7997463k9126668l612734K5777110K7470559J1096032
$$ -7097784 8072889 19687063 1689600 -27437068 -31049802 -5272692 22197867 33293899
713C3293899O47580j228429l513545n880068o421103j1554291k1985347k4935306
$$ 33293899 33941479 32713050 29199505 23319437 16898334 5344043 -16641304 -41576610
705d1576610j3747227K03363O017602P447314R559644R469936Q992355J6172665
$$ -41576610 -55323837 -55120474 -49102872 -41655558 -32095914 -22625978 -13633623 2539042
697B539042K5163149J7235321p793992k5919551k6385395k6526376l3983256k6415415
$$ 2539042 27702191 44937512 37143520 11223969 -15161426 -41687802 -75671058 -102086473
689a02086473P243192L6148416K9818741N858042K41205J0668008Q327203r103289
$$ -102086473 -94843281 -58694865 -28876124 -23018082 -22776877 -12108869 -3781666 -12884955
681a2884955j7769931j2687501j0985573j2378631K706267L1182305M1811034
$$ -12884955 -30654886 -43342387 -54327960 -66706591 -64000324 -32818019 8993015
674H993015K2038600k713498r427247p560660j3226638j9771010j4054508k643694
$$ 8993015 31031615 28318117 18890870 11330210 -1896428 -21667438 -35721946 -38365640
666c8365640r82979q508493j2113039o338292L962766J4499201K2770754K3549970
$$ -38365640 -39348619 -47857112 -59970151 -66308443 -62345677 -47846476 -25075722 -1525752
658a525752J4418972L052093n18845K037428q64294j3328194k2808098j4124554
$$ -1525752 12893220 15945313 15426468 17463896 16599602 3271408 -19536690 -33661244
650c3661244Q677434K2501065J2743247o258881r663770L470061J1035207K972150
$$ -33661244 -24983810 -2482745 10260502 4001621 -5662149 -2192088 8843119 11815269
642A1815269n720625l255965M29544m350123q718190n312470m770234j2119040
$$ 11815269 6094644 2838679 3268223 -1081900 -9800090 -15112560 -19882794 -32001834
634c2001834r749227J0229040K0069974l031495l0672450j9998743J6598189K7240122
$$ -32001834 -41751061 -31522021 -11452047 -14483542 -45155992 -65154735 -48556546 -21316424
626b1316424J907632j4546526J956031J8721061N885599j4844539j0795428R132442
$$ -21316424 -19408792 -33955318 -31999287 -13278226 -7392627 -22237166 -33032594 -23900152
618b3900152J6044146P913290J848363J06896m738676o301502M761940J8229737
$$ -23900152 -7856006 57284 1905647 2012543 -2726133 -9027635 -4265695 13964042
610A3964042J8368568R689189N506911L005928o111592j2223804j773107J4377267
$$ 13964042 32332610 42021799 47528710 50534638 44423046 32199242 30426135 44803402
602D4803402J3760885k429949j3134769j2061201j1956218j6339209j4191584
$$ 44803402 58564287 56134338 42999569 30938368 18982150 2642941 -11548643
595a1548643n104746m263063j6165840k4656783j6542880J727306J6373709K0093272
$$ -11548643 -16653389 -20916452 -37082292 -61739075 -78281955 -76554649 -60180940 -40087668
587d0087668J1021014n125329r906533J0458997L7844897L5307119k161689l2876566
$$ -40087668 -29066654 -34191983 -44098516 -33639519 4205378 39512497 37350808 4474242
579D474242k1996441R692923J5588035r676329k3675471J228027L7404545L9706568
$$ 4474242 -17522199 -7829276 7758759 -1917570 -25593041 -24365014 13039531 52746099
571E2746099N419968k5870661k6108566q899455p00958k782556J843970J5579031
$$ 52746099 58166067 32295406 6186840 -2712615 -3413573 -6196129 -4352159 11226872
563A1226872K1998013J3207632J255016l418385p445024j7807598k3960550j2614492
$$ 11226872 33224885 46432517 47687533 44269148 36824124 19016526 -4944024 -17558516
555a7558516P132697J1197717o038339k0049298n589564K8884484M6355731K3903858
$$ -17558516 -10425819 771898 -5266441 -25315739 -30905303 -2020819 44334912 68238770
547F8238770j6482692l0799874p624448J5739514K715488l2533684m6298047k6075837
$$ 68238770 51756078 20956204 13331756 29071270 31786758 -746926 -47044973 -73120810
539g3120810k87334R989905J3381656J5303253J476356k6121474l2762884n30928
$$ -73120810 -73408144 -63418239 -50036583 -34733330 -33256974 -59378448 -92141332 -92672260
531i2672260L4396126K9726614k06573r553702Q166775J9091993J0192909L883388
$$ -92672260 -58276134 -28549520 -28756093 -38309795 -30143020 -11051027 -858118 3025270
523C025270J0126561R962321l090599o875033Q045295J7087811J576335k0264997
$$ 3025270 13151831 23114152 20023553 13148520 21193815 38281626 39857961 19592964
515A9592964k3069800r906800J344213M599101R82406j0035873j8593791p589810
$$ 19592964 -3476836 -13383636 -12039423 -7440322 -6457916 -16493789 -35087580 -42677390
507d2677390J5420592J6881349j1803627l1927048j3182335J8096609K1434491
$$ -42677390 -27256798 -10375449 -22179076 -54106124 -67288459 -49191850 -27757359
500b7757359O248157R682239K9466866K9070545K597763j5941337j0930472n100812
$$ -27757359 -21509202 -11826963 17639903 46710448 49308211 33366874 22436402 17335590
492A7335590j1438528j0371072P636537J7463796J170321j9698165k0608758j3688968
$$ 17335590 5897062 -4474010 3162527 20626323 21796644 2098479 -18510279 -32199247
484c2199247k0653517l0025191j5579465J7607475L8770416L4926855J9540308
$$ -32199247 -52852764 -82877955 -98457420 -80849945 -42079529 -7152674 12387634
477A2387634M005682j0773772j7412696n333909J6683786K5693226J5745322K222967
$$ 12387634 16393316 5619544 -11793152 -17127061 -443275 25249951 40995273 43218240
469D3218240o945517k0273236l7425573l9736123j7780856J1032589K4962396
$$ 43218240 36272723 15999487 -21426086 -61162209 -78943065 -67910476 -42948080
462d2948080K2227572J2396761O06389p266206q46414J7729884K7895288J8236964
$$ -42948080 -20720508 -8323747 -7717358 -14983564 -15829978 1899906 29795194 48032158
454D8032158N561301P776968J2682038j735083k7148657l4542857j9505241o636529
$$ 48032158 53593459 61370427 74052465 72317382 45168725 10625868 -8879373 -15515902
446a5515902o711054j891400J6006170K3820928M131573j9959682j4208557J5903750
$$ -15515902 -22226956 -24118356 -8112186 15708742 19840315 -119367 -14327924 1575826
438A575826L1365449J2896627j6353499k4496991q416444R605833J0544484l990377
$$ 1575826 32941275 45837902 29484403 4987412 -3429032 6176801 16721285 12730908
430A2730908j7206475j4823396Q85625J4370582J5399001J0117980R188580J0914780
$$ 12730908 -4475567 -19298963 -18413338 -4042756 11356245 21474225 30662805 41577585
422D1577585N231463q526657j8099770j3441398J813211J5087738J6485739O692536
$$ 41577585 46809048 38282391 20182621 6741223 8554434 23642172 40127911 46820447
414D6820447k888732j446425N631083m7203k2885404l9235219k5876732L901583
$$ 46820447 43931715 42485290 48116373 48069170 25183766 -14051453 -39928185 -36026602
406c6026602J4003741m415376k0347818q734824J4205617J8558028N309565j157141
$$ -36026602 -22022861 -26438237 -46786055 -55520879 -41315262 -22757234 -17447669 -18604810
398a8604810M639491L355608j1258694j6510100M076830L0748773L2695742J0841676
$$ -18604810 -13965319 -10609711 -21868405 -38378505 -34301675 -3552902 29142840 39984516
390C9984516p423286j0961649j6060105l0106262l0915571r39084L5877818L8149108
$$ 39984516 32561230 21599581 5539476 -24566786 -55482357 -56421441 -20543623 17605485
382A7605485K972182k8232864k3832601J195914J3286873N781071j005642N968941
$$ 17605485 20577667 -7655197 -31487798 -30291884 -17005011 -11223940 -12229582 -6260641
374f260641J7097074J6718043J542578j7833706k5783754j4251770O533078J4446218
$$ -6260641 10836433 27554476 29097054 11263348 -14520406 -28772176 -22239098 -7792880
366g792880O27865j7319740j7322131k253946O046914p63921o854887K827115
$$ -7792880 -7165015 -24484755 -41806886 -44060832 -38013918 -38777839 -45632726 -42805611
358d2805611K0005912K3553952O845784j2442079j1159328J1386808K7913213
$$ -42805611 -22799699 754253 7600037 -4842042 -16001370 -4614562 23298651
351B3298651J2832935k3032823m0198448j8593339J6389042K7271777J0392727
$$ 23298651 36131586 13098763 -27099685 -45693024 -29303982 -2032205 8360522
344H360522p948962j0231980k104949N801253R234581N301103n201337j1606194
$$ 8360522 411560 -9820420 -11925369 -6124116 3110465 8411568 3210231 -8395963
336h395963o242856K13396n556872j4521248q944226M506263L813646q176247
$$ -8395963 -14638819 -14425423 -19982295 -34503543 -43447769 -38941506 -35127860 -43304107
328d3304107n688267J3859418K1243392M200676j0321550o85834J5156692J3113982
$$ -43304107 -48992374 -35132956 -13889564 -9688888 -20010438 -20696272 -5539580 7574402
320G574402J646890j40804K278078m065690q917955J566263J1711039j550292
$$ 7574402 9221292 9080488 11358566 7292876 -1625079 -58816 11652223 10101931
312A0101931k5555385k7589335o734861O418418n45888q385743m207494J964947
$$ 10101931 -15453454 -43042789 -49777650 -43359232 -43905120 -52290863 -56498357 -54533410
304e4533410M506528J2443837K2623380J5204415r139670j7628190Q258093L9422914
$$ -54533410 -50026882 -37583045 -14959665 244750 -8894920 -26523110 -18265017 21157897
296B1157897L6892969N287364j7658563j4257414k978395m213854j4106608j7891392
$$ 21157897 58050866 63338230 45679667 31422253 28443858 24230004 10123396 -7767996
288g767996j2060334l602257L594074J1397966J8545295J7301387L280225j4599134
$$ -7767996 -19828330 -23430587 -19836513 -8438547 10106748 27408135 30688360 16089226
280A6089226k0940655j2229461j047968K471029M474053J3239070J9682172P955143
$$ 16089226 -4851429 -17080890 -18128858 -15657829 -11183776 2055294 21737466 29692609
272B9692609j7008295l0070686j7579280O118238J9160756J6127321N262208n317633
$$ 29692609 12684314 -17386372 -34965652 -28847414 -9686658 6440663 11702871 6385238
264F385238r784758l980583O889580Q533290l728517j4126267o603104R960668
$$ 6385238 -3399520 -7380103 -490523 8042767 4314250 -9812017 -16415121 -6454453
256f454453J1508097p250099k3635902j6398173P343283K2594944J6445301j950141
$$ -6454453 5053644 -2196455 -25832357 -42230530 -34887247 -12292303 4152998 2202857
248B202857j7281780k2924617j9125008p288218P591604J5799809J2415055M501667
$$ 2202857 -15078923 -38003540 -57128548 -64416766 -56825162 -41025353 -28610298 -24108631
240b4108631J640571K937150J875442K59066N725366J6763662K2970585K0601000
$$ -24108631 -22468060 -19530910 -17655468 -17396402 -11671036 5092626 28063211 48664211
232D8664211J4415253L677870j6301968l5060933l0335035j018506K2680875J7029865
$$ 48664211 63079464 66757334 50455366 15394433 -14940602 -15959108 6721767 23751632
224B3751632m292256j4265750j0868499r436214j0592444k406893J2688540J9142550
$$ 23751632 19459376 5193626 -5674873 -15111087 -25703531 -28110424 -15421884 3720666
216C720666J3221116L443982r572552k8212903l6616444j5182296K1054003L0851901
$$ 3720666 16941782 20385764 10813212 -17399691 -54016135 -69198431 -48144428 -17292527
208a7292527L853023k0630780q190956K3435623L3659571J5750327j896950r00414
$$ -17292527 -13439504 -34070284 -42261240 -18825617 14833954 30584281 28687331 27786917
200B7786917O454785J655611j3960759k3404147j5232371M065343J6611472J1594232
$$ 27786917 34241702 35897313 21936554 -1467593 -16699964 -12634621 3976851 15571083
192A5571083l212994j1096448n745064M581569R868347P201213j495864j1128421
$$ 15571083 12358089 1261641 -4483423 98146 9966493 17167706 15671842 4543421
184D543421j3747728o535683K060188L239398O75069J386253Q12862p122729j2205600
$$ 4543421 -9204307 -15739990 -13679802 -10440404 -9765335 -8379082 -7566220 -14688949 -26894549
175b6894549j231656J5578616J6006977J869477l574094M692760O542323m994814
$$ -26894549 -28126205 -12547589 3459388 5328865 1754771 6447531 12989854 7995040
167G995040j0446152K34097R906192P178235O316389J5780284J7267679p97400
$$ 7995040 -2451112 -2217015 7689177 14867412 21183801 36964085 54231764 53434364
159E3434364j7359921j2916188l059899q165455j5095300m047138R065265k080273
$$ 53434364 36074443 23158255 20098356 11932901 -3162399 -7209537 1855728 -224545
151b24545k3144447j8240409Q771282J8649032J639428q513943O543622K0694649
$$ -224545 -23368992 -41609401 -32838119 -14189087 -12549659 -21063602 -14519980 6174669
143F174669J0018040q800022r705608J888353M835564j796046l476923K458145
$$ 6174669 16192709 7392687 -2312921 -424568 4410996 2614950 -861973 1596172
135A596172O429972N371997L846551K390355n70786p90293M511660O692294l536678
$$ 1596172 8026144 13398141 17244692 19635047 19064261 18273968 22785628 29477922 25941244
126B5941244j8798040k1827423q880095N697931R805242P350827P222096Q244374
$$ 25941244 7143204 -14684219 -23564314 -17866383 -8061141 -710314 6511782 14756156
118A4756156M043887k474108j277392P545616J0496624M91565j0553717r117411
$$ 14756156 18800043 16325935 15048543 22594159 33090783 33582348 23028631 13911220
110A3911220j091760j033372p065421n109450M819158Q264684L292577L563450
$$ 13911220 12819460 11786088 4720667 -388783 4430375 12695059 15987636 19551086
102A9551086R044059N04729k4780283l8872110k3372443P54539O869772L513519
$$ 19551086 28595145 29099874 4319591 -34552519 -57924962 -57170423 -50300651 -46787132
94d6787132J2494368K4981181J5113394j2263680k4014447q082631J1825270J4692560
$$ -46787132 -34292764 -9311583 5801811 -6461869 -30476316 -38558947 -26733677 -12041117
86a2041117P325993M441859O987881Q572691O540343J018981m713184l205565
$$ -12041117 -4715124 -273265 6714616 15287307 21827650 22846631 18133447 14927882
78A4927882N712444Q282994l544267j5538715j3021565o306223r620711r652506
$$ 14927882 20640326 28923320 25379053 9840338 -3181227 -9487450 -19108161 -28760667
70b8760667J1063764L1935473J8521767j6165767k3273075N068757K2266032M346838
$$ -28760667 -17696903 14238570 32760337 16594570 -6678505 -1609748 20656284 25003122
62B5003122j2616052J771517J8837151J601993l1171917l7083731j7062411k892891
$$ 25003122 12387070 14158587 32995738 34597731 3425814 -33657917 -50720328 -53613219
54e3613219J052505J3931469K8658898J7482603j3508887k3907368j807405J6191784
$$ -53613219 -52560714 -38629245 -9970347 7512256 -5996631 -29903999 -31711404 -15519620
46a5519620M121262j2463716K00344K9182091L5207684J1554556j0319281r648106
$$ -15519620 -11398358 -23862074 -23661730 5520361 40728045 52282601 41963320 32315214
38C2315214n32022j479152o718289l264720J749735o771667k0858090j6022544
$$ 32315214 31783192 30304040 23585751 20321031 22070766 15299099 -5558991 -21581535
30b1581535R641043K7578614J9050368M98597n856781m722651r998530j4558036
$$ -21581535 -11940492 15638122 34688490 35187087 29330306 24607655 14609125 51089
22E1089o049424K812004o371363j8451586l548403K8915050L7277377J2477292
$$ 51089 -5998335 -3186331 -9557694 -28009280 -31557683 -2642633 34634744 47112036
14D7112036p959796k163325M335580j0327410k3899077j1089999J0074521R403704
$$ 47112036 39152240 36988915 41324495 30997085 7098008 -3991991 6082530 15486234
6A5486234m530273l254527J0514449R773665r035690k1257780
$$ 15486234 10955961 7701434 18215883 27989548 18953858 -2303922
0b303922
$$ -2303922
##END NTUPLES=NMR SPECTRUM
##END=
