##TITLE=31Pdec_BAU-1601
 CDCl3, 24 sc
 16.1.2019
##JCAMPDX= 6.0         $$ Bruker NMR JCAMP-DX V2.0
##DATA TYPE= NMR SPECTRUM
##DATA CLASS= NTUPLES
##ORIGIN= UXNMR, Bruker Analytische Messtechnik GmbH
##OWNER= root
$$ XWIN-NMR		Version 3.5
$$ Wed Jan 16 15:34:00 2019 Russian Standard Time (UT+4h)  she@DPX200
##.OBSERVE FREQUENCY= 81.013821
##.OBSERVE NUCLEUS= ^31P
##.ACQUISITION MODE= SIMULTANEOUS
##.ACQUISITION SCHEME= undefined
##.AVERAGES= 24
##.DIGITISER RES= 17
##SPECTROMETER/DATA SYSTEM= spect
##.PULSE SEQUENCE= zgpg30
##.SOLVENT NAME= CDCl3
##.SHIFT REFERENCE= (INTERNAL, CDCl3, 0, 182.463)
##AUDIT TRAIL= $$ (NUMBER, WHEN, WHO, WHERE, WHAT)
$$ ##TITLE= Audit trail, XWIN-NMR		Version 3.5
$$ ##JCAMPDX= 5.01
$$ ##ORIGIN= Bruker BioSpin GmbH
$$ ##OWNER= she
$$ F:/spectra/data/she/nmr/P31/1/pdata/1/auditp.txt
$$ ##AUDIT TRAIL=  $$ (NUMBER, WHEN, WHO, WHERE, WHAT)
(   1,<2019-01-16 15:33:10.07 +0400>,<she>,<DPX200>,
      <created by zg, POWCHK disabled, PULCHK disabled
       configuration hash MD5:
       00 E9 B6 7A A2 85 ED C7 34 08 36 98 17 FE 4E 26
       data hash MD5: 32K
       33 41 8A 08 BE C9 F0 60 A5 05 6C EA D4 7A 91 CE>)
(   2,<2019-01-16 15:33:12.68 +0400>,<she>,<DPX200>,
      <Start of raw data processing
       efp BC_mod = 2 LB = 1 FT_mod = 6 PKNL = 1 PHC0 = -1471.107 PHC1 = 114.599 SI = 64K 
       data hash MD5: 64K
       8C 9B 91 61 9F 74 18 1F CA 07 56 C1 47 E3 64 B3>)
(   3,<2019-01-16 15:33:31.07 +0400>,<she>,<DPX200>,
      <pk PHC0 = 4.348711 PHC1 = -4.4 
       data hash MD5: 64K
       12 51 CA 08 DC DA BF 9C AE 1C 18 25 05 45 16 5C>)
$$ ##END=
$$ 
$$ hash MD5
$$ 49 28 8A 56 2B AC 4F 99 C8 F4 4B 6A 72 B1 34 06
##$RELAX= 
##$RELAX= 
##$RELAX= 
##$RELAX= 
##$RELAX= 
##$RELAX= 
##$RELAX= 
##$RELAX= 
$$ Bruker specific parameters
$$ --------------------------
##$DU= <F:/spectra>
##$EXPNO= 1
##$NAME= <P31>
##$PROCNO= 1
##$TYPE= <nmr>
##$USER= <she>
##$AMP= (0..31)
100 100 100 100 100 100 100 100 100 100 100 100 100 100 100 100 100 100 
100 100 100 100 100 100 100 100 100 100 100 100 100 100 
##$AQSEQ= 0
##$AQ_mod= 1
##$AUNM= <au_zg>
##$AUTOPOS= <>
##$BF1= 81.014009
##$BF2= 200.13
##$BF3= 200.13
##$BF4= 200.13
##$BF5= 200.13
##$BF6= 200.13
##$BF7= 200.13
##$BF8= 200.13
##$BYTORDA= 1
##$CFDGTYP= 0
##$CFRGTYP= 5
##$CHEMSTR= <none>
##$CNST= (0..31)
1 1 145 1 1 1 1 1 1 1 1 1 1 1 1 1 1 1 1 1 1 1 1 1 1 1 1 1 1 1 1 1 
##$CPDPRG= <waltz16>
##$CPDPRG1= <>
##$CPDPRG2= <waltz16>
##$CPDPRG3= <>
##$CPDPRG4= <mlev>
##$CPDPRG5= <mlev>
##$CPDPRG6= <mlev>
##$CPDPRG7= <mlev>
##$CPDPRG8= <mlev>
##$CPDPRGB= <>
##$CPDPRGT= <>
##$D= (0..31)
0 1 0 0 0 0 0 0 0 0 0 0.03 2e-05 3e-06 0 0 0 0 0 0 0 0 0 0 0 0 0 0 0 0 
0 0 
##$DATE= 1547638389
##$DBL= (0..7)
120 120 120 11 120 120 24 19 
##$DBP= (0..7)
150 150 150 150 150 150 150 150 
##$DBP07= 0
##$DBPNAM0= <>
##$DBPNAM1= <>
##$DBPNAM2= <>
##$DBPNAM3= <>
##$DBPNAM4= <>
##$DBPNAM5= <>
##$DBPNAM6= <>
##$DBPNAM7= <>
##$DBPOAL= (0..7)
0.5 0.5 0.5 0.5 0.5 0.5 0.5 0.5 
##$DBPOFFS= (0..7)
0 0 0 0 0 0 0 0 
$$ [...]
##$SUBNAM2= <"">
##$SUBNAM3= <"">
##$SUBNAM4= <"">
##$SUBNAM5= <"">
##$SUBNAM6= <"">
##$SUBNAM7= <"">
##$SUBNAM8= <"">
##$SUBNAM9= <"">
##$SW= 369.568048894756
##$SWIBOX= (0..15)
0 1 3 0 0 0 0 0 0 0 0 0 0 0 0 0 
##$SW_h= 29940.119760479
##$TD= 32768
##$TD0= 1
##$TE= 0
##$TE2= 300
##$TE3= 300
##$TEG= 300
##$TL= (0..7)
0 120 53 12 22 120 120 120 
##$TP= (0..7)
150 150 150 150 150 150 150 150 
##$TP07= 0
##$TPNAME0= <>
##$TPNAME1= <>
##$TPNAME2= <>
##$TPNAME3= <>
##$TPNAME4= <>
##$TPNAME5= <>
##$TPNAME6= <>
##$TPNAME7= <>
##$TPOAL= (0..7)
0.5 0.5 0.5 0.5 0.5 0.5 0.5 0.5 
##$TPOFFS= (0..7)
0 0 0 0 0 0 0 0 
##$TUNHIN= 0
##$TUNHOUT= 0
##$TUNXOUT= 0
##$USERA1= <user>
##$USERA2= <user>
##$USERA3= <user>
##$USERA4= <user>
##$USERA5= <user>
##$V9= 5
##$VALIST= <valist>
##$VCLIST= <CCCCCCCCCCCCCCC>
##$VD= 0
##$VDLIST= <DDDDDDDDDDDDDDD>
##$VPLIST= <PPPPPPPPPPPPPPP>
##$VTLIST= <TTTTTTTTTTTTTTT>
##$WBST= 1024
##$WBSW= 4
##$XGAIN= (0..3)
0 0 0 0 
##$XL= 0
##$YL= 0
##$YMAX_a= 142826
##$YMIN_a= -168325
##$ZGOPTNS= <>
##$ZL1= 120
##$ZL2= 120
##$ZL3= 120
##$ZL4= 120
##$ABSF1= 0
##$ABSF2= 0
##$ABSG= 0
##$ABSL= 0
##$ALPHA= 0
##$AQORDER= 0
##$ASSFAC= 0
##$ASSFACI= 0
##$ASSFACX= 0
##$ASSWID= 0
##$AUNMP= <proc_1d>
##$AZFE= 0.1
##$AZFW= 0.5
##$BCFW= 0
##$BC_mod= 2
##$BYTORDP= 0
##$COROFFS= 0
##$CY= -3
##$DATMOD= 1
##$DC= 0
##$DFILT= <>
##$DTYPP= 0
##$F1P= 0
##$F2P= 0
##$FCOR= 1
##$FTSIZE= 65536
##$FT_mod= 6
##$GAMMA= 0
##$GB= 0
##$INTBC= 1
##$INTSCL= 5.30512e-09
##$ISEN= 30
##$LB= 1
##$LEV0= 0
##$LPBIN= 0
##$MAXI= 10000
##$MC2= 0
##$MEAN= 0
##$ME_mod= 0
##$MI= 50
##$NCOEF= 0
##$NC_proc= -1
##$NLEV= 6
##$NOISF1= 182.463
##$NOISF2= 159.3651
##$NSP= 0
##$NTH_PI= 0
##$NZP= 0
##$OFFSET= 182.463
##$PC= 4
##$PHC0= -1466.758
##$PHC1= 110.199
##$PH_mod= 1
##$PKNL= yes
##$PPARMOD= 0
##$PSCAL= 0
##$PSIGN= 0
##$REVERSE= no
##$SF= 81.0140089999434
##$SI= 65536
##$SIGF1= 159.3651
##$SIGF2= -187.1042
##$SINO= 113.3802
##$SIOLD= 16384
##$SREGLST= <1H.CDCl3>
##$SSB= 0
##$STSI= 65536
##$STSR= 0
##$SW_p= 29940.119760479
##$SYMM= 0
##$S_DEV= 0
##$TDeff= 32768
##$TDoff= 0
##$TI= <>
##$TILT= no
##$TM1= 0
##$TM2= 0
##$TOPLEV= 0
##$USERP1= <user>
##$USERP2= <user>
##$USERP3= <user>
##$USERP4= <user>
##$USERP5= <user>
##$WDW= 1
##$XDIM= 65536
##$YMAX_p= 269793236
##$YMIN_p= -3438568
$$ End of Bruker specific parameters
$$ ---------------------------------
##NTUPLES= NMR SPECTRUM
##VAR_NAME=  FREQUENCY,     SPECTRUM/REAL,   SPECTRUM/IMAG
##SYMBOL=    X,             R,               I
##VAR_TYPE=  INDEPENDENT,   DEPENDENT,       DEPENDENT
##VAR_FORM=  AFFN,          ASDF,            ASDF
##VAR_DIM=   65536,         65536,           65536
##UNITS=     HZ,            ARBITRARY UNITS, ARBITRARY UNITS
##FACTOR=    0.456856943014862, 1,           1
##FIRST=     14782.0589164792, 0,            0
##LAST=      -15158.0608439998, 0,           0
##MIN=       -15158.0608439998, -3438568,    0
##MAX=       14782.0589164792, 269793236,    0
$$ Real data points
##PAGE= N=1
##DATA TABLE= (X++(R..R)), XYDATA
$$ [...]
47284g3225M9921M4578j7343n7967l3640P847J4483Q879L1483N6860L2146k8190
47272C5832n3832k0198K0343J7927j1931k2354J825L3331L4641p215o0852o9018
47260a01501j1928N5225O3737K3655N404K7459K6634l4077r3056p7079j2282J7660
47248a10149m126j6332J5685N2355M8563J4195j4374k1806j2862L150J0031m711
47236d0381k4080j5783J6589K9836M008k5524k1036L864J1804j560r536J267J6561
47223e3971J8268M228j2155j4696n350q986l5537m5241N641Q1958R1338J2889
47211C8386n8186m0792J5480J2501m2556n4760M153N3496K9864k5346l7624J380
47199a04004M3225M9337J7912k2928k9752J3357N5351K8579m7312p2126n382O5818
$$ y = [-73225, -23304, 21274, 3931, -54036, -87676, -79829, -65346, -56467, -24984, 31876, 64022, 35832, -18000, -38198, -17855, 72, -11859, -34213, -32388, 943, 35584, 28369, -32483, -101501, -113429, -58204, 5533, 29188, 34592, 62051, 88685, 54608, -38448, -115527, -127809, -110149, -114275, -130607, -114922, -62567, -14004, 191, -14183, -35989, -48851, -45701, -35670, -40381, -64461, -80244, -63655, -33819, -29811, -55335, -76371, -72507, -60703, -62263, -71799, -70532, -53971, -35703, -31475, -43630, -58326, -63676, -72662, -108199, -153440, -147799, -65841, 25497, 38386, -19800, -60592, -45112, -32611, -75167, -129927, -125774, -72278, -42414, -67760, -105384, -104004, -60779, -11442, 6470, -16458, -46210, -32853, 22498, 51077, 3765, -68361, -73743, -7925]
47187g925N0155j6043l2596J0765L1833p383m9551m0682n606N472r593k0952j7284
47174a09390n027J5094L7991M0664J0240k6046k6926J0691M6902M5731J0993k5493
47162B5424l8656k8442j0538K620P960M216q555j7951m665K6879L9373P921l6023
47149c0437l6772J1524N5449N2268J6238j6598l5913m7439m4798k1942K853N135
47137i0432j2639k9834l8809m2519l2047K402M2003N2392K9270L186n118n186
47125a27331n582N200K8863L7105Q602l2332m3880k3323n751j0039j7060o792
47113a92320J2313K5331L7815N7626O5455L3779k5666o2189m6441r485j901k6921
47101a32604m0441j5238K3663L8168K6099J0582K15j0577j2074J3609N2841O3032
$$ y = [-7925, 42230, 26187, -6409, 4356, 36189, 28806, -20745, -61427, -67033, -61561, -71154, -92106, -109390, -114417, -99323, -61332, -20668, -10428, -36474, -63400, -52709, -5807, 39924, 50917, 25424, -13232, -41674, -52212, -49592, -41632, -37416, -45971, -63922, -68587, -41708, -2335, 5586, -30437, -67209, -55685, -236, 52032, 68270, 51672, 15759, -31680, -76478, -98420, -95567, -90432, -103071, -132905, -171714, -214233, -246280, -243878, -201875, -149483, -120213, -117027, -122145, -127331, -132913, -127713, -98850, -61745, -53143, -85475, -129355, -152678, -158429, -168468, -185528, -192320, -180007, -154676, -116861, -59235, 6220, 39999, 14333, -47856, -94297, -103782, -105683, -132604, -173045, -188283, -164620, -126452, -100353, -89771, -89556, -100133, -112207, -98598, -45757, 17275]
47089A7275K8585j5589l4710l8445m8031m8319j4378L0586L4232o604l4539j3180
47077a43117K2218K0928j0626k6182p661J9696K9833K1623N508r005j2582m218
47065i3585Q77r190j9599q422J2869Q079k6939m5047n331O7616J05481P2897L665
47052F3371m2019m2149k5148k4152l5202l0021k1L1456M1100K9402O454k2635
47040d9564m4175l2621J3566N1462M0619j197k2401q803Q135J1036J9669M3909
47028B9635N5447K8280k2193o0792o8689m2805J1251O4829P3612K6755l1538n2961
47016A0831l7686j5353M58J0725Q650o504j1519R599L1498K0353j2743k9549k4200
47003d5440k2105k5959j0244K6098M6351K8512n102k4890k9578l1242l2318k9982
$$ y = [17275, 45860, 30271, -4439, -42884, -90915, -139234, -153612, -123026, -88794, -95398, -129937, -143117, -120899, -99971, -110597, -136779, -144440, -124744, -94911, -73288, -67780, -76785, -89367, -93585, -92708, -101898, -121497, -129919, -117050, -108971, -135910, -180957, -186288, -118672, -13191, 59706, 63371, 21352, -20797, -45945, -70097, -105299, -135320, -135341, -103885, -62785, -33383, -26929, -49564, -93739, -126360, -112794, -61332, -20713, -21910, -44311, -53114, -44979, -33943, -14274, 29635, 85082, 113362, 91169, 30377, -38312, -81117, -69866, -5037, 68575, 95330, 63792, 10831, -26855, -42208, -41750, -31025, -22375, -28879, -40398, -30799, 699, 21052, 8309, -21240, -45440, -67545, -93504, -103748, -77650, -31299, -2787, -7889, -32779, -62357, -93599, -125917, -155899]
46991a55899k0102Q841N7964R1871O8241K589l8454k4927m29p464k4057j3973
46979e5799L642r695l5450k2682K0857K7996k7017q3186p3017p386M8301N3930
46967a59506K2140j3795l0029j8748J1247L9920N2526M7274K3527k1190o9938
46956a16572q1078l0986M3552P4259L9577r129j3338K0250L7169J5559m252J7847
46944g142N7676N5183k215n8771o1279k2382N937Q90j5840j9815j0528K467J2003
46931f3816O968j9768m7423l7828J2788N5232M4048l417l0391j1672K6392M8564
46919b0323M1937P526m3229p6832n8648k020L4893K2658O28J4971M6196M0893
46907H650k713l2474k3487q849j5422j7959J1789M7080L9431q407m4899m1403
$$ y = [-155899, -176001, -167160, -109196, -17325, 50916, 53505, 15051, -9876, -10305, -17769, -41826, -55799, -52157, -61852, -97302, -119984, -99127, -71131, -98148, -181334, -254351, -261737, -213436, -159506, -137366, -151161, -181190, -199938, -188691, -148771, -96245, -48971, -25444, -46634, -116572, -197650, -228636, -185084, -110825, -71248, -80377, -93715, -73465, -36296, -20737, -24989, -7142, 50534, 105717, 103502, 44731, -16548, -38930, -32993, -32103, -47943, -67758, -78286, -75819, -63816, -56848, -76616, -124039, -161867, -149079, -93847, -49799, -53216, -83607, -95279, -68887, -20323, 21614, 29140, -14089, -90921, -149569, -151589, -116696, -94038, -93410, -78439, -32243, 8650, 5937, -26537, -50024, -58873, -74295, -92254, -80465, -33385, 6046, -2361, -47260, -88663]
46895h8663k3313k1464k5044n136L2260M5378J2102l4457m2259m783L1245K6217
46883i7917n135k0544n723J9291L5923M0626K9113j143l1314l3577q064J7850
46871f0614K7989K7004J4557j2957l5084k5993l780r423l0744j3322L5788L6598
46859d9981l0973o9998j2489N7362K4670p1821r6439k4387L6730K8306J2129L6026
46847a60865N1583J6977k1082j2050J4368J3926O538K1976K9002r473n8856o0379
46835a68335j9390J5104K4520J8483m058l4236l1555J7275N4352K7794k3767l1115
46823a54928k153O852m157R325L9139L1769r647k0523J6768M2018J5010k8398
46811e8925m2332k8510k910L5054P1939P2119K9373j6672l6317l8526l0173M70
$$ y = [-88663, -111976, -133440, -158484, -163620, -131360, -85982, -73880, -108337, -150596, -155379, -124134, -97917, -103052, -123596, -129319, -110028, -74105, -33479, -4366, -5509, -36823, -70400, -78464, -60614, -32625, -5621, 8936, -4021, -39105, -65098, -68878, -78301, -109045, -122367, -86579, -49981, -80954, -150952, -163441, -106079, -81409, -153230, -249669, -274056, -237326, -209020, -196891, -160865, -109282, -92305, -113387, -125437, -111069, -97143, -90605, -68629, -39627, -49100, -107956, -168335, -187725, -172621, -148101, -129618, -133676, -167912, -199467, -182192, -127840, -100046, -123813, -154928, -157081, -150229, -154386, -145061, -105922, -74153, -83800, -104323, -87555, -45537, -30527, -58925, -101257, -129767, -132677, -97623, -25684, 46435, 75808, 59136, 22819, -15707, -45880, -45410]
46799d5410M0162M6247J2568j2115j33J3414j760j6194K118K2975P34m6483n9342
46786d3219k2273K0558K6765q46k7575k1940J4104L9490J7366l0225m3402r628
46774h0825J6379j750k6621j2594J9571K0994p822k8100k4999j0859J0124L3494
46762i3008L4105L148j7479Q205M1375J9413l9148n4029p889K6450M460j9315
46750i3712J5317O7597M9174m0133r7799n0913M5835P8044J6323m9618l1575M0305
46738e1155O1386k068o7830n3688J4133M7937J7005l1269m8148k9171R804N2333
46726h0731P3009N1488M791k5589k4942j5716j5364j5579q160r64o14m654j4284
46713g7309k9470l2014l994L5859M7683K6320O947Q801J0743m892k1307j9416
$$ y = [-45410, -5248, 40999, 53567, 41452, 41319, 54733, 52973, 36779, 38897, 61872, 62606, 16123, -43219, -65492, -44934, -18169, -19015, -46590, -68530, -54426, -14936, 2430, -27795, -71197, -80825, -64446, -66196, -92817, -105411, -85840, -64846, -72668, -100768, -125767, -136626, -126502, -93008, -58903, -55755, -73234, -65029, -23654, -4241, -43389, -97418, -105307, -78857, -74397, -93712, -78395, -10798, 38376, -1757, -99556, -150469, -104634, -26590, -10267, -59885, -91460, -51155, 10231, 8163, -59667, -113355, -99222, -51285, -34280, -65549, -113697, -142868, -133064, -80731, -7722, 43766, 48557, 22968, -1974, -17690, -33054, -48633, -56793, -57757, -58371, -63025, -77309, -106779, -138793, -142787, -106928, -59245, -32925, -25978, -17177, -6434, -11326, -32633, -52049]
46701e2049r987j1857k2155k7320k3091q539J7581M0494L4288K83k2778o150L0943
46688f0337M8416L1868l652l6051m4999j8561K8204N5624L8262q436m8229n5031
46676g2922k1053L7853P6491N4519o813l7940j2999J2302j1947m8293l0895K5088
46664c6609M0550r285n9768n0566J030M0706M4913K2289j4591m7115m7044p958
46652a23448L4416M0192J3352j0305j2437n430l250m776p236j3886k1476j6879
46640a31163M026K4967K6459Q171j2985k1470j3003P714K9043L5701K1652M17
46628b0471p300K553J5059J7690J1134k607k5361m8442n1048k6289N892K5024
46616a04166L2384L1797J2278k2631l1624J5693P8039P9766J1422n5277o4555
$$ y = [-52049, -62036, -73893, -96048, -123368, -146459, -154998, -137417, -96923, -62635, -62352, -85130, -91280, -60337, -11921, 19947, 16295, -19756, -64755, -83316, -55112, 512, 38774, 30338, -17891, -72922, -93975, -56122, 20369, 74888, 68075, 30135, 17136, 29438, 17491, -30802, -61697, -36609, 3941, -5344, -65112, -115678, -114648, -73942, -29029, -6740, -21331, -68446, -115490, -123448, -89032, -48840, -35488, -45793, -58230, -63660, -66910, -71686, -78922, -92808, -114284, -131163, -127137, -102170, -75711, -67540, -80525, -101995, -114998, -107284, -78241, -42540, -20888, -20471, -27771, -25218, -10159, 7531, 18665, 16058, -9303, -57745, -108793, -135082, -129190, -104166, -71782, -39985, -27707, -50338, -81962, -66269, 11770, 91536, 102958, 47681, -16874]
46605a6874l9928k8289k7990j0749J8583K9329J5880J832o07l658j7055l0221
46593a09747k3689R436M7535M8645j747n1785l2882M0454P2808J9084m4139l0562
46581e6589K5839K9195k5309n0182q927L5078K9654N803L365J397k7403n3456
46569i1535l8262p88J9436K8710N1615O7527L7653k0516m7130k5034L347O926
46557h051L130J3817K8779L0949K3859J5986M892p426q279N86n335l7780p0234
46544a5107o8004l1521P887K5920K2906J1501L585O138J6168K0156Q593j0089
46532a867j8788j2935l180J889M583P598N871l199q452M038K7825L5206Q780l0392
46518A6977l9162k464M1980M1419j0718o4459o9838l2043K467O823n09N896J8131
$$ y = [-16874, -56802, -85091, -113081, -123830, -105247, -75918, -60038, -58206, -58813, -62471, -79526, -109747, -133436, -124000, -76465, -27820, -29567, -81352, -114234, -73780, -972, 18112, -26027, -56589, -30750, -1555, -26864, -77046, -85973, -50895, -21241, -15438, -12073, -10676, -38079, -91535, -129797, -130585, -111149, -82439, -30824, 36703, 74356, 53840, 6710, -18324, -14977, -8051, -4921, 8896, 37675, 68624, 92483, 108469, 113361, 105935, 97656, 98242, 92907, 55127, -15107, -83111, -114632, -106745, -80825, -57919, -46418, -42833, -36695, -20527, -371, 8222, -1867, -20655, -33590, -36770, -34881, -30298, -22700, -16829, -20028, -28480, -24442, 3383, 38589, 47369, 16977, -22185, -24649, 17331, 58750, 48032, -16427, -86265, -118308, -115841, -109018, -109527, -103631, -85500]
46505h5500J2170r072j7145j300J5870J3193j519j0342j0623n522J0995L7614
46493e1181M9619K6097j5332l6734k7251p451O751J4241O757k5487n9421m8642
46481a68034J3532P0504O6365J3264k7563j6473L2418P4953P3346K2350m1469
46470A13193o7540m4822j4794j5347l0619k1292J1520K6793M698k4889k2535J4149
46458g1485N3380O4338M1524L821k3353k8177j8401r642j1310k0938k4634q552
46446e3429J7222J6729k4863o2336l8666K8664O0894K8795r197n643N999j2533
46434d8364k4414J4213N9323L9952k2090m7615k9148k1502k0910K6668R3518P8207
46422I7838k2116p7589k1419M4012J6568m5889l9692J0021J4270j6015q298K1846
$$ y = [-85500, -73330, -82402, -99547, -100847, -84977, -71784, -73303, -83645, -94268, -99790, -88795, -51181, -1562, 24535, 9203, -27531, -54782, -62233, -55482, -41241, -34484, -59971, -119392, -168034, -154502, -83998, -17633, -4369, -31932, -48405, -15987, 58966, 132312, 154662, 113193, 45653, 831, -13963, -29310, -59929, -81221, -69701, -42908, -38210, -63099, -85634, -71485, -18105, 46233, 87757, 91578, 68225, 40048, 21647, 12005, 695, -20243, -44877, -53429, -36207, -19478, -44341, -106677, -145343, -116679, -55785, -26990, -36187, -41830, -35831, -48364, -72778, -58565, 758, 40710, 18620, -28995, -58143, -79645, -100555, -73887, 19631, 97838, 75722, -1867, -23286, 20726, 37294, -8595, -48287, -38266, -23996, -40011, -48309, -26463]
46410b6463J853m7843l9929J5193J7462m1993n5308J5168O6292K5820l3392k3599
46398a26739K4222L9521K9690L0084J8825k5978n4290k3101J5335k21k5757J0015
46386h8394O6442N0285k0272l9170J2904M5657J7427r339K690J83m9451q4439
46374i5477m8691J6216M2664L3367K4711J4516q654j5483J6739M5716J8908m1665
46362B867o9046m3304r18K5314K5900k009l9555l8220J8826O9669M6863k1212
46350b4825m7311j2121J6918m668m0402m1297j0752K3589N1617O6472N0603N484
46338C3307l5822m8268l9875k3425L056L1798L7580J5055q666j6368k0467k4398
46326i6493r113J7429Q488m3808o8454j0179P4475Q5112J9116l0939j6783Q135
$$ y = [-26463, -24610, -72453, -112382, -97189, -79727, -121720, -177028, -161860, -95568, -69748, -103140, -126739, -102517, -62996, -33306, -3222, 15603, -10375, -64665, -87766, -72431, -72652, -98409, -88394, -21952, 28333, 8061, -31109, -18205, 27452, 44879, 35540, 38230, 38413, -11038, -95477, -144168, -127952, -85288, -51921, -27210, -12694, -21348, -36831, -20092, 25624, 44532, 2867, -66179, -109483, -110401, -85087, -59187, -61196, -100751, -138971, -120145, -50476, -3613, -24825, -72136, -84257, -67339, -72007, -112409, -153706, -164458, -140869, -89252, -22780, 27823, 33307, -2515, -50783, -90658, -114083, -111027, -79229, -41649, -26594, -35260, -51628, -72095, -96493, -105606, -88177, -79689, -123497, -191951, -202130, -127655, -42543, -23427, -54366, -71149, -63014]
46314f3014j0970m5086l7588O051L4304K5470J665j6267k6541k5831o665K2273
46302a42199L8521L2066J2069j1074l2267m1610k8104K548L0190M4132M9049M3481
46290c198J3423l8841p6724o3428r941L2295K9490j549k3200j9321M112L8904
46278a17978P0431O8096J5341n0324o3433j0465M7044M8638O040k7432l0335j9481
46266f3858n286J1900J1954k4235o1737l6813M6514J00104O5123n878k5565P971
46254B0194K4784o269m3973m8081k6802j215K5204M2669K6743j9132m9304l4408
46242h9590m943m770k6385k9609p325Q960M161N37J6862L8453M1541K5691Q050
46229a8367M00M031J5067K3043J4294j0388k8945k3258p340j2915m2539n4835
$$ y = [-63014, -73984, -119070, -156658, -150607, -116303, -90833, -89168, -105435, -131976, -157807, -164472, -142199, -103678, -71612, -59543, -70617, -102884, -144494, -172598, -170050, -139860, -95728, -46679, -3198, 10225, -28616, -105340, -168768, -178709, -146414, -116924, -118473, -141673, -160994, -156882, -117978, -47547, 20549, 35890, -14434, -77867, -88332, -41288, 7350, 13390, -14042, -44377, -63858, -69144, -57244, -45290, -69525, -131262, -168075, -121561, -21457, 43666, 37788, 12223, 20194, 44978, 38709, -5264, -53345, -80147, -81362, -56158, -13489, 13254, -5878, -55182, -89590, -94533, -99303, -125688, -155297, -162622, -153662, -149501, -148964, -132102, -93649, -52108, -26417, -18367, -17967, -13936, 1131, 24174, 38468, 28080, -865, -24123, -31463, -44378, -86917, -141752]
46217a41752j3635N5277Q0580K7798n3119q0918l3060L9266P9234P7414N3003
46206I0088J6920k3729m7919l7705m905K1958L0054K1423p592n5682r1493p6264
46194a64846j8386K8153L2834K3713L3643M4943K3304j5340j9187J9740M5512
46183C4083J4284m4552o9665m7045j5746o343r675r218r811j6958j3816J3703
46171a80759M2202L2723j2148m1583j8446L3053N8749L9838N742j2769j8783k8851
46159a01032l6047j6087K9588N9107L6175j8872m8180k8162L985O859j0309j3821
46147a36796j892K159j393R782L3563M2889L4430L1788L3128P584m0041n7372
46135d2171k6046P27j7465m0648j9078J8146J3224j9957k3731J47L3k3117j1586
$$ y = [-141752, -155387, -100110, -19530, 8268, -44851, -125769, -158829, -119563, -40329, 37085, 90088, 107008, 83279, 35360, -2345, -7250, 14708, 44762, 66185, 58593, 2911, -88582, -164846, -183232, -155079, -122245, -98532, -64889, -19946, 3358, -11982, -31169, -11429, 34083, 48367, 3815, -65850, -112895, -128641, -134984, -144659, -153877, -163688, -180646, -194462, -180759, -138557, -105834, -117982, -159565, -178011, -144958, -86209, -46371, -40629, -53398, -72181, -101032, -137079, -153166, -123578, -64471, -28296, -47168, -95348, -123510, -119525, -112666, -122975, -136796, -138688, -136529, -137922, -128140, -94577, -51688, -17258, 14530, 47658, 55242, 15201, -42171, -68217, -67490, -84955, -125603, -144681, -126535, -113311, -133268, -156999, -156852, -156819, -179936, -191522]
46122a91522M2640P1790L6907j4066k4110j505J6221J9149J3402j119j4054q129
46110e4396K406j3875l9445j9049M2398O5942J6664l9005l9093j4066j2355j2914
46098a16788J5839L7918J4856r370J9050N6233K7463l7231m4856P041L3744J1460
46086A5359M338L3973L7837j2515n6071m6983k3573k5595k4759P415L3008R584
46074d7982l4927m6159k1056O259K0321K4002J4450m958j6172j3616q886K470
46062a26254L3234N5610K3651l8240m5209J8121O0002K1614l0801k1542R583j1022
46050e1253n2247l1871L4229N2543L391l8541l2585j5670q255J9849O3734N9800
46038C124r188o6267m8029O459K8010J9491K3544L4569J4393k8215m2585j6209
$$ y = [-191522, -148882, -77092, -40185, -54251, -78361, -79866, -63645, -44496, -31094, -32213, -46267, -54396, -51990, -65865, -105310, -124359, -81961, -16019, 645, -38360, -77453, -91519, -103874, -116788, -100949, -63031, -48175, -57545, -38495, 17738, 45201, 7970, -36886, -29845, 3899, 15359, 19697, 53670, 91507, 78992, 22921, -24062, -47635, -73230, -97989, -90574, -57566, -47982, -82909, -129068, -150124, -143865, -123544, -99542, -85092, -90050, -106222, -119838, -128724, -126254, -93020, -37410, -13759, -51999, -97208, -79087, -19085, 2529, -28272, -49814, -40231, -51253, -103500, -135371, -101142, -48599, -45208, -83749, -116334, -132004, -140259, -120410, -56676, 3124, -6064, -72331, -120360, -113901, -85891, -66400, -42856, -8287, 6106, -22109, -64694, -80903]
46026h0903Q295K872q539J657J9260J7081K094K069J7055J6481j2590m1471l7502
46013i4141p019J7070J7964N152q572j6846j1638R092K6779K0938K515J190J8421
46000a9095K4205M715j9944l1518l2173k0716R374L8087K9684r651l1884k1684
45988h0600j6743l1099k2541K5230N4256K1639k2422j3267K2822J8286k1883l8329
45976a04651j9041J81J3081L6218M4732M581m3493k6660L6376N1442m011m8243
45964e9488k8714Q952J7190J9657M3925O1935M7762K5861J3529j8382p6166r8805
45952d2744m3096L8207O3794K9268r704k3205k1922j5139m644j818j2844k4354
45940f8201k6473k3424q209K9063N4372J4869o2718p5830L458O2166N627q8229
$$ y = [-80903, -72608, -69736, -78275, -76618, -57358, -40277, -38183, -36114, -19059, -2578, -15168, -56639, -94141, -101160, -84090, -66126, -60974, -69546, -86392, -98030, -88938, -62159, -41221, -38706, -37516, -19095, 5110, 9825, -10119, -41637, -73810, -94526, -85152, -47065, -17381, -27032, -58916, -80600, -97343, -128442, -150983, -125753, -71497, -49858, -72280, -85547, -62725, -44439, -66322, -104651, -123692, -123511, -110430, -74212, -29480, -24899, -68392, -95052, -58676, -7234, -11245, -59488, -88202, -79250, -62060, -42403, 1522, 63457, 111219, 137080, 150609, 132227, 56061, -42744, -85840, -47633, 16161, 45429, 35725, 12520, -9402, -24541, -29185, -31003, -43847, -68201, -94674, -118098, -126307, -97244, -42872, -28003, -90721, -166551, -163093, -100927, -95300, -183529]
45928a83529p4695M3302J21022P9900j074k0420J3346K6984l927l8424l7572q462
45916h3549J3589Q576o794n281P378m2k6758k8084J5587N7224M6798J614k8666
45903b8408l3579k9619r079L8292P4505N0415j4499n1698m1903l2881n1502n7255
45891a87211p362P3789J19220R4179K8884j6138j3536K203j7415o1285o8804k3221
45879g6697J6346N781j5660M180M2043M3617J4500k901q918k7990l9805j0733
45867e6237K7324J5018l1582m3328j2892M596j4J8335N3737M3899r187k2689K4814
45854A1794M2053k5920r5142o7012K1423N8858J9713k2937j5037K3055M6498L4254
45842C1600o252m3785m2887n897K2126J1285j6362k7375k1137j0661N314K4570
$$ y = [-183529, -258224, -214922, -93900, -14000, -15074, -35494, -22148, 4836, 909, -37515, -75087, -83549, -69960, -61384, -68178, -73459, -66081, -66123, -92881, -120965, -105378, -48154, -1356, 258, -28408, -61987, -91606, -100685, -62393, 12112, 62527, 48028, -3670, -45573, -78454, -129956, -187211, -194573, -120784, -1564, 92615, 121499, 105361, 91825, 94028, 76613, 15328, -53476, -76697, -60351, -54570, -70230, -66050, -24007, 19610, 34110, 31209, 22291, -5699, -45504, -56237, -28913, -13895, -45477, -88805, -101697, -97101, -97115, -78780, -25043, 18856, 9669, -13020, 11794, 53847, 27927, -67215, -134227, -112804, -53946, -34233, -57170, -72207, -49152, -2654, 31600, 25348, -18437, -61324, -67221, -45095, -33810, -50172, -77547, -98684, -109345, -104031, -79461]
45830g9461K8603J2431l629j0202k0669l2210k0317R864J7541o326j9697k600
45818a26672Q832q071j9897p70K2008K4871K8437M0601K7595j1668j7317K8055
45806c996M6148j5082q2526o6043L979M1080L9997M5451M2902k431m4057j6247
45794a0825L6134J7583n3146p0884k1611P679o429L044M1228K5225n1691p8035
45782a61728n498O4656M9777J1618K5881M5516K372n3884l8577J9499L1919o35
45770i084q293J8396K8633J4962J4364K3056M778k7891k8674m221j580j8797j2940
45757g291J0150K926k8007k4565J5795K8219n089k0847J1200K8543j8062p3143
45745h0171n5984K0587P6355P4374M4722J8609m908l0975m9389m7786k5102M120
$$ y = [-79461, -50858, -38427, -42056, -52258, -72927, -105137, -125454, -115590, -98049, -104375, -124072, -126672, -117840, -125911, -145808, -146578, -124570, -99699, -71262, -30661, -3066, -14734, -32051, -3996, 42152, 27070, -55456, -121499, -117520, -76440, -36443, 9008, 51910, 49479, 5422, -10825, 25309, 42892, -10254, -81138, -102749, -95070, -101499, -98455, -57227, -32002, -83693, -161728, -167226, -102570, -52793, -41175, -15294, 30222, 32594, -21290, -59867, -40368, -8449, -9084, -17377, 1019, 29652, 44614, 58978, 82034, 86812, 58921, 30247, 26026, 24446, 5649, -7291, 2859, 5785, -22222, -46787, -30992, -2773, -7862, -28709, -17509, 11034, -7028, -80171, -136155, -115568, -39213, 35161, 79883, 98492, 93584, 62609, 13220, -34566, -59668, -55548]
45733e5548J1539j9180n8761n3500L273N3276N0177K0475J5408L4013L6804J4352
45721E2328m523m038P46n044k0773m2552o0592n1733p547L7290M0549J0689q406
45708f3606m754m784j3647k899K9781M2186J3712j7701j6353l579j4022l5885
45696i1551l9783l4552m2660m4981p956M8103O8171M6430L1222M0996L7181n93
45684A0027l0840j5020K0625K7994P135q402j0438j6902k8980k8906j4846k856
45672i1409M215J8929L9206M3748K3028o663k6517l5677m1371m1176k4724Q970
45660a29441M0257M1603J0261j8083p993K4292K6338j5415n0013l2496J2847L2790
45648f5053K1968J6133K5168K2662J239r567O319K1090L224l7024o1686m9893
$$ y = [-55548, -44009, -63189, -121950, -175450, -172177, -118901, -68724, -48249, -32841, 1172, 37976, 52328, 47805, 43767, 44513, 39469, 18696, -23856, -84448, -136181, -143728, -106438, -65889, -55200, -63606, -68360, -73144, -86791, -89690, -59909, -17723, -4011, -21712, -38065, -41644, -55666, -91551, -131334, -165886, -208546, -253527, -261483, -213380, -145209, -98779, -67557, -26561, 10620, 10027, -20813, -35833, -15208, 12786, 19921, 11519, 1081, -15821, -44801, -73707, -88553, -91409, -87194, -68265, -29059, 14689, 37717, 31054, 4537, -31140, -72511, -113687, -138411, -129441, -89184, -47581, -37320, -55403, -63396, -39104, -12766, -28181, -78194, -110690, -97843, -65053, -43085, -26952, -1784, 20878, 22117, 12550, 18869, 39959, 43183, 6159, -55527, -105420]
45636a05420j5012J3109J5591J743r81J6998K8790N316l9199n9946l8084m71J8975
45623a58591J4904M146M176K1350M2808M1206P383k6091j9937J5941L2515R448
45611a0742k0166k0086N743L0342L4138Q520l8839p0205m5264J9268N3910K5340
45599b8041j4647l153M2782N4147R682m1779n4539l6487j9121j4422j5927j5824
45587a37329o499J5056L3107K3769p678k1372O068M3395M3881J0325j2339o285
45575a5901k006j7827k1405J4314N0547K9185l6377p4218n5625k3120p604J4728
45563a45309N4619O7102K6024j6457o591K2781J1681k0125r843L1440L1746j9856
45551B7212n7184m8906l6206m2133l1961Q012L5233K9295K7128M2218K9184k4082
$$ y = [-105420, -120432, -107323, -91732, -89989, -90970, -73972, -45182, -39866, -79065, -139011, -177095, -177566, -158591, -143687, -139541, -135365, -114015, -71207, -30001, -22618, -48709, -68646, -52705, -20190, -10742, -30908, -50994, -45251, -14909, 19229, 27749, -11090, -81295, -126559, -107291, -53381, -28041, -42688, -45841, -3059, 51088, 60770, 18991, -35548, -72035, -91156, -105578, -121505, -137329, -143828, -128772, -95665, -71896, -79574, -100946, -94878, -51483, -7602, 2723, -9616, -15901, -17907, -35734, -57139, -42825, 7722, 36907, 530, -73688, -129313, -152433, -160037, -145309, -90690, -23588, 2436, -14021, -20612, 2169, 13850, -6275, -16118, 15322, 47068, 27212, -29972, -78878, -115084, -157217, -189178, -181166, -145933, -116638, -89510, -47292, -18108, -42190]
45539d2190m9861o681M2555K8967j2281r637K4395K8146K136n367N954l794l0815
45526b8473l5696k1639k4212l4269j1707L1259M2198K1107J8187L6895K5397k3603
45514d556n1424l3742j8064k9544k2285K9731O8143L6687k5390m0690l542K9122
45502f5554K7378R487q487k8857m3852l5870p657J8642L0827L1351K0686J873
45490e0033n818J3942M3239M3977P782k8820k7820N481L1821K5332r61j9164k3371
45477A5587k8069l5602k9751q734J966j1698k4430q972J8191K0941m89j3638o255
45464a10953J532m526j5248j8176p340K1367N5010N5527N337m8889m4037J1913
45452i8483M8876L1134p841l1706m3956m8720k7686J4591L2302J600l6041k9156
$$ y = [-42190, -92051, -98732, -56177, -27210, -39491, -49128, -24733, 3413, 5549, 182, 6136, 2342, -28473, -64169, -85808, -110020, -144289, -155996, -124737, -82539, -61432, -43245, -6350, 19047, -4556, -55980, -89722, -107786, -137330, -159615, -129884, -61741, -25054, -50444, -91134, -94676, -65554, -38176, -28689, -37176, -66033, -109885, -145755, -153412, -134770, -103943, -72592, -51906, -50033, -55851, -41909, 1330, 45307, 53089, 24269, -3551, 1930, 33751, 59083, 58122, 38958, 15587, -12482, -48084, -77835, -86569, -84603, -96301, -120731, -129703, -111512, -90571, -91060, -104698, -110953, -109421, -113947, -129195, -147371, -154711, -133344, -78334, -22807, -17470, -66359, -110396, -98483, -49607, -18473, -26314, -58020, -101976, -150696, -178382, -163791, -131489, -129889, -165930, -195086]
45440a95086J5240N0332N0162K2258j5982m4087l9997j072M5973O8651N0624p032
45428a6p7611j04094m6631N4201J05048O7399k982l9061l7245k7039j6147m54
45416a24632J0688J3138K0280L1905K6448M713k370Q823J381l1705m3354j3040
45404i7725J3910J2034K8294Q6253J10249L1568q6173j25644p9883l6244k6124
45393a69485k409M3339N5946K3030L890K5784M1721K2183L533Q194j620m3570
45381A0536o3630k2441K9210K4898j6446l0645j2394r312l2204l9577j0858K1057
45369a51806K1811L35j3042p189N130Q881K773k385Q96M382m687j9530j5995J4078
45355a56348M6377N2217L1625O539r590k1577l5876m6685m1914j8718J0540K9414
$$ y = [-195086, -179846, -129514, -79352, -57094, -73076, -117163, -157160, -158232, -112259, -43608, 7016, -16, -77627, -181721, -228352, -174151, -69103, -1704, -4686, -43747, -80992, -108031, -124178, -124632, -113944, -100806, -80526, -48621, -22173, -17460, -19830, -11007, -9626, -41331, -84685, -97725, -83815, -71781, -43487, 42766, 153015, 184583, 98410, -27234, -107117, -143361, -169485, -171894, -128555, -72609, -49579, -45689, -19905, 21816, 43999, 47532, 55726, 54106, 10536, -53094, -75535, -46325, -21427, -37873, -68518, -80912, -90224, -122428, -162005, -172863, -151806, -129995, -129660, -142702, -149891, -144761, -135880, -133107, -135492, -134596, -130214, -134901, -154431, -170426, -156348, -109971, -57754, -26129, -19590, -29180, -50757, -86633, -133318, -175232, -193950, -183410, -153996]
45343a53996L1878K0764l031l4854n1520k7628K3056M9534K7458l262P120M6922
45331f7559O1859L2392o961k2769k0018j8751k3763k8055k6536j7662k410J6096
45319a24137L6123N2271M5762L328m6407n0395n207K5650j36l9331l0845J1500
45307a21824K9927J4302o0j368k245O984L6410M7960N460m3854k5096L6433M0549
45294B3578l0485q2810n8826j0584R264K7598O8972Q6379M2171j5184k5109o415
45282B8549r196k7549k4264P94K3623L7803L7316L549m7952o0988k2085R874R68
45269d9558m194K0861K1652k7891m3786L6784J20879Q1818m0388r6465n0796n740
45257c6824j7324l0503r896P76j6788j0872L5967O1023K8579p448J634K2780J2253
$$ y = [-153996, -122118, -101354, -104385, -139239, -190759, -218387, -195331, -145797, -118339, -121601, -114481, -67559, -5700, 26692, 19731, -3038, -23056, -41807, -65570, -93625, -120161, -137823, -140233, -124137, -88014, -35743, 10019, 13347, -33060, -83455, -88662, -63012, -63148, -102479, -133324, -121824, -91897, -77595, -77655, -79023, -81268, -74284, -37874, 10086, 15546, -28308, -53404, -16971, 23578, -6907, -89717, -148543, -159127, -149863, -122265, -53293, 33086, 75257, 60073, 34964, 28549, 19353, -8196, -32460, -31666, -8043, 29760, 67076, 70625, 22673, -38315, -60400, -50526, -49558, -53752, -32891, -11239, -39130, -82916, -46132, 74747, 156565, 116177, 19712, -31084, -36824, -54148, -84651, -94547, -93771, -110559, -121431, -85464, -24441, 4138, -3310, -1676, 21104, 33357]
45244C3357q160q44K0337K3461J1770K431m342n003J1302K4358k322m7280m1381
45231A7684J7979M1691j5679p3885m5266L2907O2457K9080j368J645O121o909
45219F6457j5300o474n37j5433m4326o6008n4422L673P4396Q9921L1923l0301
45207C3569k9051P896Q009l0467m3174p902K3924J1655k0951l5213l0705k4985
45195a37395j7816j633J5860K0753J2255J792P18J0289J6637L321k1396k5450
45183a22065K643L0406K6139N339J01L163j4193m1124l4135J4082N9417O8713
45171a514N5584M1212J9968j4234l9861l3369m494J5798J0549j4367m3708o1124
45159f9560n4598k7305K078J7998K2709K8432L9495M4872K7050j7434o3464p3867
$$ y = [33357, 25197, 24353, 44690, 68151, 79921, 82352, 78010, 73007, 84309, 108667, 106345, 59065, 17684, 35663, 77354, 61675, -12210, -57476, -24569, 37888, 66968, 65600, 67245, 73366, 66457, 51157, 44683, 44146, 28713, -15613, -81621, -136043, -132370, -57974, 31947, 63870, 33569, 4518, 12414, 20423, -10044, -53218, -61120, -37196, -25541, -46492, -81705, -112410, -137395, -155211, -156844, -140984, -120231, -107976, -106184, -105466, -95177, -78540, -75219, -96615, -122065, -119422, -89016, -62877, -57538, -57437, -54274, -68467, -109591, -143726, -129644, -70227, -1514, 54070, 95282, 115250, 101016, 61155, 27786, 23292, 39090, 49639, 35272, -8436, -69560, -124158, -151463, -149385, -131387, -108678, -80246, -40751, 4121, 31171, 13737, -49727, -123594]
45147a23594l9126J0194M0293M8016M4280K5583j0606l8506k8882L465J3501r886
45135f5268k8131j0725K2392L2202J0840j7260k9043k2068q850k482l726p14J2632
45122a10201K3635J8984Q238R741J8528J3413m185o511J7450M0472L3232L848
45110F6644j5722j3428j0481k8779n3551m1613K1925Q5165P7622K344n7953m7878
45098a5705j0321j1155l4782j9237K9216L7490j5040n7195l1871K3438L8814N194
45086f1154l2598l8804r548L6012O1643M2441N196K109L0446L1429j0962l7259
45074A8951j4796J668l0557n5492j3537L9484J2985n9550o1925J7639O4396J8476
45062f2258l8350j9472M3628P4206O4474M8371K3277k6606p0407o4661k3253M511
$$ y = [-123594, -162720, -152526, -112233, -64217, -19937, 5646, -4960, -43466, -72348, -68883, -55382, -65268, -93399, -104124, -81732, -49530, -38690, -55950, -84993, -107061, -115911, -118393, -122119, -122833, -110201, -86566, -67582, -59344, -49603, -31075, -17662, -21847, -28358, -10908, 29564, 62796, 66644, 50922, 37494, 27013, -1766, -55317, -96930, -75005, 10160, 87782, 90126, 32173, -15705, -26026, -37181, -71963, -91200, -61984, -24494, -39534, -96729, -128600, -105162, -66348, -61154, -93752, -132556, -142104, -106092, -44449, -2008, 3188, 5297, 35743, 67172, 56210, 18951, 4155, 5823, -24734, -80226, -93763, -54279, -41294, -100844, -162769, -145130, -80734, -62258, -100608, -120080, -76452, -2246, 62228, 110599, 133876, 107270, 36863, -27798, -51051, -46540]
45050d6540O169N876R914J615k0239l8241m1484k4199J9013O5238O2594J487m6345
45037d5142j7524M1744L5438l5402o8301j1606N9800N5281r822n2088l6277p93
45025h4692J1693K545j070J6617M4417N4974L4066o65k2420l1510m5016n5428
45013g6489l6857L241K1696M158j1216K175J4999n017l4399k9894O391M0075N7201
45000d3936O0688L8898j2680n6604n2330j8074l620j3451j2250K571j300j9397
44988a31485n206M7564Q1334N8159R777k2545m0740n0067k6338L0698O3732L3222
44976D8105j5481j8638R151R687j6842j8971J0482K1740n357l0670k4491r195
44964d0480q561o306J7622M8399N9985M8308K1963j3124m5379o0339o0957n7367
$$ y = [-46540, -40371, -34495, -24581, -22966, -43205, -81446, -122930, -147129, -128116, -62878, -284, 1203, -45142, -62666, -20922, 14516, -20886, -89187, -100793, -40993, 14288, 4466, -47622, -83899, -84692, -72999, -70454, -71524, -54907, -10490, 44484, 78550, 77885, 55465, 23955, -21061, -76489, -113346, -110105, -88409, -84251, -95467, -93292, -78293, -83310, -117709, -147603, -141212, -101137, -43936, 16752, 55650, 42970, -13634, -65964, -84038, -87658, -101109, -113359, -110788, -112088, -131485, -136691, -89127, -7793, 50366, 60143, 37598, -3142, -53209, -79547, -48849, 14883, 48105, 32624, 13986, 23137, 32824, 15982, -2989, 7493, 29233, 23876, -6794, -31285, -40480, -49041, -55347, -37725, 10674, 70659, 118967, 140930, 127806, 82427, 22088, -38869, -96236]
44952i6236l6067J8775P0063N2282k7011p1371k2930M8283M0562l4421p3361k8278
44940a59710M1725O7323N0466K9252J5422l8j2378q588O594J3691K242j9940l5899
44927i838l3617j8124q681j3277j1212K0673O7132Q3305M8613r251n0219o0645
44915D859m8466k2834N261J8786R952p887j6442j3107n489M262J6066K0732Q077
44902b6230j5331k9229k2317m059P650N685q04J903J5650K8160L0285K9655L6222
44889E7240L8286J2842l4247o0020l4857J2553K5061j1443n0850m6805q727J6364
44877h4603M929j8980j9305P483L1228K6693M814o60K2564M4442K7975j8582m4649
44864a6651k0528K1994L1328M345j4873M52K8864L9331K7129k422m9648r3534
$$ y = [-96236, -132303, -113528, -43465, 8817, -18194, -89565, -112495, -64212, -23650, -58071, -131432, -159710, -117985, -50662, -196, 29056, 44478, 44440, 32062, 23474, 30068, 43759, 46001, 26061, -9838, -43455, -61579, -70260, -83537, -94749, -74076, -6944, 76361, 124974, 115723, 65504, 4859, -43607, -66441, -61180, -42394, -32442, -40329, -56771, -69878, -75367, -71105, -55039, -34307, -26230, -41561, -70790, -93107, -97166, -89516, -83831, -84635, -82732, -67082, -38922, -8637, 21018, 57240, 95526, 108368, 74121, 14101, -20756, -8203, 16858, 5415, -45435, -92240, -100967, -84603, -79674, -98654, -117959, -110476, -79248, -52555, -47741, -48401, -25837, 18605, 46580, 27998, -16651, -37179, -15185, 16143, 20488, 5615, 6067, 34931, 74262, 101391, 98969, 49321, -44213]
44852d4213q5214j2737N3030L4915l7796n9243J838N3349J7595m9694m3822K8878
44840a43114O0041Q13o8253n5074J9313O0739L0863j6722k1288J0242K8893J6024
44828g7523J359J1856L0400K4099j365p042J8323L7212J9697j0646j5013K306
44816C3663R229n33j0718k4733n5580p8854n0206K1516O9918N7173J7541n873
44804a7457j8156l4744l4821n43L1474J3071l8537n8904k4589K3888M5891M2104
44792g1323K6780K403k1823k1317J1186M5386M4849N874m5225p7877p1181k2102
44780a94370M3055P8972O2654J9240p950q136p979k8047n3481n5770k9599N043
44768a76368K8946L5907K4141k400k0569j066N0121Q4006O3122O852l9433n9519
$$ y = [-44213, -129427, -142164, -89134, -54219, -92015, -151258, -149420, -96071, -78476, -128170, -171992, -143114, -83073, -82260, -150513, -205587, -186274, -125535, -94672, -111394, -132682, -122440, -93547, -77523, -76164, -64308, -33908, -9809, -11174, -18216, 107, 37319, 57016, 46370, 31357, 33663, 42892, 42359, 31641, 6908, -48672, -127526, -177732, -156216, -86298, -29125, -11584, -17457, -35613, -70357, -105178, -105721, -74247, -61176, -99713, -158617, -183206, -159318, -113427, -71323, -44543, -42140, -63963, -85280, -74094, -28708, 16141, 22015, -23210, -101087, -172268, -194370, -151315, -72343, -9689, 9551, 1601, -6535, -14514, -42561, -96042, -151812, -181411, -176368, -147422, -111515, -87374, -89774, -110343, -111409, -61288, 22718, 85840, 92692, 53259, -6260]
44756f260n9930l2428K7370P6022N7743j0281m8357k5279L949l197r820K2099
44744h369N0778K0252l9090n2534j6346N384j4991m0539m0597k1894R419N1238
44732i7289P1477L7879j5623k1748J6104K7645p005k8009n950Q294j6797l2290
44720f3312l911J4682k2555n8032k0053M7665M7387j6346m6735o985L9643M5443
44708d3109L6875L8241K5722q369k1188Q053L3109J3544k0522k4581j3963k6437
44696b625m5935k5654K9107O0016L7582l461j8760p510J615q443k8929l6476j2769
44683f2242L2707N9368L4129k4193o0226m7378j4377L163R017K1068K6050m91
44671b3405l9939m3129l175K9727K3401P239J0821P715k8511n3678j2354N4201
$$ y = [-6260, -66190, -98618, -71248, 4774, 62517, 52236, 3879, -21400, -17451, -20648, -30468, -8369, 42409, 62661, 23571, -28963, -45309, -39925, -54916, -95455, -136052, -157946, -148527, -97289, -25812, 12067, -3556, -25304, -9200, 18445, 11440, -16569, -22519, -14225, -31022, -63312, -67223, -52541, -75096, -133128, -153181, -105516, -58129, -74475, -121210, -128195, -88552, -43109, -6234, 32007, 57729, 49360, 28172, 36225, 69334, 82878, 62356, 37775, 23812, -2625, -48560, -74214, -45107, 14909, 52491, 49030, 30270, 22760, 24375, 15932, -12997, -49473, -62242, -29535, 29833, 63962, 39769, -20457, -67835, -82212, -79049, -70032, -48964, -22914, -23405, -63344, -106473, -109648, -79921, -56520, -49281, -38460, -30745, -59256, -112934, -125288, -71087]
44659g1087M8491l0386o8461l916P7265P1410O886j7031J3856K8436k063l2144
44647B1256l3084k8038k6714n092L0359L2276n486k3113J1092M3414J8126l3421
44635A575m2501n365K2496J3453o566j2898j3882k1946k9131k3730j0489l598
44623a32582p545q497J4002N7618Q2155M7594k5217o1785k4023L2694K6631m0059
44611c9014p9235k9992O1494R8292N0881j1801j3879L2364M9937M808n0320n2965
44599B0570j2731J5947J2655r19j1124k0330j6887Q509K3215j0151n7756m5423
44587i4425K4023O0737K0911k9053k3610M613j066k1650j5064q386m3163p1848
44575a97981j7465Q1424R9144P251p5231n0761K8247N3118J0559k5649j1861K2483
$$ y = [-71087, -22596, -52982, -121443, -125359, -48094, 23316, 30202, 13171, 27027, 55463, 53400, 21256, -11828, -39866, -66580, -71672, -41313, -9037, -14523, -37636, -26544, 16870, 34996, 1575, -40926, -46291, -23795, -10342, -16908, -29806, -43688, -65634, -94765, -118495, -128984, -132582, -140127, -148624, -134622, -77004, 5151, 52745, 27528, -34257, -58280, -25586, 1045, -39014, -118249, -148241, -86747, 11545, 62426, 50625, 36746, 69110, 119047, 123855, 73535, 20570, 7839, 23786, 36441, 35522, 24398, 4068, -12819, -4310, 18905, 8754, -49002, -94425, -70402, -9665, 11246, -17807, -41417, -36804, -37870, -59520, -74584, -82970, -126133, -197981, -215446, -134022, -34878, -27627, -102858, -153619, -125372, -72254, -61695, -87344, -99205, -76722]
44563g6722L3735J5503q433j2638R187L6333L8382Q629k8487m6246l7949j0703
44551g9409K1800L8483K7540Q189R972K6198J8762k1405n2134l6548O024K7691
44539d837J0529k2425l8696k2574J5247M1002K6720j2432k7503M891N0675O0171
44527H0768K4835k2536m8594m5083k6229j3673j4327q087K5815O6873O5019Q255
44515I3036m8670m7366J285L3645J1887l8111o2745l6101J8701N2246L6896k465
44503A2238j5921R937L7516L4007J5556J4164K4076J4771j4318l0531k2159j9386
44491E9950m3598o3623l3712L4394P2833M2392j3189k5718L424J1347k4843m9266
44479b9609j7283K6117J1057m6357o5479k3158J7557J1919j839K5612P2002P6662
$$ y = [-76722, -42987, -27484, -35917, -48555, -39368, -3035, 35347, 43976, 15489, -30757, -68706, -79409, -57609, -19126, 8414, 16603, 26575, 52773, 71535, 50130, -2004, -38552, -32528, -4837, 5692, -16733, -55429, -78003, -62756, -21754, 4966, -7466, -34969, -30078, 20597, 80768, 105603, 83067, 34473, -10610, -36839, -50512, -64839, -72926, -47111, 19762, 84781, 93036, 44366, -3000, -1715, 31930, 43817, 5706, -57039, -93140, -74439, -22193, 14703, 12238, -3683, 6254, 43770, 77777, 93333, 107497, 131573, 146344, 132026, 101495, 79336, 59950, 16352, -47271, -80983, -46589, 26244, 68636, 55447, 29729, 33153, 44500, 19657, -29609, -46892, -20775, -9718, -56075, -121554, -144712, -127155, -115236, -117075, -91463, -19461, 57201]
44467E7201K4698l9954o6080l5325K7289O4722L7398k2606m1759n922J7400j2970
44455D092l9386L263P0230N8909l9066j15265q3255J9791Q8326O2868k6304r6841
44443i2638q4314k000O4165M6449k1721m7810j318N3976N7812L1764L0155N3464
44431H7984N5563J9028k1668l3656k6651k6163l0545j9263N821J6571K144j1005
44419A8160j542Q982p819l3461k9997r441j7029m2755k1158N4847R4270L4928
44407D7985n2743o0561M284M3376J6431k1911k6060j2368J933L2222P4005Q3721
44395A30314M3295p420k9175k8434k2903j0558K603q541m2654n6809k5902J9274
44383c6910L7724K5984R4k8552l8647p258M1600M6570k389l8532j8423J1722O91
$$ y = [57201, 81899, 41945, -24135, -59460, -32171, 32551, 69949, 47343, 5584, -338, 17062, 4092, -35294, -32031, 38199, 97108, 58042, -57223, -140478, -120687, -32361, 30507, 4203, -92638, -176952, -178952, -114787, -68338, -90059, -137869, -139187, -85211, -27399, 4365, 34520, 87984, 143547, 162575, 140907, 107251, 80600, 54437, 23892, 4629, 10450, 27021, 29165, 18160, 16618, 25600, 17781, -15680, -45677, -55118, -72147, -114902, -136060, -81213, 13057, 47985, -4758, -65319, -61035, -17659, -1228, -23139, -49199, -61567, -59634, -27412, 46593, 130314, 173609, 166189, 137014, 108580, 85677, 75119, 77722, 69181, 26527, -30282, -56184, -36910, 814, 26798, 26892, -1660, -40307, -47565, -5965, 40605, 38216, -316, -18739, -7017, -6326]
44370f326j7538J0193N0219L1821k6215l6733J4133M4711J3595j5693J3916N5615
44358A31698L2964m1169q5488o1855p650K8840L3396J2325j8163k6308Q530N4596
44346F1716N2322n285n4998m8458j6614j2782k5750o663L4613L2541k3368n4910
44334f7636j1629M3909L0122k4302k8563K0261L4079j5860m6727Q79O4066N6434
44322E5033j40j9149J5755L9927J5145k5541m0984k8666n51L5079N5657L5190
44310A36755j0028k7215J665L0766J6719j8303k3309K848J0240k5958o4656n2962
44298b3438k0L3012J6107q599R874N0857M5357k3287q7699q3137k7679J3641J4887
44285g0124J951j288K979J0814K5960L9766L1141m185m2901n7685l9084K735M2717
$$ y = [-6326, -23864, -13671, 36548, 68369, 42154, 5421, 19554, 64265, 77860, 62167, 76083, 131698, 164662, 123493, 38005, -23850, -31500, -2660, 30736, 43061, 24898, -1410, 7120, 61716, 114038, 108753, 53755, 5297, -11317, -24099, -49849, -56512, -21899, 10642, -12726, -67636, -79265, -35356, -5234, -29536, -58099, -37838, -3759, -19619, -66346, -65467, -1401, 55033, 54893, 35744, 51499, 91426, 106571, 81030, 40046, 11380, 10829, 45908, 101565, 136755, 126727, 99512, 101177, 131943, 148662, 130359, 107050, 109898, 120138, 94180, 29524, -23438, -23458, 9554, 25661, 17062, 26936, 77793, 123150, 99863, 12164, -70973, -98652, -85011, -70124, -68173, -69461, -66482, -55668, -29708, 10058, 41199, 37014, -5887, -63572, -102656, -99921, -57204]
44272e7204N3644L3026J1515J4651K4496N604l5684n1071j6525L0855L9160N708
44260E8175k5423k1597K374J0788l983j5427o094N686N24j776K5583N4182K4954
44247A07966n3519r0214l0040O3163R0090M1630j5547m4166n7314n4380j4409
44236e6740M3900O5623L7718O314L102J0184J1147J7020K2164l114m7558m9980
44224E9780M406L9179o883p9586q2696j6066L4300K7135R778K6189N0753L9817
44212A06106o32l1988l7209k8324j8406j1012o945k591J1691L6730N3632M1090
44200A12142J658l9143n7955m9089j8630K1857N1606M7080Q095k9925k9281M675
44188B3090L0571K4850M467j0847k7541m8909m7312j074N9702Q3368O2318L0628
$$ y = [-57204, -3560, 29466, 40981, 55632, 80128, 85732, 50048, -1023, -17548, 13307, 52467, 58175, 32752, 11155, 13529, 24317, 20334, 4907, -1187, 4499, 5023, 3247, 28830, 83012, 107966, 54447, -35767, -65807, -2644, 87446, 129076, 113529, 69363, 12049, -42331, -56740, -12840, 52783, 90501, 96815, 99917, 110101, 121248, 138268, 160432, 157318, 109760, 59780, 64186, 103365, 96482, 16896, -65800, -81866, -47566, -20431, -10653, 15536, 66289, 106106, 105474, 73486, 36277, 7953, -10453, -21465, -28410, -31001, -19310, 17420, 71052, 112142, 113800, 74657, 16702, -32387, -51017, -29160, 22446, 69526, 77621, 47696, 18415, 23090, 53661, 78511, 82978, 72131, 44590, -4319, -51631, -52705, 6997, 90365, 152683, 183311]
44176A83311P002j5008k6390o705K5168K0681k0315l6933q39L2825J0788l1246
44164A42339k5188K0136L4862j13k6668l628L1787K2542k8293o6874n6378j0224
44152C4300L2394M5860L4565J7954K891k0032m7199m8089m669M7313N0690J789
44140A47767m1084l3893Q13J5584K335j2247j3867r921k615J3240K6990J8141
44128A11243q920k3651j1602P189J2508J0106Q210l620k7757l6553j0276K3344
44116E0221K6306J0495J3822K7903R277l4234l6540K2587P0656M2871k4048n2512
44104A26804l5122k1641k6519k0878k025J255p034J1895N7476P4750L4990j9119
44092A74832l4814j5265K288K198k718P26J1623J7830P844q796k519L2522N2270
$$ y = [183311, 190313, 175305, 148915, 142210, 167378, 188059, 167744, 130811, 129972, 162797, 173585, 142339, 117151, 137287, 172149, 172036, 145368, 141740, 173527, 196069, 167776, 100902, 44524, 34300, 66694, 112554, 147119, 165073, 167964, 147932, 100733, 52644, 47975, 95288, 145978, 147767, 106683, 72790, 73603, 89187, 91522, 79275, 65408, 55487, 52872, 66112, 93102, 111243, 102323, 78672, 67070, 74259, 86767, 96873, 105083, 101463, 73706, 37153, 26877, 50221, 76527, 87022, 100844, 128747, 138024, 103790, 67250, 89837, 160493, 203364, 179316, 126804, 91682, 70041, 43522, 22644, 20619, 21874, 14840, 26735, 84211, 158961, 193951, 174832, 140018, 124753, 127041, 129239, 126521, 127247, 138870, 156700, 164544, 155748, 153229, 185751, 238021]
44079B38021J6913m3966o7636m8157l2771l3941j4023L2457N3241K2009j6083
44068A06064j7442k689o970j7067k386K9200M7654M4048K6391J255j6401p736
44056A83921J6310K2889J1788J3934K3994m95n0782n4173J1058O5338M5076n155
44044B83703k0226j6951l0593k4427L6919Q5164L6326n8136p1164O848N8626K5418
44032C11507k0183j1264J6283J0477n413J0907L9027L2392l964k4369q368K1009
44020C68041L0974J0200k1931l0622m674K3946K0006o779k0897j3527j585J0329
44008C63481K7851M0820L8882L6244M0705K3454k9887o7578l6391K5618L6423
43997D99622m967k4023L149J8592r890l5992j7839J9488L7560L8985L5157J4100
$$ y = [238021, 254934, 210968, 143332, 95175, 62404, 28463, 14440, 46897, 100138, 122147, 106064, 88622, 85933, 78963, 61896, 59510, 88710, 136364, 180412, 206803, 208058, 191657, 183921, 200231, 223120, 234908, 248842, 272836, 272341, 221559, 167386, 178444, 243782, 288858, 283703, 263477, 246526, 215933, 191506, 228425, 313589, 349915, 291779, 220615, 227463, 286089, 311507, 291324, 280060, 296343, 306820, 301407, 312314, 351341, 383733, 379769, 355400, 347032, 368041, 399015, 409215, 387284, 356662, 351988, 375934, 395940, 389161, 368264, 354737, 353152, 363481, 391332, 432152, 471034, 507278, 547983, 571437, 541550, 473972, 437581, 463199, 499622, 494655, 470632, 473781, 492373, 482483, 446491, 428652, 448140, 485700, 524685, 559842, 573942]
43985E73942k4620m5614j9907L7213Q6736R8593O3853P166k0641P89K9771L0402
43973H17683L7912R2056J43690J19263N3018M8305J17888J78474K05471K64200
43963B077960L61341L93828K96136J28388l3869j89680l33708l94774l32127k11934
43953A761561j20191p2440n9977r3871j42655j22916k4576M5988K1489k3994r349
43942A159069K1701M869j0522M1532R6348N1883m7246o6885O339N5222K5013p939
43930A329384K2232P3277P3546K0385l1056k9455L2129J01622J05501L6602k2840
43919A711327n897N0491P0157M5177K0385J5678K7885O6817J23474J45147J08957
43908B379598P6030J04685J56642J61239J25872J07713J19655J37513J57816J81339
$$ y = [573942, 549322, 503708, 483801, 521014, 607750, 706343, 770196, 777362, 756721, 757510, 787281, 817683, 855595, 947651, 1091341, 1210604, 1263622, 1311927, 1429815, 1608289, 1813760, 2077960, 2439301, 2833129, 3129265, 3257653, 3223784, 3034104, 2700396, 2305622, 1973495, 1761561, 1641370, 1568930, 1508953, 1415082, 1272427, 1149511, 1124935, 1170923, 1192412, 1168418, 1159069, 1180770, 1185639, 1175117, 1216649, 1312997, 1364880, 1317634, 1250749, 1257088, 1312310, 1337323, 1329384, 1351616, 1424893, 1498439, 1518824, 1487768, 1458313, 1490442, 1592064, 1697565, 1734167, 1711327, 1705430, 1755921, 1826078, 1871255, 1891640, 1907318, 1935203, 2002020, 2125494, 2270641, 2379598, 2455628, 2560313, 2716955, 2878194, 3004066, 3111779, 3231434, 3368947, 3526763, 3708102]
43898C708102J86800J81189K15519K90347L23203K80647K54372L21285M19968
43889F181432M62615M77800N38569O40381P55224R10229J107770J273431J384018
43880A3731469J519430J688554J774902J783575J942926K399645L033369L759190
43872C1633060M752351O149664P851268R917624J2785840J6704150K1391187K6659733
43864A37844877L2450361L6987100L5610885K3879059L020954j8990909l3317953
43857B17484374l7017125l3548464k7831237k2370954j7596930j3646673j0687435
43850E4785556q467059o604102n089972m041703l291139k627621k152156k013726
43842B0498078k032926j923287j687750j496987j351850j149376r35588q24500
$$ y = [3708102, 3894902, 4076091, 4291610, 4581957, 4905160, 5185807, 5440179, 5761464, 6181432, 6644047, 7121847, 7660416, 8300797, 9056021, 9966250, 11074020, 12347451, 13731469, 15250899, 16939453, 18714355, 20497930, 22440856, 24840501, 27873870, 31633060, 36385411, 42535075, 50386343, 60303967, 73089807, 89793957, 111185144, 137844877, 170295238, 207282338, 242893223, 266772282, 269793236, 250802327, 217484374, 180467249, 146918785, 119087548, 96716594, 79119664, 65472991, 54785556, 46318497, 39714395, 34624423, 30582720, 27291581, 24663960, 22511804, 20498078, 18465152, 16541865, 14854115, 13357128, 12005278, 10855902, 9920314, 9095814]
43834I095814p74286o71989n42770m75407m39435l63315k96125l11057l42667
43825D878763k96676k31498k53378l12752k84407j84024j29588j38920j32312
43816B915208r5772q3307q8220o0396k5649m8790j02744j08805q2444j01916j50337
43805A966828j31670m2487J0422k0707o4452o5883o5176r8306j19382q0008j5941
43794A273238M022k5218m6908k3149J7585J6133l9466q4238n1456K7745N2760
43783A121048n477n9632l7616J3046J1420l0419m3200j5061J0041J5626J8326
43772I98102J5596j962q415K3120O8623R6247J28799J96913K65739K84933K78666
43761B346361K97670L04160K02232j5395k35692l52067l57012l05073k48834k18007
$$ y = [9095814, 8321528, 7649539, 7106769, 6631362, 6191927, 5828612, 5532487, 5221430, 4878763, 4582087, 4350589, 4097211, 3784459, 3500052, 3316028, 3186440, 3047520, 2915208, 2819436, 2736129, 2647909, 2587513, 2561864, 2513074, 2410330, 2301525, 2219081, 2117165, 1966828, 1835158, 1792671, 1803093, 1782386, 1717934, 1652051, 1586875, 1488569, 1369187, 1289179, 1273238, 1277260, 1252042, 1205134, 1181985, 1199570, 1215703, 1176237, 1091999, 1040543, 1068288, 1121048, 1115571, 1055939, 1018323, 1031369, 1042789, 1012370, 969170, 954109, 964150, 979776, 998102, 1013698, 1011736, 1003321, 1026441, 1095064, 1191311, 1320110, 1517023, 1782762, 2067695, 2346361, 2644031, 2948191, 3150423, 3135028, 2899336, 2547269, 2190257, 1885184, 1636350, 1418343]
43751A418343k04954j67118q9854l1602m8811r7872q8245k1880O667m4762j05934
43740E23978j01754m6116L816K7320L7165L9081K8574O492j8908l2038j7727J1149
43728D61032J3720k0949m4959k2647N529j1178m1308k3075J9308O688n6641p7652
43716B07868k0107M1674M2275J0897Q13J1044K1050L5810N1362L4077k1229o3259
43704C52275n5365k8022k2296k6962j2405J3244K1934Q573j4288l4626l3849P47
43692A68960L9466L2174j4479l5468o693J5510j0208l9002j6329K8926L1522q722
43680A85657l7720l4057k2879j7143k654K0518K8105P928k3584m1679l1559M073
43668C5006L8902L9929P825j7247n385K8473N2305N1527K3020k8942p2041o2801
$$ y = [1418343, 1213389, 1046271, 956417, 924815, 876004, 778132, 689887, 668007, 674674, 629912, 523978, 422224, 376108, 379924, 407244, 444409, 483490, 512064, 518556, 499648, 467610, 449883, 461032, 474752, 453803, 408844, 386197, 391726, 380548, 339240, 316165, 335473, 342161, 285520, 207868, 187761, 229435, 271710, 282607, 283420, 294464, 315514, 351324, 402686, 436763, 415534, 352275, 296910, 268888, 246592, 219630, 207225, 220469, 242403, 250976, 236688, 202062, 168213, 168960, 208426, 240600, 226121, 190653, 183960, 199470, 189262, 150260, 133931, 162857, 194379, 185657, 147937, 113880, 91001, 73858, 71204, 91722, 119827, 127755, 104171, 62492, 30933, 35006, 73908, 113837, 121662, 104415, 99030, 127503, 179808, 231335, 254355, 225413, 153372, 90571]
43656I0571j1520J2037k6989o9891m4432L1895P9178N9926O591l5458m3203j0063
43644C8642M5317P2713L7953k7009n8889m0704q956N961O161p0r543r011J5122
43631F7687M8624N9037L4331q939m7882o2037l6430J4511M3447K5749J265J8673
43619A58036N4880M4567j4746m9172j5322L5078K9930k4025n8600m1082j1028
43608A08516j6654m5563m1918J3261O5480N0956j6014n5337k5475K4782L0974
43597I3008R58j1146Q178K1648R089m278M214J6625J865l9109o9310n1783Q633
43584a1408N7142M0296k3857n3988o459O2655P2569K5785j0401j1105j7940n4008
43572F9281p9072n3365K150L9891M6342L8958K7616R809r017j6315j0372j793
$$ y = [90571, 79051, 91088, 64099, -5792, -50224, -18329, 60849, 120775, 127366, 91908, 48705, 38642, 83959, 156672, 194625, 167616, 108727, 68023, 59067, 65028, 71189, 71119, 61576, 52565, 67687, 116311, 175348, 209679, 200740, 152858, 90821, 54391, 68902, 112349, 138098, 139363, 158036, 212916, 257483, 242737, 193565, 178243, 213321, 243251, 219226, 160626, 119544, 108516, 91862, 46299, 4381, 17642, 83122, 134078, 118064, 62727, 37252, 62034, 93008, 93966, 82820, 90998, 112646, 121735, 117457, 121671, 138296, 140161, 101052, 31742, -20041, -11408, 45734, 86030, 62173, 8185, 1726, 64381, 136950, 162735, 152334, 141229, 123289, 69281, -9791, -63156, -61006, -21115, 25227, 64185, 91801, 101610, 92593, 76278, 65906, 64113]
43560F4113K171O457J9909L8293L8249L47n6738q3273n4504k862K4892K4560K4184
43547D5798L4640M2419L9743K9650J0023j6238k5936m889J7988M736l1166m0163
43535A06605q937K4936K9909J0178k0669n0781n3706j0424M4477M8482l066m4329
43523G2675k9477J0442K3322N258j4070j9653j5840q742n943j2495j6264k909
43511a3696J2259M086j0867O571M2043L4572k0589m6753j960M8179L0401k2218
43499F2028k7486J7108M2222K0934l549j901j208l0062p0635q1578l9970M0805
43487g3292J09629J05969K4467n9484o6709p761L8589K9154o152k4273j7718L85
43475E2804J6583J5102q215k6690j3259J1062J655l5526m4194l605L6159K7116
$$ y = [64113, 66284, 72741, 92650, 130943, 169192, 169539, 112801, 29528, -24976, -27838, -2946, 21614, 45798, 80438, 122857, 162600, 192250, 202273, 186035, 160099, 155210, 173198, 177934, 146768, 106605, 97668, 122604, 152513, 162691, 142022, 91241, 37535, 27111, 71588, 120070, 117004, 72675, 43198, 53640, 76962, 82220, 68150, 48497, 32657, 23915, 17972, 5477, -10787, -13696, -1437, 2649, -8218, -1647, 40396, 74968, 54379, 7626, 5666, 53845, 84246, 62028, 34542, 51650, 93872, 114806, 111257, 109356, 108148, 78086, 7451, -74127, -114097, -73292, 36337, 142306, 166773, 107289, 40580, 32819, 71408, 100562, 94410, 70137, 52419, 52804, 69387, 84489, 76274, 49584, 36325, 47387, 49042, 13516, -30678, -34283, 1876, 28992]
43463B8992j2820l7824l7609k8282j0425K3779N8536O5628M0804L778k8144m3133
43451B3280k5147K6883P4974O9878R292n5983q0321o4764l3443K577L7612N2339
43439C7177L5607J3339J8070L2544P999n1991p7597l2424K3193J9586j4027p05
43427A0771N2397O5095K4810J3785O7220J04430N8560j3595k9469j3673l6960
43416C03371p9941p0555k4208k5299p5770q2632j3505M8926M3464J7523K7146
43405F8520M4027K7362P686K2533L3855o671n9775n3557j691K1442J558r510N00
43392I6279j3904n7131o5087j0199M1249K5263k4410l4801o012K540k0813j9247
43380h6273L4268P8952M5591m0159q2661l7877L4813N5031J8500j6397j3392J0255
$$ y = [28992, 16172, -21652, -59261, -87543, -97968, -74189, -15653, 49975, 90779, 94557, 66413, 23280, -1867, 25016, 99990, 169868, 179160, 123177, 42856, -21908, -55351, -52774, -15162, 37177, 72784, 86123, 104193, 136737, 144736, 92745, 15148, -17276, 5917, 25503, 11476, 10771, 63168, 128263, 153073, 166858, 234078, 338508, 397068, 383473, 354004, 340331, 303371, 223430, 152875, 128667, 103368, 27598, -55034, -68539, -19613, 23851, 41374, 68520, 112547, 139909, 147595, 170128, 203983, 197312, 137537, 83980, 82289, 103731, 105289, 95779, 96279, 82375, 25244, -39843, -50042, -8793, 16470, -7940, -42741, -48753, -46213, -67026, -86273, -52005, 26947, 72538, 32379, -50282, -88159, -53346, 1685, 20185, 3788, -9604, 651]
43368F51K7865L5283L1272N060l6706n9697m3034j0603J642o939j0221K445J7357
43355d5625K2172J8660J3315J0411R565J225k2568m3805k7942K3677N6996L1374
43343D7455j9732l2793j324K8055L5026M2163M9022J6935n2471q5351l2850M4322
43331C8457N1061r780n0716l5483k1948n1631p4140l1188M0863N9916J8648j4906
43319h0847n761J1099Q027P701K4832K9849Q941K659L4622N2629N107o2957o6414
43306c0513q823K7740J3330J699K0510K2163j9409m5626n025N4841N4980J220
43294H7087l5231k3887N239K8030M4422L8557j1221p5190q5307k5104L9565M2146
43282B9106p237m7143l8851N778M7827N2349J2216m0614n8129k5337K0104K8002
$$ y = [651, 28516, 63799, 95071, 100131, 63425, 3728, -39306, -49909, -48267, -55206, -65427, -62982, -45625, -23453, -4793, 8522, 18933, 28498, 29723, 7155, -36650, -64592, -40915, 16081, 47455, 27723, -5070, -6394, 21661, 56687, 98850, 147872, 164807, 112336, 26985, -5865, 38457, 89518, 79738, 29022, -6461, -28409, -80040, -154180, -185368, -144505, -84589, -65941, -80847, -86608, -75509, -67482, -59781, -34949, -5100, 3841, 6500, 41122, 93751, 98858, 35901, -30513, -39336, -11596, 1734, 3433, 23943, 46106, 26697, -18929, -23954, 30887, 85867, 87087, 51856, 27969, 33208, 61238, 105660, 144217, 132996, 57806, -27501, -52605, -13040, 29106, 21869, -25274, -64125, -58347, -10520, 41829, 54045, 13431, -44698, -70035, -49931, -21929]
43270b1929q993m8824m7914q931K4790K2202P6o011O377R788l045q999n04q3j2023
43255a04023m535L0464M5484R369k9476q741M8840O7094K8758j1814k0284j6794
43243C4342j6389m451J5220J1788j4795k5969j2318q438k0709q564L1889L8460
43231B0066j5179n6675j8883M9885N7050O261j9523O751K8788J4609L203K0044
43219I6397K3249k1047o5839m4062K6657N9447J6145m1009l6109J6949L7650l466
43207F4962l9816o949N4868N2539j9834o4972k4730L3918K4941k3868k1307L5796
43195F5548N3917q878p1924m6954L7706Q0368L7995l7260p7190o4926k4242J6432
43183c9408L5114J9821j6930l9283k2763J6030M0213M0278L9617M7730L6634j2284
$$ y = [-21929, -30922, -79746, -127660, -136591, -111801, -89599, -89523, -95534, -89157, -79369, -82414, -91413, -91917, -92000, -104023, -108558, -78094, -32610, -23241, -52717, -61458, -12618, 54476, 83234, 71420, 51136, 34342, 17953, 13502, 28722, 40510, 25715, -254, -12572, -21010, -41719, -50283, -18394, 20066, 4887, -51788, -70671, -20786, 36264, 42525, 23002, 29753, 58541, 73150, 76353, 96397, 119646, 98599, 32760, -11302, 15355, 74802, 90947, 49938, 13829, 30778, 68428, 64962, 25146, 18197, 73065, 125604, 105770, 40798, 16068, 49986, 74927, 51059, 29752, 65548, 119465, 110587, 38663, -8291, 29415, 109783, 147778, 110518, 33328, -31598, -55840, -39408, -4294, 15527, -1403, -40686, -63449, -47419, -7206, 33072, 72689, 120419, 157053, 144769]
43171A44769o0770n3812j42L4142J9148k272O477J3230k2118o5576m9593K2632
43159a3885P5841O5192K4645M132Q168J4518J3039M829n638J08M2674J04272J30106
43146D68001R2409K8153r435j4486j9693m2804o8461p3994n3159k0295k813j9279
43134B64144n4910p1967n3764k2552m862M52P139J6521K3744K8721K5137J794
43122A59597k8131k8620L486J7291k0199o1519l9987K6728N6730K2751j6870j7908
43110G3349j0423k5355k6155K6473Q5301O7116k1379q1421n5371L279K0388M362
43098F0164R701L4753K1903m3387r4654p0398K869M9790M4741K8456L2171L2105
43086A08214k077m8506n8008k3790R178N416k0490l2935j9199R129L5855M3358
$$ y = [144769, 83999, 30187, 30045, 64187, 83335, 81063, 87540, 100770, 78652, 13076, -36517, -13885, 61956, 127148, 151793, 155925, 164093, 178611, 191650, 196479, 190841, 190949, 233623, 337895, 468001, 560410, 588563, 579128, 564642, 544949, 502145, 433684, 359690, 306531, 286236, 283423, 264144, 209234, 137267, 83503, 60951, 56089, 56541, 63680, 80201, 103945, 132666, 157803, 159597, 131466, 102846, 106332, 123623, 103424, 41905, 1918, 28646, 85376, 108127, 91257, 73349, 62926, 37571, 11416, 37889, 123190, 190306, 168927, 87506, 32135, 35414, 55802, 60164, 69865, 104618, 126521, 83134, -11520, -81918, -79049, -29259, 15482, 43938, 76109, 108214, 106137, 57631, -377, -24167, -14989, -9573, -30063, -62998, -82197, -73068, -37213, 6145]
43074F145J6740l1680n8729l9142m030K095j0631K484L7492L8151p731l1384J4466
43061f5754O9372M6895l0520n7938k653N0184K8528k3431k0393L6431O7296K8711
43049A26728l4876n7215l0187k161j1190l5061j8432M6395Q8639M1294n8957j05181
43037e0204n7592J1503L0409J9972L0091M7356L3904J2335K9101N8307L1037m3715
43025A52504p6860l4557P384j9459p4636p6403k1800J9690R123j7772q398L7744
43013a03440O7465L5103l6121o6625j2759O9432Q7994L1055k8827m1561l0663
43002b8947k7832k2074k408P352n536j1500P819K2219J0145L646K7065L9874J927
42989B1750m5934l7548J1733K8866l180l0184j8923O722K3514L5065L3252j194
$$ y = [6145, 22885, -8795, -67524, -106666, -110696, -108601, -119232, -116748, -79256, -41105, -48836, -80220, -65754, 3618, 50513, 19993, -37945, -40598, 9586, 38114, 14683, -5710, 30721, 98017, 126728, 91852, 34637, 4450, 2289, -8901, -43962, -62394, -15999, 72640, 113934, 54977, -50204, -107796, -96293, -65884, -45912, -15821, 31535, 65439, 77774, 106875, 165182, 196219, 152504, 75644, 41087, 48471, 29012, -45624, -122027, -143827, -124137, -115014, -132786, -141184, -103440, -35975, -872, -36993, -103618, -116377, -46945, 41049, 72104, 43277, 1716, -28947, -56779, -78853, -81261, -73909, -79445, -90945, -83126, -60907, -50762, -47116, -20051, 19823, 21750, -24184, -61732, -49999, -21133, -24313, -54497, -73420, -66698, -43184, -8119, 25133, 23939]
42977B3939m5980m6688J293L5927J6681k0912k4640N025L2103L4418J2022k0651
42965B537l3905q687K5112J8539j7573j8172L1871O2376K3720l4151m2418j8282
42953i033k0364m1142k6185K0374L5553L417j9304n46J7974J092j4644J5579O2947
42940B5718O3540J2969l2737l9741k7205j4845P704M0650M7652M886n0079n8920
42928b0408k0955R046p7k1203k3514j7743k0801j4935J5591L5942L407n4565o5049
42915a95264j4939K9358K3412M124J5137L1480J1327k1155j0788L4384N2107K2949
42903a7868o633m414O573N274J2668M1687N4418J3138n5812r2064p6024l5340
42891a54397N626L9148M7335J1899m2933o1046k4115K4512M2767M0250M0115K8281
$$ y = [23939, -22041, -68729, -67436, -31509, -14828, -35740, -60380, -55355, -23252, 11166, 23188, 2537, -31368, -40055, -14943, 3596, -13977, -32149, -278, 62098, 85818, 51667, 9249, -9033, -29397, -70539, -96724, -76350, -40797, -37380, -56684, -57230, -39256, -38164, -52808, -37229, 25718, 89258, 102227, 69490, 29749, 2544, -12301, -4597, 36053, 83705, 88591, 38512, -20408, -41363, -32317, -32394, -53597, -77111, -94854, -115655, -130590, -114999, -79057, -75650, -130215, -195264, -210203, -180845, -157433, -153309, -138172, -106692, -95365, -116520, -127308, -92924, -40817, -17868, -24501, -28915, -22342, -17068, -4400, 37287, 91705, 104843, 49031, -43033, -119057, -154397, -148771, -109623, -62288, -50389, -93322, -154368, -178483, -153971, -111204, -70954, -30839, -2558]
42879b558j5366n9423n0645K569L2701J1770p007K4153O7886N7203j445m0089
42867A9749l2281k2174m2439o0950l7195J1335L7220L1227K2817K5254J9069p210
42855c5578l0987k5429M79J1179n443j4934J7652O4736N5855k0546p5166k7298
42843h5480P0015Q7899M276n8867j4196O1910M9697l1985o4015j4937K1286j6737
42831H866o5233m2824K6940N9939L1383p454r407J9613M3272L4010n805m3379
42819D9921m5008j5946N204k230k0397k9528l0546k0055J4196N2530M6413n076
42807e22l1951P238N1760K7627l2147l8105J0085K4340k5217o2361l0642K0951
42795g8944K5545m33k569J9827L0562K5208K0396M747l6696p0423m9306J1882
$$ y = [-2558, -17924, -77347, -127992, -125423, -92722, -80952, -87959, -63806, 4080, 61283, 59838, 19749, -12532, -34706, -77145, -138095, -175290, -163955, -126735, -95508, -72691, -47437, -28368, -35578, -66565, -91994, -91515, -80336, -85779, -100713, -83061, -18325, 37530, 16984, -58182, -85480, -15465, 72434, 76710, 17843, 3647, 65557, 115254, 83269, 19254, 4317, 25603, 8866, -56367, -99191, -72251, -12312, 19071, 11617, 2210, 21823, 65095, 99105, 93300, 49921, 4913, -11033, -5829, -8059, -28456, -57984, -88530, -108585, -94389, -41859, 4554, -522, -32473, -25235, 26525, 54152, 22005, -16100, -6015, 18325, -6892, -69253, -99895, -78944, -53399, -53832, -56401, -36574, -6012, 19196, 39592, 44339, 7643, -62780, -112086, -100204]
42783a00204N2655M9670K9024O638k2029l7804j1612L1190K8912j9290m4883k1339
42771e9072o593l3093l5769L9747J22146J02716L035m9524q415L4006J95n5793
42759E3586m2873K3505M8970O28n4532n0787k779L5065M4850M8320N3846L7379
42747A95178j5915p3271q0219k4864M2003O0935K4660k8210o4596p6987o1668
42736a02954j4509M1316N7046J3139m6017n8692j8480K3763K7261N597k869J2231
42724f3168K8114K8587K6078L3817L3267l481n8869p1703j5889M9951M9366j0076
42712B5994m8432k5632J1082Q811j4386j1668J3985K3308J0510P145K2910L0440
42700E4067J3168j2034k7745l6138l7224k1453L409J0758l697j0576N363J9417
$$ y = [-100204, -47549, 2121, 31145, 37783, 15754, -22050, -33662, -2472, 26440, 7150, -37733, -59072, -65665, -98758, -134527, -94780, 27366, 130082, 133117, 83593, 75178, 109184, 109379, 53586, 10713, 34218, 83188, 83816, 29284, -21503, -24282, 10783, 55633, 103953, 157799, 195178, 179263, 105992, 25773, 909, 42912, 103847, 128507, 100297, 35701, -41286, -102954, -117463, -76147, -19101, -5962, -51979, -110671, -129151, -105388, -78127, -72530, -75399, -63168, -35054, -6467, 19611, 53428, 86695, 83214, 24345, -47358, -63247, -13296, 36070, 25994, -22438, -48070, -36988, -28177, -42563, -54231, -40246, -16938, -6428, 717, 23627, 54067, 67235, 55201, 27456, -8682, -45906, -67359, -63950, -53192, -56889, -67465, -62102, -42685]
42688d2685J3563J3366M0126N6820J6443n0149n9404L218N0526J3901n8072p2060
42676g4407k2167J6630J0814Q258M2487O7701L1754l5018n9508k9450j634j3295
42664e7835l6105k7129J3543N1775O0562L9517J0611R01J4381K1798k912m0775
42652D8332m7784j3801K7129M3763L3205J765m0532o3945m2654l357j406l3504
42640i2789l0825L2259Q2817N1769j9238l8036N496L9256K4893J2J478J3169Q986
42627G9247m098j1538k1866m4792o2627m8081j639M1662M2741N42l3737m210P4848
42614F452J18895P3319j4951o1291m9195k4489j0700O212K0656M412l3306m4728
42602h714j5570J5026J7962O009o895k2874k6607N733N0072N0109O694j6505J752
$$ y = [-42685, -29122, -15756, 24370, 81190, 97633, 47484, -11920, -8702, 41824, 55725, -2347, -74407, -96574, -79944, -69130, -60872, -18385, 49316, 81070, 46052, -13456, -42906, -44540, -57835, -93940, -121069, -107526, -55751, 4811, 44328, 54939, 55840, 70221, 92019, 89107, 48332, 548, -13253, 13876, 57639, 90844, 92609, 52077, -11868, -54522, -57879, -59285, -92789, -123614, -91355, -8538, 43231, 23993, -14043, -8547, 30709, 55602, 55614, 57092, 70261, 79247, 75149, 63611, 41745, -3047, -65674, -113755, -115394, -73732, -30991, -30449, -64186, -68396, 6452, 125347, 198666, 183715, 122424, 73229, 48740, 38040, 44252, 64908, 69320, 36014, -8714, -24284, -9258, 8704, 14713, 7818, -15056, -41663, -35930, 14142, 64251, 70945, 54440, 56192]
42589E6192P117k4824l5350J1087N0842K5789j0139J8191O9210M6731l6377p3166
42577A05303l0755J0732q03j7106Q464M0622L4334J3481J9007L3012J5564j9067
42565B12788k2175J1805L8208K7373k112j8451j8293k4383n0572p5043n7484N447
42553B7108N4825L0478m4389p8428k5150N6198P7205K8312k2168j9208K3505N5848
42541A64136N0151J9687o718j7053k1575k9038k9231j1071J1646J4542o61r804
42529A35011p466j3003k7708k2541J0349K7994o451n9773o3896p830M6064M2914
42517E3664k101l5505l2171r660O571Q582J989l995p54J2858K5051K1894N422
42504E1845q408j1844j3346j8093j5660n76R059l833k0432o753K8422L2346j6762
$$ y = [56192, 63309, 38485, 3135, 14222, 65064, 90853, 80714, 98905, 168115, 214846, 178469, 105303, 74548, 85280, 84477, 67371, 75835, 116457, 150791, 164272, 183279, 216291, 231855, 212788, 190613, 202418, 240626, 267999, 265887, 247436, 229143, 204760, 154188, 79145, 21661, 27108, 81933, 112411, 68022, -10406, -35556, 20642, 97847, 126159, 103991, 84783, 108288, 164136, 214287, 233974, 227256, 210203, 188628, 159590, 130359, 119288, 130934, 145476, 144815, 135011, 127545, 114542, 86834, 64293, 74642, 102636, 96185, 36412, -27484, -35314, 10750, 53664, 51563, 16058, -16113, -25773, -19202, -10620, -8631, -12626, -13380, -522, 24529, 46423, 51845, 43437, 31593, 18247, 154, -15506, -16082, -7023, -10856, -31288, -38041, -9619, 22727, 5965]
42491E965o6007n2314R409M4238J9200j5761j632N0987Q3790O8380K7932j0035
42479A64152m3349o7005n2848P695O0968M1240l2599o3917q082N7038M0169k8906
42467G4556n0226j2617j975m4340n1137L0720J12544Q8207q314o4405n5317m3635
42455b5939m5675j6449L5304L4616l0559p0022k5962L8386L9888m523k2350J828
42443i1457K4650K2735J2382O089l149k1415m7681p6063q4918m7820K1976O6817
42431b17854N2737J5340P742K9093L8944K0903l844j2927l063J5684K5185J2373
42419a9687q936j0324O561R559n935j086L8814O5973L6489k3953o0919o0901l9016
42406g3361J704M8318N5014K937m8423l3258K3611M7304K4558J098j1566m2048
$$ y = [5965, -60042, -112356, -102947, -58709, -39509, -55270, -56902, -5915, 77875, 146255, 174187, 164152, 120803, 53798, 950, 8645, 69613, 110853, 78254, 14337, 6255, 63293, 103462, 74556, 24330, 11713, 9738, -34602, -85739, -55019, 57525, 145732, 137418, 73013, 17696, -25939, -71614, -88063, -52759, -18143, -48702, -118724, -144686, -106300, -66412, -70935, -93285, -91457, -66807, -44072, -31690, -25601, -28750, -50165, -97846, -173909, -258827, -306647, -284671, -217854, -165117, -149777, -142035, -112942, -73998, -53095, -56939, -69866, -72929, -57245, -32060, -19687, -28623, -38947, -32386, -22827, -28762, -29848, 8966, 74939, 111428, 87475, 26556, -34345, -73361, -71657, -23339, 31675, 34612, -13811, -47069, -23458, 23846, 48404, 49502, 37936, -4112]
42394d112p8468o9975j8529J2338j647j2092J1952L4937K6482J2597J7976J9435
42382d9106k458k1237j4581m209o037N289L7836M3898n353n5787m2957J0467L4233
42369g0002J6022P90P069J1468O119R695K3742K9729K6577K6277K0240n196l1673
42356G0857l4358k8922l9954m1215O054O6379N9574j7821p7787o4227j7732O321
42344a12831J1053J6484J4537O085J8576M4699L0784k5782m2583J9219O8745J7723
42332F6709o6797n5609M0123Q7773L8641j9419k4796k3088m7646m7698L04K3743
42320b7760k0266n0316O979P6052M6001l7676l6334N5013R2943J0180q4368p8021
42308d7573r696K0138N149Q290L6526L5708o770l5233j1321L0232L3453l415k9418
$$ y = [-4112, -82580, -152555, -171084, -158746, -160393, -172485, -160533, -125596, -99114, -86517, -68541, -49106, -51564, -72801, -87382, -91591, -97628, -92339, -54503, -10605, -15958, -71745, -114702, -104235, -70002, -53980, -53190, -46121, -34653, -28534, -18839, 4903, 34632, 61209, 87486, 107726, 102530, 70857, 36499, 7577, -32377, -73592, -67538, -1159, 58415, 40594, -37193, -101420, -119152, -112831, -101778, -85294, -70757, -64672, -46096, -1397, 29387, 3605, -38978, -19759, 48986, 66709, -88, -55697, -15574, 72199, 110840, 91421, 66625, 43537, -4109, -51807, -51503, -27760, -48026, -98342, -91363, -15311, 30690, -6986, -43320, 11693, 104636, 114816, 30448, -47573, -57269, -37131, -31982, -23692, 12834, 48542, 41772, 6539, -4782, 25450, 58903, 55488, 26070]
42295B6070r357K8521K6307k5191o7404n1754q878m74k2654j6371K9476N5516
42283c6193L1328Q258L2783O5846M4265j8244n2285l2741j606n4k3785m3920l8521
42270f4869n574L2401M5255L2262K2736K5885J4249k0524l9686k2284j1034m0226
42258c1409o2336j8444N0367M9218k3177o4567j9600M5432N1634J7668R391L1630
42246C5807L1782j1186n5178n3246r924K9260K9545r9k4367k5724j8501j7018
42234h8849j2434L088J2416j225k3966l3090k9912k3289m492K8168M6965L7063
42222h9557L0705N0709N5296M893m8454k4460M8549N8685k0835q7104n9783J3085
42210f8271M4618K5322l140k4433l9106k9508J1160N0246N8540M6857K8524q730
$$ y = [26070, 16713, 45234, 71541, 46350, -21054, -72808, -81686, -82160, -104814, -121185, -91709, -36193, -4865, 3393, 36176, 102022, 146287, 128043, 75758, 43017, 41411, 41357, 17572, -26348, -64869, -70443, -38042, 7213, 39475, 62211, 88096, 102345, 81821, 42135, 19851, 8817, -31409, -93745, -112189, -61822, -12604, -35781, -100348, -119948, -74516, -22882, -5214, 4177, 35807, 67589, 56403, 1225, -52021, -61945, -32685, -3140, -3239, -27606, -53330, -71831, -88849, -101283, -98195, -85779, -87004, -110970, -144060, -173972, -197261, -201753, -173585, -126620, -89557, -58852, -8143, 47153, 52046, 3592, -20868, 27681, 86366, 65531, -21573, -81356, -68271, -23653, 1669, -1471, -25904, -65010, -94518, -83358, -33112, 25428, 72285, 100809, 92079]
42198I2079n8069p1818k8966K0900K6629N716Q18J0637J3222J5406K6404K1626
42186G4584j3254l9546k2237P169K287j9663j4361O572j632l3733m3741k3534
42174a21089p172n791R87J4649J4847K319m642q068j7716j5661J5083M3062K6521
42161f2671j4110k1059J3192M2381M2758L2951K2820K105k2195l2706l9888n7921
42149i4343n6339k610N9657N4775m706k7981J3026M2477P864l8321l0588P747
42137f9342J2791k0068m1957k6415O041K2224P597k1153k4702J3385N0751L5338
42125e5510j2276k1117K0362M3938J1721k3757q531K6036J8448k5875m8208k0768
42113i5537K7895N4424L6791j1615m3023j7010M1123N8388R973m3936m2925m700
$$ y = [92079, 34010, -37808, -66774, -45874, -19245, -13529, -12711, -2074, 11148, 26554, 52958, 74584, 61330, 21784, -453, 6716, 9003, -10660, -25021, -18449, -20081, -53814, -97555, -121089, -128261, -134052, -133065, -118416, -103569, -101250, -105892, -113960, -131676, -147337, -132254, -89192, -62671, -76781, -97840, -84648, -42267, 491, 33442, 56262, 58367, 36172, 3466, -36422, -94343, -150682, -153292, -93635, -38860, -43566, -71547, -58521, -16044, -8180, -46501, -77089, -69342, -56551, -76619, -118576, -144991, -138950, -116726, -109129, -130282, -154984, -141599, -90848, -55510, -67786, -88903, -68541, -24603, -12882, -36639, -45170, -19134, -686, -26561, -74769, -95537, -67642, -13218, 23573, 11958, -31065, -48075, -6952, 51436, 61409, 17473, -25452, -30152]
42101c0152J5752O349m137o12N899M844k377n953P963L6111M2724K075m7097m4009
42087a2620m114m707n8908q6534m2608J1669J6357N575K5315L8744N1m3185j9710
42074a74675M1096N4616J5744j0961q818j4850k5345m13M0905L3312j8472l4318
42062a02179J2495N4656M6053K7911M0113M6955M954n5530p2739l9483j348N653
42050c2489j5156l3341j7999K5252M4410M219m8334l6915K7105N1730L449l9602
42038f7671j0902M1994L6859j7430m3535j0698L8389N8578M3482M350m2293o6678
42026c5555m6173J745L4891L5938K4442K2315L0035L7961M3221N1260O8142R1244
42014C59466J07766J10191J08291J07590Q1484j813j16701j81855j49241o6074
$$ y = [-30152, -14400, -8051, -12188, -12800, -6901, -2057, -4434, -10387, -2424, 33687, 76411, 78486, 31389, -12620, -16734, -21441, -80349, -166883, -209491, -197822, -181465, -175890, -150575, -111831, -111780, -154965, -174675, -133579, -78963, -63219, -74180, -82998, -97848, -123193, -123606, -82701, -49389, -67861, -102179, -89684, -35028, 11025, 38936, 79049, 126004, 130958, 75428, 2689, -36794, -38142, -32489, -47645, -80986, -98985, -73733, -29323, -25104, -73438, -110353, -83248, -31518, -28069, -67671, -78573, -36579, 280, -17150, -60685, -71383, -32994, 25584, 69066, 73416, 31123, -35555, -81728, -79983, -45092, -9154, 15288, 37603, 67638, 105599, 148820, 200080, 268222, 359466, 467232, 577423, 685714, 793304, 874788, 872975, 756274, 574419, 425178, 359104]
42004C59104j9925l8375p0968o2468j7470J2067r131n5585o6422j9051L5606L1008
41992G8390l1906q7281q4848l5715J8962M6761L0572j9067n0307j6608M8873N8126
41980d4048q679o1405k0959O8629J02792N2817k0433o3166p4037o2634k5808K4970
41968a31961N8501N9212L8553R260k2510m1844l4769j3589j910L357K1782M4054
41956a1864L7517K789j7051J61K0521O376k6612l6270j8860j0978k8630l7319
41944a20220J37O2068Q0755K4758n1138o3823n595M3487K0861l4726l9021J9029
41932f3428O2165L1146l8327o7852l6425M069M670k0649k2377J3818M6702L5121
41920e1367m704j9544Q882M1184L7559Q576j1629j7942k8455m0627l0924J447
$$ y = [359104, 339179, 300804, 229836, 167368, 149898, 161965, 152834, 97249, 30827, 11776, 47382, 78390, 46484, -40797, -125645, -161360, -142398, -95637, -65065, -84132, -134439, -151047, -102174, -44048, -52727, -114132, -135091, -66462, 36330, 89147, 68714, 5548, -68489, -131123, -156931, -131961, -73460, -14248, 24305, 33565, 11055, -30789, -65558, -79147, -81057, -77700, -55918, -11864, 25653, 28442, 11391, 11552, 32073, 38449, 11837, -24433, -43293, -54271, -82901, -120220, -120083, -58015, 22740, 47498, -3640, -67463, -73058, -29571, -8710, -43436, -82457, -63428, -1263, 29883, -8444, -76296, -112721, -108652, -103982, -124631, -147008, -133190, -86488, -51367, -56071, -75615, -66733, -25549, 12010, 20586, 8957, -8985, -37440, -78067, -108991, -107544]
41908a07544K3581J2675j2077j4802J3489M7896N8835M0731J3599k091r970k8095
41896C6227n3783n7206k3038K0003L2684J4620m103q864r113q710k45J1243R808
41883d0477k489o506J43q75j2999j5412J277J8898K2190J6611M862k1370n0300
41870h6447m6981n761K8592K3212O565J6187L0246O233l4765l0299K0556M7918
41858b4744J9664j0751K367K1919j016l6323k5930J1074P270l5286m5768q575
41846a26099P194k7065l7479K8059R2876N7834l7696o5920j08N4821K8454k4006
41834d9135l1381j2753j5395k2145M192L5918K1669j7210j3234L4604N2783O304
41822e783m8410m6970m30L5044L3305J0965r001j4983j965K4353M2812L4354M766
$$ y = [-107544, -83963, -71288, -83365, -98167, -84678, -36782, 22053, 62784, 76383, 74292, 64322, 36227, -17556, -74762, -97800, -77797, -45113, -30493, -34596, -43460, -52573, -61283, -61528, -50285, -40477, -42966, -49472, -49329, -50204, -63203, -78615, -77338, -58440, -36250, -19639, -14777, -36147, -86447, -133428, -139189, -110597, -87385, -80820, -64633, -34387, -28154, -62919, -93218, -72662, -24744, -5080, -15831, -13464, 8455, 7439, -28884, -54814, -43740, -36470, -71756, -117524, -126099, -118905, -145970, -183449, -155390, -62514, -4680, -42376, -108296, -108404, -53583, -25129, -49135, -80516, -93269, -108664, -130809, -126617, -90699, -69030, -86240, -99474, -64870, -12087, -5783, -54193, -101163, -101593, -66549, -33244, -22279, -31280, -46263, -48228, -23875, 18937, 53291, 58057]
41809E8057k0014k1957q576n92n306r892o006q432k9450m3558j3121M6532P0943
41796H628L5291n994k758J4087o965m0317k1147L8062N4492M134m0225k6368N73
41783A1493j5566m5931l0544J7563L3528L039k4922k2250j5791k7222l3024r612
41771a59239J9839J7656q171j0832K7921O5893N3942O718j0126L0553P2552M8246
41759A54952k7256p5878o1817k6998j4524j1376N732J6595m770l1304j5228L4888
41747e6984O0301L4530n427j8230r057m724r001o774M353J0694O517L266J0435
41734A9899J7815O904k1346m2698m0606k8017k2600j4042J5597M6884L8937m295
41722b7568k8333o381K2145J8739L150J928j0674n6799q0654j7041Q2494R1676
$$ y = [58057, 38043, 16086, 7510, 6918, 1612, -8280, -14286, -22718, -52168, -95726, -108847, -62315, 8628, 43919, 37925, 35167, 49254, 42289, 1972, -19175, 18887, 73379, 77513, 37288, 10920, 11493, -4073, -50004, -80548, -62985, -29457, -26418, -51340, -73590, -89381, -116603, -149627, -159239, -139400, -121744, -129915, -140747, -112826, -46933, 7009, 13727, 3601, 34154, 106706, 154952, 127696, 51818, -9999, -36997, -51521, -62897, -57165, -40570, -45340, -76644, -91872, -56984, 3317, 37847, 32420, 14190, 5133, 409, -8592, -15366, -11013, -319, 6198, 9464, 19899, 37714, 44618, 23272, -19426, -60032, -88049, -110649, -124691, -109094, -62210, -23273, -27568, -55901, -62282, -40137, -21398, -18248, -16320, -26994, -83793, -164447, -181488, -98994, -7318]
41710g318q469q8194n1154L3036M7149J569n442M1699N7367L494m9153l8646l486
41697f7548n224k6310j1276L3403N2790L6058K4468K9650J3741l1959n1869p451
41685a1527N2322N1033j0025n7316m6516r403O491Q33J328J2715J6140O409n2
41672A2432N126Q658R18m233O482J2613j9903p9103r9209m0387M4204O2792K543
41659h7067n3764l9885J2896L4748J4062q031r484k843M488J5750J8760J104j4385
41646a13651L164L4359L0711n167j8111J0762L3647J6183r666o542M900j2850
41634c2261m6425n1107j6769K3109L4470J0169k8464m0892k814N3753O8082L1790
41622B641j3M722J2226m578j3997O725J4084k5468n6578j4462N6836N9042q506
$$ y = [-7318, -15787, -103981, -155135, -122099, -74950, -73381, -78823, -37124, 20243, 23737, -25416, -64062, -67548, -72772, -99082, -110358, -76955, -24165, 11893, 36361, 66011, 79752, 47793, -4076, -11527, 40795, 91828, 81803, 24487, -22029, -31432, -24941, -24108, -22780, -10065, 6075, 12484, 12432, 17558, 26216, 27134, 22901, 29383, 41996, 22093, -57010, -156219, -196606, -152402, -89610, -87067, -140831, -180716, -167820, -133072, -119010, -127041, -136525, -139368, -134880, -119130, -100370, -99266, -113651, -110487, -76128, -45417, -50584, -68695, -57933, -24286, -8103, -17769, -24311, -19411, -32261, -78686, -129793, -146562, -123453, -88983, -78814, -107278, -148170, -150984, -97231, -29149, 2641, 2628, 7350, 19576, 14998, 1001, 7726, 21810, -3658, -60236, -74698, -17862, 41180, 32674]
41609C2674m8787j7270K1681N768m0227n9985m1417p299J8606J4822k0689m3875
41597a85998q251N5032O4217J0024k1199K0441O6862L5773m3986p8387m2063K876
41585a24659O960q845p15L4295N7575L7508r104k9452J269M1015L5022l432j3919
41572B3518J2165J5680l1014p4061o2155k3023j0270k2110k4251j3729n250J2922
41560b01578N1540P3878L7532k9947n4313j1767M4147N4563J6517k9247m1216
41549h9891q503L7470M9121J8814p870M423K9784K3611r807l0827k4822q711N308
41536a1900J1918m157m3647o6205l5204K1024M0105J2661q892J0266M2943M3311
41524A2223K230m7717o1235j8882M3758O0623J3024l9503l6850J854J8014M019
$$ y = [32674, -16113, -33383, -11702, -5934, -46161, -106146, -147563, -154862, -136256, -121434, -142123, -185998, -194249, -139217, -75000, -64976, -86175, -65734, 1128, 36901, -7085, -85472, -127535, -124659, -117699, -126544, -127259, -92964, -35389, 2119, -6985, -36437, -35168, 5847, 40869, 37437, 23518, 35683, 51363, 20349, -53712, -115867, -138890, -149160, -171270, -195521, -209250, -214500, -201578, -150038, -76160, -38628, -68575, -122888, -134655, -90508, -35945, -19428, -48675, -89891, -98394, -60924, -11803, 7011, -859, 3564, 33348, 56959, 47152, 16325, -8497, -17208, -11900, 18, -4139, -47786, -113991, -149195, -128171, -88066, -75405, -84297, -74031, -31088, 12223, 14453, -33264, -94499, -113381, -69623, -9000, 4024, -35479, -72329, -70475, -52461, -48442]
41512d8442j288J2103J4895m752k8062m2432m2765j0892N2106R1605O1546L880
41500E7502o064K2173J5230l3024m9989j3277J1627r474k2833O758K6426r372
41488d317n5291n3386k5729j9084j7772J3364M7861L6639n480k2013J101L2415
41476g1692N0568M9382J5472m5487q6361p2995l4463j3468j644K6125N2855N2834
41464g8874M4852M9973L7162j7992o1184l0183L4909M4937J754j6102M495m689
41452I058n7326p3050r641O2258O6364K3615n459j3681k4233k9210j1985P154
41440e6136K826o750Q208L2593K9586L571n852J2920K5239J072m1102n3998j9343
41427f7166K3827K1903k0347l7077O954N5394L6716k4577l9892P677L6628o618
$$ y = [-48442, -49730, -37627, -22732, -27484, -55546, -97978, -140743, -151635, -99529, -7924, 53622, 57502, 51438, 73611, 88841, 55817, 5828, -7449, 4178, -5296, -28129, -21371, 5055, -4317, -59608, -112994, -138723, -157807, -175579, -162215, -114354, -77715, -83195, -105208, -104107, -71692, -21124, 28258, 43730, -1757, -88118, -161113, -195576, -209044, -210688, -184563, -131708, -78874, -34022, 15951, 53113, 35121, -26063, -56246, -21337, 23600, 25354, 9252, 13747, 9058, -48268, -121318, -130959, -68701, -2337, 21278, 15819, 2138, -22095, -51305, -63290, -56136, -53310, -60060, -51852, -19259, 10327, 13898, 8046, 20966, 46205, 47277, 6175, -47823, -67166, -43339, -21436, -41783, -78860, -71906, -16512, 20204, -4373, -44265, -36588, 40, -6578]
41415f578o8030o9971j6559L1414M4135L7909L0508K3089J1561r247l6228m2331
41403g0328j611N8883P4276K7656k3576k9320p157N194N290n06k4274n3858l7606
41390g6937L4219Q3925M6652k8420m9128j4607L763j1675j1083J6879J9118k4259
41378a1553n6995l3014J6468L6877K2650J835j3268k6784l6960l9604l5723k1315
41366a97386R619M2627M9220K7134Q114J2386K0472O832j9723k9472j3872M018
41354h0031K71j8043j8828J1979M1783K8464j4125k4605J6946N1610K6262k6011
41342d328l9099j3595k410j8605k4943p005Q939J0203P954n318m2116o3306j2510
41329b06139P9427J06477L5071l8218k2356M4359O4839K1696k2525k7474j1685
$$ y = [-6578, -74608, -144579, -161138, -129724, -85589, -47680, -17172, 5917, 17478, 8231, -27997, -70328, -71939, -13056, 61220, 88876, 65300, 35980, 28823, 34017, 39307, 38801, 14527, -39331, -76937, -42718, 41207, 87859, 59439, 10311, -4296, -533, -12208, -23291, -6412, 12706, -11553, -68548, -101562, -85094, -48217, -25567, -23732, -37000, -63784, -100744, -140348, -176071, -197386, -187767, -145140, -95920, -68786, -60672, -48286, -27814, -20982, -40705, -70177, -84049, -80031, -79760, -97803, -116631, -104652, -62869, -34405, -48530, -73135, -56189, -4579, 21683, -4328, -43427, -57022, -59432, -78037, -102980, -109985, -101046, -90843, -82889, -88207, -130323, -193629, -206139, -126712, -20235, 14836, -23382, -45738, -1379, 63460, 85156, 62631, 35157, 23472]
41318B3472n165j7891m4246o0865l6726K1493N7843L6256n322r845J6606K4200
41306a90n60k5367l0640k7868k4191j3171J46L662N304J8620K6514K457l2162
41293i7446k1027M1767Q4500M7382l0373n4360J628N8428L5596l9346o8732k3799
41281f5782J3829k2256p5149m8572L8415P2761J8413l4539j6964K2219J8679J678
41269g7268K2177M4529P114n5063n0935K4008Q0821O7810K2273j1468l4588n0554
41257a1144m0789o030K1882K6493K0468P849j8946m1913l0034N467J9524J388
41245d5785j5940j5663j2627q479J0140K6942J1904j5371n717L1485L5703J916
41233a492l943L9253O2705J8920m0890n1978k9311j9222j8585k925J4630J1335
$$ y = [23472, 18307, 416, -43830, -104695, -141421, -119928, -62085, -25829, -31151, -40996, -24390, -190, -750, -26117, -56757, -84625, -108816, -121987, -121841, -118179, -112875, -94255, -67741, -65284, -97446, -118473, -76706, 7794, 55176, 24803, -29557, -27929, 30499, 66095, 26749, -41983, -65782, -51953, -74209, -149358, -197930, -159515, -86754, -68341, -102880, -119844, -97625, -78946, -77268, -55091, -10562, -3448, -58511, -109446, -85438, -4617, 63193, 85466, 73998, 39410, -11144, -51933, -57963, -36081, -9588, 10880, 18729, -217, -42130, -72164, -66697, -47173, -45785, -61725, -77388, -90015, -98494, -88354, -61412, -49508, -64879, -70596, -39111, -3408, -1492, -5435, 33818, 96523, 115443, 74553, 22575, -6736, -25958, -44543, -47468, -32838, -21503]
41221b1503J214K993K418q688l473K2993K1747k9374o8041l7092J8060J7436k9388
41208a10698m8922k3321k0K77L571J7452J9629J0174J1270J8309J0688L002K3273
41195f5316M8866L0593k3457n4976m4793k7808j8081Q167M4533M2742o416m1886
41183a07832j3452N0801Q4149N5080j3291o7331o1930n447L9594L1754N090N768
41171B953J0745k1095n2121j7660M4726L4707l8109n0485L2901Q7118K2068p2209
41159a6461o9610K851L2357J892j7759r342j8180m1123k3032L4315O0027K4105
41147c9960k3075l6153k6599j3497R801L8671M3869J7334j2335k2505j4599J0900
41135f8148M9299O3464J9167m7218n9437j0528K5558Q700j4220k214R897j3434
$$ y = [-21503, -20289, -17296, -14878, -23566, -27039, -4046, 17701, -11673, -79714, -116806, -98746, -81310, -110698, -159620, -182941, -182961, -182684, -179113, -161661, -142032, -131858, -120588, -102279, -91591, -88589, -65316, -16450, 14143, -9314, -64290, -109083, -136891, -154972, -146805, -102272, -59530, -65946, -107832, -121284, -70483, 13666, 68746, 55455, -11876, -73806, -79253, -39659, -7905, -2815, 2953, 13698, -7397, -59518, -77178, -32452, 2255, -35854, -86339, -53438, 33680, 55748, -16461, -86071, -83220, -50863, -48971, -66730, -76072, -94252, -135375, -158407, -124092, -64065, -39960, -63035, -99188, -125787, -139284, -129483, -90812, -46943, -29609, -41944, -64449, -79048, -68148, -18849, 44615, 63782, 16564, -42873, -53401, -27843, -19143, -33363, -35577, -25680, -39114]
41123c9114l1454L246M8554L0353l2158m8097L344M1548J4447k1301M604O2053
41111C6025O5354M32n9073n7920k2925o413j3754j7196j0535j0005j1746J1175
41099i6581N9890Q8097N2961k3458o8122l8209K7595N4467K2029j4683n730K0207
41087G8463K22n7640p1728p825N6664L8552k6665l7573K0152N8383K6292k2448
41075E4849k9711j7978k5674k7972R392M8679L0728k3958m3647j9192j0727m1013
41063i6224n7911k0523M0139P1473O1129K5528j8729m7031l1040J9697N2076L2788
41051C1372r291k8066k0104j1914j1621n989P737J6797J4766P302m47p135j0563
41038b7156j1266j5101k3627k8898k4396j2824J145J4440J8894O957r767n533
$$ y = [-39114, -70568, -67322, -18768, 11585, -20573, -68670, -65326, -23778, -9331, -30632, -26028, 36025, 101379, 101811, 42738, -15182, -38107, -44520, -58274, -75470, -86005, -96010, -107756, -96581, -36691, 51406, 104367, 80909, 12787, -25422, 2173, 56640, 78669, 63986, 58256, 78463, 78685, 21045, -50683, -58508, -1844, 36708, 10043, -27530, -7378, 51005, 77297, 54849, 25138, 7160, -18514, -46486, -37094, 11585, 42313, 18355, -25292, -44484, -55211, -96224, -154135, -174658, -134519, -63046, -1917, 23611, 4882, -42149, -73189, -53492, -1416, 31372, 22081, -5985, -26089, -38003, -49624, -55613, -47876, -31079, -16313, -9011, -9458, -16593, -27156, -38422, -53523, -77150, -106048, -130444, -143268, -142123, -127683, -108789, -101832, -111599, -117132]
41026a17132K4943N2138M5488J0902j7666j7014M048J7051K741k7699m1196k0058
41014h3454J4948L1627K6883J9175J0692r928k9845j8044K0552L7564Q593k7628
41002A135k5223M228J6374l5j8458k0495j0679N301K3142K5869L42l2794l7056
40989f8349j1576N014r274k7029j1245L0981N5829L8251K340r456J0891K7038
40977C3415N841l5982n0026j9183K0127K7063N607j1621r413L312J8370L1509
40965A9019K8141k237l5519k9066J8906N3420K8850k7259m5726n388M0723L7081
40953H0945o280m0041m6075m3406l4234M007N9231P0631J2213n1669m7365K417
40941c9626J9861j318N945N4254O6132K026o2263m8940J75l665n1217n7897q204
$$ y = [-117132, -92189, -40051, 5437, 16339, -1327, -18341, -14293, 2758, 5499, -22200, -63396, -83454, -68506, -36879, -9996, 9179, 19871, 9943, -19902, -37946, -17394, 20170, 28763, 1135, -24088, -19860, -3486, -3521, -21979, -42474, -53153, -47852, -24710, 1159, 1501, -31293, -68349, -79925, -74911, -84185, -111214, -122459, -91478, -35649, 2602, 4942, -4514, 6377, 33415, 39256, 3274, -46752, -65935, -45808, -18745, -13138, -24759, -34172, -30860, -12490, 19019, 47160, 44923, 9404, -19662, -756, 52664, 81514, 54255, 8529, 3141, 43864, 80945, 74665, 34624, -11451, -54857, -89091, -85084, -25853, 44778, 56991, 5322, -42043, -39626, -19765, -21083, -15138, 39116, 105248, 107274, 45011, -3929, -3754, -7419, -58636, -116533, -124737]
40928a24737K2237n434l5828j8726J1419J793k9780k6720J9164O3161P2427N2750
40916A726K0782j2499l2221k5496l550L524j6526l8735k7449K0756O6618O5206
40904B2136J5139l5687m1176p503K0104J5531l190q823k413k566j1958j3518J585
40891e2339J6596P478k4863m9874m1550j1556N681J01k547J5582L3122K2600l046
40878h4615n521K4066N2301M5901P602l0436l4686K732N0024N8433J6795k9451
40866G3145l5029j2661l838j1558p406M842j1262n4567p0424k7625L3308N6555
40854f6520L9165J3521m547j5281j0281J1483K0505q893m7946l7989K8513Q5353
40842G083O8608m697n6277l9826P417J6846k3707o0015m8078p360J8972K4469
$$ y = [-124737, -102500, -107934, -143762, -162488, -151069, -149276, -179056, -205776, -186612, -123451, -51024, 1726, 22508, 10009, -22212, -47708, -51258, -47734, -64260, -102995, -130444, -109688, -43070, 22136, 37275, 1588, -39588, -47091, -26987, -11456, -14646, -23469, -25882, -28448, -40406, -53924, -52339, -35743, -28265, -53128, -103002, -144552, -156108, -150427, -150326, -152873, -137291, -104169, -81569, -84615, -90136, -66070, -13769, 32132, 39734, 9298, -25388, -22656, 27368, 85801, 102596, 73145, 38116, 25455, 21617, 10059, 2653, 7495, -3767, -58334, -128758, -156383, -123075, -66520, -27355, -13834, -18381, -33662, -43943, -32460, -11955, -20848, -68794, -106783, -78270, 7083, 75691, 70994, 14717, -25109, -17692, -846, -24553, -84568, -132646, -140006, -121034, -96565]
40830i6565K8195K8976J3918k640M312K2572J9174m84k484Q825n089l9513m0696
40817f1499K879L1524Q428k2728j5124Q961J3583J6842M1155M9211L463n1018
40805B5677m4084N324J5188l1652o6582m3820L946K9736K7864J0174j7035l4842
40793a20106j8733J9819M0424L3340K9517M1822M2373J4154j7096k3023j1006
40782C1485m224r878j9677k0425j520K6417K9739j503k2647N884M6841L3752k2183
40769G2061m6097j9993o358l4365m8772r794L5188L1656K440o258m386j8510k3518
40756g6706J2267M9964K5268m7775q8238n6293Q730N2365N4173J9009k9175m6960
40744a23371j1856L7916M5174R541k0354k0241p144Q414L0448L8236Q56n7138
$$ y = [-96565, -68370, -39394, -25476, -28116, -23804, -1232, 17942, 17458, 14974, 23799, 18710, -20803, -61499, -58620, -27096, -18668, -41396, -56520, -47559, -33976, -17134, 24021, 73232, 76695, 25677, -18407, -13083, 2105, -29547, -96129, -139949, -136003, -106267, -78403, -68229, -85264, -120106, -138839, -119020, -78596, -45256, -15739, 26083, 68456, 82610, 65514, 42491, 31485, 27261, 17383, -2294, -22719, -24239, 2178, 31917, 30414, 7767, 13651, 60492, 94244, 72061, 25964, 5971, -387, -34752, -83524, -93318, -58130, -26474, -24034, -30292, -34678, -53188, -76706, -64439, -14475, 10793, -36982, -125220, -181513, -172783, -120418, -66245, -47236, -76411, -123371, -135227, -97311, -52137, -42596, -62950, -83191, -90335, -81921, -51473, -13237, -12381, -69519]
40732f9519o5223o123M9256L9001o437k0167K915J7405J0137R640J9292M238l8710
40719e4295n4199q361M5821L6524j6533k5692K9797O5931K2185m1024l3788K5867
40707g767M7596J2354j4474p486j5838n2273n0120K0096Q1244O3537J1928K472
40695I1269J7842k424l9492k7295K1848K8825k2458o2908m9898j4095J3925M0829
40683d032O0297M4813O876n083Q982m540n1775o5077j3632L5660J6621l9820o0432
40670g1142k9860J5007M6748N3921K4190k9970n9318l5098R046K8488K8788L7094
40658A7894M5765K9439n348k9494l3509k8378k2579k3195l5781m1409p406N3751
40646h0250P7542L5374j1899L913N6070N8454j3991r2798j01780l8208L3888N1343
$$ y = [-69519, -134742, -140865, -91609, -52608, -59045, -79212, -76297, -58892, -48755, -39115, -19823, -15585, -54295, -108494, -116855, -71034, -34510, -51043, -76735, -46938, 18993, 41178, 154, -33634, -7767, 39829, 52183, 37709, 30223, 14385, -37888, -88008, -67912, 13332, 76869, 88797, 91269, 109111, 106687, 67195, 39900, 61748, 90573, 68115, 5207, -44691, -58786, -44861, -4032, 56265, 101078, 107954, 102871, 111853, 107313, 55538, -9539, -23171, 12489, 29110, -10710, -71142, -101002, -85995, -39247, 14674, 38864, 8894, -50424, -85522, -76476, -47988, -19200, 17894, 63659, 93098, 87750, 58256, 24747, -3631, -26210, -49405, -85186, -126595, -134001, -80250, -2708, 32666, 20767, 24680, 80750, 139204, 125213, 32415, -69365, -107573, -73685, -22342]
40634b2342J4504j4737Q088M5416L2791j4257j8433L0082N1096Q520k8881j0336
40622H1511J1462j1574k6750J4123M4174q043p5534n4637J2568Q144n3803n5724
40610a14083O402J3721n4634p1781J6549Q9711M9371k5798k0975L7080N0484Q212
40598a5741l0629m3412m1262j6890K4448L5916J449k0981O511L2579J1575r523
40586f5960J6510L5897j2829p3020n3220J8243M4477K2951K7079N4244L1669l3127
40574A2914m7996J741J9920l6555q2145m3918K6251M5125J9831Q028K0335K7616
40562b8853J9922M722j6587l0458q954L9517N9379K2228l0010m8568l9677k9317
40550h6656j5241M700M082k3460l0070J6513O5168M5469k4909o1551l0754J7166
$$ y = [-22342, -7838, -22575, -14487, 30929, 63720, 49463, 31030, 61112, 112208, 120728, 91847, 81511, 92973, 81399, 54649, 68772, 112946, 104903, 29369, -25268, -12700, -4556, -58359, -114083, -107681, -93960, -148594, -220375, -203826, -114115, -64744, -90542, -111517, -74437, -23953, -15741, -46370, -89782, -131044, -147934, -123486, -87570, -86121, -107102, -100591, -68012, -56437, -65960, -49450, -13553, -26382, -99402, -152622, -134379, -89902, -66951, -39872, 14372, 46041, 12914, -35082, -33341, -13421, -49976, -132121, -176039, -149788, -104663, -84832, -76804, -56469, -28853, -8931, -4209, -20796, -51254, -60208, -20691, 38688, 60916, 30906, -17662, -57339, -86656, -101897, -97197, -93115, -116575, -146645, -130132, -64964, -19495, -44404, -105955, -136709, -119543]
40538a19543L3133K8782L4127M3351L2201K814j8184j8016j2821k1358l5704k9774
40526h0992K965L4759L7994K1212J0905Q779l428k2590k4327p552p61j4400k5298
40513f2734k2271k5896m1175l2788J8990P2176P2741K6866j4186k3044j4094p671
40501e3086j1405k5585l5541j1974M7561R0558O1858k1148q2468p6086k6768J7955
40489a26129M0064M5777L9878K4140M843j1948k3684k5118j0223J4225K7231J3628
40477A2684j7117l6788k6599j006N583j4568k3689R146N0568M1792o559j8540
40465b5093K7517N0796r485q2427n6894M7718R6945K8539o6662p9341j9875K6429
40453f1833K4329P214K313m86j0785j6379p414P476J6434J7125J0827j483j4555
$$ y = [-119543, -86410, -57628, -23501, 19850, 52051, 54865, 36681, 18665, 5844, -15514, -51218, -80992, -78027, -43268, -5274, 15938, 26843, 35622, 32194, 9604, -14723, -22275, -23036, -37436, -62734, -85005, -110901, -152076, -184864, -165874, -93698, -20957, 5909, -8277, -31321, -45415, -53086, -64491, -90076, -125617, -137591, -90030, 528, 62386, 41238, -41230, -117316, -144084, -126129, -86065, -40288, -410, 23730, 28573, 16625, -7059, -32177, -42400, -28175, -944, 12684, -4433, -41221, -67820, -68826, -63243, -77811, -101500, -92354, -41786, 6, -6553, -25093, 2424, 53220, 43735, -38692, -95586, -47868, 49077, 77616, 10954, -68387, -88262, -61833, -37504, -30290, -27977, -28463, -39248, -55627, -63041, -55565, -39131, -22006, -11179, -12662, -27217]
40440b7217k1269k0784j6844r756K074J4452J9003J2354j125j4315k0836j5514
40428i9777K822K7166M3627M0717J9867m635j9134k1888j6567j534K0741K9025
40416B0430L021l7051m0043Q842N7444N1782R292j0998K867M633l0761o4812n2699
40403g8053o887K4632K1184J930j1760j8496k2870k0971p580J1474K1331J2596
$$ y = [-27217, -48486, -69270, -86114, -95870, -93796, -79344, -60341, -47987, -49112, -63427, -84263, -99777, -96955, -69789, -26162, 14555, 34422, 29787, 10653, -11235, -27802, -29336, -8595, 20430, 23451, -13600, -53643, -44801, 12643, 64425, 73717, 62719, 65586, 70219, 39458, -25354, -78053, -84940, -60308, -39124, -37194, -48954, -67450, -90320, -111291, -118871, -107397, -86066, -73470]
$$ [...]
##END NTUPLES=NMR SPECTRUM
##END=
