##TITLE=31Pdec_BAU-15_01
 CDCl3, 24 sc
 18.1.2019
##JCAMPDX= 6.0         $$ Bruker NMR JCAMP-DX V2.0
##DATA TYPE= NMR SPECTRUM
##DATA CLASS= NTUPLES
##ORIGIN= UXNMR, Bruker Analytische Messtechnik GmbH
##OWNER= root
$$ XWIN-NMR		Version 3.5
$$ Fri Jan 18 14:29:34 2019 Russian Standard Time (UT+4h)  she@DPX200
##.OBSERVE FREQUENCY= 81.013821
##.OBSERVE NUCLEUS= ^31P
##.ACQUISITION MODE= SIMULTANEOUS
##.ACQUISITION SCHEME= undefined
##.AVERAGES= 24
##.DIGITISER RES= 17
##SPECTROMETER/DATA SYSTEM= spect
##.PULSE SEQUENCE= zgpg30
##.SOLVENT NAME= D2O
##.SHIFT REFERENCE= (INTERNAL, D2O, 0, 182.463)
##AUDIT TRAIL= $$ (NUMBER, WHEN, WHO, WHERE, WHAT)
$$ ##TITLE= Audit trail, XWIN-NMR		Version 3.5
$$ ##JCAMPDX= 5.01
$$ ##ORIGIN= Bruker BioSpin GmbH
$$ ##OWNER= she
$$ F:/spectra/data/she/nmr/P31/1/pdata/1/auditp.txt
$$ ##AUDIT TRAIL=  $$ (NUMBER, WHEN, WHO, WHERE, WHAT)
(   1,<2019-01-18 14:28:34.29 +0400>,<she>,<DPX200>,
      <created by zg, POWCHK disabled, PULCHK disabled
       configuration hash MD5:
       00 E9 B6 7A A2 85 ED C7 34 08 36 98 17 FE 4E 26
       data hash MD5: 32K
       39 48 3C E8 E5 19 70 DD FB 27 41 B1 EA 7C 9A AA>)
(   2,<2019-01-18 14:28:36.76 +0400>,<she>,<DPX200>,
      <Start of raw data processing
       efp BC_mod = 2 LB = 1 FT_mod = 6 PKNL = 1 PHC0 = -1426.786 PHC1 = 4.798988 SI = 64K 
       data hash MD5: 64K
       00 03 F0 DA 84 87 B3 8E 60 CB 10 C1 19 86 01 60>)
(   3,<2019-01-18 14:28:57.45 +0400>,<she>,<DPX200>,
      <pk PHC0 = -13.94988 PHC1 = 0 
       data hash MD5: 64K
       1F B2 9C 2B 7E 87 79 72 FE E8 F3 0B F7 4E 0A A9>)
(   4,<2019-01-18 14:29:07.15 +0400>,<she>,<DPX200>,
      <abs ABSG = 5 
       data hash MD5: 64K
       E7 4E 48 48 47 6E 52 8B 54 6B 6D 66 2E 45 4A 14>)
$$ ##END=
$$ 
$$ hash MD5
$$ 32 A3 FD 5E FF 3E BB C3 4F 11 85 20 EC D9 D4 19
##$RELAX= 
##$RELAX= 
##$RELAX= 
##$RELAX= 
##$RELAX= 
##$RELAX= 
##$RELAX= 
##$RELAX= 
$$ Bruker specific parameters
$$ --------------------------
##$DU= <F:/spectra>
##$EXPNO= 1
##$NAME= <P31>
##$PROCNO= 1
##$TYPE= <nmr>
##$USER= <she>
##$AMP= (0..31)
100 100 100 100 100 100 100 100 100 100 100 100 100 100 100 100 100 100 
100 100 100 100 100 100 100 100 100 100 100 100 100 100 
##$AQSEQ= 0
##$AQ_mod= 1
##$AUNM= <au_zg>
##$AUTOPOS= <>
##$BF1= 81.014009
##$BF2= 200.13
##$BF3= 200.13
##$BF4= 200.13
##$BF5= 200.13
##$BF6= 200.13
##$BF7= 200.13
##$BF8= 200.13
##$BYTORDA= 1
##$CFDGTYP= 0
##$CFRGTYP= 5
##$CHEMSTR= <none>
##$CNST= (0..31)
1 1 145 1 1 1 1 1 1 1 1 1 1 1 1 1 1 1 1 1 1 1 1 1 1 1 1 1 1 1 1 1 
##$CPDPRG= <waltz16>
##$CPDPRG1= <>
##$CPDPRG2= <waltz16>
##$CPDPRG3= <>
##$CPDPRG4= <mlev>
##$CPDPRG5= <mlev>
##$CPDPRG6= <mlev>
##$CPDPRG7= <mlev>
##$CPDPRG8= <mlev>
##$CPDPRGB= <>
##$CPDPRGT= <>
##$D= (0..31)
0 1 0 0 0 0 0 0 0 0 0 0.03 2e-05 3e-06 0 0 0 0 0 0 0 0 0 0 0 0 0 0 0 0 
0 0 
##$DATE= 1547807313
##$DBL= (0..7)
120 120 120 11 120 120 24 19 
##$DBP= (0..7)
150 150 150 150 150 150 150 150 
##$DBP07= 0
##$DBPNAM0= <>
##$DBPNAM1= <>
##$DBPNAM2= <>
$$ [...]
##$SUBNAM3= <"">
##$SUBNAM4= <"">
##$SUBNAM5= <"">
##$SUBNAM6= <"">
##$SUBNAM7= <"">
##$SUBNAM8= <"">
##$SUBNAM9= <"">
##$SW= 369.568048894756
##$SWIBOX= (0..15)
0 1 3 0 0 0 0 0 0 0 0 0 0 0 0 0 
##$SW_h= 29940.119760479
##$TD= 32768
##$TD0= 1
##$TE= 0
##$TE2= 300
##$TE3= 300
##$TEG= 300
##$TL= (0..7)
0 120 53 12 22 120 120 120 
##$TP= (0..7)
150 150 150 150 150 150 150 150 
##$TP07= 0
##$TPNAME0= <>
##$TPNAME1= <>
##$TPNAME2= <>
##$TPNAME3= <>
##$TPNAME4= <>
##$TPNAME5= <>
##$TPNAME6= <>
##$TPNAME7= <>
##$TPOAL= (0..7)
0.5 0.5 0.5 0.5 0.5 0.5 0.5 0.5 
##$TPOFFS= (0..7)
0 0 0 0 0 0 0 0 
##$TUNHIN= 0
##$TUNHOUT= 0
##$TUNXOUT= 0
##$USERA1= <user>
##$USERA2= <user>
##$USERA3= <user>
##$USERA4= <user>
##$USERA5= <user>
##$V9= 5
##$VALIST= <valist>
##$VCLIST= <CCCCCCCCCCCCCCC>
##$VD= 0
##$VDLIST= <DDDDDDDDDDDDDDD>
##$VPLIST= <PPPPPPPPPPPPPPP>
##$VTLIST= <TTTTTTTTTTTTTTT>
##$WBST= 1024
##$WBSW= 4
##$XGAIN= (0..3)
0 0 0 0 
##$XL= 0
##$YL= 0
##$YMAX_a= 8408
##$YMIN_a= -14501
##$ZGOPTNS= <>
##$ZL1= 120
##$ZL2= 120
##$ZL3= 120
##$ZL4= 120
##$ABSF1= 182.463
##$ABSF2= -187.1042
##$ABSG= 5
##$ABSL= 3
##$ALPHA= 0
##$AQORDER= 0
##$ASSFAC= 0
##$ASSFACI= 0
##$ASSFACX= 0
##$ASSWID= 0
##$AUNMP= <proc_1d>
##$AZFE= 0.1
##$AZFW= 0.5
##$BCFW= 0
##$BC_mod= 2
##$BYTORDP= 0
##$COROFFS= 0
##$CY= -3
##$DATMOD= 1
##$DC= 0
##$DFILT= <>
##$DTYPP= 0
##$F1P= 0
##$F2P= 0
##$FCOR= 1
##$FTSIZE= 65536
##$FT_mod= 6
##$GAMMA= 0
##$GB= 0
##$INTBC= 1
##$INTSCL= 5.30512e-09
##$ISEN= 30
##$LB= 1
##$LEV0= 0
##$LPBIN= 0
##$MAXI= 10000
##$MC2= 0
##$MEAN= 0
##$ME_mod= 0
##$MI= 50
##$NCOEF= 0
##$NC_proc= -5
##$NLEV= 6
##$NOISF1= 182.463
##$NOISF2= 159.3651
##$NSP= 0
##$NTH_PI= 0
##$NZP= 0
##$OFFSET= 182.463
##$PC= 4
##$PHC0= -1440.736
##$PHC1= 4.798988
##$PH_mod= 1
##$PKNL= yes
##$PPARMOD= 0
##$PSCAL= 0
##$PSIGN= 0
##$REVERSE= no
##$SF= 81.0140089999434
##$SI= 65536
##$SIGF1= 159.3651
##$SIGF2= -187.1042
##$SINO= 113.3802
##$SIOLD= 16384
##$SREGLST= <1H.CDCl3>
##$SSB= 0
##$STSI= 65536
##$STSR= 0
##$SW_p= 29940.119760479
##$SYMM= 0
##$S_DEV= 0
##$TDeff= 32768
##$TDoff= 0
##$TI= <>
##$TILT= no
##$TM1= 0
##$TM2= 0
##$TOPLEV= 0
##$USERP1= <user>
##$USERP2= <user>
##$USERP3= <user>
##$USERP4= <user>
##$USERP5= <user>
##$WDW= 1
##$XDIM= 65536
##$YMAX_p= 376121349
##$YMIN_p= -19357562
$$ End of Bruker specific parameters
$$ ---------------------------------
##NTUPLES= NMR SPECTRUM
##VAR_NAME=  FREQUENCY,     SPECTRUM/REAL,   SPECTRUM/IMAG
##SYMBOL=    X,             R,               I
##VAR_TYPE=  INDEPENDENT,   DEPENDENT,       DEPENDENT
##VAR_FORM=  AFFN,          ASDF,            ASDF
##VAR_DIM=   65536,         65536,           65536
##UNITS=     HZ,            ARBITRARY UNITS, ARBITRARY UNITS
##FACTOR=    0.456856943014862, 1,           1
##FIRST=     14782.0589164792, 0,            0
##LAST=      -15158.0608439998, 0,           0
##MIN=       -15158.0608439998, -19357562,   0
##MAX=       14782.0589164792, 376121349,    0
$$ Real data points
##PAGE= N=1
##DATA TABLE= (X++(R..R)), XYDATA
$$ [...]
40390d52491R6266M65567M48305q5450q75048j175276l89322R19447J269773N9433
40380B81204j392081j332554K06565J505577J352556K84128m71103m55032l6900
40371e7640L24150L69377J0664n02755o21142q1261O90330J023772P07911P5307
40361A938713m00365m36122j26558N7146k34145o16875l33622N57125R64256K21201
40351A590754q15095q45943J02519Q60558Q22376M86226K93308j8433n74874q09715
40341A091681l24877L61830N48131L19018J65856P0121l13988q27139r09953m87496
40331c06816p8916M2387J87273N54241P26024K39348o29680j053186o02753K35449
40321f86629N94804J96769l48111k79801L91176R29118Q02740K30157k99086o36576
$$ y = [-452491, -356225, 109342, 557647, 472197, -402851, -1578127, -1967449, -1048002, 221771, 281204, -1110877, -2443431, -2236866, -731289, 621267, 905395, 434292, -20740, -57640, 266510, 635887, 646551, 143796, -477346, -558607, 131723, 1155495, 1863406, 1938713, 1538348, 1102226, 975668, 1032814, 798669, 181794, -151828, 405297, 1369553, 1590754, 775659, -70284, 32235, 892793, 1715169, 2201395, 2494703, 2476270, 1901396, 1091681, 766804, 1128634, 1676765, 1995783, 2161639, 2231760, 1917772, 1090633, 180680, -306816, -385732, -343345, -156072, 398169, 1124193, 1363541, 733861, -319325, -922078, -686629, -91825, 104944, -243167, -522968, -131792, 797326, 1600066, 1830223, 1531137, 894561]
40311H94561q30451p51939l31644O1744O706k94119k41756K47215N77794L52780
40301c09109o0489q1611L16695O76184O65977L76996J22999J14939K61062K32655
40291B316298j60019o58227q03392n04223j37649n0933j90587k82417j68958R2813
40281e47294L01634K78596J18881J57385M40215M61680j16603p07742m67358L44003
40271B63397N60969j33303o47750j81466N10169M06215p2930J44445Q21207O87044
40261B357997m13250j111351n87398K66120L76087L3051K5536J78162j22976n78846
40251D23132l93458K63459M45287K6939j00814L89252O82017K51025k53694k25906
40241A507239j93782p45934j206210o03098N49294Q04176l2581o41720k77957
$$ y = [894561, 64110, -687829, -1019473, -957729, -951023, -1245142, -1486898, -1239683, -661889, -309109, -369598, -451209, -134514, 541670, 1207647, 1584643, 1707642, 1822581, 2083643, 2316298, 2156279, 1498052, 694660, 190437, 52788, 1855, -188732, -471149, -640107, -547294, -245660, 32936, 151817, 309202, 749417, 1211097, 1094494, 386752, -80606, 263397, 824366, 691063, 43313, -138153, 372016, 778231, 705301, 849746, 1670953, 2357997, 1944747, 833396, 245998, 512118, 888205, 921256, 946792, 1124954, 1001978, 423132, 29674, 293133, 738420, 765359, 664545, 1053797, 1735814, 1986839, 1733145, 1507239, 1313457, 567523, -638687, -1241785, -692491, 111685, 79104, -562616, -840573]
40232h40573K22811J5477l90945j55977M37361N30219Q9046j98522n6353K02136
40222a45320L55814L81784J44450l10482m60628m8389K54748j93095p54369l23071
40212a098558Q31702J292101N85767k42834l86312k78404l73984k31440L98080
40203D96118O75031j16176j235189j387285m44374O12163J027850P61344Q0562
40194D70044n16962l75576N09961J093596M83656p60760j339178r12259k35976
40185a583454J53863M28082O88551O30057J44541m05993o67313n74346j86678
40176a372690K92377M77426K90125K58063P32972J103006N53423n88234j136758
40167F09710o43265J23347L46836N6615k61000k79285O0664N18531O11279J74769
$$ y = [-840573, -617762, -602285, -993230, -1149207, -711846, -181627, -92581, -291103, -347456, -145320, 210494, 592278, 736728, 426246, -34382, -82771, 171977, -21118, -775487, -1098558, -266856, 1025245, 1611012, 1368178, 981866, 703462, 329478, 98038, 496118, 1171149, 1054973, -180216, -1567501, -2011875, -1399712, -371862, 389482, 470044, -46918, -422494, 87467, 1181063, 1664719, 903959, -435219, -1347478, -1583454, -1429591, -1001509, -312958, 317099, 461640, 55647, -611666, -1186012, -1372690, -1080313, -602887, -312762, -54699, 678273, 1781279, 2334702, 1746468, 609710, -33555, 89792, 436628, 493243, 232243, -47042, 13622, 532153, 1143432, 1318201]
40157A318201k79517k82571j54020l51473n15243j07094L95694J24207o14973
40148d66789p11271p8551L11109K36498M84173J043612P39556p10601j832089
40139i84353j436899j96742O82160J049519J146734O82640k87004p51710k56579
40130c52234P5864o61635j439422q83208L74668O84582K9403j78780M30073Q00127
40120a120562M78179K34385M33735L98349j80702n76793l04543P4636l7107l90328
40110i90751m95267l30277o0841K55158M14538J97816q3589J10866N93541N96605
40100B07799N295m19018k38297J11721K10234K22808K97009K28902L8532N3542
40090G18527J38144k63147r82248j019724p0494Q22952P82690L31334L30521N43551
$$ y = [1318201, 1038684, 756113, 602093, 250620, -264623, -371717, 23977, 148184, -466789, -1178060, -1256611, -945502, -709004, -224831, 818781, 1558337, 847736, -984353, -2421252, -2617994, -1935834, -886315, 260419, 943059, 656055, -95655, -352234, -276370, -938005, -2377427, -3260635, -2885967, -2201385, -2171982, -2350762, -1920689, -1120562, -642383, -407998, 25737, 424086, 243384, -333409, -637952, -563316, -600423, -990751, -1486018, -1816295, -1877136, -1621978, -1207440, -1009624, -1093213, -982347, -388806, 207799, 213094, -205924, -444221, -332500, -122266, 100542, 397551, 626453, 664985, 718527, 856671, 593524, -388724, -1408448, -1478942, -655990, 126700, 458034, 788555, 1332106]
40080A332106K55334l10244l24284J91996L13562l78468j177905j217440m83918
40071a799261L09153N19728J46670k11502N991O23929Q65117L29433m52420o99231
40061c62393l42178K6274l918k06990j02962L92733P74323M87632k81389o47095
40051b65963j49921N09412M18141j85672l20527J40087L15255j49162n12246k62637
40041d63233N8697q9238l49794k79440j38872j42557J63711R08597J183638L86737
40031A238246n24485l44161M83794O36386N0179k39328q3085l46626j014550r03391
40021a047021K73801J128302O52038k64434l27401K32788L59449j2207r8373K06701
40011A103643K00308k99162n84291k21706K73598K68368j21237l91463m06436
$$ y = [1332106, 1587440, 1277196, 952912, 1144908, 1458470, 1080002, -97903, -1315343, -1799261, -1490108, -970380, -823710, -1035212, -1029221, -405292, 459825, 789258, 336838, -362393, -704571, -678297, -682215, -889205, -992167, -599434, 174889, 662521, 381132, -265963, -415884, 93528, 511669, 325997, 5470, 145557, 460812, 311650, -200596, -463233, -404536, -493774, -843568, -1123008, -1261880, -1404437, -1240726, -332129, 851509, 1238246, 713761, 369600, 853394, 1489780, 1539959, 1300631, 1217546, 870920, -143630, -1047021, -773220, 355082, 1007120, 742686, 415285, 648073, 1007522, 995315, 896942, 1103643, 1303951, 1004789, 420498, 198792, 472390, 740758, 619521, 228058, -178378]
40002a78378l33048j34100L47365Q86127R56899M33589j81122m31205m65588n94396
39992C06143o05353p3647P58619J066818N47748j55361l94755l08866k85452k11783
39982F44111J46044M52672K06142m05394p24621n49683k03878J53158N72298P74878
39972A065727L59866l97890p13624l78151N1167K69538O04044J101715J112326
39963C074718L00671o42887r13489o32026l57072j17238L20012O45198L32179
39954B010066m21717q62401p13920l47300K3190N44199J031061Q47451j75058
39945A935571j251282j487388q75151j25047K07861J34414j081J21769N29239
39936h11095Q53333O74692J05108k31558M701M01044M18742J78078J59370L28866
$$ y = [-178378, -511426, -645526, -298161, 587966, 1544865, 1978454, 1797332, 1366127, 900539, 306143, -299210, -372857, 385762, 1452580, 2000328, 1844967, 1450212, 1141346, 855894, 644111, 790155, 1242827, 1448969, 1043575, 318954, -230729, -434607, -281449, 290849, 1065727, 1425593, 1027703, 314079, -64072, -12905, 256633, 860677, 1962392, 3074718, 3375389, 2732502, 1819013, 1186987, 829915, 712677, 1032689, 1677887, 2010066, 1588349, 725948, 12028, -335272, -312082, 232117, 1263178, 2110629, 1935571, 684289, -803099, -1678250, -1803297, -1595436, -1461022, -1462103, -1340334, -811095, 42238, 716930, 822038, 590480, 595181, 996225, 1414967, 1593045, 1752415, 2081281]
39926B081281J55417m90713j033825r75448n02521n4487K75262N39823N23971
39917E18760L9142n58684o49346j01109O40774J124604J144787N69397n02506
39908B225819j405024j365208m89659K62252L12495Q7527J09417J44015j78988
39899b97354m74910j33789N66786P17310P1490o71664r16276p83817n51162j85132
39889b658518K68962M35259J49753j69451p9022K88197N12200M66467K73585k0952
39879e33520l48012m27403q8815L74770N43604M22361K96597K03890m55j49059
39869B93958J14752O38950P25971O3262p25174q36216l24656N5547p1994k64984
39859c30584k746N11428N81538p0591q90704j063673m10225L87275N14803m8272
$$ y = [2081281, 2236698, 1745985, 712160, -263288, -765809, -820296, -545034, -5211, 518760, 557902, -782, -650128, -751237, -110463, 1014141, 2158928, 2728325, 2225819, 820795, -544413, -1034072, -771820, -459325, -371798, -262381, -118366, -297354, -772264, -906053, -339267, 378043, 449533, -222131, -1138407, -1922224, -2473386, -2658518, -2389556, -1954297, -1804544, -1973995, -2053017, -1764820, -1252620, -786153, -512568, -533520, -881532, -1308935, -1397750, -1022980, -479376, -57015, 239582, 443472, 443017, 293958, 408710, 1047660, 1773631, 1836893, 1111719, 275503, -49153, 6394, -65600, -330584, -333330, 178098, 759636, 689045, -201659, -1265332, -1675557, -1288282, -773479, -821751]
39849h21751m93466j78702N27204O97781R0714m80527j94354P01230J183116O50337
39839A681582m79700j275643j134248k13353P13273Q96994L31371k52255k64492
39830C529R0502K86828K63904K85898K99360N1767k93290l30346j51829k14858
39820B91465m61673l39510J95741N02547K88734Q082m8804j89539m79707m12434
39810f45098N4402J10652n29751q31557K2603J158782J246831N16905K07707M81121
39800A792597L69807l50405p28006k74693K53119J14445l97671o35186m76102
39791c32095j28325K78751N71472N30478K13039j54089n55745r43428q67534j28870
39781a516346M85010J27596o49883n75217L06340O77731J43977j89309K52359
$$ y = [-821751, -1315217, -1493919, -966715, -268934, -178220, -658747, -853101, -151871, 1031245, 1681582, 1201882, -73761, -1208009, -1421362, -708089, 188905, 520276, 268021, 3529, 94031, 380859, 644763, 930661, 1230021, 1281788, 988498, 658152, 506323, 291465, -170208, -509718, -313977, 188570, 477304, 485386, 436582, 247043, -232664, -645098, -590696, -480044, -1009795, -1841352, -1818749, -659967, 586864, 1103769, 1311476, 1792597, 2162404, 1811999, 1083993, 809300, 1062419, 1176864, 779193, 144007, -332095, -460420, -181669, 389803, 920281, 1133320, 979231, 423486, -519942, -1387476, -1516346, -1031336, -903740, -1553623, -2128840, -1822500, -1144769, -1000792, -1190101, -937742]
39772i37742N23885k0247m38925J54829R26959O00083n35741j199132j001509
39763a927540n01775M5014P31008J188832R53460M01816K69277M27091J39385
39754A726568o27445j123385r61755m82685m0469K89475L87274K13906J45420
39745d73096M85413Q21739N86971L5842j30583Q6739P2495k96927n10513l37951
39735C40129o2561J58214L57283K66024l47489q89395m90209N51961R14844J22634
39725I21435p31685o09812L7650J52554l08001m89288m8053M00641K93043o5853
39715d47369k1143M12274N18401o4052o92797n41512J96918N61969K13215k12990
39705g7086k53099k11884k64318L5682P19649Q59855m8624j019339r24493j45255
$$ y = [-937742, -413857, -434104, -873029, -718200, 208759, 808842, 273101, -926031, -1927540, -2429315, -2384301, -1653293, -464461, 488999, 890815, 1160092, 1587183, 1726568, 1099123, -24262, -986017, -1468702, -1509171, -1219696, -832422, -618516, -473096, 12317, 834056, 1421027, 1456869, 1326286, 1413025, 1485520, 1188593, 678080, 340129, 277568, 435782, 793065, 1059089, 711600, -177795, -668004, -116043, 798801, 921435, 189750, -420062, -382412, -229858, -537859, -1027147, -1075200, -674559, -381516, -447369, -468512, -56238, 462163, 398111, -294686, -836198, -639280, -77311, 135904, -77086, -330185, -542069, -806387, -770705, -51056, 808799, 760175, -259164, -1183657, -1328912]
39695a328912K67955L25348O36466Q87034L63411m39500m18015J89145J96615
39686F79547l19709j24668P69678Q53926k62432j016657m69151K03031j34005
39677A79560o79936l21424L67148K91720j95235j18928K52950J2451n83434n16981
39667a312109J95680O07611M80847M30191N69052L46721k35425m51813n5149L66830
39657I42436M15016L58368L94592K59571j51504m63737m41611m04541p02257j118565
39647i12232j082497l46331O69170J198463Q67030R4974l98262l90471j31524
39638d31680K68240P79115R13357J78474q40059r25718m8378M55899M316k80014
39628G3552M46070J184484P44793k39730m51510j00235l03799r19463p93020J48798
$$ y = [-1328912, -1060957, -735609, -99143, 787891, 1151302, 711802, 293787, 482932, 679547, 359838, 235170, 1004848, 1858774, 1596342, 579685, 110534, 313565, 179560, -500376, -821800, -454652, -162932, -358167, -477095, -224145, -211694, -795128, -1312109, -1116429, -508818, -27971, 402220, 971272, 1317993, 1082568, 630755, 575606, 942436, 1357452, 1715820, 2110412, 2369983, 2218479, 1754742, 1313131, 908590, 206333, -912232, -1994729, -2341060, -1671890, -473427, 393603, 488577, 90315, -300156, -431680, -163440, 615675, 1529032, 1707506, 867447, -58271, -106649, 349250, 353566, 73552, 519622, 1704106, 2448899, 2209169, 1757659, 1657424, 1353625, 434162, -358858, -210060]
39618b10060P84251O72894M42050L11887j90241r17174j006430l51052J72327
39609b91548J69170J41015K71360J31363k17792k00093J3214l15280q42468l61242
39599a502301R31836J235816k5285j022985l25251Q18423N18772p77985j128230
39590a277190n1398J076135J152196L98739m64497q59334l87217O81203J195630
39581A464267M16865p67735r36793j30396L68349L3326l38577r0689M01074N47989
39571I67680L54994J05456p0998p4021J62971L80284J86307l70200q47610j008246
39561b13383r32913o56388k05963J18499P3879k0362K94039P79611P53011J42243
39551A32273l83647l90083j21890J28103M27779P60329P57448K14394n09504q84579
$$ y = [-210060, 574191, 1247085, 1689135, 2001022, 1810781, 893607, -112823, -463875, -291548, -122378, 18637, 289997, 421360, 203568, 3475, 16689, -298591, -1141059, -1502301, -570465, 665351, 640066, -382919, -708170, 110253, 629025, -148960, -1277190, -1328588, -252453, 899743, 1298482, 833985, -25349, -412566, 268637, 1464267, 1881132, 1113397, 176604, 46208, 414557, 447883, 109306, 18617, 419691, 967680, 1322674, 1428130, 1357132, 1283111, 1446082, 1826366, 2012673, 1642473, 794863, -213383, -1146296, -1802684, -2008647, -1890148, -1816269, -1836631, -1542592, -762981, -9970, 132273, -251374, -641457, -763347, -635244, -207465, 552864, 1310312, 1524706, 1015202, 130623]
39541A30623p55024l35171R2525L43774L77059K62930N4297k25049m13715k95976
39531g63727K0143J66007J22497K67707N71739M45699j49768k98697L83645P40391
39521A505636k68037j615256j453459Q4334J052441O26460M4107K63002N11744
39512G50972j8449o57596n53544j77270k83880m41296N6947O74950M84332q7228
39502b52062J20503R61179J097134J47796o98335n22358N3880m8276q38376j365929
39492a344844q90724M04032J568006J649115O31282m13177m72584K34373O86648
39483B052127M33955r3755m79113p23704p50515l21107L41079N41178J3788o98743
39473C15190r74142p21057j57092M30965N81374J901p47219o34511M13463J159179
$$ y = [130623, -624401, -959572, -867047, -523273, -146214, 116716, 171013, -54036, -467751, -763727, -743584, -577577, -455080, -187373, 384366, 830065, 680297, 381600, 765245, 1505636, 1237599, -377657, -1831116, -1746782, -694341, -67881, -23774, 239228, 750972, 732523, 74927, -478617, -655887, -939767, -1381063, -1324116, -649166, -164834, -252062, -131559, 829620, 1926754, 2074550, 1376215, 853857, 907737, 859461, 21085, -1344844, -2235568, -1831536, -263530, 1385585, 2016867, 1603690, 1131106, 1365479, 2052127, 2486082, 2392327, 1913214, 1189510, 438995, 117888, 458967, 1000145, 1013933, 315190, -658952, -1380009, -1537101, -1106136, -524762, -522861, -1270080, -1904591, -1491128, -331949]
39463c31949O35851n23835r65244l60379M17569O08914L57725J94934K74632L16228
39453F24446Q6719k26700k09323J66278L58930J8573l48706j02826L36116l5016
39443F68491j049949j260984q9535J047299O71141o11570j063399k83647N78807
39434a393346P42994N78466M96924L26885K3507o6214L3664j86426p54020r85627
39424a183193n65034l3729J59729K82428N60868O19629K25828j35454l6920J88014
39414H2166J27950K9991J71315J40552m22278r16731n74432K13877L76316k28902
39404a000176o78387m10491J72322N87087Q21138Q28929L90914k16519k53286
39395B41531L62832P25894K31626n03991o17659k50379p8420j14989J01406M14518
$$ y = [-331949, 303902, -219933, -1185177, -1545556, -1127987, -519073, -161348, 33586, 308218, 624446, 711165, 484465, 275142, 441420, 800350, 818923, 470217, 367391, 703507, 668491, -381458, -1642442, -1731977, -684678, -13537, -625107, -1688506, -1972153, -1393346, -650352, -71886, 425038, 751923, 775430, 709216, 742880, 556454, -197566, -1183193, -1748227, -1781956, -1622227, -1339799, -778931, -159302, 66526, -68928, -105848, 82166, 210116, 240107, 411422, 551974, 129696, -787035, -1361467, -1147590, -771274, -1000176, -1678563, -2089054, -1916732, -1329645, -508507, 320422, 711336, 494817, 241531, 604363, 1330257, 1561883, 1057892, 440233, 189854, 111434, -3555, 97851, 512369]
39385E12369J70791n43671p71348j09223N65141L31219m45495p14748k57660J98626
39375a063999K17040J42869K38510J59439k76410m81962N4653P63829O62460j53528
39365B62901n83119j62528K95699P3684l31291j60870K39015J6579n88209m25745
39355a363884O98889J467610Q44139m49462r69271m56283J35332J70325l0454
39346D6941n4126k7834j32551j63306L9767K19475J68944J52873M05649N75969
39336A231801K32451l37717m79427j89300q4023l37650m03653J68L70393K73517
39326B76560O0473J85648L73612J33716l17366l89876r8413M9101m0126j2258
39316B21071J49346Q2767k13259l43523k53160k67503l66476k02773J09344Q9110
$$ y = [512369, 683160, 139489, -631859, -741082, -175941, 155278, -290217, -1004965, -1262625, -1063999, -846959, -704090, -465580, -306141, -582551, -1064513, -1009860, -246031, 416429, 262901, -320218, -482746, -187047, -113363, -444654, -605524, -366509, -349930, -938139, -1363884, -664995, 802615, 1646754, 1197292, 228021, -228262, -92930, 77395, 46941, -7185, -35019, -167570, -330876, -291109, -71634, 97310, 250183, 655832, 1231801, 1464252, 1126535, 647108, 457808, 373785, 36135, -367518, -367350, 3043, 276560, 337033, 522681, 896293, 1030009, 712643, 322767, 224354, 273455, 233329, 221071, 370417, 453184, 239925, -103598, -356758, -624261, -990737, -1193510, -1084166, -995056]
39306i95056j41259L8672N08742M04639l10584n29292J57186O23766J25321k79001
39296c96866M72897J364659P37601r19879j536625n69455L59943J24689m00937
39287g63973r2078O67298Q58202L97793o3515k08204j54924K186J73944J98345
39277A015074J62915L52416O13591L70323m04576q81961m76890L15601O46277
39268A712770L72315m7207k46895j21239K59520M98527R0093q02623j246473o71831
39258b03043K96102O03286K9851p25012r04738k84567P46490J335303P87587n40681
39248A140578j327662p09780O58142J376653Q71399k13052r34708r05449l28314
39239c72193L89222R30105J092470O76942l53203j433301j571447n03506O93699
$$ y = [-995056, -1136315, -1097643, -588901, -184262, -494846, -1024138, -866952, -243186, -117865, -396866, 76031, 1440690, 2178291, 1258412, -278213, -847668, -487725, -363036, -763973, -856051, -188753, 669449, 1067242, 1003727, 795523, 640599, 642785, 816729, 1015074, 1177989, 1530405, 2143996, 2514319, 2109743, 1227782, 750892, 1066493, 1712770, 2085085, 2037878, 1790983, 1669744, 1929264, 2427791, 2517884, 1715261, 468788, -203043, 93059, 696345, 726196, 1184, -903554, -1188121, -441631, 893672, 1681259, 1140578, -187084, -896864, -238722, 1137931, 2009330, 1796278, 861570, -43879, -372193, 17029, 947134, 2039604, 2716546, 2363343, 930042, -641405, -1144911, -451212]
39230d51212Q80391L89947K98216M90322j15769j390599j728974n30744O59187
39221a499235M49551l65361k91723N38866R63672P96814P02300O73380J77792
39212B146056n21632o21872j85352j2227k26370j92190K22519M48310K83322J14513
39202A455077N0761k00365n72669o41718l72874q6704J81635N11170N74079J68755
39192A067147r7228L19201P42247J94146q88239j208667o33181j89227j84967
39183h78768P3775O35627O25752r2895n34452k69761l1605k13296k16461K04680
39173f97404L78591N1561r8831J70723K08327j01424J140M61144J27275j024179
39163e23077j272347P9634J214510O09036m71328k09515O26105J40575j220382
$$ y = [-451212, 429179, 819126, 1117342, 1607664, 1491895, 101296, -1627678, -2158422, -1499235, -1049684, -1415045, -1706768, -1167902, -204230, 592584, 1294884, 1968264, 2146056, 1624424, 1002552, 817200, 804973, 578603, 386413, 608932, 1057242, 1340564, 1455077, 1505838, 1305473, 732804, 91086, -281788, -368492, -186857, 324313, 898392, 1067147, 969919, 1289120, 2031367, 2225513, 1337274, 128607, -504574, -693801, -878768, -804993, -169366, 456386, 363491, -170961, -440722, -472327, -685623, -902084, -697404, -318813, -267252, -366083, -195360, 12967, -88457, -87317, 373827, 501102, -523077, -1795424, -1715790, -501280, 107756, -363572, -573087, 53018, 193593, -1026789]
39154a026789j282004K73829J472362J202000N02954L60807K84829k53018o78704
39145H56266m49678k8807M7372L7046K59211L83647Q0961l39173m59821l23717
39135F3307j02200J95525L92475J62319l35212m69139p3043K60409J22625j02863
39125A14203M0252L10057J90931k76778n47188l00378J72563L03713r5348n24100
39115f12073l25662L84566O97857R0298q24842j149437q22414l21769K25218Q43135
39105a815123J076882N41362j74493j85269K76973K12368m54201p18565j73513
39096a413579L45281J55798k75961k37496J92770N21628N54858L02826j84444
39087c8319n25643j96202O51065J175076R37093L55654j33176n83155r39612q21785
$$ y = [-1026789, -2308793, -2034964, -562602, 639398, 1142352, 1503159, 1787988, 1534970, 856266, 406588, 377781, 425153, 462199, 721410, 1105057, 1186018, 846845, 387024, 63307, -38893, 156632, 549107, 711426, 376214, -92925, -165968, 94441, 217066, 114203, 154455, 464512, 655443, 378665, -168523, -468901, -296338, 7375, -87973, -612073, -937735, -553169, 144688, 234986, -589856, -1739293, -2561707, -2883476, -2658258, -1815123, -738241, -196879, -371372, -556641, -279668, -67300, -521501, -1240066, -1413579, -1068298, -912500, -1188461, -1425957, -1233187, -711559, -156701, 146125, -38319, -563962, -760164, -109099, 1065977, 2003070, 2358724, 2225548, 1642393, 702781, -119004]
39077a19004l12104r0703l01672j84337N67134R98057K68069r24378j223284l98118
39067a720340O11479J004383O79040j02092q06713p42781J36930Q40475M94330
39058C94711m24400p87420l96785M2201K51429N92254R63532O29323m96222j322286
39048e53663r31191J45382O25125J17283n34397m71251J42394N06158L13445R0158
39038e50557L37490P29020N66107j57971p15652o88007m30099l01985r1614L92369
39028i10899P44916N52133J03738j03171j95835n56021q95974n30697M56136J101424
39018b34250Q09663J00953j72740J03016L86475L54933K63265L93674M80198L5976
39008B521163p51834r54862j49754O86344L22272q51908j159651m7148J021536
$$ y = [-119004, -431108, -521811, -823483, -1007820, -440686, 557371, 825440, -98938, -1322222, -1720340, -1108861, -104478, 574562, 472470, -334243, -1077024, -940094, -99619, 394711, -29689, -817109, -1213894, -1171693, -920264, -328010, 635522, 1264845, 768623, -553663, -1484854, -1339472, -714347, -597064, -1131461, -1602712, -1460318, -954160, -640715, -550557, -213067, 515953, 1082060, 924089, 208437, -479570, -909669, -1211654, -1303268, -910899, -165983, 386150, 489888, 386717, 190882, -365139, -1261113, -1791810, -1335674, -234250, 575413, 676366, 503626, 606642, 993117, 1348050, 1611315, 2004989, 2485187, 2521163, 1769329, 814467, 664713, 1351057, 1673329, 821421, -338230, -385378, 636158]
38999F36158O93165l72742p26685l26289k01510n28375n24268n5099J29100j18355
38989a394900K3304Q51016J456680J070135J43730m62968o03819o01276n38937
38980e7035l44198q7979J95284N28076O11443N5712p74389r16511j77637M64352
38970e02882K94249j60571j97451r3879l43551n40735j06486M74512L54088j39245
38960i61951K8939P49689P85188k06513j015310p33420o9413n8136m35075k81184
38950b197186L59184N97030J67459k30665p6553L44660O24904P98400Q97390N74821
38940A859444l02733j078606r48564p9233M87456J55821m84292n24145M1007M41162
38930d32683L17514J54036L58374N15154Q6767n06588k86267P77729J452521Q33780
$$ y = [636158, 1329323, 956581, 229896, -96393, -297903, -826278, -1350546, -1405645, -1276545, -1394900, -1371596, -520580, 936100, 2006235, 2149965, 1686997, 1083178, 481902, -57035, -401233, -489212, -293928, 234148, 845591, 901303, 126914, -789597, -967234, -502882, -208633, -369204, -566655, -660534, -1004085, -1544820, -1651306, -1176794, -822706, -961951, -933012, -183323, 601865, 395352, -619958, -1353378, -1422791, -1480927, -1916002, -2197186, -1838002, -1240972, -1073513, -1304178, -1380731, -1036071, -411167, 387233, 1284623, 1859444, 1556711, 478105, -470459, -549692, -62236, 93585, -390707, -914852, -873845, -432683, -115169, 38867, 397241, 912395, 999162, 492574, 206307, 984036, 2436557, 3270337]
38920C270337l79317q45103l83795K6161j11065j83423K68151O26764J85645o26468
38910A847887q44786l98476n1098r1356k1401L73903N49060J22764m38899n17884
38900E29714k02855l254r3826k47926k28800M7376M35472M71604j84281j021555
38890d98331j021504p5029O53178L24201l41375k15242M99285P07440J84595k45651
38880b8433j49643N880j62367m37769n92543o17388k90752N59447J282454R28885
38870D97771k38774q32694k78026M32697M05041J19917L06825N87915K46032m18748
38860H27956n61639j31440K17466J92206P573k08127m01874l22111O1966K67072
38850e0952P8142P5566N98507Q39931M1161r77715p99232L93402J009482L80494
$$ y = [3270337, 2891020, 2045917, 1662122, 1688283, 1577218, 1393795, 1661946, 2288710, 2474355, 1847887, 1003101, 604625, 553527, 462171, 440770, 814673, 1363733, 1486497, 1047598, 529714, 326859, 323605, 229779, -18147, -246947, -199571, 235901, 707505, 523224, -498331, -1519835, -1594864, -941686, -617485, -958860, -1174102, -674817, 32623, 217218, -28433, -178076, -172196, -334563, -772332, -1364875, -1982263, -2273015, -1713568, -431114, 497771, 258997, -573697, -851723, -419026, -13985, 105932, 412757, 1000672, 1246704, 827956, 266317, 134877, 352343, 544549, 552122, 343995, -57879, -379990, -318024, -50952, 27190, 102756, 701263, 1541194, 1582355, 604640, -194592, 198810, 1208292, 1588786]
38840A588786n12243p83821p18172p04886m11510L42043R32901Q56927M73648
38831A063673K24939q5778o02206p87831k51377M07827L56640k83369o75253l84499
38821a017234K77854P45610O29216j3181n41384l10802L75333N08112j35046n41148
38811b2670j7483O55648M16866m42018p90519l27864K28536L30510J02440j46352
38801a2906j72628K14492P60071O88078k79458j230431j188281n02184j89409
38792a912656l08993j03376N06858P86381M93376J77974J28358Q9778P1841L40981
38782B70522N57940R0370p01178p30741M9562M59112L617l73815K6841N75989
38772B28219N99770M68773N70830M04586l42409r12844p00695l24065m23564m46592
$$ y = [1588786, 1076543, 292722, -425450, -1130336, -1541846, -1199803, -266902, 590025, 1063673, 1288612, 1202834, 600628, -187203, -438580, -30753, 325887, 42518, -632735, -1017234, -739380, 6230, 635446, 622265, 80881, -229921, 145412, 653524, 518478, -22670, -40153, 615495, 1032361, 590343, -200176, -528040, -299504, 31006, 133446, -12906, -185534, 28958, 789029, 1477107, 1197649, -32782, -1221063, -1723247, -1912656, -2221649, -2325025, -1818167, -1031786, -538410, -360436, -232078, -142300, -70459, 270522, 828462, 918832, 217654, -513087, -463525, -4413, -796, -374611, -347770, 228219, 827989, 1296762, 1867592, 2272178, 1929769, 1016925, 316230, -7835, -431399, -877991]
38762h77991J65087O19553M2179p93737o01210K60517M67147L9983J27685P43354
38752A92567O57947l39957r19036l50307M37563N05049J88631J04613J06891p2501
38742E11460j82157q0744r5152k44044l4278N06984N94206q626m52587j61815
38732C53247K54391Q7507l97088o15769n05780j22668O28148J257549Q06112n59752
38722A185897j246555m48424N56842M38172j43646K9850M61728l4795r12820o29008
38712g42759O07007J002026J05833n32361J9171P68249P43197M48765N00383L94261
38702C313772k69866o79197j58263M37910n878j001502j203685m77653R8978O266
38692F0882k00961q3936J01107J41181K32677L84639K48927j87151m19712k30984
$$ y = [-877991, -712904, -93351, -51172, -844909, -1446119, -1185602, -718455, -678472, -550787, 192567, 850514, 510557, -408479, -758786, -321223, 183826, 372457, 477070, 583961, 511460, 329303, 248559, 153407, -90637, -124915, 382069, 976275, 967649, 515062, 353247, 607638, 695145, 298057, -317712, -823492, -946160, -318012, 939537, 1745649, 1185897, -60658, -509082, 47760, 485932, 342286, 372136, 833864, 799069, -113751, -742759, -135752, 866274, 972107, 439746, 458917, 1227166, 1970363, 2419128, 2919511, 3313772, 3043906, 2364709, 2206446, 2644356, 2638478, 1636976, 433291, -44362, 54616, 60882, -140079, -224015, -122908, 18273, 250950, 635589, 884516, 697365, 277653, 46669]
38682D6669n3689j88160k40072J83142O96559O80297L00264K60938N98893N15537
38672B800378l21680j039290p21560J76789M02038l04690q98541o22414P868J88843
38662c32259l7373k19790l27193l96164k2019Q66090J290671M30570q53474j024639
38652f25580k19142n7245r50578j292839m3718J438586J358837J24664m50500
38643g17515J20144O33636L15045k17705k79553j25130j77843k29698K5972L65867
38633b86780M89791N59788P58656P77061L30394j72308j56087J20504j32182q85563
38623A403274j081157j87226P55089M42781p39893j138433k08139O83306L29557
38614B59159n23421m40228M42074P48943J14878l80795j25657J20785k66821o45612
$$ y = [46669, -7020, -195180, -435252, -252110, 444449, 1124746, 1425010, 1685948, 2284841, 2800378, 2478698, 1439408, 717848, 894637, 1296675, 991985, 93444, -528970, -521102, -332259, -369632, -589422, -916615, -1312779, -1334798, -468708, 821963, 1252533, 399059, -625580, -844722, -901967, -1852545, -3145384, -3189102, -1750516, -391679, -267015, -717515, -597371, 36265, 351310, 133605, -145948, -271078, -448921, -678619, -652647, -286780, 203011, 762799, 1521455, 2298516, 2628910, 2456602, 2300515, 2421019, 2288837, 1403274, 322117, 134891, 889980, 1332761, 592868, -545565, -753704, -70398, 259159, -264262, -704490, -262416, 486527, 601405, 220610, 94953, 215738, -51083, -696695]
38604f96695k82958L42443L85023L4175N4578M44768N65610K83153M0652j1874
38594A158875j02879j93944n0989J35124m2814m42004n26412k32812J3241P9483
38584b05131K09915L78631L04974R6138J11793J94589j25566o07733m36312L81555
38574C02853P38455K9699q38504p26812J24300N67279K14721k13869r6759K84455
38564C85818L06025j13392m72489l57979P1118L16943J63428j07700j53021K6245
38554F4996K59634M80466N55755K08515m61456p57027k87194K54006n350p00227
38544c87882p05142P7476N52141K07037j53747J04527L93440N1201m46819l26616
38534f34384J98140M20529L27169L44944L73113K4139n01678o83775n61669n00093
$$ y = [-696695, -979653, -637210, -252187, -218012, -163434, 281334, 846944, 1130097, 1170749, 1158875, 1055996, 862052, 811063, 946187, 903373, 461369, -65043, -297855, -284614, -205131, 4784, 383415, 688389, 784527, 896320, 1090909, 965343, 357610, -78702, 302853, 1041308, 1071007, 232503, -494309, -370009, 197270, 411991, 198122, 101363, 385818, 691843, 578451, 105962, -252017, -180899, 136044, 299472, 191772, 38751, 64996, 324630, 805096, 1360851, 1569366, 1107910, 350883, 63689, 317695, 312345, -387882, -1093024, -1015548, -463407, -256370, -410117, -305590, 87850, 139051, -307768, -634384, -436244, -15715, 311454, 656398, 1029511, 1053650, 551972, -131803, -693472, -1193565]
38524a193565l38226L21522J140677J276944N71287k82175p25350p63858m82633
38515d75377P5208N46469N16706J78831M9010R7897q3476l59264j92255K95390
38505F49139L78605l6422k30015N0204J42006l12754o71279l56532J99763K83376
38495I6091r2249m49460n37496k96524K71429P67288N67775k37263p49270n16961
38485a176640j27019q9429l5019L50716N42250J56338j62425J87860O18942L63550
38475F29124j15278M5287N17758L83088j99207l75388k48730n61582r71027l85065
38465a281020R29479J350440L70355o07766n05817j6807n3644k38143M9749L60665
38455C57491N7479m55854m98353l02509l66552l38673L21912J125667J130724
$$ y = [-1193565, -1531791, -1210269, -69592, 1207352, 1778639, 1496464, 771114, 7256, -475377, -400169, 146300, 663006, 841837, 890847, 988744, 905268, 546004, 353749, 649139, 1027744, 991322, 761307, 811511, 953517, 640763, -30516, -387048, -187285, 96091, 3842, -445618, -983114, -1279638, -1008209, -240921, 326854, 89591, -659679, -1176640, -1303659, -1393088, -1428107, -1077391, -535141, -378803, -541228, -353368, 265574, 629124, 513846, 559133, 1076891, 1459979, 1260772, 885384, 636654, 75072, -895955, -1281020, -351541, 998899, 1369254, 761488, 255671, 238864, 185220, -52923, -3174, 357491, 414970, -40884, -539237, -841746, -1208298, -1546971, -1225059, -99392, 1031332]
38446A031332L93106j79729j91154o6293j53196k99935k69438j3405L61637N51308
38436A164233K69247k37832l96809k59156m74094r85995q05152L11980J108157
38427c05421O59512j66773k17013J10929p7492l45782J54812Q05624M57104l93482
38417F82018l74980K75778J64754o12651o21524J36889J15687p74649o82815Q59807
38407h31686J715682N30540r96380q71877K12823N54292L08813N37291P84439
38398A943937l3928j226895j138218R2852O99689L3572p68376q44070n95117m71420
38388b307974k89910J5J29287K31511O29711R15812M33679l53487k74289O89013
38378a96632J252825P59685r46k30902k09543m76098r05245j084954q64612k19261
$$ y = [1031332, 1424438, 1244709, 1053555, 987262, 834066, 534131, 264693, 251288, 612925, 1164233, 1433480, 1195648, 798839, 539683, 65589, -920406, -1725558, -1413578, -305421, 354091, 187318, -29695, 81234, 3742, -342040, -187228, 618396, 1075500, 682018, 307038, 582816, 747570, 134919, -486605, -349716, -234029, -1008678, -1691493, -831686, 883996, 1414536, 418156, -453721, -240898, 313394, 622207, 1159498, 1943937, 1910009, 683114, -455104, -362252, 337437, 371009, -397367, -1241437, -1836554, -2307974, -2597884, -2597869, -2468582, -2237071, -1607360, -691548, -257869, -611356, -885645, -196632, 1056193, 1815878, 1814932, 1584030, 1374487, 898389, -6856, -1091810, -1956422, -2175683]
38368b175683P02474J233335P40906k90795o37942k1708N26670K73399k44396
38359A06260l01253r2711j44125l66209l60946j25703J12495L25674M95680M15707
38349F4869P9744j16503Q3339L93420M03386R1594k69058m17056k18541K03389
38339B98583M49384K89435N795j07301k89704p55171r57893l08327O45841Q20185
38329I0827K36401j10190L0853o3974m76288l24594M93341P64597p0624q18565
38319b48216l95469M42163M06572l08985o28605m13163l15020l51430L865N57148
38309a251140M88975k85648q72849o25335J50260P87903R69366Q05565O49940
38300H17037P75426R52699O09231l05954j032038r34814k76206L12774N57547
$$ y = [-2175683, -1473209, -239874, 501032, 210237, -427705, -449413, 77257, 350656, 106260, -194993, -287704, -431829, -798038, -1158984, -1284687, -1172192, -846518, -350838, 64869, 144613, 28110, 111449, 504869, 908255, 999849, 730791, 313735, 95194, 298583, 747967, 1037402, 1043197, 935896, 646192, -108979, -1066872, -1375199, -729358, 90827, 327228, 217038, 247891, 183917, -292371, -616965, -123624, 640973, 570349, -248216, -643685, -201522, 205050, -103935, -732540, -1145703, -1460723, -1812153, -1808288, -1251140, -762165, -1047813, -1920662, -2545997, -2395737, -1607834, -638468, 167097, 817037, 1592463, 2545162, 3154393, 2848439, 1816401, 881587, 605381, 918155, 1475702]
38291A475702L50461m20913j286363j224226l7795J027736Q82110P8752k24491
38282F20973k0939j8256j41202J42589M67503K8051q33065r71415l18174N1217
38272i92718j97065j94887M15369P77776L74457l8682K25570O20067L62624l08430
38262A044081p27833q95795j092153j008951k25333Q11838J196244Q22504M57730
38253C82332N41076O03918J03403o70472r22576m22888J47627P4388m21982m78331
38243a063505J86846Q56794Q38585L73999J01981Q8827n160j71349j81081j95583
38233H30354m65521o14121r0537P34000Q59598J39173m57762k89585J40950J69743
38223I56292o6697j48283j38025k48315k94389p6240J14163o1985l60775l18425
$$ y = [1475702, 1826163, 1405250, 118887, -1105339, -1143134, -115398, 766712, 845464, 620973, 600034, 581778, 440576, 583165, 1050668, 1078719, 245654, -725761, -1043935, -992718, -1189783, -1384670, -969301, -191525, 182932, 144250, 369820, 989887, 1352511, 1044081, 316248, -579547, -1671700, -2680651, -2905984, -2094146, -897902, -75398, 382332, 923408, 1527326, 1630729, 960257, 37681, -385207, -237580, -163192, -585174, -1063505, -876659, -19865, 818720, 1192719, 1294700, 1383527, 1378367, 1207018, 1025937, 830354, 364833, -249288, -339825, 394175, 1253773, 1392946, 935184, 645599, 786549, 956292, 889595, 741312, 603287, 354972, 60583, -15657, 98506, 36521, -324254, -642679]
38213f42679j6296M3329k73033n17782k73944L08963O74345M56481j12628m40166
38203g93410k78194l2352j45494l70108q3356P29035J299414J012109J26680n90840
38193H73484o74918k68821J55776K82650K41191L53259N56493M08996j40398m77851
38183A309861k40562L0671k06786m87282j26142M30612K00112o14736p98694p4525
38173e77471M60260J63437j98142R0501M71492J87260l68443l27994K57010N96292
38163G54202L25824k40543p03619q36051n46607m7406K58062L58537O37785J029650
38153I89834Q52910p6229q88617q08781k05463J35763J35385R2764j16757o32428
38143e21619r04692l73144M72502O57148J58737j21930K45017P08243O75517K32254
$$ y = [-642679, -658975, -615646, -888679, -1406461, -1680405, -1371442, -697097, -240616, -353244, -793410, -1071604, -1103956, -1249450, -1619558, -1702914, -973879, 325535, 1337644, 1464324, 873484, 198566, -70255, 85521, 368171, 609362, 962621, 1519114, 1928110, 1787712, 1309861, 1069299, 1099970, 893184, 405902, 279760, 710372, 910484, 295748, -502946, -577471, -117211, 46226, -151916, -61415, 410077, 597337, 228894, -99100, 157910, 754202, 1080026, 839483, 135864, -700187, -1246794, -1294200, -1036138, -677601, -39816, 989834, 1842744, 1766515, 877898, 69117, -136346, -583, 134802, 227566, 110809, -521619, -1426311, -1799455, -1326953, -669805, -511068, -632998, -387981, 320262, 995779, 1228033]
38133A228033k17068m47426m05389j45264R7175O6230k22815n27607o26173l95145
38123a595449J20831N64967N31287J52556J880K14298K70400o1375k55179M5135
38113a0649L37579J03001l35758m76993m89027o18912m44986L39948J024592Q22439
38103B51234J92374R5784M29921M34190J96833L31679M77093k69924j488550j684195
38093a033561o00333L63961M07506L16230O24604N40617l27277p91321M2225J053651
38083E96302P97655j52333k73748K53183q3075j358186j803998n14154J124957
38074a413397J441229O42488P1628K05607M07678J88827k18358m20819l27786
38065E77097m4324K55353L40915J24634j68860k55547j45584n4551r2692k54885
$$ y = [1228033, 1010965, 563539, 158150, 12886, 110061, 176291, -46524, -574131, -1200304, -1595449, -1474618, -909651, -378364, -225808, -223928, -9630, 260770, 199395, -55784, -10649, 326930, 429931, 94173, -382820, -871847, -1490759, -1935745, -1595797, -571205, 251234, 443608, 539392, 969313, 1403503, 1600336, 1932015, 2409108, 2139184, 650634, -1033561, -1633894, -1269933, -862427, -546197, 78407, 619024, 291747, -499574, -457349, 596302, 1393957, 1241624, 967876, 1221059, 1137984, -220202, -2024200, -2538354, -1413397, 27832, 670320, 741948, 947555, 1355233, 1544060, 1325702, 904883, 577097, 532773, 788126, 1129041, 1253675, 1084815, 829268, 683684, 629133, 536441, 281556]
38055B81556n46271q41566q06261l30936J05971j7490m30883l53280L27758Q13425
38045a797977N85622J70368K29178N01941L74375M4722K09560P76215Q68648K05692
38035B168344m29675l65183R8093L38098K25708q4751n04287p43779l87495L01179
38025F16252L72136m34426j061658o41397J25781R5122m57571l63933M10022P01269
38015f38403J24501l25257j3871L00821j36676p41768n70649J33059M01492R5222
38005a371529m2267K87192N27220K82326q2063j38031m2243q2952p5307K76508
37995d61146P12100O78570J70677k34333k34904j73258l54681n09544k99947N9890
37985f46576J79165J66226L58678O12411N08988J31441p6233j51465n05667r38249
$$ y = [281556, -264715, -1106281, -1912542, -2243478, -2137507, -2154997, -2585880, -2939160, -2611402, -1797977, -1212355, -1041987, -812809, -310868, 63507, 108229, 317789, 1094004, 1962652, 2168344, 1738669, 1373486, 1471579, 1809677, 2035385, 1950634, 1446347, 702568, 315073, 616252, 988388, 553962, -507696, -1149093, -1023312, -928190, -1385761, -1749694, -1339672, -638403, -513902, -839159, -853030, -552209, -688885, -1430653, -2001302, -1868243, -1466751, -1371529, -1413796, -1126604, -599384, -317058, -399121, -537152, -579395, -662347, -737654, -461146, 250954, 929524, 1100201, 865868, 630964, 457706, 103025, -406519, -706466, -646576, -467411, -301185, 57493, 669904, 1178892, 1310333, 1234100, 1082635, 576968, -361281]
37975c61281o91742K46086Q37100M74566q7052O1822N86412N21904k25754q20494
37965E41567o63644L7387O63007O79674M2872n39195k15915P65489J096943J93972
37955B602157q52247q34644j20388J78789l9696j38701j55933n74927j037359
37946i72949o97984K54410P60223N49299L50967M20855J98616l81925n56319m8155
37936a22962M57954N34651N71236P16787M17505m49608j043363p96966k73668
37927A1566j48927j83291J15568N50209O57447M95575L78886K84140K1869l88180
37917A794862q22240j104541q48953J02548J001651Q19744k46696q55593l99337
37908e58555K47703K80759J07337K79560M05405J8284m08246k89909J2874n6743
$$ y = [-361281, -1053023, -806937, 30163, 504729, 417677, 479499, 1065911, 1587815, 1362061, 541567, -122077, -84690, 578317, 1257991, 1300863, 761668, 545753, 1311242, 2408185, 2602157, 1749910, 915266, 794878, 973667, 933971, 795270, 639337, 64410, -972949, -1670933, -1416523, -656300, -107001, 243966, 664821, 863437, 481512, -74807, -122962, 334992, 869643, 1440879, 2157666, 2575171, 2125563, 1082200, 285234, 11566, -137361, -320652, -205084, 345125, 1002572, 1498147, 1877033, 2161173, 2183042, 1794862, 972622, -131919, -980872, -878324, 123327, 943071, 696375, -159218, -558555, -310852, -30093, 77244, 356804, 762209, 780493, 372247, 82338, 95212, 38469]
37898C8469j73313J82380O11527M56653K2351K0705K58899N2674l95293k71462
37888H03590L47923N13303j6485l68131M311M77685K91715l48811o98404m79690
37878E27006l1630K17879J02093k36591m41953k70350P2493J26392k15139n24414
37868f74214l95409J2483J92308o357j32625K42694Q11656Q18367J35685m35155
37858E69433k74169J42490J9393m93961o31525l25155k03073l55583j87591L68103
37848a371638O01189K96308J55005M83299N49843r8669p08251n25990m3723r1243
37838g53870m24255k51295L57287O21764L08123p1545j24644R0548M16327O66113
37828H34553N61873J23152j65215l5095J01418j66194n81653p51775p93883q61230
$$ y = [38469, -134844, 47536, 659063, 1115716, 1138067, 1158772, 1417671, 1470345, 1075052, 803590, 1151513, 1664816, 1648331, 1280200, 1284511, 1762196, 2053911, 1705100, 1006696, 527006, 495376, 713255, 815348, 578757, 136804, -133546, -61053, 65339, -149800, -674214, -1069623, -1057140, -864832, -871189, -1003814, -761120, 50536, 868903, 1004588, 569433, 295264, 437754, 457147, -36814, -668339, -993494, -1196567, -1552150, -1739741, -1371638, -770449, -474141, -319136, 164163, 714006, 615337, -92914, -618904, -662627, -753870, -1178125, -1429420, -1072133, -450369, -142246, -213791, -338435, -247887, 168440, 834553, 1396426, 1519578, 1354363, 1319268, 1420686, 1254492, 672839, -78936, -872819, -1734049]
37818a734049o12248J32517P61375P04688M05925O00077J048202R19030J37747
37809B363264n58028p28395n68339k83000Q6537L05579J30855j92033k02455R8356
37799D52341L43069L79860K70493k8448m67280o72407m24906n8287R4101K28434
37789A16970N25216N93417J28787l63732k79684O2565p0187o13382q30504m48764
37779a179298Q8863L69504L58759J39919j37524j97428L5337K62581K83208K59186
37769B83107K37620l0804m68658n55323k21634p1751k85675k42826K31430L44561
37759g79953k19366n13460Q8531P12500M99951J22604M67419R24595N02869l08836
37749A496854m13626l0869j06474n11594m80336j89107k43252k53665L46865P50889
$$ y = [-1734049, -2346297, -2213780, -1452405, -747717, -341792, 258285, 1306487, 2225517, 2363264, 1805236, 1076841, 508502, 225502, 312039, 617618, 748473, 556440, 353985, 452341, 795410, 1175270, 1445763, 1417315, 950035, 277628, -147278, -205565, -111464, 116970, 642186, 1235603, 1364390, 1000658, 720974, 783539, 713352, 99970, -730534, -1179298, -1090435, -720931, -362172, -222253, -359777, -557205, -521868, -259287, 23921, 283107, 520727, 489923, 21265, -534058, -755692, -827443, -1113118, -1355944, -1124514, -779953, -999319, -1512779, -1424248, -711748, -211797, -89193, 378226, 1302821, 1805690, 1496854, 1083228, 1052359, 945885, 434291, -46045, -235152, -478404, -732069, -385204, 365685]
37739C65685o2029j200515r44569M52712J141476O04431Q9151J98931J82321k33813
37729E93781l03034J58639L95482J42441j28776l88091q78290r79220k7868J008027
37719d06909O77304m20595m85337L52011L12829o50124o33522O63777J140946
37710E50380q2729j093588m70721M76081K60364l48249j44187L03672N0309l17989
37700h16657Q6815P32125P44564M47164M13534K14396n58389j167252q74512j69266
37690i47478J97021L37317N19584M92789K74540L37767M09856l71532j519159
37681b69295j306837L63621J296694L35478p76277k94614Q58856J058893O44173
37672A910692O28931M75825o29649j641577j054657N13018J206810O67779L5843
$$ y = [365685, 303656, -896859, -1841428, -1388716, -247240, 357191, 446342, 645273, 827594, 593781, 290747, 449386, 844868, 987309, 858533, 470442, -407848, -1387068, -1414936, -406909, 270395, -150200, -635537, -283526, 29303, -620821, -1254343, -590566, 550380, 467651, -625937, -1096658, -620577, -360213, -708462, -852649, -548977, -498668, -816657, -729842, 2283, 746847, 1194011, 1607545, 1821941, 1263552, 96300, -778212, -947478, -750457, -413140, 106444, 599233, 873773, 1211540, 1621396, 1249864, -269295, -1576132, -1212511, 84183, 419661, -356616, -651230, 207626, 1266519, 1910692, 2539623, 3015448, 2385799, 744222, -310435, 202583, 1409393, 2077172, 2113015]
37663B113015j19504j67358k50113k28541l13678n90208n39184n790K21064k74029
37653a54326o77654l39146J67668L03585N28496J025487R76565J87999k04991
37644A813683J89570Q3362j017211j417746j4946J499129J190858j51734p02408
37635A472557n39302o74325p25640O3963Q29944M53754k54389M4902Q11790P59641
37625B242895J84896P5215J91973J09995O62858K116488K545253N66635j866764
37616F829444k113949p94798k70192o76188n72025j95444p26226j348980m49659
37607c18017J060183R79411k98378n19459L61389L22103q04198j015418J91162
37598d1222J052372O82362J08140m2618k63799m85605r3428M41367J96196l12136
$$ y = [2113015, 1993511, 1826153, 1576040, 1347499, 1033821, 443613, -95571, -101361, 119703, -154326, -831980, -1171126, -1003458, -699873, -171377, 854110, 1830675, 2018674, 1813683, 2003253, 2086615, 1069404, -348342, -363288, 1135841, 2326699, 2174965, 1472557, 933255, 258930, -466710, -402747, 427197, 880951, 626562, 671464, 1483254, 2242895, 2427791, 2503006, 2694979, 2804974, 3467832, 5584320, 8129573, 8696208, 6829444, 4715495, 3920697, 3650505, 2974317, 2402292, 2206848, 1480622, 131642, -318017, 742166, 1721577, 1423199, 903740, 1265129, 1587232, 783034, -232384, -41222, 1011150, 1693512, 1801652, 1759034, 1495235, 1009630, 916202, 1357569, 1553765, 1241629]
37588A241629p3213L25480q6708l96756N82891J604825Q40940p33870r58829k38893
37578B107496l12377o28821L02944J266853J50127j725233j414981M60318Q34003
37569A040329l55936n38310L79058J78867q75560m24404J129792J155573j00519
37560A588890M1J247677J052222k83385k18025O39246l74100k089094j035297
37551E28175J670325J755565l19357k21554J822143J420695j155961j089607J681117
37542F091541K268045N24896J348011M572600M950351L041188M579653P914739
37534C5291024N269188j711875k646982K732874L729663N74269O409301K0686031
37526G0333493K5805789K2745727L9887610Q1628351R6895147L8825232n9343934
$$ y = [1241629, 1168416, 1493896, 1407188, 1010432, 1593323, 3198148, 4039088, 3305218, 2346389, 2107496, 1795119, 1166298, 1469242, 2736095, 2886222, 1160989, -253992, 206326, 1040329, 684393, 146083, 525141, 704008, -171552, -595956, 533836, 1689409, 1588890, 1588931, 2836608, 3888830, 3605445, 3387420, 4026666, 3652566, 1563472, 528175, 2198500, 3954065, 3634708, 3413154, 5235297, 6655992, 5500031, 4410424, 6091541, 8359586, 8884482, 10232493, 14805093, 19755444, 22796632, 27376285, 35291024, 40560212, 38848337, 36201355, 38934229, 42663892, 43238161, 49647462, 70333493, 96139282, 118885009, 158772619, 240400970, 337296117, 376121349, 316777415]
37519C16777415j12864826q8486968l6543260j3863018j7718238j5441426j949571
37512B9910108M161861n38463k460481J433208J146107m957857p742992m850241
37504A6101250l157788m382336l172270P06093J486578j201674j715107P18998
37496E383744J112913j204721j605607M88537O83684j510202j790772L25876N38776
37487B422228j725542k033029O27888J935273K48404q45801K79062O06050j006630
37478E07903j331551Q29751J978491K70690j197953k36326O59560o09750j760414
37469h89599n16756J226642R87419j19400p829O06585J57281n79547j42728P70145
37459A492213O48011k71224q42735r45888r16767n00933K53749M92469M5650n8965
$$ y = [316777415, 203912589, 115425621, 78882361, 65019343, 47301105, 31859679, 29910108, 34071969, 33533506, 31073025, 32506233, 33652340, 28694483, 20951491, 16101250, 12943462, 8561126, 5388856, 6094949, 7581527, 6379853, 4664746, 5383744, 6496657, 5291936, 3686329, 4174866, 4858550, 3348348, 1557576, 1883452, 2422228, 696686, -1336343, -708455, 1226818, 1475222, 629421, 908483, 1514533, 507903, -823648, 6103, 1984594, 2255284, 1057331, 821005, 1480565, 870815, -889599, -1406355, -179713, 807706, 688306, 680477, 1287062, 1444343, 864796, 722068, 1492213, 2140224, 1869000, 1026265, 80377, -836390, -1337323, -1083574, -591105, -545455, -604420]
37449f04420N45690Q21327K39724k68788p6774J37338j00473k30543j5544n6532
37439C91005l98022l24620M1486j93320p01813j36481J249120J530355L31235
37430A788945l53893M66407J086866J79768p60891J15089J919075K373438J032151
37421G846955o23753j456327j516912j207339q26408o20451n30547k43494J70320
37412I92044K67443L3882j08107j34566l26356m33023p5062J88512m00799j152753
37402a148785p00714O01371R56651l718o64676j92014K62385j06542k91495N20429
37392g67108J288386Q38306j82947m55252K422K32015p2555m38503m73601j20149
37382a48986L92085M80235j80452q57165n57490L56686O17960J26133J4215N12263
$$ y = [-604420, -58730, 762597, 1002321, 733533, 656759, 794097, 693624, 463081, 447537, 391005, -7017, -331637, -290151, -483471, -1185284, -1321765, -72645, 1457710, 1788945, 1435052, 1901459, 2988325, 3168093, 2407202, 2522291, 4441366, 6814804, 7846955, 7223202, 5766875, 4249963, 3042624, 2216216, 1595765, 1065218, 821724, 992044, 1259487, 1293369, 1185262, 1050696, 724340, 291317, 216255, 404767, 3968, -1148785, -1849499, -1248128, -291477, -295195, -959871, -1151885, -889500, -996042, -1287537, -767108, 521278, 1359584, 1176637, 721385, 723807, 955822, 883267, 444764, -28837, -148986, 243099, 723334, 542882, -314283, -871773, -515087, 102873, 229006, 243221, 755484]
37372G55484N55950r4906k86001L30867M82368m20342j035188l01024P94793R17322
37362A699323L35175r4219m48518r24576q44779J19513Q97710N48143k16662k91191
37352G79919R5120J62000L4266J18915K0320o08603j038204n64280K07454L79858
37342d13235J94694K68833L34858j1586k28948K05986O33539L24682j29341Q7331
37332A266813M27283j1767p10972n79554R5040K10601j77462j46822K30797O5668
37322F69625n10469m16705M14383P63945Q9148o46953n22969J08933M07457J86812
37312E43207j57499k65683o2725K20489K17598p9140j92206J16085L61134O3983
37302G65243m50380n53732k30297O9507J11260p4774l66214l52606L85739J344984
$$ y = [755484, 1311434, 1216528, 930527, 1261394, 1743762, 1323420, 288232, -12792, 782001, 1699323, 2034498, 1940279, 1491761, 567185, -277594, -158081, 739629, 1287772, 1071110, 779919, 875039, 1037039, 1071305, 1190220, 1210540, 601937, -436267, -1000547, -793093, -413235, -218541, 50292, 385150, 373564, 144616, 350602, 984141, 1308823, 1179482, 1266813, 1694096, 1682329, 971357, 391803, 486843, 697444, 519982, 373160, 603957, 669625, 159156, -257549, 156834, 920779, 1009927, 362974, -159995, -51062, 356395, 543207, 385708, 120025, 57300, 277789, 495387, 416247, 224041, 340126, 701260, 765243, 314863, -238869, -469166, -399659, -288399, -363173, -729387, -1081993, -696254, 648730]
37292F48730J295911N4839q93296m04920O28859O63062k71176r28759p64299k42634
37282b13683K28304N00036L04369k44714l16641M25230R77081M97304j85837N3435
37272B024884O24144K53142o93302q41483k73476k87244r10866q15905J78394
37263g41712O52168N5277l81841J25339O27111K61337k68028q9387L07669P5946
37253F23879m92804n69410j30982K43598L49002L48780K57899M1623j39914j81905
37243C49766j64331o6067J70996K75955k0308l52849k01925J31767R807k59651
37233a26840J10530P03744K61243j035864j380987p4031J242972J033997M431
37224G39195m05070k50266l45915m53895J15978Q67308P56654P646k78672j3049
$$ y = [648730, 1944641, 1999480, 1106184, 701264, 1330123, 1993185, 1722009, 793250, 28951, -213683, 14621, 514657, 819026, 574312, 257671, 682901, 1659982, 2157286, 1971449, 2024884, 2649028, 2902170, 2208868, 1367385, 1093909, 806665, -104201, -920106, -741712, -89544, -34267, -416108, -290769, 336342, 597679, 329651, 240264, 547933, 623879, 131075, -438335, -569317, -325719, 23283, 372063, 629962, 671585, 531671, 349766, 185435, 119368, 290364, 566319, 546011, 193162, -8763, 123004, 132811, -126840, -16310, 687434, 948677, -87187, -1468174, -1542205, -299233, 734764, 739195, 334125, 83859, -262056, -715951, -599973, 267335, 1023989, 1031635, 752963, 739914]
37214G39914q1439n76955o18167k2915L05784k1307k31306J65083M71451L6855
37204A66998n86414n44843l2516J51824n2095K2456N58548Q83302M65843k89999
37194G43104n55713q6837N55080O74861J39901n68681q62641n71648l2212K88137
37184b76649K32897J5306j18382j61110k16112k36195q9201J65876L09216K94820
37174g9534L05355L89894L07870j02305n98038p45977l42763M14196R78015P44456
37164A271169k81157j114542p23800M97681R71334P1695q50232l85419P72927
37155B29656Q02279n20647j475169q77688L87425P98231J57629n46994n98648
37146a643926j81876J35419N6395k11292k00800K00715M63410R4284n19660n06200
$$ y = [739914, 658475, 81520, -536647, -559562, -253778, -275085, -506391, -341308, 130143, 166998, -419416, -964259, -996775, -844951, -897046, -874590, -316042, 567260, 1033103, 743104, 187391, 100554, 655634, 1330495, 1470396, 901715, 39074, -532574, -564786, -276649, -43752, -28446, -146828, -307938, -524050, -760245, -849446, -683570, -374354, -79534, 225821, 615715, 923585, 821280, 223242, -522735, -865498, -451302, 526713, 1271169, 990012, -124530, -848330, -350649, 620685, 692380, -157852, -543271, 229656, 1031935, 511288, -963881, -1841569, -1454144, -655913, -498284, -1045278, -1643926, -1825802, -1690383, -1633988, -1845280, -2046080, -1845365, -1381955, -1287671, -1807331, -2313531]
37136b313531K75328J036024J133675P00744J10816m49028o73004j88595O87240
37127C19669R24971M5058j083043j217863j90374J026837J397911O57973o09774
37118A271365j416883j152928j73941O00827P44155O17971N97670N50599K72742
37109A911577q5206l02075l75198l23749j27349N534j97590n20477m34762M5003
37099d04292L20215J64083r747j7815j99055n39930m45280J45697L69441j90844
37089h07527o67490k54848M61214N00465P6242M3729L12860Q5696n81412p13343
37079a544414M8340R08241J082210O41103L3770m55674n83935j78452M56228O94876
37069A102293L63500n7551j16828R1673J58423j86820q05799j114512n78844M43523
$$ y = [-2313531, -2038203, -1002179, 131496, 832240, 943056, 494028, -178976, -367571, 319669, 1244640, 1289698, 206655, -1011208, -1201582, -174745, 1223166, 1881139, 1271365, -145518, -1298446, -1472387, -871560, -127405, 490566, 1088236, 1638835, 1911577, 1826371, 1524296, 1149098, 825349, 698000, 703534, 505944, -14533, -449295, -404292, -84077, 80006, 70259, 52444, -146611, -686541, -1131821, -986124, -616683, -807527, -1475017, -1729865, -1268651, -768186, -691944, -648215, -335355, -249659, -831071, -1544414, -1496074, -587833, 494377, 1135480, 1169250, 713576, 129641, -48811, 407417, 1102293, 1465793, 1408242, 1291414, 1383087, 1541510, 1354690, 548891, -565621, -1144465, -700942]
37059g00942Q18969J29808n10661J2421R83779P88171n37619j165561j70243J093476
37049G41598J054288J41902j82361K24278J88554o84094j256718n31287Q55025
37040E51185J403736N84621o70166j173806p16975J7165M10547M18072K17135
37031A041514j61429o06321p07730k25259M04892N34017K10306Q2047L55662M73374
37021A401073P4533l18683n7620N92590P57775J42810o30446q86978o44906l64299
37011F5849k86617k44059K1373N06508Q71665P01589l7932p92900q65009j74758
37001b34291N78524O83118K08799j96824k05257j23058k22251j89862L55961J039697
36991A694556R89645N100j041158j251412p76280m29415m89412m58576j8807L81032
$$ y = [-700942, 118027, 247835, -262826, -250405, 733374, 1521545, 983926, -181635, -351878, 741598, 1795886, 1937788, 1755427, 1979705, 2168259, 1484165, 227447, -303840, 551185, 1954921, 2539542, 1869376, 695570, -21405, -4240, 406307, 824379, 1041514, 880085, 273764, -433966, -659225, -254333, 279684, 489990, 572037, 927699, 1401073, 1475606, 1156923, 1099303, 1691893, 2449668, 2592478, 1962032, 1075054, 430148, 65849, -220768, -464827, -443454, 63054, 934719, 1636308, 1598376, 805476, -59533, -234291, 344233, 1027351, 1236150, 1039326, 834069, 711011, 488760, 298898, 654859, 1694556, 2684201, 2689301, 1648143, 396731, -379549, -808964, -1298376, -1756952, -1775759, -1394727]
36981a394727K31340j61402n1391O15413J040296P01022J10262M0498L79918L68561
36971A879790j85699o41420n73002l69873m39184m44732Q3798Q20818J002690
36962A133186N03282p2128k62820j63147l3853l8699l10254p55981q66499k71999
36952a138912N57085P46823J48024n38605p31355m57476O2642O10889P62143K61043
36942B82301l36678k20331L98519M93352j25736m26694J89536Q97352P10856j61430
36932A701047q86523j135037r84178m56472J77977L67420J63018L33361R89140
36923B69753J093285J43867p51776n57491J1764j68890n98987j05624R07355J022533
36913A265789K20566j85124Q8203p3310r89632j495022r24949j26097J49529L31608
$$ y = [-1394727, -1163387, -1324789, -1376180, -760767, 279529, 980551, 1090813, 1131311, 1511229, 1879790, 1694091, 1052671, 479669, 109796, -329388, -774120, -690322, 130496, 1133186, 1636468, 1564340, 1301520, 1138373, 1104520, 1065821, 755567, -414, -866913, -1138912, -581827, 164996, 313020, -225585, -956940, -1414416, -1351774, -740885, 21258, 282301, -54377, -274708, 123811, 617163, 491427, 64733, 254269, 1151621, 1862477, 1701047, 814524, -320513, -1304691, -1761163, -1583186, -1215766, -1052748, -719387, 269753, 1363038, 1506905, 755129, 197638, 209402, 40512, -558475, -664099, 243256, 1265789, 1486355, 1301231, 1389434, 1316124, 326492, -1168530, -2093479, -2219576, -2070047, -1738439]
36903a738439P73066Q42790J92793l12108O0173O75307O52140K88579L17349N41589
36893B293239L34090j13691j58217J08032Q5810k06494k22841O8516J47577j03088
36883B232933k23568j8401J16410j30418m95627n41701k51183l5858k23957n97177
36873a68547n51049J20033P81617P02364Q4663k41095o4257M7085j30287j46844
36863D33683Q8924Q442m25538l34057N43390J019826K00666q89412p22016L68638
36853B92546P06349j72566r73160o55311L44439J104193J265085Q09433j52959
36844B568049j020939j054588m50590k03228n78289o83326N15O73186M98700n9252
36834c09762q5303K90913K81902j15581j83009J59614J60314m25898p74390k16868
$$ y = [-1738439, -965373, -122583, 70210, -241898, -181725, 493582, 1145722, 1434301, 1751650, 2293239, 2627329, 2513638, 2355421, 2463453, 2549263, 2342769, 2119928, 2188444, 2336021, 2232933, 2009365, 1990964, 2107374, 1976956, 1481329, 939628, 688445, 652587, 428630, -168547, -719596, -599563, 182054, 884418, 969081, 727986, 663729, 710814, 580527, 433683, 522607, 531049, 105511, -228546, 314844, 1334670, 1535336, 645924, -76092, 292546, 998895, 826329, -146831, -802142, -457703, 646490, 1911575, 2721008, 2568049, 1547110, 492522, 41932, -161296, -739585, -1422911, -1422396, -749210, -250510, -309762, -395065, -104152, 177750, 62169, -120840, 38774, 199088, -226810, -1001200, -1218068]
36824a218068O83223Q83184K71210k94823j89986K98357N23202K54983k54564
36815I56718o47260o55707j67025N82525R78498N62932l34841q16205m27053L05806
36805C38388N84221L39640J43239K43285K21126k38299p17191o24248j08717J29785
36795C11229r2148j57765L31897P88367M09229n67284j045180n19671K78869M14401
36785A51944r3675m97672l44557J28428M03956J78903l55433n30006J56116J171647
36775C69651J266627R8518j046190q67254J50821N29274q075l66735k0676K62880
36765C68841n6218l65092j17408J67392n0509k59887J47683O37287L47689m02495
36755D17283n71913m1145L10673N0720l09951k94278m7591J59135K73664K15035
$$ y = [-1218068, -534845, 348339, 619549, 324726, 134740, 433097, 956299, 1211282, 956718, 309458, -346249, -513274, 69251, 1047749, 1610681, 1275840, 459635, 32582, 338388, 922609, 1262249, 1405488, 1648773, 1869899, 1631600, 914409, 290161, 181444, 311229, 219081, 61316, 393213, 1181580, 1590809, 1023525, -21655, -541326, -262457, 151944, 58269, -439403, -783960, -655532, -251576, -72673, -428106, -958112, -801996, 369651, 1636278, 1734796, 688606, -178648, -27827, 501447, 493372, 126637, 105961, 368841, 312623, -52469, -169877, -2485, -52994, -312881, -165198, 472089, 819778, 417283, -154630, -195775, 114898, 165618, -144333, -438611, -486202, -327067, -53403, 161632]
36745A61632o9088k54899J6867M44064L61907k38674o52472m61170N3065N07772
36735a30996P45398N61170j01591o21367k45597O50037P87298j87722j051374
36726D05256p14320K85984P19872L63284q9523k84346m57440o85249p10000m57188
36716a623670j31641J28281K50124J00497j77890k8893P20995J257259P26053
36707A221115m20140q76377k45632N07153M60937k20123q55037j069206p45885
36698b243195R4043R45163J016170K56240m01264k99214N2825q3694m89431n01647
36688a654004j77061l0544o415K84220N73322L16681n0610M60746J537243J527155
36678B780733j38979j765776j595516k01479M94126j00298q44878p72986q6834
$$ y = [161632, 92544, -162355, -145488, 298576, 660483, 421809, -230663, -691833, -638768, -130996, 614402, 1175572, 1073981, 452614, 207017, 857054, 1644352, 1456630, 405256, -309064, -23080, 696792, 1060076, 970553, 686207, 228767, -456482, -1166482, -1623670, -1755311, -1627030, -1376906, -1276409, -1454299, -1483192, -762197, 495062, 1221115, 800975, -75402, -321034, 186119, 647056, 426933, -428104, -1497310, -2243195, -2149152, -1203989, -187819, 68421, -332843, -632057, -579232, -662926, -1152357, -1654004, -1831065, -1861609, -1868024, -1583804, -1010482, -693801, -744411, -283665, 1253578, 2780733, 2641754, 875978, -719538, -921017, -426891, -527189, -1372067, -2145053, -2231887]
36669b231887O75996J250814J284324M74989o24519r11092k14707L85549J38600
36660B28067l45675j96192L67006N14658R5380l15188l24491l7000L04390M57282
36650G48237K04187k75965l47323K53243Q29551N78978k19448n79608k42576N5683
36640A004959j62308l82578K041O46801O86551k6483o74558n22033J88168O12383
36630A372943L44930k55995o90542q10157n82605P5695Q31994Q47447j36030j029147
36620c1467o75416L33961L46880p83090j264842o4024J398269J307467O4644n72569
36610E9813j79905J08302k65566n39340j53430L56776L77128P8117j33821j89295
36600d81221o3720L16204O07267K64091n03754p65230j83525M58341M23538j9974
$$ y = [-2231887, -1555891, -305077, 979247, 1454236, 829717, -81375, -296082, 89467, 228067, -117608, -313800, 53206, 567864, 663244, 348056, 23565, -13435, 290955, 748237, 952424, 676459, 329136, 582379, 1411930, 1990908, 1771460, 1191852, 949276, 1004959, 842651, 460073, 462114, 1108915, 1795466, 1768983, 1094425, 572392, 760560, 1372943, 1717873, 1461878, 771336, -38821, -621426, -545731, 286263, 1133710, 997680, -31467, -706883, -372922, -26042, -809132, -2073974, -2137998, -739729, 567738, 632382, 59813, -120092, -11790, -277356, -816696, -970126, -613350, -236222, -158105, -291926, -481221, -544941, -228737, 378530, 642621, 138867, -626363, -809888, -351547, 71991, 52017]
36590E2017k54376k41093k52808k31986N583L04434L88862K66553Q0256j32523
36580a5081k80777j90573M3532Q7834o2695l3076K26428K71795l2146j84166J01030
36569f7895L46807R1566l67130n14147l64806j61471J19901M05702K58546l62218
36559f15145o43921l969Q68523R26131L06696K284K74638M38534J21831k80412
36549A395190m62086n72442o00217k89312J43076Q4123m14922n22977O5720N56269
36539f17578K75442l05650l88987l0110K09891K70080M64865O96915N74786J48806
36529A298460j52637k19395k84309l56485k43938o7243j18022k48503q2343J67262
36519c07153j15127p89724q61202N9576J001759R64774L22662R8798L55678K90200
$$ y = [52017, -202359, -443452, -696260, -928246, -922663, -618229, -229367, 37186, 117442, -15081, -295858, -486431, -442899, -355065, -417760, -450836, -224408, 47387, 15241, -168925, -67895, 278912, 370478, 3348, -510799, -875605, -1037076, -917175, -511473, -252927, -615145, -1259066, -1263035, -394512, 531619, 838315, 840599, 1115237, 1553771, 1675602, 1395190, 933104, 360662, -239555, -528867, -385791, -301668, -716590, -1239567, -1173847, -617578, -342136, -647786, -1036773, -1066883, -856992, -586912, -122047, 574868, 1149654, 1298460, 1145823, 926428, 642119, 285634, 41696, -25547, -143569, -392072, -474415, -307153, -422280, -1212004, -2073206, -2013630, -1011871, -47097, 275565, 374363, 730041, 1020241]
36509A020241l04130p14926n24876k05279k05751k41905P7721N21794O12689L08876
36499C44454q9079l47331k91043J87332P47420O76571j91218j014414r05986m0812
36489i24106O97642Q62607O71194L53644o7856m45061n37767l87889k19747k9820
36479b7159L02635O01130N40661J40578k84325n48046o12648m14073q3896l6811
36469d21954l33063l31177L78308J100919R33269J74783j61106J4268r2522n57509
36459G04216n34470J33732M56158n8435n46169k63007K29334K01915N4979M34272
36449H12525Q66924M63707n11807r23015l91069L17303M33657o6472p74895j226699
36439i99841j049427l32079K51642J96519j35229p5394L35407M94560K12968q9451
$$ y = [1020241, 716111, 1185, -523691, -728970, -934721, -1176626, -1098905, -577111, 35578, 344454, 255375, -91956, -382999, -195667, 551753, 1228324, 1037106, 22692, -883294, -924106, -226464, 636143, 1307337, 1660981, 1593125, 1148064, 610297, 222408, 2661, -27159, 275476, 876606, 1417267, 1557845, 1273520, 725474, 112826, -301247, -385143, -421954, -755017, -1086194, -707886, 393033, 1326302, 1501085, 1339979, 1354247, 1261725, 704216, 169746, 303478, 759636, 701201, 155032, -107975, 121359, 323274, 378253, 812525, 1679449, 2143156, 1631349, 708334, 317265, 634568, 1068225, 1001753, 226858, -999841, -2049268, -2381347, -2129705, -1933186, -2068415, -2143809, -1808402, -1313842, -1100874, -1190325]
36429a190325q7304J11335K95781L54673J97787j24781l20206k20125p8303j49844
36419a211312k25625p817L17422L74551K41177K80973N06911O07644M72575K47879
36409A604378K0739j53196j15620J05463J41927j58595l59329j10828J79214k7768
36399A126385m51143m08526M7800K13385j22756l89121j72017K01871K02342k20231
36389B7989o21952m99494K10569R01804Q40211J47285k20453J92803O39571L36424
36379A954757l37944n74662m38241m87389o13272l41957Q4102P4276j32307J56419
36369f56218P21625O94411R3659j94354j499r5703o32788p53354j07001M85214
36359d46008L93986P2767N2729J09021O1M5899L66548M47064M5209l05878k14099
$$ y = [-1190325, -1277629, -1166294, -870513, -515840, -318053, -442834, -763040, -983165, -1061468, -1211312, -1436937, -1444754, -1127332, -752781, -511604, -230631, 276280, 883924, 1356499, 1604378, 1625117, 1471921, 1356301, 1461764, 1603691, 1445096, 1085767, 974939, 1154153, 1126385, 675242, 266716, 314516, 527901, 405145, 16024, -155993, 45878, 248220, 27989, -593963, -1093457, -882888, 18916, 859127, 1006412, 785959, 978762, 1618333, 1954757, 1616813, 1042151, 603910, 116521, -496751, -838708, -754606, -680330, -812637, -656218, 65407, 759818, 853477, 659123, 657624, 561921, -70867, -824221, -931222, -446008, -52022, 20745, 73474, 182495, 182556, 228455, 595003, 1042067, 1087276, 781398, 567299]
36348E67299L808J16036L82295O97086L98386m75149q50567k58321L29276J21471
36338A031620k25962o410Q7409p16055j498332q40332Q28120J706741J157510
36329A524309K51840p3052K2516J64542K83451J30793n20801j059259n84431N39384
36319F79292Q70776m7123r60586p26680J74353N74770K07623l42348o13481m98984
36309f82388j2050N33345N21716j64177o95020k86433O20870Q52275P0078q14468
36299e6252q81422k68293K45845K64147N461k12351k90246k20362j8237J79968
36289a251742K53309L47656O35352P99619K95502o64233j028284l04780N72768
36280c44833N26070m7202M8195Q37183J128801M23148m33920p47096q26856q96625
$$ y = [567299, 571107, 687143, 1069438, 1766524, 2164910, 1689761, 839194, 580873, 910149, 1031620, 805658, 799248, 886657, 170602, -1327730, -2168062, -1339942, 366799, 1524309, 1776149, 1703097, 1725613, 1890155, 2173606, 2304399, 1783598, 724339, 139908, 679292, 1550068, 1502945, 542359, -184321, -9968, 564802, 772425, 430077, -183404, -682388, -694438, -161093, 360623, 196446, -498574, -785007, -164137, 688138, 758216, -56252, -937674, -1205967, -960122, -695975, -690514, -902865, -1193111, -1413473, -1431710, -1251742, -998433, -650777, -15425, 784194, 1079696, 415463, -612821, -917601, -344833, 181237, 134035, 182230, 1019413, 2148214, 2571362, 2137442, 1390346, 563490, -333135]
36270c33135m60237N14067J002876M58754j56937P0394M57761j5868q31546p99587
36260i3458j04409J38468j04274P2009N88623M05654m64210p50762j04934K26154
36250a91139m42223r81194l24230P24909P73429k157k74204L70408R80786P13225
36240A347610j79656q79656q97024l55578K32812M36928L10726K30418L01769
36231E48349K48951l2224k46690j96150o1428J3232J64454M08483M59706K18821
36221A525504O474M8343J52004J17111j506k27044o78952j037117o98723J71953
36211f21953N39917m034m46512J56061J100393J002752j17689r14507p32633l44793
36201c82998m76751o96407l10192M21506O72916K67802j32815K7913N18336O62907
$$ y = [-333135, -793372, -279305, 723571, 1182325, 1025388, 1095782, 1553543, 1537675, 706129, -93458, -197867, -59399, -163673, -91664, 496959, 902613, 438403, -312359, -417293, -191139, -633362, -1614556, -1938786, -1213877, -440448, -442605, -716809, -346401, 634385, 1347610, 1167954, 288298, -608726, -964304, -731492, -294564, 16162, 246580, 548349, 797300, 765076, 518386, 322236, 260808, 274040, 438494, 846977, 1306683, 1525504, 1531978, 1580321, 1732325, 1849436, 1847930, 1620886, 941934, -95183, -793906, -621953, -82036, -86070, -532582, -376521, 723872, 1726624, 1608935, 694428, -38205, -382998, -859749, -1556156, -1866348, -1444842, -771926, -504124, -636939, -609026, -90690, 572217]
36191E72217J72241m93421o23600r2509M76957M95786J24550o6702M9720P7793
36181F93032j95854m95915n47972m35996k93691m0280L06859L98651K578n31154
36171a139742o48029l28236m7199j1450J28516O28468J076363Q34763n2903p53914
36161c13363n52396L19889R10720N66987l78371r86255p41536q0525K12063k439
36151a045226j34663K02325O24179O23154L72110L48834M30730R1369n43921o69534
36141B99357o7157L87478l7214q40593j054136n67649J005L24816M64396K75533
36131h14164l65744q76634m59352O28354J175651O30462j87863l28829P8458L42712
36121a76949L11018L05621L47718J33743l12025n23325k30384K35431L45224K5247
$$ y = [572217, 744458, 251037, -372563, -465072, 11885, 507671, 632221, 565519, 615239, 693032, 497178, 1263, -546709, -982705, -1276396, -1316676, -1009817, -611166, -608588, -1139742, -1787771, -2116007, -2163206, -2174656, -2046140, -1417672, -341309, 493454, 440551, -313363, -865759, -545870, 364850, 931837, 553466, -432789, -1174325, -1254850, -1042787, -1045226, -1179889, -977564, -353385, 269769, 641879, 990713, 1421443, 1512812, 968891, 299357, 232200, 619678, 582464, -258129, -1312265, -1879914, -1878909, -1554093, -1089697, -814164, -1179908, -2056542, -2515894, -1887540, -711889, -81427, -269290, -598119, -519661, -176949, 134069, 439690, 787408, 921151, 609126, 85801, -144583, 90848, 436072, 461319]
36111D61319k79419k18240k9200j62714m88394l67247L03077P07451K66959l69741
36101a76149k40641M28020N86016J7093m46161l78596k89869m47004l15518L23767
36091i39042P43844M38225J6420J52087M35368J69817l59279m20821j46521k36017
36081a45919o45128o37577p0150L63803K73634R6275K58926N08559L75981j66495
36071B11909p56627j025017p94080j76257M45818P40228P08041N03653J81824
36062C9492j33621j31359K44224N05245K42761k09745k57697M2098J58047L000
36052E02445q706K19159K74391m4744m13225n15426m02638k17124k1291L9151
36042e88008j30815k52412J1018M06632L44671j54597m31247k41370j08945l21026
$$ y = [461319, 181900, -36340, -65540, -228254, -716648, -1083895, -780818, -73367, 193592, -176149, -416790, 11230, 597246, 614339, 168178, -210418, -500287, -947291, -1262809, -939042, -195198, 243027, 259447, 411534, 846902, 1016719, 657440, 236619, 90098, -145919, -791047, -1428624, -1498774, -1134971, -861337, -765062, -506136, 2423, 378404, 211909, -544718, -1569735, -2363815, -2540072, -2094254, -1354026, -645985, -142332, 39492, -94129, -225488, 18736, 523981, 766742, 556997, 299300, 341398, 499445, 502445, 493739, 712898, 987289, 942545, 529320, 13894, -388744, -605868, -627159, -588008, -718823, -971235, -960217, -553585, -208914, -363511, -794758, -1036128, -1145073, -1466099]
36032a466099l17353L68010J136122J015951N1555o90675m71065L10481P61153
36023F98080N55174J07344j24099j86827l55472n17644k61623L34371N24505p2895
36013G00914p22752n36177J36595J95784m32606o41332r986L80986k92268j078651
36003b299493n94722P97435J454416Q30268P7322J52864N46150L73802k28754
35994A109288n30795l88097k31602k15336q3670K40647N17400O01441N24834K17038
35984A761148l64630q26371o21435R5377M39050m4851o54102m72169K78826N00186
35974I1029k06625r26898o74436K97848R12256O79222J30500q4653K3760P3309
35964C15312o3493k30581l35535l89752l25110r3233J02231M686k43423k06516
$$ y = [-1466099, -1783452, -1415442, -279320, 736631, 788186, 97511, -373554, -63073, 698080, 1253254, 1360598, 1236499, 1049672, 694200, 176556, -85067, 249304, 773809, 700914, -21838, -558015, -421420, -225636, -658242, -1299574, -1309560, -928574, -1220842, -2299493, -2894215, -2096780, -642364, 187904, 265226, 418090, 964240, 1338042, 1109288, 578493, 190396, -41206, -256542, -340212, -99565, 417835, 1019276, 1544110, 1761148, 1396518, 570147, -51288, 44089, 483139, 438288, -215814, -687983, -409157, 91029, -115596, -1042494, -1716930, -1419082, -506826, 172396, 302896, 218243, 242003, 315312, 251819, 21238, -314297, -704049, -1029159, -1122392, -1020161, -1015475, -1258898, -1465414]
35954a465414J72168L96598J73460n3160K21203O59790N20588j24979m12952o6920
35944B0382J09806m23445r18468m33017O23342J005871M17623k17310k16440P7783
35934D6127J15145j11842l71442n19355l16216L58544R38734O45588k35573m98685
35924E1025J87238O78348J64278n20133l37993J73608j45723j015437j073416
35915a838205o0493P79364N86747o3479k93706n2032L04094O77628R81083Q68269
35905A889270K20242n27614r09440r35770q27830n88683q9688O22948J224991
35896G8426J220353L46954q52773j230075l43469P57211P84200m2292m27828K190
35886B92897L03117r0588n05878l15669L5798k5591j63070J51201N84933M83349
$$ y = [-1465414, -1293246, -896648, -723188, -776348, -555145, 104645, 625233, 500254, 87302, 20382, 130188, -293257, -1211725, -1644742, -1021400, -15529, 402094, 184784, -31656, 46127, 161272, 49430, -322012, -841367, -1157583, -799039, 139695, 785283, 549710, 51025, 238263, 916611, 1080889, 560756, 222763, 396371, 250648, -764789, -1838205, -1898698, -1119334, -532587, -596066, -889772, -941804, -637710, 39918, 1021001, 1889270, 2109512, 1581898, 672458, -263312, -1091142, -1679825, -1769513, -1146565, 78426, 1298779, 1645733, 792960, -437115, -780584, -23373, 760827, 718535, 290707, 292897, 596014, 505426, -452, -316121, -280323, -305914, -468984, -317783, 267150, 750499]
35876G50499k9382k91621r9250K35028M89332N49222J63027o17535j047986n03772
35866d02438M97287Q44949L24417k12394j95528o5733l89604r10973r62615m43913
35856a916545J21593L76516N17830P99205R96950O90276l5428n51417m65437r0240
35846D43303J03760J45918K78484L42771L7303m03856m57695j56674J2659J3415
35836C59388K49975O03957M28132k38553m51976J43065N61276m5977r87991j035940
35826d14644k25719L50517J95569j46869j62480J2675R2352P5857P9294J83096
35816C9648M38477O91221N80080P0131l01334j39832J83862J13394k69059n51100
35806H55488p02872q31491o65707p0918L33081r270m93390j37987P46577Q65431
$$ y = [750499, 721117, 429496, 330246, 565274, 1054606, 1603828, 1766855, 1149320, 101334, -402438, 94849, 939798, 1264215, 1051821, 856293, 790560, 400956, -510017, -1472632, -1916545, -1794952, -1418436, -900606, -101401, 895549, 1585825, 1550397, 998980, 533543, 443303, 547063, 692981, 971465, 1314236, 1351539, 947683, 489988, 333314, 345973, 359388, 609363, 1213320, 1641452, 1402899, 950923, 1093988, 1655264, 1609287, 621296, -414644, -640363, -289846, -94277, -241146, -403626, -390951, -298599, -222742, -143448, 39648, 478125, 1169346, 1749426, 1819557, 1518223, 1378391, 1562253, 1675647, 1406588, 855488, 152616, -678875, -1344582, -1415500, -1082419, -1091689, -1585079, -1723066, -976489, -111058]
35796a11058n9863p99839m06382N61923J010255O25898j75032q40886q64774j18987
35786a178745O69382N44216k91878n92949Q1330O56171K52763m37990l51643K75963
35776c73380N00114K77842L13549O74530P22459K95899q2750j83973l17534n28202
35766A298554m30699k8588J05723k54770n85591m38817q5864K2425n7122R59K30207
35755b23583M08071M05463K45404J9849j09004o9193r5347m27275p61388n37145
35745a144148Q1778J85760n33708j098679n73377M69614P14694L8131l69181J55035
35735b074081Q38639P93292L14657J90508L76501K23340l08392n55898k67888
35726d69322k3843k99153p06491n69981R2010N93750M78006J8573k23157p0464
$$ y = [-111058, -170921, -970760, -1377142, -815219, 195036, 820934, 645902, -194984, -1059758, -1178745, -509363, 34853, -257025, -849974, -768644, -112473, 140290, -297700, -649343, -373380, 126734, 404576, 718125, 1392655, 2115114, 2411013, 2328263, 2144290, 1826756, 1298554, 867855, 839267, 944990, 690220, 104629, -334188, -420052, -397627, -454749, -453790, -223583, 184488, 589951, 835355, 855204, 746200, 677007, 581660, 154385, -607003, -1144148, -1062370, -876610, -1410318, -2508997, -3082374, -2612760, -1898066, -1859935, -2229116, -2074081, -1235442, -442150, -127493, 63015, 439516, 662856, 354464, -201434, -469322, -493165, -792318, -1498809, -2068790, -1976780, -1383030, -905024, -886451, -1109608, -1180072]
35716a180072K28435M78680P21835Q69815N52789k94929r79859p74068m726K96250
35706h5850r1047k62100K89335P90103M86857q0039o8842J73896j43246o17835
35696C91232k63392N60875N36488k78240l39136P28185J235015R6306j310219
35687A357114j249811j95139K62719k0989r164L97315L22330k79873m65693J4731
35677A33540L10314q0789o42477p87920m62259K44021J082457J297266L86836
35668A480989q20768j021091l28025j1011l25932j68331P91778J283562M70352
35659A351523o59350q93584n25169l85971k68543L91880J077192Q15126j80745
35650G22359p17423k59118O06802J125236R57934R5231r73822j285776m63999
$$ y = [-1180072, -951637, -472957, 248878, 1118693, 1671482, 1376553, 396694, -377374, -382100, -85850, -176897, -438997, -149662, 640441, 1127298, 1047259, 978417, 1152313, 1009067, 391232, 127840, 688715, 1225203, 946963, 607827, 1336012, 2571027, 2667333, 1357114, 107303, -87836, 174883, 153894, 144730, 542045, 864375, 584502, 118809, 133540, 443854, 363065, -279412, -1067332, -1529591, -1285570, -203113, 1094153, 1480989, 660221, -360870, -688895, -699906, -1025838, -1194169, -402391, 881171, 1351523, 692173, -201411, -726580, -1112551, -1381094, -989214, 87978, 903104, 722359, 4936, -254182, 352620, 1477856, 2435790, 2531021, 1557199, 271423, -192576]
35641a92576M97812M01751m45676o82897P1129P18617L66014m84574p96416l11462
35631h58278M08178P39420M65969j43508n16593l36918L3538M5761k06285j76116
35621e44832J74173K99550N1347l6695K78740M56055J27499j40944K57857Q38565
35611A761315O42504k64231q30239n77173k14667l87536o22540j67279O53354
35602f492P73443m1540p80221n66840J84515M34828p0674o03435n20567k3696
35592a220679K44090K8288l03706k60991J64308M67271K75691r6640l9934M27368
35582c14934N94996J10955m27157l47401Q5858J25691l15224o55079n95996l85208
35572b123499j85669J24371M82059N97458M63310L62390L38929K11496P7236J74805
$$ y = [-192576, 305236, 706987, 261311, -421586, -350457, 368160, 734174, 249600, -546816, -858278, -450100, 289320, 755289, 611781, 95188, -241730, -208192, -162431, -368716, -544832, -370659, -71109, -19762, -56457, 222283, 678338, 805837, 664893, 922750, 1761315, 2403819, 2139588, 1309349, 732176, 517509, 129973, -492567, -659846, -6492, 766951, 725411, -54810, -621650, -437135, -2307, -72981, -676416, -1196983, -1220679, -976589, -948301, -1252007, -1512998, -1348690, -881419, -605728, -702368, -742302, -314934, 280062, 391017, -36140, -383541, -297683, -171992, -487216, -1142295, -1738291, -2123499, -2309168, -2184797, -1702738, -1105280, -641970, -279580, 59349, 270845, 348081, 522886]
35562E22886K92923M4804k92854p2856N16530M97020l94857j189001j054289l22610
35552a452304K88180O22504P60226N57378P9874k11033j95213k90827n22891l05188
35542f69294L75651O21910J09906k38397J08510K35512n17902j054257k18326
35533a246687J053024J069475J08063j87023L22966J43199j099758j870035j144749
35524b851525J76028R09020J055273R24721K91924o70435r14715l3893P62278
35515c51324K62556r40462j313169m67642O11317J031104P76921K56275j70867
35506c05291k72649q7339O2392j0126j09858m7250N3259P9709K00642N08456P23234
35495G95179N56011J22527k21088k49626L044K47976J26662k93040m05935P1954
$$ y = [522886, 815809, 860613, 567759, 494903, 1011433, 1508453, 1113596, -75405, -1129694, -1452304, -1164124, -541620, 218606, 775984, 855858, 644825, 449612, 158785, -364106, -669294, -293643, 328267, 438173, 199776, 308286, 543798, 25896, -1028361, -1246687, -193663, 875812, 983875, 796852, 1119818, 1263017, 163259, -1706776, -2851525, -2675497, -1766477, -711204, 213517, 505441, -164994, -1079709, -1113602, -351324, -88768, -1029230, -2342399, -2810041, -2198724, -1167620, -390699, -134424, -305291, -577940, -665279, -602887, -613013, -722871, -770121, -716862, -637153, -436511, 71945, 795179, 1351190, 1473717, 1252629, 1003003, 1006047, 1254023, 1380685, 1087645, 681710, 753664]
35485G53664M48654r859q08258q88865l50742k32783o04558l90637N82065R89761
35475e11558J88569n63161j19615O93017N53852j74473k77156J81863K20153j37193
35465E4298J4459O41753O88922j41672r13836r38444n47704j97823J38753M61533
35455g39761N40172M14711L33613J87209k01324l82359J13603O21506K5793j351656
35445d38493j860972p94716P05731J386484J264835P91669m4684j011191j218056
35436a219393l83249M31450L04605j81052m1118M92235O00058L97449N23224P33099
35426A657308L01743m54796m97614J30089K50236m70763q84055k48463M79380
35417B63065J26112q28665r53589R006Q12399N13580k87562m07742K61240O74207
$$ y = [753664, 1202318, 1192459, 384201, -504664, -855406, -1088189, -1692747, -2083384, -1501319, -511558, -322989, -886150, -1005765, -312748, 241104, 66631, -210525, -28662, 191491, 54298, 68757, 710510, 1399432, 1257760, 343924, -594520, -1142224, -1340047, -1201294, -739761, -199589, 215122, 548735, 735944, 534620, 152261, 265864, 887370, 913163, -438493, -2299465, -3094181, -2388450, -1001966, 262869, 1054538, 1009854, -1337, -1219393, -1602642, -1171192, -866587, -1047639, -1088757, -596522, 3536, 400985, 924209, 1657308, 1959051, 1504255, 1006641, 1136730, 1386966, 916203, 32148, -216315, 263065, 389177, -439488, -1393077, -1384071, -571672, -58092, -345654, -753396, -492156, 182051]
35407A82051J65608n38636k85675Q25631J459489Q48688j98723n69513l92328
35398A496592n04349r13130q68929k60501J83718J25158j5957n1575k96631o18114
35388a723718l72207L33934N41036J15537J68423J014520J209224j20394j391723
35379b25368p69195Q35041J085167j13413o58033J72887O90234j52670j018605
35370a53955n42190N17636P82549L37058p0038n46246j293910j476481m37930
35361b883507Q24709R80684M26897M44186R31222P11996k72425q45771n89298
35352b71307l10963m27143l89864N1168L86008M05442M72744N23569O2939o19110
35342a16517n70461J68418M16878j98046n75075n4751M27658K0108m95190l560
$$ y = [182051, 347659, -190977, -476652, 348979, 1808468, 2657156, 2458433, 1888920, 1496592, 992243, 79113, -789816, -1050317, -866599, -741441, -757398, -808973, -1105604, -1723718, -2095925, -1761991, -1220955, -1105418, -936995, 77525, 1286749, 1166355, -225368, -994563, -159522, 925645, 812232, 154199, 327086, 1017320, 864650, -153955, -696145, -178509, 604040, 941098, 871060, 324814, -969096, -2445577, -2883507, -2058798, -1078114, -651217, -207031, 724191, 1436187, 1163762, 317991, -271307, -582270, -1009413, -1399277, -1348109, -962101, -556659, -83915, 439654, 502593, -116517, -686978, -518560, -101682, -299728, -874803, -929554, -501896, -481788, -976978, -980538]
35332i80538J041436J271279L71337p03868j096586p13569J46960J027517J390325
35323A754293J073529M61654j32735p86226j343504j201642k57963O26866P45761
35314I40033M63472L87309L66011P6699j44278K1947L7520o30738j363784j184167
35304a029976k74552L55713L53693J19038k11661p19622r14734k27320Q07845
35295a741576J055031M60841N9496K41878K65230k57763o02994j73663N08590
35286a84930O54970K89194q2525k59333l00603k05143o1051q6681k28973j78039
35276f43114J5808q4747m74907n16920N0957N71674M42015M4921Q3402M42865
35266f8046M53471L1306k11980J2172K33742R470l91068m33979j14274J26317
$$ y = [-980538, 60898, 1332177, 1703514, 999646, -96940, -810509, -663549, 363968, 1754293, 2827822, 3289476, 3156741, 2370515, 1027011, -174631, -432594, 194272, 940033, 1403505, 1790814, 2156825, 2233524, 2089246, 2111193, 2148713, 1517975, 154191, -1029976, -1304528, -948815, -595122, -476084, -687745, -1407367, -2322101, -2549421, -1741576, -686545, -225704, -166208, 75670, 340900, 83137, -519857, -693520, -184930, 470040, 759234, 676709, 417376, 116773, -88370, -149421, -236102, -465075, -643114, -627306, -712053, -1186960, -1703880, -1652923, -1081249, -639234, -594313, -510911, -68046, 385425, 416731, 204751, 216923, 450665, 460135, 69067, -364912, -479186, -352869]
35256c52869J25309J82284M67184O77541M98158M8704m01090p96538j021476p14780
35246a287573N7661M20051j66281p71677j75621J052971J134655j61054j039908
35237i36776m86147K67171N1968k62667L72926R73066J71088j099111q80762N48452
35227a280792J084977J79342n67478k53264J92293J05043J27596N15844M31425
35218E34986k62471l85904M33701Q15223r1725j054203p75023M3312R3164l74352
35208a023292l27398J44349K73230J61349L79366O44869L31645k00874j40887
35199B42357L21415L55580l6883j49457J00824J59120m6057p5497P6479L3725
35189I81606j20690l4623N7540l31518q88995p91223j706O52299O82397L58542
$$ y = [-352869, -227560, -45276, 421908, 1099449, 1597607, 1646311, 1245221, 448683, -572793, -1287573, -1229912, -809861, -976142, -1747819, -1923440, -870469, 264186, 103132, -936776, -1422923, -1155752, -1103784, -1366451, -993525, -20459, 150629, -948482, -1829244, -1280792, -195815, -16473, -583951, -837215, -644922, -539879, -412283, 103561, 534986, 272515, -113389, 320312, 1135535, 1043810, -10393, -785416, -742104, -648940, -1023292, -1350690, -1206341, -933111, -771762, -392396, 252473, 584118, 383244, 242357, 563772, 919352, 882469, 733012, 833836, 992956, 946899, 871402, 947881, 981606, 860916, 826293, 883833, 552315, -336680, -1127903, -1129609, -477310, 205087, 563629]
35179E63629k1520m09424n70050k29101K90713L44059r5517m62273n11195m72824
35169a573503l79332m5183K98905J84410k16447j88398M14777Q84524O60628j3950
35159B6431o01094q53272p39920l05734K32345O07518P55637O82058L00156k16475
35149a12350l00640K06584N21227o1220r72270j097810m04906J81561L20532N05578
35139a213714Q13127O65287N6342k02589J36522K62671k83119p53875m28560K20650
35129g27258L71392J01128l4809m7821k46005l75945K6066O42060O18861j70051
35119A57618q25681n61165L59890J038425R69822M24633m9829k66638m39041o73350
35109A34684o94727k73749K84532M41195J46819j14477j2951K65639L96313K88719
$$ y = [563629, 542109, 132685, -437365, -666466, -375753, -31694, -127211, -589484, -1100679, -1573503, -1952835, -1998018, -1699113, -1514703, -1731150, -1919548, -1504771, -620247, 40381, 26431, -574663, -1427935, -2167855, -2473589, -2241244, -1633726, -878089, -196031, 104125, -112350, -412990, -206406, 314821, 253601, -718669, -1816479, -2221385, -2039824, -1719292, -1213714, -400587, 264700, 321042, 118453, 254975, 517646, 234527, -519348, -947908, -727258, -355866, -254738, -289547, -337368, -583373, -959318, -933252, -291192, 327669, 157618, -668063, -1229228, -869338, 169087, 1138909, 1563542, 1513713, 1247075, 808034, 134684, -560043, -833792, -549260, -108065, 38754, -75723, -88674, 176965, 573278, 861997]
35099H61997K325l55825n25094k20418M38553Q63262N64961k98515j026732j000198
35089f95684k65978M47987M69901n032j58435K65259N23145j105p70637q26537
35079a017116j48267M74228O71202P64914R06748P83370K83151k29512m40713
35070B048005l69484j23471J13788l4119o63361j149277q64488j70307R1090q2140
35060a203764K6060M99403O26703J72365k55311l02059k92115l03933R4907Q05835
35050a31909R55621K20204n50630n83617j87801K7289O5653Q9188j10496n44239
35040g50737o86209l02696J21326L07793O60978J215962J117326L618j011913
35031F75448p92431J23387L83778j79245n58036k14346L66018O01298M16448L2957
$$ y = [861997, 864322, 508497, -16597, -237015, 201538, 1064800, 1629761, 1331246, 304514, -695684, -961662, -513675, -43774, -48806, -207241, 58018, 581163, 580058, -190579, -1017116, -1165383, -691155, -19953, 744961, 1651709, 2435079, 2718230, 2488718, 2048005, 1678521, 1555050, 1668838, 1634719, 971358, -177919, -1042407, -1212714, -1121624, -1203764, -1177704, -678301, -51598, 120767, -134544, -436603, -728718, -1032651, -937744, -131909, 823712, 1043916, 493286, -90331, -278132, -250843, -185190, -96002, -206498, -750737, -1436946, -1739642, -1618316, -1310523, -649545, 566417, 1683743, 1687361, 675448, -116983, 6404, 390182, 210937, -347099, -561445, -195427, 405871, 822319, 855276]
35021H55276j83240R8051N86203M06236o40874j418862q77013M07419J058038
35012B91234P96264M30994L05476l0062o57803r41547n22359J88189O77864Q18329
35002A356579O12366J00500m10577n58100l69960j05767J45648K81671j2488o86144
34992C53728r87917m48811K33918J66503k97060j18598O91202J047884M51828
34983A092677m03049p58808n84075j45080L34785M93996J11943l90958m64258
34974g12827l14993m60687o46590k67242L42058L15467r8062K52426J370074J793227
34964A572851Q27024l44539n16999j47721k55335p29275q03526m07701k821L30256
34954d77786O98272Q03574M25508M6460J53290L19289j51709r74251j162083m40345
$$ y = [855276, 672036, 770087, 1356290, 1762526, 1121652, -297210, -1174223, -766804, 291234, 1087498, 1518492, 1823968, 1793906, 1136103, 194556, -327803, -139614, 538250, 1356579, 1968945, 2069445, 1658868, 1100768, 730808, 625041, 770689, 1052360, 1039872, 353728, -634189, -1083000, -849082, -682579, -979639, -1098237, -407035, 640849, 1092677, 689628, -69180, -653255, -798335, -463550, 30446, 142389, -248569, -712827, -1027820, -1488507, -2135097, -2402339, -2060281, -1744814, -1842876, -1590450, -220376, 1572851, 2399875, 2055336, 1538337, 1390616, 1135281, 406006, -397520, -805221, -808042, -477786, 220486, 1024060, 1449568, 1496028, 1649318, 1968607, 1816898, 842647, -319436, -759781]
34944g59781L98785N64863R5506m27202n32852j86362K51982L88628K41737J64505
34934A99809K68376K79479R6414J6664J55587J34076k94343p48144p56879m19931
34924a068892j33521q061N9960N7959l7435j06306j08096j37977q2668L08878
34914a256159Q03646P45623P6691l68405p2099L21090J4756o56625p40740r4671
34904a226893M81754L70331k30303o84631n01156K69987Q98573N96067m04734
34895d31005r29698m33336K15179J35726j68308K29436R93721J026268K71736
34886I09719k67714k02912j69785m86045o16113k58151J29037K63750M95512Q63059
34876F60357O83785k69872j033038o98440K14877N22339J09060l4698N62575J074319
$$ y = [-759781, -360996, 203867, 299373, -127829, -660681, -847043, -595061, -206433, 35304, 199809, 468185, 747664, 844078, 860742, 1016329, 1150405, 856062, 107918, -648961, -1068892, -1202413, -1210474, -1150514, -1092555, -1129990, -1236296, -1344392, -1482369, -1565037, -1256159, -452513, 293110, 369801, 1396, -70703, 250387, 265143, -391482, -1132222, -1226893, -745139, -374808, -605111, -1289742, -1790898, -1520911, -622338, -26271, -431005, -1360703, -1794039, -1578860, -1443134, -1611442, -1382006, -388285, 637983, 909719, 642005, 439093, 269308, -216737, -832850, -1091001, -961964, -698214, -202702, 660357, 1344142, 1074270, 41232, -657208, -442331, 80008, 189068, 154370, 716945, 1791264]
34866A791264N32989p76009j563497j058547J12676P24482L86587j76666k48600
34857b75321j7065n6761l42114l15038K40414R16321J227601J014384L74392l73362
34847B393451p44539n65150k94714m04248o08956l39591J87869J97501l43707
34838e22084n72408j14517K90733M181m97941m47785M0415L43348L74307M87178
34828f14573O71180O07413L46575K21113J69744j80615p55234r79718o01526m6526
34818a162167K00687J47628N9309L9786N2535R8665J84474K55127K48514J08826
34808B33384k05732n42543n02363R3266P46493P44098J30279k76980k9292L14306
34798G04916O6978n26186o68444j69821M10231O54739O47016M19402k11964j009357
$$ y = [1791264, 2324253, 1548244, -15253, -1073800, -961124, -236642, 149945, -26721, -275321, -292386, -349147, -691261, -1006299, -765885, 150436, 1378037, 2392421, 2766813, 2393451, 1648912, 1083762, 789048, 384800, -224156, -563747, -375878, -178377, -522084, -1094492, -1209009, -918276, -914095, -1412036, -1859821, -1819406, -1476058, -1101751, -614573, 56607, 664020, 1010595, 1231708, 1401452, 1220837, 465603, -514115, -1115641, -1162167, -961480, -813852, -754543, -714757, -662222, -563557, -379083, -123956, 124558, 233384, 27652, -514891, -1017254, -923988, -177495, 566603, 696882, 419902, 390610, 704916, 771894, 245708, -422736, -592557, -182326, 472413, 1119429, 1538831, 1326867, 317510]
34788C17510j205022m99554L60686N37074J78277m7456m9426j62331k41155J06620
34778g04777M98710R6546q74615j051005J26271J395368J338692K58897m73715
34769F10372l18363J45734L74422L07444o2307n99853o87842N6998Q40961N00192
34759A167758p26939j307863n05611O74953J000456N00943o8994l86919n03506
34750a55722l08615K02733N78500M51806O6517k37970n95717j088597j147055
34741b234120k53623J032171J536264Q97024q8598n14526k33602K92052N19034
34732I52076J85297m73658q77182p23792l10796J047K76837N65631M56726k26579
34722a74393o78538M673J325373J772459Q06336n11391j096928j046014q38044
$$ y = [317510, -887512, -1387066, -1026380, -489306, -311029, -358485, -407911, -570242, -811397, -704777, -206067, -109521, -984136, -2035141, -1908870, -513502, 825190, 1084087, 610372, 292009, 437743, 812165, 1119609, 1057302, 457449, -230393, -173395, 667566, 1167758, 440819, -867044, -1372655, -697702, 302754, 803697, 734703, 347784, -155722, -464337, -261604, 316896, 768702, 835219, 597249, 1532, -1087065, -2234120, -2487743, -1455572, 80692, 977716, 889118, 374592, 140990, 433042, 952076, 1137373, 663715, -213467, -937259, -1248055, -1247008, -970171, -404540, 52186, -174393, -852931, -848258, 477115, 2249574, 3055910, 2544519, 1447591, 401577, -436467]
34713d36467l82387L82215P97525L90009j33785J08233N91917R2908j135676j344894
34703a070402J28871J598197J260202k81570r81830l07399K44733l54731j101426
34694h65355o12005P01120J245054N71282j37974K6967M31207O6785q07688j053599
34684d34206l35354M70551N82330K48062P9092R6027k8304k03479q6158J51091
34674E39652n1338o41471p85812m8763Q29953Q67004J48237m04809l26023J6402
34664A43032K07536K10411k1087n69652j005187o08968M74211J064343M66310
34655C60949n24202p95590m41656k52173k54578J22961P28206P46553J11453k91870
34645d89947m6089K42749J43452J05431M57823O78618L42566m2912O4174K26796
$$ y = [-436467, -818854, -436639, 360886, 750895, 617110, 725343, 1317260, 1410168, 274492, -1070402, -941531, 656666, 1916868, 1635298, 653468, 346069, 590802, 236071, -865355, -1477360, -776240, 468814, 1040096, 902122, 929089, 1360296, 1427081, 619393, -434206, -769560, -299009, 283321, 531383, 610475, 706502, 678198, 474719, 388561, 539652, 488314, -153157, -938969, -987732, -157779, 709225, 857462, 452653, 126630, 143032, 350568, 560979, 539892, -29760, -1034947, -1643915, -1169704, -105361, 360949, -163253, -958843, -1400499, -1652672, -1907250, -1784289, -1056083, -309530, -198077, -489947, -536036, -293287, -149835, -44404, 413419, 1092037, 1434603, 1391691, 1455865, 1682661]
34635A682661j97293q35819q23673j82505K59537J20713k11875l66095k98556
$$ y = [1682661, 1485368, 649549, -174124, -356629, -97092, 23621, -188254, -554349, -852905]
$$ [...]
##END NTUPLES=NMR SPECTRUM
##END=
