##TITLE=31Pdec_BAU-14_01
 CDCl3, 24 sc
 18.1.2019
##JCAMPDX= 6.0         $$ Bruker NMR JCAMP-DX V2.0
##DATA TYPE= NMR SPECTRUM
##DATA CLASS= NTUPLES
##ORIGIN= UXNMR, Bruker Analytische Messtechnik GmbH
##OWNER= root
$$ XWIN-NMR		Version 3.5
$$ Fri Jan 18 14:38:08 2019 Russian Standard Time (UT+4h)  she@DPX200
##.OBSERVE FREQUENCY= 81.013821
##.OBSERVE NUCLEUS= ^31P
##.ACQUISITION MODE= SIMULTANEOUS
##.ACQUISITION SCHEME= undefined
##.AVERAGES= 24
##.DIGITISER RES= 17
##SPECTROMETER/DATA SYSTEM= spect
##.PULSE SEQUENCE= zgpg30
##.SOLVENT NAME= D2O
##.SHIFT REFERENCE= (INTERNAL, D2O, 0, 182.463)
##AUDIT TRAIL= $$ (NUMBER, WHEN, WHO, WHERE, WHAT)
$$ ##TITLE= Audit trail, XWIN-NMR		Version 3.5
$$ ##JCAMPDX= 5.01
$$ ##ORIGIN= Bruker BioSpin GmbH
$$ ##OWNER= she
$$ F:/spectra/data/she/nmr/P31/1/pdata/1/auditp.txt
$$ ##AUDIT TRAIL=  $$ (NUMBER, WHEN, WHO, WHERE, WHAT)
(   1,<2019-01-18 14:37:17.42 +0400>,<she>,<DPX200>,
      <created by zg, POWCHK disabled, PULCHK disabled
       configuration hash MD5:
       00 E9 B6 7A A2 85 ED C7 34 08 36 98 17 FE 4E 26
       data hash MD5: 32K
       26 22 79 37 22 51 24 1E 7D C5 AF CA 46 27 CE 52>)
(   2,<2019-01-18 14:37:20.71 +0400>,<she>,<DPX200>,
      <Start of raw data processing
       efp BC_mod = 2 LB = 1 FT_mod = 6 PKNL = 1 PHC0 = -1440.736 PHC1 = 4.798988 SI = 64K 
       data hash MD5: 64K
       2A 50 E9 5C 6A AD 6D 1D 98 C6 2C 70 3D 61 46 9C>)
(   3,<2019-01-18 14:37:33.87 +0400>,<she>,<DPX200>,
      <pk PHC0 = 1.661556 PHC1 = 0 
       data hash MD5: 64K
       BB 3F 9D 08 0A 3E 63 26 7E B1 60 E9 4D 3D 96 C4>)
(   4,<2019-01-18 14:37:36.62 +0400>,<she>,<DPX200>,
      <abs ABSG = 5 
       data hash MD5: 64K
       B0 BE 0B EE D0 D6 60 E3 E5 D1 A3 E0 33 59 8D D1>)
$$ ##END=
$$ 
$$ hash MD5
$$ A5 9D 46 F6 79 51 37 59 ED 54 29 A2 5E B3 90 E3
##$RELAX= 
##$RELAX= 
##$RELAX= 
##$RELAX= 
##$RELAX= 
##$RELAX= 
##$RELAX= 
##$RELAX= 
$$ Bruker specific parameters
$$ --------------------------
##$DU= <F:/spectra>
##$EXPNO= 1
##$NAME= <P31>
##$PROCNO= 1
##$TYPE= <nmr>
##$USER= <she>
##$AMP= (0..31)
100 100 100 100 100 100 100 100 100 100 100 100 100 100 100 100 100 100 
100 100 100 100 100 100 100 100 100 100 100 100 100 100 
##$AQSEQ= 0
##$AQ_mod= 1
##$AUNM= <au_zg>
##$AUTOPOS= <>
##$BF1= 81.014009
##$BF2= 200.13
##$BF3= 200.13
##$BF4= 200.13
##$BF5= 200.13
##$BF6= 200.13
##$BF7= 200.13
##$BF8= 200.13
##$BYTORDA= 1
##$CFDGTYP= 0
##$CFRGTYP= 5
##$CHEMSTR= <none>
##$CNST= (0..31)
1 1 145 1 1 1 1 1 1 1 1 1 1 1 1 1 1 1 1 1 1 1 1 1 1 1 1 1 1 1 1 1 
##$CPDPRG= <waltz16>
##$CPDPRG1= <>
##$CPDPRG2= <waltz16>
##$CPDPRG3= <>
##$CPDPRG4= <mlev>
##$CPDPRG5= <mlev>
##$CPDPRG6= <mlev>
##$CPDPRG7= <mlev>
##$CPDPRG8= <mlev>
##$CPDPRGB= <>
##$CPDPRGT= <>
##$D= (0..31)
0 1 0 0 0 0 0 0 0 0 0 0.03 2e-05 3e-06 0 0 0 0 0 0 0 0 0 0 0 0 0 0 0 0 
0 0 
##$DATE= 1547807836
##$DBL= (0..7)
120 120 120 11 120 120 24 19 
##$DBP= (0..7)
150 150 150 150 150 150 150 150 
##$DBP07= 0
##$DBPNAM0= <>
##$DBPNAM1= <>
##$DBPNAM2= <>
$$ [...]
##$SUBNAM3= <"">
##$SUBNAM4= <"">
##$SUBNAM5= <"">
##$SUBNAM6= <"">
##$SUBNAM7= <"">
##$SUBNAM8= <"">
##$SUBNAM9= <"">
##$SW= 369.568048894756
##$SWIBOX= (0..15)
0 1 3 0 0 0 0 0 0 0 0 0 0 0 0 0 
##$SW_h= 29940.119760479
##$TD= 32768
##$TD0= 1
##$TE= 0
##$TE2= 300
##$TE3= 300
##$TEG= 300
##$TL= (0..7)
0 120 53 12 22 120 120 120 
##$TP= (0..7)
150 150 150 150 150 150 150 150 
##$TP07= 0
##$TPNAME0= <>
##$TPNAME1= <>
##$TPNAME2= <>
##$TPNAME3= <>
##$TPNAME4= <>
##$TPNAME5= <>
##$TPNAME6= <>
##$TPNAME7= <>
##$TPOAL= (0..7)
0.5 0.5 0.5 0.5 0.5 0.5 0.5 0.5 
##$TPOFFS= (0..7)
0 0 0 0 0 0 0 0 
##$TUNHIN= 0
##$TUNHOUT= 0
##$TUNXOUT= 0
##$USERA1= <user>
##$USERA2= <user>
##$USERA3= <user>
##$USERA4= <user>
##$USERA5= <user>
##$V9= 5
##$VALIST= <valist>
##$VCLIST= <CCCCCCCCCCCCCCC>
##$VD= 0
##$VDLIST= <DDDDDDDDDDDDDDD>
##$VPLIST= <PPPPPPPPPPPPPPP>
##$VTLIST= <TTTTTTTTTTTTTTT>
##$WBST= 1024
##$WBSW= 4
##$XGAIN= (0..3)
0 0 0 0 
##$XL= 0
##$YL= 0
##$YMAX_a= 11550
##$YMIN_a= -11094
##$ZGOPTNS= <>
##$ZL1= 120
##$ZL2= 120
##$ZL3= 120
##$ZL4= 120
##$ABSF1= 182.463
##$ABSF2= -187.1042
##$ABSG= 5
##$ABSL= 3
##$ALPHA= 0
##$AQORDER= 0
##$ASSFAC= 0
##$ASSFACI= 0
##$ASSFACX= 0
##$ASSWID= 0
##$AUNMP= <proc_1d>
##$AZFE= 0.1
##$AZFW= 0.5
##$BCFW= 0
##$BC_mod= 2
##$BYTORDP= 0
##$COROFFS= 0
##$CY= -3
##$DATMOD= 1
##$DC= 0
##$DFILT= <>
##$DTYPP= 0
##$F1P= 0
##$F2P= 0
##$FCOR= 1
##$FTSIZE= 65536
##$FT_mod= 6
##$GAMMA= 0
##$GB= 0
##$INTBC= 1
##$INTSCL= 5.30512e-09
##$ISEN= 30
##$LB= 1
##$LEV0= 0
##$LPBIN= 0
##$MAXI= 10000
##$MC2= 0
##$MEAN= 0
##$ME_mod= 0
##$MI= 50
##$NCOEF= 0
##$NC_proc= -4
##$NLEV= 6
##$NOISF1= 182.463
##$NOISF2= 159.3651
##$NSP= 0
##$NTH_PI= 0
##$NZP= 0
##$OFFSET= 182.463
##$PC= 4
##$PHC0= -1439.074
##$PHC1= 4.798988
##$PH_mod= 1
##$PKNL= yes
##$PPARMOD= 0
##$PSCAL= 0
##$PSIGN= 0
##$REVERSE= no
##$SF= 81.0140089999434
##$SI= 65536
##$SIGF1= 159.3651
##$SIGF2= -187.1042
##$SINO= 113.3802
##$SIOLD= 16384
##$SREGLST= <1H.CDCl3>
##$SSB= 0
##$STSI= 65536
##$STSR= 0
##$SW_p= 29940.119760479
##$SYMM= 0
##$S_DEV= 0
##$TDeff= 32768
##$TDoff= 0
##$TI= <>
##$TILT= no
##$TM1= 0
##$TM2= 0
##$TOPLEV= 0
##$USERP1= <user>
##$USERP2= <user>
##$USERP3= <user>
##$USERP4= <user>
##$USERP5= <user>
##$WDW= 1
##$XDIM= 65536
##$YMAX_p= 292282198
##$YMIN_p= -10142997
$$ End of Bruker specific parameters
$$ ---------------------------------
##NTUPLES= NMR SPECTRUM
##VAR_NAME=  FREQUENCY,     SPECTRUM/REAL,   SPECTRUM/IMAG
##SYMBOL=    X,             R,               I
##VAR_TYPE=  INDEPENDENT,   DEPENDENT,       DEPENDENT
##VAR_FORM=  AFFN,          ASDF,            ASDF
##VAR_DIM=   65536,         65536,           65536
##UNITS=     HZ,            ARBITRARY UNITS, ARBITRARY UNITS
##FACTOR=    0.456856943014862, 1,           1
##FIRST=     14782.0589164792, 0,            0
##LAST=      -15158.0608439998, 0,           0
##MIN=       -15158.0608439998, -10142997,   0
##MAX=       14782.0589164792, 292282198,    0
$$ Real data points
##PAGE= N=1
##DATA TABLE= (X++(R..R)), XYDATA
$$ [...]
##PAGE= N=2
##DATA TABLE= (X++(I..I)), XYDATA
42358 1030212 900159 625219 185749 -69894 170513 706917 1024387 862427 408635
42349 408635 43388 42290 406671 850114 1055229 1011344 945360 902374 677535 259570
42339 259570 3260 144007 428673 489528 333503 171661 -386 -295168 -564390 -519467
42329 -519467 -178444 123214 171998 81722 58141 164479 327064 415967 335947 161603
42319 161603 120165 303013 477083 353607 -9912 -247970 -117338 236293 449413 319776
42309 319776 28763 -15522 380818 955107 1303144 1351306 1309507 1261386 1135816 1030528
42299 1030528 1128194 1252919 995323 397556 -8571 -35964 -132162 -529887 -736975 -370031
42289 -370031 74186 -53626 -481152 -418813 219507 757745 804995 648427 607328 631652
42279 631652 604097 514365 293390 -63970 -245009 25367 441928 469208 170081 90217
42269 90217 351018 517791 410485 347397 441326 345218 -54398 -316097 -119066 274094
42259 274094 510218 587794 538302 207484 -309305 -511279 -144971 403677 685882 724051
42249 724051 672820 451438 98465 2206 319312 596130 446164 191213 306893 615812
42239 615812 623559 353243 222280 297796 290067 160302 153162 290297 364002 393894 586594
42228 586594 859185 884197 619855 353587 210466 51826 -125755 -137192 -3624 29592
42218 29592 -56552 -5303 213790 272774 17315 -249307 -227394 -50703 -16564 -134095 -197151
42207 -197151 -145735 -111184 -170140 -241371 -230435 -175113 -202385 -331887 -361848 -84782 336323
42196 336323 412299 -70121 -657569 -695561 -86200 664720 1055434 967077 542356 44763
42186 44763 -178595 44556 425425 478129 120423 -266035 -391888 -337758 -217829 42041
42176 42041 410504 574066 316734 -141079 -412766 -388506 -226603 -83497 -47843 -172568
42166 -172568 -353521 -315064 51534 432821 409496 -16045 -409950 -406730 -50611 345783
42156 345783 516601 403538 148696 -23880 -1921 121102 207847 299767 549071 914533
42146 914533 1084378 818911 283172 -109245 -161863 -53899 -20654 -68626 -112258 -189389
42136 -189389 -311495 -249341 190498 709614 739272 225093 -204819 -84086 242574 160040
42126 160040 -313279 -600113 -376772 148711 695897 1176666 1478323 1443437 1197828 1118833
42116 1118833 1314029 1458431 1321190 1137103 1225889 1495852 1581071 1302205 767641 151729
42106 151729 -412451 -795432 -899883 -716760 -314543 147371 416694 352697 153050 143720
42096 143720 303035 286734 14966 -123363 141970 515346 585992 438371 418220 490922
42086 490922 299119 -192593 -558364 -494726 -186362 48158 196309 451354 841530 1140708
42076 1140708 1099244 681390 109420 -306027 -425176 -357814 -242119 -29639 385324 891409
42066 891409 1201355 1179924 986853 871492 938342 1111200 1202037 1023532 579356 146715
42056 146715 13893 121559 137345 -81660 -306635 -309493 -210533 -269525 -461302 -489318 -202806
42045 -202806 189648 365300 217921 -102953 -374573 -454657 -335160 -132358 14096 100512
42035 100512 267331 551965 693131 375044 -288711 -734314 -590303 -186791 -153858 -575835
42025 -575835 -883842 -662299 -208658 -50973 -182640 -152053 196645 487504 388133 78396
42015 78396 -41131 122956 346079 461101 498904 495904 383813 114736 -250467 -626879
42005 -626879 -961756 -1162135 -1097772 -774298 -408444 -206032 -123573 10108 175458 158252
41995 158252 -96524 -328842 -298366 -123405 -89179 -209613 -225510 -35367 132818 82441
41985 82441 -35328 49390 308241 443517 302969 65225 -42256 -60433 -210856 -538153
41975 -538153 -768364 -587709 -15229 593595 925379 987439 947944 827063 519702 71850
41965 71850 -281292 -387146 -301999 -108193 172405 396528 303454 -82919 -279053 111073
41955 111073 783223 1015984 560298 -93645 -411264 -435774 -524832 -740574 -806173 -560018
41945 -560018 -171438 96435 136579 -5841 -209242 -299681 -148925 169098 411445 422091
41935 422091 287023 192696 215355 305186 385674 385728 257532 69625 11694 175309 382180
41924 382180 389625 241342 220494 424627 593234 458928 98652 -199675 -280635 -182243
41914 -182243 17874 234671 344428 306413 246623 249530 170489 -116679 -390687 -325396 -36365
41903 -36365 -5785 -367600 -643648 -409247 93367 314212 143848 -66394 -121952 -212637
41893 -212637 -459078 -578676 -229692 466353 983000 986471 729615 742898 1168807 1551701
41883 1551701 1385102 752570 220432 117507 178860 -1337 -407642 -695213 -681531 -498864
41873 -498864 -318901 -161802 -4678 95607 69878 -36044 -48196 200282 664952 1035537
41863 1035537 1018926 712606 528691 660971 813745 605753 72194 -418141 -594723 -435935
41853 -435935 -48503 350837 462091 204196 -80343 -6951 324177 483811 349426 236164
41843 236164 375479 624584 785650 874160 921104 808830 495028 161066 -47253 -209740
41833 -209740 -378730 -358643 18479 545936 811507 641678 215055 -171388 -304076 -145204
41823 -145204 101308 112669 -202148 -562957 -663272 -526834 -363410 -225503 -30898 196399
41813 196399 363833 509151 701808 803180 605918 197225 -101754 -181584 -243384 -391518
41803 -391518 -421762 -151023 284783 623627 770149 744046 546353 280040 219873 500401
41793 500401 840218 841395 515596 258770 309808 487518 516409 383509 262217 254222 341160
41782 341160 485393 655652 804708 896854 920920 861309 735866 659086 730645 841769
41772 841769 776185 573543 579664 985619 1507612 1732327 1626673 1458350 1332869 1114304
41762 1114304 770554 495239 440709 559642 739888 879816 830457 524022 185942 140783
41752 140783 359980 496212 421225 381294 511503 585781 442421 269005 204874 55830
41742 55830 -250133 -315395 150210 723719 798129 496683 444089 742255 836513 425100
41732 425100 -142973 -504145 -696944 -730148 -340341 463222 1107936 1142147 850839 780644
41722 780644 959009 1006834 772768 410156 -1023 -466779 -805235 -754257 -324378 243827
41712 243827 786361 1201787 1291234 988924 639360 624404 775556 609201 131061 -113869
41702 -113869 99316 300857 76499 -272234 -220729 151927 308069 69818 -183698 -142112
41692 -142112 25374 11752 -179113 -316962 -297374 -220723 -207571 -281018 -380617 -379968 -146719
41681 -146719 280953 605733 520062 88811 -249571 -155379 231377 493264 445759 284991
41671 284991 232328 218268 31538 -324584 -585562 -539015 -265384 -4551 147288 303638
41661 303638 548282 750652 730571 551265 476906 598209 674426 473278 126057 -47423
41651 -47423 16827 85590 9486 -100045 -128310 -165311 -336487 -591330 -791282 -881844 -853322
41640 -853322 -649091 -262709 148829 392923 445042 414455 354356 235570 92845 55235
41630 55235 168387 264289 109676 -294287 -636967 -625746 -377686 -331750 -691663 -1109657
41620 -1109657 -1082880 -546724 122951 597905 841708 932387 931077 929636 958113 833591 379380
41609 379380 -197128 -461636 -316374 -63250 123307 360223 607447 564980 234483 75140
41599 75140 281314 405148 118813 -139624 151057 672966 714946 277357 -1894 106874
41589 106874 207627 104660 94970 294717 365288 155507 4021 99911 109180 -181925 -360069
41578 -360069 -3693 568780 699748 321048 -22853 16535 219535 261437 178860 233731
41568 233731 502823 747731 684055 349754 129728 300392 618807 589815 125219 -361198
41558 -361198 -563525 -624649 -708753 -615349 -136744 470395 745116 609200 359583 179246
41548 179246 -7707 -238638 -399565 -447187 -485764 -559636 -566510 -440970 -266120 -131836
41538 -131836 6405 254411 611340 915164 967686 743855 450118 282335 157651 -137061
41528 -137061 -523422 -615813 -245504 245856 433811 332895 261944 355974 476152 490518
41518 490518 377559 123402 -237400 -535791 -643276 -653579 -668653 -536849 -112898 335780
41508 335780 385805 95912 -53991 74688 62529 -314706 -589054 -254204 408467 654011
41498 654011 289447 -126733 -118529 127650 177733 -23411 -222845 -338345 -536685 -880234
41488 -880234 -1165779 -1174069 -913493 -553117 -239965 -55801 -53804 -228422 -464213 -575252
41478 -575252 -424572 -48292 300568 312093 -43244 -381534 -303535 68612 199903 -127738
41468 -127738 -473948 -329293 197474 571537 538159 302506 115975 54573 170300 473815
41458 473815 724674 608921 220674 22965 207298 436108 388286 213771 196121 253968
41448 253968 89784 -343408 -799962 -1046144 -999651 -706018 -375305 -293196 -488716 -630848
41438 -630848 -453730 -128205 7788 -71934 -133421 -95440 -115211 -305013 -577810 -751340
41428 -751340 -674702 -339331 20044 86055 -137428 -265910 -44599 305530 466407 495750
41418 495750 625265 810076 834027 701738 571086 434189 217477 55044 87667 138742
41408 138742 6371 -72999 252171 762893 868840 484617 125281 56686 -36358 -338306
41398 -338306 -458552 -55436 556470 834293 717739 525454 403768 285767 239617 456407
41388 456407 903036 1260678 1246626 874130 425912 251353 507013 1010533 1416101 1562775
41378 1562775 1551645 1499494 1396832 1227859 1042618 874674 741501 699849 718474 594150
41368 594150 278234 175360 701606 1572124 2000669 1667298 1011541 483555 62481 -296198
41358 -296198 -344572 -36114 186231 42000 -73631 299298 929983 1251963 1162731 953088
41348 953088 711011 357246 81233 154948 388844 301719 -182222 -652448 -796597 -643918
41338 -643918 -278061 230832 601846 509043 63587 -231453 -99235 221584 348499 164081
41328 164081 -146807 -244073 111939 713073 958485 563115 25946 -4348 356880 453470
41318 453470 96137 -238162 -196903 51841 286477 523884 703460 608204 286499 88740
41308 88740 122850 131586 40671 99329 288976 161726 -438419 -1012838 -1098025 -834531 -509963
41297 -509963 -53972 571673 959316 772822 330388 154183 236431 249617 183705 225651
41287 225651 259790 76647 -100741 107028 549069 718214 545680 439294 544765 566806
41277 566806 400607 362906 608634 799373 591606 99784 -328981 -516030 -484631 -361571
41267 -361571 -346800 -518009 -615846 -328929 177418 390517 174912 -47490 36421 227531
41257 227531 272910 274377 341822 257581 -110055 -386109 -155485 346805 491291 121136
41247 121136 -281036 -304144 -79646 66273 95192 185024 369353 474788 381848 195217
41237 195217 102491 125807 106368 -39721 -159019 -74402 113275 123667 -115914 -379648
41227 -379648 -455034 -340081 -112100 150834 272562 101022 -167380 -106119 330328 643423
41217 643423 475730 133338 111750 404398 672008 831695 998139 1029214 687452 195977
41207 195977 72697 355910 524399 320719 138503 350896 714054 790449 631523 637873
41197 637873 920756 1172121 1120504 848700 642826 663941 772081 654156 212075 -205927
41187 -205927 -162793 279274 607801 545265 338580 239248 104232 -209246 -423626 -222283
41177 -222283 195460 367898 221968 60590 23573 -9649 -52158 12319 94797 -19727
41167 -19727 -224021 -156732 193949 395981 244493 101727 315425 670109 753710 593974
41157 593974 538964 646460 576124 96295 -568699 -949478 -747946 -54193 718393 1127638
41147 1127638 1048885 735833 502049 422031 404765 418067 478457 502831 363051 88432
41137 88432 -129994 -161531 -61592 42365 96975 109052 47524 -154557 -465325 -673728 -564728
41126 -564728 -223597 -29651 -200115 -445816 -310474 180651 483186 205168 -431406 -909221
41116 -909221 -972860 -729370 -401739 -171424 -126418 -194587 -221511 -207002 -310005 -532978
41106 -532978 -633010 -496692 -342137 -325266 -222178 162686 503400 314704 -284021 -628393
41096 -628393 -375351 90511 231975 2991 -249701 -267287 -64173 201393 360641 312197
41086 312197 81011 -215348 -458377 -542828 -382184 -26460 306588 474622 587575 754566
41076 754566 797588 508252 78347 -100060 -28246 -83460 -370141 -518869 -264601 163820
41066 163820 401301 340221 9396 -542439 -1020154 -949516 -289735 364134 521745 405320
41056 405320 456954 606186 519263 286499 279530 487432 582193 559047 708174 959231 885717
41045 885717 461909 191400 274516 246003 -238974 -801098 -935038 -740823 -558821 -281112
41035 -281112 341117 953837 886900 177069 -356652 -221034 128555 40339 -434697 -783911
41025 -783911 -841032 -887988 -1083076 -1215537 -1053026 -627731 -122486 292451 461922 318564
41015 318564 48587 -4427 280799 660826 862300 903698 951932 1012049 957448 781892
41005 781892 610447 488338 354246 219813 173366 168139 11956 -330967 -592616 -498619
40995 -498619 -114732 241769 379534 390633 445295 543698 521363 275705 -50193 -165596
40985 -165596 42951 347161 439601 306960 186580 194403 233058 289762 513363 838664
40975 838664 839085 254669 -533775 -920471 -864636 -871962 -1186135 -1419839 -1157100 -585687 -248653
40964 -248653 -347245 -571410 -554912 -254053 136605 441362 582168 515678 235909 -134155
40954 -134155 -342306 -212264 132284 353070 271904 56411 -66612 -145935 -353389 -593431
40944 -593431 -558081 -190508 197156 358891 385457 399662 288593 3282 -130932 210738
40934 210738 776934 945781 536871 64571 66532 471002 800596 775726 509718 264998
40924 264998 236503 484545 864993 1049267 796226 233624 -238724 -336015 -108571 178874
40914 178874 273152 73763 -296673 -535117 -399904 24992 373064 334768 -88583 -634679
40904 -634679 -973012 -875468 -376293 179868 411806 320659 295622 594110 977083 1037422
40894 1037422 755739 481777 420155 415005 292611 162527 234254 494266 724201 760996
40884 760996 615837 389565 183923 81470 129607 321103 594450 837619 922893 813168
40874 813168 621241 472960 330739 83140 -199258 -286293 -126340 28623 -44188 -243672
40864 -243672 -337218 -309580 -324323 -418609 -443245 -300346 -86297 22824 -51174 -202991 -191135
40853 -191135 127849 534258 574068 117292 -365982 -329649 152127 495061 355578 -45414
40843 -45414 -351638 -468379 -418952 -134764 386611 918462 1210420 1222962 1016971 598969
40833 598969 68555 -267384 -199345 66903 163209 66686 73052 281289 427163 330209 222123
40822 222123 419687 840403 1083834 936550 585977 327510 243947 235941 215662 147234
40812 147234 -18443 -300608 -588962 -711153 -635700 -520483 -514812 -585594 -595340 -495194 -375701
40801 -375701 -354996 -456081 -561036 -472991 -102127 372454 625304 534227 300357 140356
40791 140356 12534 -191808 -340567 -217950 69044 153545 -70273 -276030 -179619 67906
40781 67906 154854 77979 74494 169272 61939 -470964 -1215425 -1662731 -1490087 -873970 -325733
40770 -325733 -202236 -384636 -466136 -211544 253398 656274 815401 655812 193143 -386661
40760 -386661 -770176 -771652 -482032 -109819 209105 385290 336291 113857 -68577 -99144
40750 -99144 -146639 -404267 -754465 -888099 -695402 -339823 14766 337974 596135 690457
40740 690457 587379 366361 100864 -178489 -381777 -374166 -156629 79613 140550 -9500
40730 -9500 -302990 -679184 -1075349 -1377437 -1447809 -1198976 -659461 -14870 454937 578899
40720 578899 440687 253278 110881 -42757 -224893 -319704 -196851 159800 636262 1010224
40710 1010224 1024931 599866 724 -333253 -192629 243758 650445 838907 800637 627201
40700 627201 447769 331849 215798 36688 -72585 80689 387091 473364 240630 103341
40690 103341 440272 1000366 1184387 829594 358916 138842 56282 -126827 -323428 -303707
40680 -303707 -146158 -181658 -500255 -778210 -688407 -317749 -46159 -80696 -236970 -202780
40670 -202780 60849 271304 199491 4794 62577 461604 853387 903643 720300 627157
40660 627157 636357 452680 -2964 -413882 -532218 -515836 -591741 -652090 -480427 -179380
40650 -179380 -21232 1877 97654 213737 88510 -210142 -240982 170974 635084 726581
40640 726581 480625 164381 -84764 -155439 112529 557325 616610 62157 -500604 -404619
40630 -404619 43058 -66524 -932152 -1775201 -1929393 -1530194 -954582 -257236 478251 813985
40620 813985 500368 -34625 -232959 -151191 -173450 -255451 -48035 354925 432661 78325
40610 78325 -135039 242540 879207 1094936 696678 111861 -153948 32440 418462 607557
40600 607557 368376 -150862 -545706 -576378 -395809 -273104 -206495 9574 380197 604676
40590 604676 470905 196147 194613 547222 890457 884092 612693 373196 194398 -178900
40580 -178900 -823628 -1422866 -1632077 -1466027 -1159975 -803698 -327192 235741 694108 901036
40570 901036 844283 561227 139579 -209182 -273425 -80158 141343 258570 335834 412955
40560 412955 393334 249762 157240 270910 497495 639978 673932 719056 798584 794899 630009
40549 630009 350073 31770 -265522 -445425 -412522 -219493 -66108 -71163 -118016 -11881
40539 -11881 258427 510442 598759 552735 468202 372336 273336 261315 419432 636758 656305
40528 656305 388760 81076 64201 385500 793957 1034916 1021146 752691 280935 -178142
40518 -178142 -294142 38557 504999 682252 497851 213365 1704 -217301 -461800 -463670
40508 -463670 20307 788395 1338000 1439730 1349886 1371830 1413239 1177545 689082 358603
40498 358603 460216 742986 724054 278053 -237787 -434498 -306578 -140727 -133023 -209399
40488 -209399 -187621 -21554 135194 88004 -156671 -308273 -48215 554896 987350 810081
40478 810081 195761 -257640 -269903 -182236 -384513 -696871 -624709 -106099 367881 420692
40468 420692 242087 223839 420655 602255 646045 604511 489140 269605 63904 69986
40458 69986 266487 393122 305030 184658 307155 694804 1078799 1156963 879095 526018
40448 526018 462329 733241 994420 966868 825624 904872 1138880 1148461 856318 602199
40438 602199 562910 494927 247624 93646 230599 356948 187137 62726 486208 1228184
40428 1228184 1521130 1128078 619811 483733 529476 409851 218420 210586 305521 263147
40418 263147 118029 82360 191637 354259 586518 893769 1073389 955721 713126 606396
40408 606396 545994 271330 -113697 -196666 133462 516771 646046 618292 641223 695699
40398 695699 658913 526612 342694 82735 -254571 -572026 -758410 -710917 -301057 420217
40388 420217 989546 876045 168550 -448632 -551897 -402718 -322806 -157345 250141 538594
40378 538594 375139 167990 528221 1206925 1330805 681374 -15884 -192833 -80392 -5279
40368 -5279 208576 696078 1044221 914282 708615 979112 1478278 1452022 726832 -92832
40358 -92832 -458868 -382542 -114687 173179 318590 207006 -798 12391 313731 693827
40348 693827 1020275 1304497 1454377 1326103 1019729 756294 476921 -12228 -491893 -446857
40338 -446857 130260 558660 347812 -168406 -374033 -180407 47123 79668 -21516 -148830
40328 -148830 -220954 -137860 84134 245810 217676 107728 19761 -147261 -463600 -740096
40318 -740096 -752122 -519444 -192159 133146 330859 263510 83465 198149 673352 1012388
40308 1012388 863683 598972 749372 1165063 1259106 888454 451876 233396 184405 287721
40298 287721 590665 868860 775105 391254 182864 345584 619733 787203 899992 962074
40288 962074 851213 638947 530923 425549 48688 -382088 -240831 530579 1139701 1002950
40278 1002950 548237 501992 838280 995371 816165 673304 800423 1027223 1152514 1169275
40268 1169275 1114170 1004817 915091 878045 789395 625353 604905 851022 1050077 820942
40258 820942 340823 197703 592729 1058290 1082229 715126 382485 294279 264601 78049
40248 78049 -148639 -104344 228045 416274 111060 -395289 -495131 -150139 -10201 -488158
40238 -488158 -1165187 -1422665 -1250689 -1002732 -714754 -238643 181885 125011 -267242 -379135
40228 -379135 -23881 303725 216829 -44707 -102363 19473 122053 214326 344494 350285
40218 350285 106978 -192739 -305066 -304710 -414425 -621264 -735253 -709153 -638149 -531674
40208 -531674 -330317 -81584 125856 336902 608688 770238 569884 85082 -256277 -158102
40198 -158102 202528 419487 335728 165564 177693 351269 391376 78965 -445644 -813467
40188 -813467 -827052 -638516 -521779 -596544 -826710 -1127322 -1332805 -1192392 -618606 88519
40178 88519 472415 408404 193183 109876 107923 38830 16344 280976 751106 997376 786988
40167 786988 449020 478865 873882 1127641 906245 451314 155401 -16012 -363031 -811840
40157 -811840 -838361 -166126 762630 1271006 1230903 1071125 1088693 1105077 880918 542453
40147 542453 362446 323045 195937 -24375 -81315 120683 344616 391689 396240 559642
40137 559642 777417 775231 511471 196611 -38163 -241852 -410170 -395910 -134969 198919
40127 198919 341949 153031 -310383 -796384 -969198 -697078 -229237 77277 159728 169014
40117 169014 80376 -264689 -730704 -917913 -736220 -552382 -590299 -592383 -332152 -57245
40107 -57245 -61424 -162973 -40725 184987 181586 12437 13530 182168 193827 -11518 -138217
40096 -138217 -43554 99743 184388 300119 438859 465760 435576 543598 712114 644363
40086 644363 358072 212339 291192 248027 -41497 -166411 170403 617592 679722 430491
40076 430491 300371 380003 375363 158973 -28010 56188 353154 624086 724831 736134
40066 736134 865453 1171728 1400638 1244130 762648 329724 131650 -1908 -205291 -345893
40056 -345893 -330346 -313932 -393772 -381699 -117651 244535 489718 627013 705953 629997 399361
40045 399361 242019 222291 31188 -504692 -1021385 -1103554 -855904 -559200 -112241 591497
40035 591497 1016513 486271 -703926 -1420210 -1082956 -290024 159100 241829 360119 528916
40025 528916 432484 44830 -260556 -164828 306793 899430 1342946 1507152 1481956 1459489
40015 1459489 1478873 1386680 1090291 707238 402170 213782 95856 -7000 -151792 -310135
40005 -310135 -292928 26873 416609 487529 245720 119275 320680 537269 477051 373613
39995 373613 589484 967341 1022143 675101 339654 252034 157040 -180976 -540768 -615678
39985 -615678 -559894 -765518 -1174574 -1232805 -655245 83953 281914 -141633 -591747 -523347
39975 -523347 34431 646379 893487 605464 -43667 -573325 -577972 -198748 2518 -253028
39965 -253028 -640372 -737449 -526439 -176980 305930 864567 1136785 889580 497191 491294
39955 491294 781554 857605 663113 639785 871632 857835 353960 -162516 -209992 3663
39945 3663 9594 -190110 -268489 -177072 -147328 -242942 -311396 -301477 -303183 -333348 -350869 -410126
39933 -410126 -551020 -625255 -486223 -270229 -228360 -342098 -369470 -233387 -95731 -40030
39923 -40030 70789 361021 740705 989914 938384 577159 115686 -105584 92727 533356
39913 533356 895009 1075409 1200669 1329578 1357701 1247521 1168826 1296389 1545420 1614630
39903 1614630 1318809 858502 698494 1095431 1758542 2097762 1837474 1261218 809763
39894 809763 596259 416426 98279 -296008 -543658 -454656 -76792 252747 205905 -129045
39884 -129045 -318176 -135097 176282 302514 254305 162855 -43408 -452897 -855917 -959960
39874 -959960 -809239 -668560 -583297 -395413 -133849 -12271 -26056 77907 345369 468149
39864 468149 246356 -74855 -123643 126087 381967 415896 265596 120115 122402 265452
39854 265452 421462 465028 359421 138354 -95209 -127590 213113 723620 858760 364395
39844 364395 -278647 -385371 42238 348089 146706 -216764 -254742 25332 313213 490107
39834 490107 599966 542668 167051 -389035 -757036 -764211 -592373 -478623 -441309 -380178
39824 -380178 -309752 -351034 -511561 -604223 -477383 -267922 -262756 -465834 -489659 -37211 648212
39813 648212 1045683 999866 844858 895564 1089987 1208150 1201138 1162245 1126061 1025435 774062
39802 774062 356527 -72576 -218714 42918 412358 453595 146244 -112225 -76355 94831
39792 94831 227158 392293 589513 537422 102524 -329422 -270270 236144 706939 807779
39782 807779 542740 8070 -657376 -1118098 -1018093 -396973 302720 685219 687708 474166
39772 474166 285177 349020 663174 874289 660620 232689 131864 494243 875077 916577
39762 916577 813941 896110 1076390 1048257 810702 635045 602327 511275 249682 -16978
39752 -16978 -86879 38542 210427 286629 195906 -26378 -233057 -291311 -223965 -144855 -91327
39741 -91327 -35112 5767 52185 317308 1003110 1877495 2331058 2039332 1375182 950923
39731 950923 902395 876821 624955 298924 154963 235149 419561 574279 560234 305474
39721 305474 -8646 -23208 376752 866670 1076033 1032940 1002493 1001597 777575 288800 -81829
39710 -81829 40536 526239 871864 805441 594331 656551 954700 977156 415445 -314990
39700 -314990 -486605 46528 672538 817217 589813 431019 430137 358073 199181 217875
39690 217875 508581 840353 988357 920198 642593 206163 -86034 142807 804250 1315846
39680 1315846 1296696 989910 791471 682572 423619 41830 -234657 -352595 -387903 -258972
39670 -258972 134764 564767 674346 545957 660759 1163834 1533528 1230944 437783 -150673
39660 -150673 -162243 111973 224163 150069 195831 458127 636293 466169 154980 162771
39650 162771 591881 1037012 1112450 905899 756056 764870 760790 640768 484265 338408
39640 338408 135818 -114364 -257987 -223188 -162328 -236302 -361216 -316113 -52917 247481
39630 247481 426797 514734 594057 637799 605501 609164 793335 1059502 1117949 875545 567382
39619 567382 398747 288547 147409 151371 424656 653184 440738 -33776 -172409 221318
39609 221318 740007 1050413 1264565 1470092 1420496 1008200 604589 560253 737912 903933
39599 903933 1178606 1638097 1855667 1435537 747552 495371 700155 757968 445268 191929
39589 191929 278058 398120 238783 -18175 -20954 304488 819056 1329585 1536549 1203198
39579 1203198 559505 191433 345832 660562 726778 564580 379358 227205 139261 225876
39569 225876 420324 439061 216766 54170 126563 221318 204966 314851 634690 712600
39559 712600 196689 -462216 -494365 170291 867122 1066991 809586 355052 -98274 -337156
39549 -337156 -232165 -9303 -68842 -435903 -678181 -447747 137426 690073 896629 659903
39539 659903 168995 -138286 58157 573335 910976 862719 669279 560896 437485 139366
39529 139366 -193171 -221617 212764 911545 1476477 1636503 1484568 1354756 1396987 1393023
39519 1393023 1134717 811851 742971 827819 636439 61755 -479625 -617495 -490554 -459340
39509 -459340 -602294 -727936 -738101 -732742 -777892 -749075 -473408 19152 450758 567131
39499 567131 451224 437309 644562 770782 527802 130640 78476 500315 992015 1118389
39489 1118389 846385 458234 248954 337405 584262 679302 474533 187620 77682 21401
39479 21401 -280017 -739668 -931887 -736435 -518352 -531507 -536940 -234999 250407 583804
39469 583804 671885 657431 653530 701312 813318 860162 598162 21723 -473722 -494477 -93790
39458 -93790 352571 583451 613835 597897 670910 805773 760117 359710 -128743 -223645 69313
39447 69313 180694 -173107 -487115 -184658 517723 922531 774722 395164 91285 -50762
39437 -50762 86042 561927 1052953 1102430 734926 393474 266481 148147 -2835 97029
39427 97029 498068 783700 637583 257173 -38470 -257215 -523571 -731514 -705968 -491359
39417 -491359 -230269 52570 342587 524169 574725 648537 775120 730457 439814 237327
39407 237327 425622 811409 1011169 1010133 1041966 1086543 927436 625045 468193 433667
39397 433667 145344 -493168 -1006640 -908465 -297006 316467 590080 574808 508098 581752
39387 581752 836189 1126838 1227130 1057791 778180 604788 608590 723101 841855 850820
39377 850820 688198 461919 397361 566067 770189 810002 756402 807261 967898 1068725
39367 1068725 1048555 995908 904795 640329 243657 38941 236435 568718 564349 148401
39357 148401 -254290 -246912 109816 486671 730753 949105 1222757 1427690 1388476 1108054
39347 1108054 771835 551634 456317 383210 280571 207082 216511 246824 196479 80411 15996
39336 15996 53173 113437 116627 81927 86346 206769 489980 850381 1016507 788546 390321
39325 390321 310641 669912 1007893 908143 578328 506136 741929 909082 815481 633466
39315 633466 493118 326479 181922 277039 587369 748801 573059 352706 429367 720872
39305 720872 907427 854432 613839 220683 -246634 -558459 -528217 -207072 267788 833533
39295 833533 1340175 1475386 1119382 595418 313232 332976 498930 745602 968638 879236
39285 879236 415460 77045 351502 946620 1127674 751447 402957 482930 721049 706333
39275 706333 388848 -80917 -516865 -565780 48830 953650 1354300 1095916 903683 1218495
39265 1218495 1451917 967056 211621 89768 583609 874209 674224 548012 849719
39256 849719 1184260 1183235 1112432 1323208 1633529 1671190 1441949 1176881 944089 768555
39246 768555 818801 1076915 1099999 563982 -141802 -330066 80521 538784 685845 704338
39236 704338 781680 742026 457706 220755 346319 653594 721059 534571 498047 794031
39226 794031 1080672 955219 474960 33338 -136879 -143443 -186937 -320691 -462921 -499758
39216 -499758 -333454 54313 509534 749230 598717 191522 -113667 -39555 363128 735953
39206 735953 690594 149221 -542684 -895586 -727536 -308038 -13750 88290 213415 464778
39196 464778 643573 533694 249024 134018 333226 611673 660823 459842 223777 90273
39186 90273 35768 72436 296019 647799 834219 665227 339328 181200 189217 94633 -171084
39175 -171084 -360739 -311919 -187559 -203575 -356097 -558074 -805997 -1011934 -890953 -301940
39165 -301940 416717 738437 541455 177409 -24477 -78584 -145822 -245345 -268630 -162271
39155 -162271 -10784 32416 -99397 -273760 -273721 -74677 114037 164492 211130 369422 482977
39144 482977 397643 298892 443071 688274 689648 493475 489909 754230 905249 739733 549372
39133 549372 590146 650209 442598 92771 -95645 -99414 -70689 6806 219326 452259 547533
39122 547533 596886 763935 932816 851119 533516 223079 35355 -61983 -9990 259838
39112 259838 551191 557778 306173 144406 276456 589221 930486 1233039 1337501 1051387
39102 1051387 509146 180990 360636 840774 1206306 1267435 1122663 978276 980591 1069148
39092 1069148 978429 574196 163018 194333 642349 999274 945007 692581 560614 545933
39082 545933 498705 419767 372500 336772 321648 389640 449537 330222 187103 429959 1021061
39071 1021061 1296131 849142 181122 1478 252362 402353 413529 708467 1289379 1620603
39061 1620603 1451956 1104085 798888 348118 -250233 -522292 -213828 215708 245016 54538
39051 54538 154819 549648 811598 824727 886488 1081662 1094061 797369 596657 888204
39041 888204 1432963 1595219 1132378 474061 167215 246500 306826 103789 -144201 -117589
39031 -117589 142040 336887 385564 521453 883161 1257426 1369883 1263655 1217953 1377164
39021 1377164 1610663 1705686 1590056 1370167 1203523 1130651 1042452 852417 638484 501601
39011 501601 361980 99359 -151799 -136776 55107 -679 -434287 -774156 -530799 132423
39001 132423 598141 521321 91442 -317046 -486050 -405858 -224853 -134380 -160817 -142948
38991 -142948 -17208 56237 18658 126723 566826 1066356 1235381 1132791 1108438 1214626
38981 1214626 1214852 1104708 1137313 1308522 1298151 1027414 832542 930789 1110855 1124889 1016755
38970 1016755 878441 642919 328357 149573 165755 135444 -64169 -202855 -104944 63205
38960 63205 176249 448394 1010738 1524463 1597853 1306878 930013 476688 -78598 -394636
38950 -394636 -150378 348659 508969 287570 148390 256552 297814 113678 -59071 -75685
38940 -75685 -72802 -41088 250772 695907 734692 127409 -563496 -625370 -44567 611963 911911
38929 911911 834039 531793 163734 -112435 -218577 -208791 -154161 -87092 -103210 -295093 -490471
38918 -490471 -329579 225631 715721 727706 386847 86093 -37996 -84229 -46728 165892
38908 165892 459722 593725 467885 188764 -89152 -237465 -182286 -15499 63432 77341
38898 77341 346346 1004647 1641244 1730300 1287801 783910 502160 325516 115143 -42745
38888 -42745 -10714 231654 613410 961143 1011329 686112 307103 246155 400688 349144
38878 349144 27923 -133953 137167 534547 592068 272193 -67114 -102576 221513 708725
38868 708725 999556 821953 325769 11917 157212 470449 523239 362018 399802 765389
38858 765389 1096013 1063863 828569 755733 852284 774897 398773 82169 191095 559135
38848 559135 694412 445874 151622 101488 186312 216997 272713 482054 698681 695487 525774
38837 525774 408839 395435 428026 570922 834634 914155 528080 -42292 -205330 129546
38827 129546 437850 352628 105127 49309 171173 284345 347022 350153 215449 34068
38817 34068 83011 360558 449726 149550 -95391 208056 842233 1171058 1024905 818493
38807 818493 845417 922989 811000 601089 531231 656736 850885 981015 979082 836359
38797 836359 605601 376100 237645 267665 471102 703979 784355 734495 757609 914831
38787 914831 1044672 1106526 1320351 1758269 2078259 1964827 1606396 1392116 1331374 1165342
38777 1165342 893498 735555 657546 425508 132323 173140 594076 923850 827020 524629
38767 524629 360698 320880 238674 165789 239669 404394 527489 605567 624661 435280 44086
38756 44086 -173986 93676 570058 666614 279613 -42135 186010 790098 1225007 1254302
38746 1254302 1124338 1142543 1309452 1429568 1437413 1460902 1581860 1684210 1614118 1388973
38736 1388973 1140011 924151 728098 599504 595212 610019 453807 149416 -21354 139954
38726 139954 490246 722630 707336 578526 555649 723807 917578 824835 338015 -193360
38716 -193360 -251822 239508 786961 909424 665972 460619 503682 670155 761678 675948
38706 675948 386027 -14464 -260975 -132411 246427 492733 412885 217437 220745 452575
38696 452575 670535 680628 532049 416860 478931 743596 1142754 1520996 1659597 1436390
38686 1436390 1015906 754926 800703 881475 667230 272601 163995 542339 1055289 1220123
38676 1220123 930831 421962 -68935 -410357 -495250 -283112 110673 506097 782240 827859
38666 827859 543601 85050 -75692 351050 981629 1108823 559927 -128207 -456320 -509935
38656 -509935 -575137 -578411 -276551 208809 477967 429565 353161 397960 342303 65992 -99674
38645 -99674 188078 706844 905308 641816 320629 266133 324010 227930 44397 -6455
38635 -6455 30320 -94361 -433445 -764650 -889120 -794588 -537271 -177049 157841 349380
38625 349380 468734 679383 915151 876319 463551 28448 12724 432381 885932 1040053
38615 1040053 961172 932871 1040752 1051892 761173 381753 398236 951757 1568846 1703822
38605 1703822 1405232 1169229 1224729 1308666 1147579 795154 408424 42205 -196720 -141988
38595 -141988 86403 62261 -364567 -773935 -762820 -520333 -425718 -342928 156844 975159
38585 975159 1449193 1224561 713700 511164 705038 978494 1115069 1145197 1151964 1174816
38575 1174816 1258487 1432930 1637920 1741744 1646421 1376994 1086225 928227 883700 789164
38565 789164 605215 517735 632987 734965 588841 361669 417891 744178 944925 850060
38555 850060 742721 843140 941859 809847 677837 942031 1523965 1875311 1631661 1015628
38545 1015628 539664 477336 691333 874652 879762 815352 839161 917468 894494 783252 806821
38534 806821 1066933 1337030 1334622 1081659 819404 648099 462036 232955 144153 345933
38524 345933 694718 855670 653465 261877 28830 132867 438652 687480 761821 705881
38514 705881 572248 402164 328067 484097 753978 820628 602066 443144 663606 1064593
38504 1064593 1163551 857059 539809 523380 635469 548761 285070 171441 397042 807853
38494 807853 1104912 1102794 826348 491426 369710 528732 697894 527353 12956 -448336
38484 -448336 -461437 4089 656049 1132075 1171312 734626 103188 -276167 -215737 28105
38474 28105 138182 170475 380737 733880 911971 804966 655780 645688 677336 707765
38464 707765 926780 1336194 1484733 1032796 385396 296040 886317 1503649 1607061 1370009
38454 1370009 1242027 1286139 1233649 964850 634913 424209 401697 579351 899452 1186624
38444 1186624 1271900 1162814 984099 793830 588385 441571 458070 572975 575745 408722
38434 408722 291122 422925 680476 780884 695128 684905 895874 1133719 1173993 1107055
38424 1107055 1160071 1301994 1306450 1167639 1137163 1288423 1359358 1179865 973234 1006358
38414 1006358 1169558 1179844 1028480 915532 857312 707457 534259 616396 983112 1254228
38404 1254228 1089376 608944 227585 190009 387674 560737 585370 569978 691649 955914
38394 955914 1186961 1268872 1265892 1243577 1145633 970356 877300 938545 974218 853550 753811
38383 753811 844211 928883 766553 558536 674389 1009133 1102694 856749 629981 606821
38373 606821 589217 487858 493729 623942 610309 425958 425351 735633 993512 946373 838205
38362 838205 905753 966916 844781 731277 755448 665151 366130 287274 679214 1010004
38352 1010004 704270 112148 15959 432486 686734 542407 436182 549937 451737 -103183
38342 -103183 -668412 -736888 -400442 -62675 133533 289692 451205 605672 788237 976555
38332 976555 1034512 911425 749475 674260 624382 507047 413231 562582 1047175 1643682
38322 1643682 1908728 1594682 1002033 698614 796384 814445 449435 96359 243452 704388
38312 704388 941257 867801 767005 642370 312175 13962 187784 661344 773696 399236
38302 399236 143974 372354 745673 949163 1159586 1459945 1473831 1023052 566647 516091
38292 516091 625046 525028 365461 409022 464782 300581 207224 525194 942327 924624
38282 924624 609992 600158 990777 1257097 1086532 751629 597449 620014 627990 479361
38272 479361 144719 -186802 -156640 306915 743138 736599 553566 748900 1296103 1638265
38262 1638265 1532280 1300038 1238208 1296142 1383219 1505624 1537289 1326647 1085410 1182628
38252 1182628 1496717 1518819 1209964 1146829 1575416 1919558 1623200 988882 695654 834304
38242 834304 931854 729307 454987 396365 579420 863593 1083735 1106477 940986 767814
38232 767814 725059 737637 669444 535265 447871 472130 625441 879007 1076065 1028810 785044
38221 785044 591808 510538 333653 1500 -216857 -149588 2613 72297 264262 738679
38211 738679 1161948 1116240 745419 529397 561888 527426 299252 65346 -99855 -280785
38201 -280785 -322839 79890 790028 1224919 1132502 915034 967346 1140313 1136821 1016283
38191 1016283 956179 878341 706261 675546 943747 1153676 891856 414329 373893 871379
38181 871379 1300181 1183473 689091 209218 -106367 -209952 19442 510219 857386 760348
38171 760348 409720 185962 165178 191793 264102 519806 914807 1214053 1288288 1191402
38161 1191402 985081 735062 649328 921421 1380785 1573226 1309059 908899 761920 842464
38151 842464 861977 746463 703058 851323 1033253 1049317 908756 752804 657890 632555
38141 632555 717201 934113 1171524 1278397 1288359 1377680 1537062 1483648 1070074 626260
38131 626260 633305 1109460 1589679 1718412 1570850 1325135 958476 475369 154667 252988
38121 252988 600919 785940 667630 466855 411610 539969 794755 1051623 1090234 817090
38111 817090 519370 619561 1140184 1669221 1891880 1873076 1750552 1485533 1104671 907499
38101 907499 1145560 1624614 1878441 1698789 1310291 1034964 942459 884522 792194 823758
38091 823758 1127338 1490871 1442490 845159 203552 118636 559518 989103 1113800 1096334
38081 1096334 1033260 715427 79921 -521813 -762755 -724134 -608131 -393382 -42047 269683
38071 269683 442117 685575 1125426 1451034 1351377 1066289 1069286 1374500 1601461 1591694
38061 1591694 1499211 1371820 1144139 1011587 1288896 1840025 2139600 2007433 1807877 1774577
38051 1774577 1641336 1216277 870958 1047527 1554560 1767541 1407186 792276 390288
38042 390288 385648 653866 935208 1028097 954014 921444 1051912 1223271 1268034 1200138 1117190
38031 1117190 1006006 812612 603935 480299 414431 372288 504414 950813 1470292 1569586
38021 1569586 1116406 578953 473051 755586 995351 1002147 965325 992390 883869 529908
38011 529908 234967 363456 822366 1191413 1279598 1250593 1242107 1205656 1166643 1298867 1605208
38000 1605208 1807827 1716723 1469286 1260174 1086130 919078 862678 941098 1000610 1029563
37990 1029563 1267841 1730318 1960775 1635524 1107861 899439 920040 740683 438672 510731
37980 510731 990702 1333426 1282181 1210883 1384531 1476998 1173298 763328 704978 938220
37970 938220 1068828 1008396 1017780 1230828 1483179 1572856 1444128 1154914 849968 716477
37960 716477 822733 1058036 1310607 1573703 1788117 1770854 1464025 1104825 975543 1094131
37950 1094131 1282293 1400477 1373936 1141717 763555 462619 387979 430208 423762 413800 539000
37939 539000 750381 865154 863653 924744 1137037 1335724 1305822 1067712 873304 916454
37929 916454 1107831 1200230 1108706 981367 929903 874116 761297 728548 843074 884137 677265
37918 677265 476776 641550 1036629 1186990 996923 862897 1027922 1280289 1404110 1489810
37908 1489810 1630450 1706078 1658786 1635973 1699950 1728233 1708410 1748853 1720319 1366123 872700
37897 872700 757555 1021746 1076636 773965 735323 1212562 1451977 906308 333568 733952
37887 733952 1734999 2123333 1661990 1226096 1237425 1157024 698267 421136 701330 1032293
37877 1032293 890541 563868 545241 691683 588040 309292 236621 421370 649039 891655
37867 891655 1220071 1464803 1421053 1251275 1263878 1397800 1332079 1042813 846622 878651
37857 878651 901716 734793 570733 693139 1054176 1320193 1282133 1077638 978155 1048061
37847 1048061 1116079 1069257 1025262 1125007 1295756 1384591 1408662 1447078 1381625 1056793 677240
37836 677240 679631 1113047 1498033 1487825 1353198 1537852 1983285 2246577 2155916 1976738
37826 1976738 1930972 1889148 1652366 1293166 1038999 958877 960617 1041852 1326179 1782526
37816 1782526 2085641 1940361 1490107 1203727 1326282 1624110 1744395 1636451 1487975
37807 1487975 1424559 1458145 1583584 1704397 1588991 1167561 789102 878219 1349920 1666835
37797 1666835 1512252 1111499 814483 671110 575843 552702 654153 765977 786142 897136
37787 897136 1375523 2128713 2678057 2699609 2391515 2151977 2035271 1768171 1270960 858778
37777 858778 789372 869756 770367 547688 518319 723155 918839 1066382 1351700 1645029
37767 1645029 1477581 808809 324277 578543 1227486 1561883 1500050 1549261 1972868 2494933
37757 2494933 2756453 2657973 2304399 1933894 1801438 1846877 1654371 1046656 475129 448598
37747 448598 846862 1232440 1532828 1873806 2038477 1762883 1370146 1408747 1791909 1989433
37737 1989433 1922820 1899784 1810576 1309117 751615 926480 1720639 2104747 1714013 1377355
37727 1377355 1660932 1974219 1753535 1518236 1908033 2498931 2522561 2134736 2015478 2194532
37717 2194532 2216511 2092033 2145424 2194718 1812954 1235252 1110995 1432639 1561684 1314653
37707 1314653 1207439 1530609 1921043 2013018 1886337 1702173 1448408 1209499 1197573 1363742
37697 1363742 1405846 1263953 1196409 1302582 1401227 1438144 1563382 1731178 1685658 1449382
37687 1449382 1371830 1557412 1688382 1588500 1537700 1790103 2124928 2139811 1770826 1339649
37677 1339649 1247967 1681728 2394532 2774126 2425526 1714551 1384491 1591346 1746535 1449234
37667 1449234 1097713 1258102 1794282 2058349 1777158 1342043 1230083 1452692 1662856
37658 1662856 1607038 1332993 1026476 788472 627969 583428 707222 927992 1081979 1124843
37648 1124843 1151804 1155136 975242 603455 306159 288625 454811 665192 964026 1326217
37638 1326217 1478715 1297516 1122553 1303915 1657295 1774420 1672455 1686986 1884821 2062811
37628 2062811 2202339 2416093 2532266 2278321 1857709 1787971 2109326 2280161 1966475 1457722
37618 1457722 1178875 1231874 1524150 1899882 2032667 1657992 1059990 873288 1249652 1683608
37608 1683608 1812819 1855671 2015342 2017536 1648235 1300172 1493927 2128872 2639351 2704174
37598 2704174 2445515 2101432 1839093 1760615 1801475 1721798 1414060 1091780 992598 1059472
37588 1059472 1094995 1048480 974783 914723 996364 1413301 2075411 2513855 2395459 1935578
37578 1935578 1553122 1337137 1148776 1031247 1130726 1322826 1309483 1078822 938074 1053005
37568 1053005 1239534 1290952 1278501 1403074 1693957 1983128 2121143 2120875 2076947 2001427 1822212
37557 1822212 1566633 1426406 1514183 1655427 1626761 1543590 1739331 2235914 2622909 2569642
37547 2569642 2208570 1878267 1721600 1701518 1788523 1910545 1880939 1618092 1347829 1371922
37537 1371922 1675573 1946205 1976543 1898817 1975368 2239878 2421212 2248408 1797440 1437087
37527 1437087 1402531 1564770 1709903 1850985 2063271 2196953 2065960 1820811 1791385 1997948
37517 1997948 2158476 2162003 2166419 2208995 2116255 1880575 1739587 1761214 1725662 1571667 1585987
37506 1585987 1944171 2398000 2647659 2727439 2793476 2815643 2732787 2655263 2642691 2501644
37496 2501644 2088120 1647453 1583761 1987376 2583040 3040422 3180058 2998136 2653558 2358936
37486 2358936 2201589 2155462 2248389 2512001 2773288 2784941 2616499 2607238 2841305 2998509
37476 2998509 2861114 2636835 2588657 2636487 2540032 2246837 1883735 1609779 1590436 1877627
37466 1877627 2234319 2358056 2326871 2468671 2749451 2770066 2498556 2452285 2880920 3304709
37456 3304709 3254374 2999421 3068890 3421701 3601521 3451534 3189737 2962252 2765670 2680438
37446 2680438 2791697 2960418 2957962 2728918 2350439 1951905 1827158 2264735 3021555 3384347
37436 3384347 3101143 2820001 3158553 3766926 3887223 3487989 3165251 3139461 3071306 2804698
37426 2804698 2602406 2585555 2551721 2480863 2672747 3172234 3516355 3328165 2839811 2553108
37416 2553108 2597022 2686411 2616530 2559262 2816451 3388062 3909582 4056237 3889285 3668355
37406 3668355 3454795 3167941 2947305 3068834 3458312 3681001 3528254 3250226 3104232
37397 3104232 3082765 3211730 3636147 4199062 4419477 4159007 3846733 3766841 3637773 3248389
37387 3248389 2977982 3216907 3716744 3997530 4008347 3929475 3729274 3403071 3255645 3442621
37377 3442621 3608000 3467844 3340898 3566269 3827755 3673947 3323010 3284611 3499001 3522743
37367 3522743 3313464 3185363 3204274 3222782 3290144 3469070 3511672 3270839 3120575 3393988
37357 3393988 3763168 3793364 3702277 3863109 3984758 3627805 3176989 3364632 4054664 4434425
37347 4434425 4272138 4068470 4051241 3949578 3776944 3951438 4516699 4980279 5033574 4822835
37337 4822835 4509199 4160409 4011570 4225918 4500416 4486231 4390874 4540719 4655736 4307024
37327 4307024 3778641 3629920 3697099 3451260 3078101 3194376 3686187 3867328 3662903 3612147
37317 3612147 3819785 3943601 4083396 4576269 5027141 4725276 3975731 3804120 4334116
37308 4334116 4694415 4572259 4557287 4824629 4826634 4542871 4717799 5497322 6048730 5910660
37298 5910660 5577459 5418856 5180005 4878203 5017518 5559290 5818316 5677286 5730620 5994872
37288 5994872 5792345 5189241 5115227 5674933 5842771 5328326 5191282 5962098 6697114 6669747
37278 6669747 6493877 6706900 6730024 6225894 6057277 6783525 7511418 7393594 7048994 7311436
37268 7311436 7724367 7523252 7073528 7083923 7320692 7305369 7413403 8097158 8821026 8896565
37258 8896565 8632807 8640694 8772594 8704927 8732031 9051471 9173072 8962770 9238862 10287095
37248 10287095 10845969 9765531 7738136 6202847 5448645 4993338 4908295 5451978 6140469
37239 6140469 6409750 6555595 7002920 7409730 7443354 7556793 8057953 8403102 8339205 8592269
37229 8592269 9427017 9828374 9255730 8827753 9467714 10286577 10249795 10016956 10516984 11095660
37219 11095660 10851696 10523894 11190235 12249450 12533505 12314249 12413136 12485217 12012177
37210 12012177 11781146 12490169 13138900 12736207 12261658 12892050 13721450 13473964 13015714
37201 13015714 13724993 14782067 14692420 14175147 14803297 16020374 16324564 16218540 17083323
37192 17083323 18287531 18394281 18093137 18895149 20105334 20227420 20101199 21332718 22942953
37183 22942953 23093070 22749874 23885904 25497324 25481797 25008100 26603246 29299715 30390552
37174 30390552 30616556 32577914 35420124 36565337 37291444 40620358 45067618 46983231
37166 46983231 47610530 50570893 53930900 53181295 50775406 53153479 59358556 63571211
37158 63571211 67983490 79723786 95106712 103794756 110472706 129735219 149689671
37151 149689671 125894614 34841704 -81980896 -154627015 -159282660 -131986476 -112434793
37144 -112434793 -103322711 -90452698 -74405592 -65010744 -61539885 -56586500 -51009977 -50661295
37136 -50661295 -53813304 -53743383 -50009748 -47283437 -46054336 -43200070 -39312114 -37593113
37128 -37593113 -37300910 -35187408 -31862837 -30502664 -30710826 -29501481 -27084980 -26155638
37120 -26155638 -26492326 -25497260 -23288102 -22346234 -22717587 -22155420 -20556746 -19932524 -20326626
37111 -20326626 -19848261 -18502099 -18120130 -18666390 -18288495 -16934632 -16403916 -16837190 -16525001
37102 -16525001 -15244841 -14575023 -14795037 -14550579 -13726207 -13655298 -14272691 -13972110 -12615593
37093 -12615593 -11918301 -12443567 -12823194 -12383549 -12038958 -12106746 -11653710 -10589472 -10170299
37084 -10170299 -10803956 -11375752 -11291137 -11269733 -11638314 -11698171 -11246188 -10960222 -10900397 -10368247
37074 -10368247 -9546964 -9475777 -10082221 -10082829 -9204061 -8638229 -8854052 -8841069 -8110142 -7615123
37064 -7615123 -7965717 -8406516 -8331085 -8238980 -8421701 -8216386 -7391807 -6844724 -7043685 -7129823
37054 -7129823 -6514440 -6131270 -7030216 -8710415 -9895384 -10211250 -10166106 -10074409 -9862545
37045 -9862545 -9552183 -9279815 -9064393 -8882278 -8699934 -8358755 -7837803 -7544607 -7768727
37036 -7768727 -8019762 -7658097 -6986683 -6801406 -7024306 -6853074 -6203087 -5844200 -6044608
37027 -6044608 -6239334 -6175827 -6225061 -6380225 -6139118 -5626502 -5631674 -6215356 -6477449 -6084692
37017 -6084692 -5817938 -6131641 -6370532 -6013695 -5580334 -5620998 -5813303 -5764442 -5798146 -6223789
37007 -6223789 -6640239 -6665190 -6609399 -6765377 -6755691 -6270570 -5784787 -5843613 -6196567 -6277035
36997 -6277035 -6038941 -5747993 -5427061 -5040673 -4783764 -4723400 -4591505 -4316822 -4265809 -4573934
36987 -4573934 -4767267 -4474164 -4033186 -3976459 -4320171 -4711403 -4896485 -4801092 -4545762 -4510186
36977 -4510186 -4902117 -5237558 -4894407 -4189034 -4058906 -4573062 -4762882 -4225547 -3817647
36968 -3817647 -4213051 -4776452 -4617471 -3946698 -3560570 -3610938 -3704864 -3749719 -3927680 -4161137
36958 -4161137 -4249267 -4275355 -4386370 -4462536 -4410039 -4433512 -4654684 -4847039 -4872316 -4938618 -5121338
36947 -5121338 -5136928 -4912765 -4821233 -4995046 -5008839 -4638594 -4315280 -4372207 -4470021 -4280894
36937 -4280894 -4126807 -4354311 -4630388 -4477441 -4036926 -3716258 -3513851 -3249672 -3044019
36928 -3044019 -3035774 -3028917 -2894017 -2880332 -3089862 -3169562 -3007392 -3135475 -3847102 -4496837
36918 -4496837 -4379458 -3812281 -3609883 -3887385 -4112378 -4018037 -3778905 -3551889 -3446092 -3659554
36908 -3659554 -4097443 -4203183 -3720368 -3222120 -3294085 -3628110 -3590815 -3261520 -3154583 -3274897
36898 -3274897 -3250695 -3138224 -3298411 -3649788 -3781564 -3673458 -3632146 -3660435 -3535233 -3352821
36888 -3352821 -3357910 -3396564 -3184027 -2954812 -3180779 -3757937 -4111575 -4020333 -3750804 -3492244
36878 -3492244 -3234814 -3072001 -3046253 -2850694 -2273442 -1755672 -1866710 -2383735 -2571193 -2266011
36868 -2266011 -2003195 -2122192 -2410875 -2622097 -2732643 -2698419 -2511623 -2457413 -2774962 -3155866
36858 -3155866 -3138742 -2877205 -2905643 -3253590 -3435609 -3246035 -2935258 -2677991 -2494581 -2583799
36848 -2583799 -3049422 -3406008 -3097035 -2426972 -2200488 -2496577 -2655928 -2484218 -2517736 -2939362
36838 -2939362 -3185462 -2951669 -2728006 -2919473 -3188550 -3125059 -2904077 -2809447 -2701073 -2434208
36828 -2434208 -2261431 -2317650 -2202739 -1623183 -1042173 -1110801 -1717976 -2143477 -2006072 -1609685
36818 -1609685 -1431288 -1628967 -2020943 -2284806 -2198436 -1854356 -1596428 -1655197 -1936378 -2218579
36808 -2218579 -2408628 -2526848 -2579985 -2531533 -2329686 -1977654 -1648163 -1617672 -1950214 -2387236
36798 -2387236 -2698038 -2909566 -2987040 -2643817 -1864972 -1281243 -1461454 -2064343 -2318803 -2175871
36788 -2175871 -2259787 -2726591 -2970701 -2620754 -2103720 -1930860 -2008754 -1981288 -1787529 -1576839
36778 -1576839 -1445876 -1497548 -1816980 -2203342 -2256528 -1870838 -1334140 -902689 -665152 -801148
36768 -801148 -1422662 -2088667 -2098834 -1478561 -1094303 -1516338 -2305250 -2746174 -2772781 -2753438
36758 -2753438 -2790644 -2719862 -2564606 -2566798 -2832418 -3170669 -3234994 -2795086 -2027606 -1479405
36748 -1479405 -1483235 -1719105 -1702436 -1520449 -1559731 -1680285 -1393558 -839126 -754225 -1308696
36738 -1308696 -1784889 -1700058 -1459877 -1513936 -1621343 -1457688 -1284753 -1442375 -1712955 -1748560
36728 -1748560 -1669502 -1723906 -1786880 -1688405 -1618551 -1737503 -1804969 -1651792 -1576574 -1809690 -2045856
36717 -2045856 -1993577 -1901444 -2012281 -2009379 -1623377 -1306959 -1602414 -2227285 -2504329 -2376378
36707 -2376378 -2285456 -2333767 -2289042 -2190290 -2238650 -2282650 -2092563 -1939124 -2195628 -2559390
36697 -2559390 -2406779 -1763882 -1173580 -756298 -234640 205557 11352 -703963 -1129080
36688 -1129080 -970548 -867796 -1294988 -1835572 -1967510 -1877032 -1967910 -2111814 -1973788 -1711238
36678 -1711238 -1767372 -2160293 -2465917 -2423244 -2172729 -1932937 -1764550 -1681262 -1748556 -1978061
36668 -1978061 -2239392 -2367245 -2344337 -2320415 -2391922 -2403213 -2123575 -1659084 -1469888 -1817084
36658 -1817084 -2368324 -2566629 -2271942 -1831146 -1612468 -1671378 -1804888 -1779339 -1575442 -1475516
36648 -1475516 -1735323 -2126344 -2123199 -1670769 -1351166 -1538239 -1838235 -1757788 -1486899 -1493983
36638 -1493983 -1714968 -1769726 -1708064 -1853893 -2083732 -1983743 -1654242 -1622788 -1921206 -1978097
36628 -1978097 -1583427 -1275184 -1491352 -1912578 -1991180 -1697128 -1399603 -1327953 -1444018 -1616892
36618 -1616892 -1700516 -1605978 -1414901 -1261715 -1101865 -833014 -605341 -686250 -1018887 -1249542
36608 -1249542 -1199088 -984953 -722908 -491947 -533590 -1010093 -1562778 -1619929 -1210721 -970451
36598 -970451 -1237704 -1655792 -1809595 -1743549 -1649279 -1519199 -1343480 -1230638 -1130800 -858992
36588 -858992 -566848 -710638 -1318344 -1774064 -1626970 -1170464 -905470 -865752 -839007 -859556
36578 -859556 -1059712 -1314853 -1414526 -1379930 -1341479 -1333646 -1410956 -1654989 -1868502 -1653770 -1047924
36567 -1047924 -653536 -819909 -1131810 -1093553 -877525 -916024 -1149054 -1241646 -1242926 -1428098
36557 -1428098 -1692476 -1702750 -1525662 -1519894 -1654088 -1503915 -971184 -494578 -425368 -607893
36547 -607893 -726746 -742933 -823436 -1053253 -1336118 -1463325 -1279173 -903060 -715074 -947816
36537 -947816 -1370630 -1562071 -1407837 -1144248 -1015276 -1083522 -1268613 -1380218 -1248081 -1008900
36527 -1008900 -1072458 -1559590 -1993197 -1880702 -1427199 -1280563 -1665323 -2152539 -2244262 -1834147
36517 -1834147 -1127611 -467883 -238201 -575842 -1124696 -1361678 -1207946 -1051788 -1162196
36508 -1162196 -1387817 -1488342 -1465300 -1453534 -1507536 -1597752 -1658221 -1584462 -1328852 -1016853
36498 -1016853 -834351 -820091 -904493 -1079789 -1346121 -1563079 -1571168 -1408739 -1208681 -963864
36488 -963864 -622829 -315943 -206897 -202072 -117652 -64578 -296481 -679412 -721382 -254836
36478 -254836 239764 177710 -473516 -1231248 -1630346 -1584253 -1312643 -1026243 -713495 -286963
36468 -286963 96381 95703 -331693 -800606 -1059961 -1344457 -1819760 -2046680 -1561574 -751113
36458 -751113 -469205 -860503 -1272553 -1371978 -1580236 -2171610 -2666879 -2550244 -2042398 -1700068
36448 -1700068 -1664391 -1743510 -1878534 -2078153 -2175006 -2070695 -1990684 -2119662 -2220933 -1992894
36438 -1992894 -1569435 -1279292 -1136416 -983472 -926158 -1150665 -1445433 -1387953 -964977 -588319
36428 -588319 -518935 -653995 -845047 -1031881 -1078665 -887934 -705214 -903793 -1391115 -1626590
36418 -1626590 -1369577 -1043417 -1133307 -1500111 -1576575 -1128160 -577276 -539137 -1128418 -1808403
36408 -1808403 -1998292 -1773790 -1731215 -2100844 -2363274 -2029238 -1446996 -1330984 -1688503 -1829485
36398 -1829485 -1429152 -951560 -861068 -990819 -986753 -903095 -981884 -1182992 -1304389 -1320124
36388 -1320124 -1275137 -1076719 -711621 -457538 -542366 -760834 -751700 -512466 -333668 -363454
36378 -363454 -542175 -820714 -1113291 -1177000 -913872 -687991 -935000 -1503093 -1793364 -1555252
36368 -1555252 -1133323 -888745 -802639 -755425 -779913 -859629 -846389 -785403 -972697 -1439816
36358 -1439816 -1715603 -1429195 -887815 -677873 -862861 -971277 -706276 -290192 -89707
36349 -89707 -217711 -559793 -913422 -1015945 -696874 -147272 163685 10430 -300080 -343815
36339 -343815 -160552 -173504 -563293 -1010573 -1174519 -1176753 -1356612 -1685293 -1771148 -1474047
36329 -1474047 -1163414 -1185975 -1362244 -1294489 -983920 -805078 -950622 -1222923 -1351137 -1226936
36319 -1226936 -855534 -381244 -143439 -364062 -764214 -850801 -608315 -490761 -669074 -791598
36309 -791598 -665376 -630008 -921090 -1155466 -910344 -435521 -283349 -510413 -750794 -851055
36299 -851055 -910519 -867331 -578695 -205623 -27256 16152 113035 76640 -370407 -934289
36289 -934289 -1042583 -765909 -730116 -1048238 -1115463 -684599 -375925 -724839 -1389417 -1792311
36279 -1792311 -1971482 -2210777 -2290408 -1790228 -899845 -301307 -323734 -690226 -1032873 -1231444
36269 -1231444 -1278651 -1191579 -1080537 -1047594 -1034472 -950095 -839769 -746953 -582476 -349202
36259 -349202 -283970 -502833 -723302 -670185 -559287 -785235 -1258569 -1465640 -1150224 -588771
36249 -588771 -211090 -237613 -624957 -1062883 -1100464 -608470 -57727 145 -335785 -481533
36239 -481533 -223626 33039 -63568 -326512 -399158 -279463 -236696 -394245 -589769 -564208
36229 -564208 -208444 293777 567540 416672 63688 -132438 -136413 -203959 -440415 -654548
36219 -654548 -664165 -505293 -304711 -159525 -162931 -330692 -482009 -420031 -264518 -378881
36209 -378881 -903002 -1540051 -1856920 -1660968 -1104972 -587976 -486444 -755960 -863860 -389965
36199 -389965 360906 668557 296599 -280885 -575385 -600939 -581803 -547102 -444691 -356135
36189 -356135 -353289 -361842 -366376 -522552 -849349 -1032031 -800760 -355876 -148417 -324901 -634492
36178 -634492 -838263 -969075 -1159717 -1407398 -1601391 -1684365 -1681824 -1589291 -1330021 -898610
36168 -898610 -495945 -381329 -556623 -731492 -669192 -437339 -253195 -249559 -471860 -881283
36158 -881283 -1236167 -1242352 -1002524 -997818 -1370416 -1604757 -1306367 -894532 -954851 -1238145
36148 -1238145 -1034990 -362976 41753 -92601 -243553 -97776 -54457 -401058 -717538 -542837
36138 -542837 -57980 318911 503081 512396 198024 -345354 -600938 -351579 -121701 -392083
36128 -392083 -827917 -858367 -602705 -570659 -780059 -868275 -842623 -1010497 -1297844 -1323879
36118 -1323879 -1108535 -1072877 -1328438 -1541131 -1521664 -1397101 -1159064 -611357 109352 472708
36108 472708 205370 -374174 -796594 -879093 -673694 -379042 -381151 -957791 -1799234 -2207260
36098 -2207260 -1937747 -1494016 -1403131 -1545081 -1447663 -981879 -478297 -277942 -386550 -543720
36088 -543720 -532366 -414265 -418076 -553789 -508505 -110462 287857 210999 -259403 -575345
36078 -575345 -464094 -202245 -121204 -211200 -305338 -327480 -247810 -80536 -24086 -324052 -892528
36067 -892528 -1324127 -1389785 -1270133 -1217539 -1244081 -1243809 -1190125 -1113748 -1070795 -1157704 -1351342
36056 -1351342 -1383531 -1078105 -762305 -932399 -1483018 -1729857 -1323449 -686271 -346704 -280134
36046 -280134 -185745 -28732 20707 -110340 -443218 -995889 -1509114 -1477492 -829369 -266165
36036 -266165 -472713 -1208602 -1652359 -1485929 -1125992 -948244 -837407 -618296 -460045 -596320
36026 -596320 -929359 -1162891 -1174103 -1063340 -940738 -839139 -801056 -903752 -1146819 -1366875
36016 -1366875 -1337479 -1002695 -589339 -409836 -540938 -776761 -913862 -970600 -1069232 -1210242
36006 -1210242 -1265168 -1146973 -913649 -711543 -623992 -555539 -324749 48947 249477 29462
35996 29462 -401922 -602097 -485297 -398339 -560716 -745035 -653325 -339177 -79475 -48627
35986 -48627 -277302 -699332 -1069440 -1090827 -835925 -781559 -1173896 -1625356 -1661706 -1409425
35976 -1409425 -1314268 -1365673 -1131059 -539213 -93814 -149863 -406900 -377764 -65608 107006
35966 107006 -132744 -662016 -1181102 -1456992 -1398850 -1082450 -706723 -409552 -149654 111714
35956 111714 167767 -268878 -1079350 -1638020 -1440541 -752441 -345302 -549635 -882582 -790287
35946 -790287 -449733 -468349 -957168 -1367225 -1267788 -847793 -495415 -266231 -18921 218629
35936 218629 321121 308083 233117 -8873 -471868 -876134 -856364 -466419 -156657 -215239
35926 -215239 -452806 -504880 -284285 -44926 -62548 -300884 -410083 -117316 382924 566673
35916 566673 169207 -509970 -977032 -1056099 -912732 -743048 -625523 -565788 -509072 -383210
35906 -383210 -254895 -334906 -704355 -1159157 -1441490 -1478384 -1295138 -915579 -492859 -271765
35896 -271765 -211608 61589 643532 1001328 636109 -147745 -602822 -497316 -219641 -61180
35886 -61180 32592 27195 -267885 -710147 -821404 -481034 -153272 -202077 -420131 -487025 -461071
35875 -461071 -502636 -501419 -348195 -248547 -369370 -453027 -217355 81341 -33269 -495083
35865 -495083 -742510 -530070 -251975 -362286 -832301 -1321481 -1598557 -1632620 -1493517 -1339865
35855 -1339865 -1350493 -1501744 -1512388 -1148041 -519864 10079 150739 -154826 -754040 -1317783
35845 -1317783 -1447806 -1002448 -369674 -205364 -741571 -1466727 -1661656 -1179704 -504345
35836 -504345 -101440 -11486 -122088 -461505 -955461 -1185143 -824401 -235960 -185974 -872313
35826 -872313 -1600364 -1606672 -931061 -256743 -99936 -409588 -826486 -1053070 -988327 -728822
35816 -728822 -497362 -451992 -530777 -555746 -480525 -445176 -574985 -803688 -940199 -887508 -759984
35805 -759984 -756749 -918712 -1065892 -1014497 -782091 -493104 -172102 204717 506353 522267
35795 522267 272430 26726 -61267 -137305 -359702 -632511 -775830 -789281 -774998 -752025
35785 -752025 -730604 -812668 -987807 -969176 -527786 78899 328879 84732 -296921 -551219
35775 -551219 -839065 -1317571 -1706505 -1619310 -1162049 -838555 -881073 -1007178 -917750 -734668
35765 -734668 -753590 -972468 -1124067 -1084000 -985320 -934469 -866175 -758038 -769293 -1008816 -1304876
35754 -1304876 -1384867 -1218785 -1032021 -1017294 -1166365 -1343495 -1378616 -1120421 -576680 -32368
35744 -32368 124151 -229915 -817562 -1201026 -1089992 -487220 285305 710903 461527 -238313
35734 -238313 -794517 -897396 -837678 -1044986 -1486176 -1742445 -1588243 -1229956 -954254 -784886
35724 -784886 -613209 -502454 -655981 -1096136 -1537337 -1661771 -1456517 -1197540 -1127313 -1224992
35714 -1224992 -1275771 -1065121 -505997 273589 898013 961371 444874 -172865 -402402 -282385
35704 -282385 -241290 -474735 -725333 -725844 -593432 -629734 -909424 -1245340 -1456206 -1508607 -1456042
35693 -1456042 -1372015 -1310453 -1242217 -1078640 -831926 -675065 -738327 -906757 -936091 -739477
35683 -739477 -460522 -288691 -297582 -443429 -617691 -692684 -606508 -438879 -349585 -407909 -512936
35672 -512936 -513684 -397583 -326631 -462749 -771036 -1042698 -1123292 -1055910 -962154 -862747 -706590
35661 -706590 -522737 -426223 -483926 -665544 -902357 -1090692 -1065693 -710474 -116692 454797
35651 454797 779751 774798 467512 7798 -335000 -372782 -210569 -105369 -122008 -111836
35641 -111836 -29981 -32483 -177704 -253756 -60476 266614 367761 57073 -461563 -763247
35631 -763247 -609968 -238880 -149889 -493005 -817934 -657449 -205932 -62650 -375184 -674080
35621 -674080 -598273 -333367 -190178 -175363 -187992 -252433 -313466 -166263 147579 244589 -612
35610 -612 -143304 165711 561466 478662 7713 -272802 -141202 90562 144685 62646 -23217
35599 -23217 -10127 212665 564627 659549 267821 -266504 -488997 -508926 -690316 -882484
35589 -882484 -643071 -136764 -30353 -412629 -612278 -323874 -137649 -547315 -1128125 -1252466
35579 -1252466 -1070073 -1137106 -1449690 -1506037 -1131851 -659866 -378857 -286365 -327411 -457331
35569 -457331 -509314 -363240 -194199 -226516 -334664 -244498 -33018 -17720 -198673 -260481
35559 -260481 -167401 -302462 -857528 -1465778 -1679835 -1554419 -1504107 -1734384 -2025869 -2010931
35549 -2010931 -1530048 -776977 -184277 -100035 -493089 -1003724 -1301975 -1342644 -1288887 -1299788
35539 -1299788 -1408737 -1499898 -1380543 -983675 -521349 -320462 -466585 -712031 -767492 -574762
35529 -574762 -262432 22884 156612 35469 -323122 -723419 -939094 -914202 -774207 -685301
35519 -685301 -756354 -1001037 -1276640 -1295920 -863832 -167219 290623 165984 -357117 -778419
35509 -778419 -820432 -613473 -364806 -89002 193264 211709 -285912 -1065349 -1517034 -1323768
35499 -1323768 -789898 -413302 -363897 -515070 -728098 -872919 -787932 -529234 -502928 -980163
35489 -980163 -1562202 -1556485 -918715 -372759 -434322 -756008 -750354 -482251 -469897 -815974 -1093149
35478 -1093149 -1081569 -1079487 -1309817 -1474473 -1212396 -691744 -383599 -424064 -552420 -579284
35468 -579284 -556265 -498840 -294035 28431 206759 53070 -335614 -744429 -1025044 -1058100
35458 -1058100 -776450 -344328 -88486 -109008 -171716 -126711 -163500 -420030 -608218 -384328
35448 -384328 70644 233922 -50896 -412248 -489679 -282419 68513 477275 781864 750088
35438 750088 395712 39598 -104407 -168346 -295839 -334785 -112416 186768 223628 -8346
35428 -8346 -184113 -123143 -23105 -167065 -567972 -986460 -1215326 -1277192 -1358007 -1574051
35418 -1574051 -1835895 -1974828 -1951828 -1838156 -1634089 -1298037 -983835 -1009530 -1432871 -1831213
35408 -1831213 -1721325 -1122000 -504547 -222812 -184111 -95396 145733 387988 443306 259578
35398 259578 -90623 -493342 -822303 -951422 -855764 -717189 -792654 -1087637 -1295905 -1211712
35388 -1211712 -1055581 -1146005 -1360252 -1275531 -846461 -544160 -683855 -972346 -952102 -606062
35378 -606062 -257098 -107433 -165403 -422327 -781119 -965297 -831041 -656833 -794304 -1130488
35368 -1130488 -1254018 -1085157 -935616 -940821 -867422 -594800 -375630 -401534 -449567 -249999
35358 -249999 39191 50757 -242987 -525129 -619846 -667422 -786347 -854603 -754477 -607690
35348 -607690 -571125 -548292 -352586 -100428 -155148 -610753 -1092586 -1235055 -1138940 -1118873
35338 -1118873 -1182547 -1092732 -844695 -683964 -640067 -454960 -80278 156949 63244 -135666
35328 -135666 -249315 -453733 -837020 -1019672 -705746 -300675 -407571 -899993 -1116993 -904194
35318 -904194 -799928 -1109250 -1430009 -1325682 -933909 -608612 -390700 -147548 124388 435310
35308 435310 892252 1341970 1281319 518922 -363237 -642432 -333898 -7910 68835 104216
35298 104216 205955 194285 34422 -42815 15448 -42979 -277508 -337776 -14425 320939
35288 320939 159957 -466430 -1073886 -1341919 -1334515 -1203313 -1004522 -809695 -704632 -613668
35278 -613668 -349370 92686 473055 594087 461458 124282 -400844 -941342 -1166573 -982275
35268 -982275 -731035 -756903 -927452 -871876 -577349 -404395 -529141 -717656 -724900 -610138
35258 -610138 -534059 -508464 -502091 -576832 -758190 -944644 -1069679 -1169334 -1193798 -1001402 -673060
35247 -673060 -534669 -659347 -664145 -301334 54554 -83651 -565246 -853658 -869750 -1010642
35237 -1010642 -1349725 -1430915 -1025126 -547240 -415589 -423007 -136966 358003 551964 244796
35227 244796 -173448 -212372 167743 553143 524078 79203 -367360 -446071 -256736 -207658
35217 -207658 -451540 -694476 -628438 -326104 -57827 103402 296730 589485 858737 931001
35207 931001 736662 361951 16098 -109800 -16213 115594 132043 39976 -66393 -106162
35197 -106162 -33411 128197 276216 374474 559079 915057 1202370 1079569 608734 226097
35187 226097 146824 142355 36268 36270 314694 593273 504349 141948 -120503 -209532 -359871
35176 -359871 -612764 -688043 -395017 115850 559044 746727 601052 170536 -314737 -594631
35166 -594631 -631949 -570927 -465781 -255489 -11768 33236 -203416 -506179 -632371 -599839
35156 -599839 -606232 -767800 -1027708 -1242814 -1288841 -1145879 -932279 -786548 -676456 -412071
35146 -412071 89499 631147 913031 838497 565922 296849 116758 40103 80300 191704
35136 191704 225076 66202 -201334 -387527 -439960 -463185 -507569 -541145 -661476 -1044657
35126 -1044657 -1529015 -1572551 -948555 -233280 -162793 -649185 -936726 -678167 -276849 -84931
35116 -84931 96352 432217 560648 169604 -340162 -333120 133171 386891 63625 -512714
35106 -512714 -861698 -860256 -667478 -442685 -234168 11460 338027 588845 472785 -2096
35096 -2096 -349478 -137017 436920 787707 644618 203344 -293231 -756789 -1091626 -1202196
35086 -1202196 -1180087 -1185053 -1149285 -893070 -504292 -277831 -280668 -297610 -213173 -126019 -80055
35075 -80055 -17773 -14215 -209608 -491888 -614373 -640052 -834207 -1068087 -859998 -199190
35065 -199190 212259 -100281 -642451 -612918 1933 512333 533652 362722 334362 304348
35055 304348 -16549 -535532 -868129 -830260 -603119 -422631 -299411 -124673 86136 215338
35045 215338 255895 312595 374207 286608 15938 -282404 -551126 -907285 -1262775 -1215685
35035 -1215685 -651897 -143093 -271074 -766173 -869915 -435519 -38834 6683 49641 329656
35025 329656 481680 201508 -121717 57840 601414 870942 582207 61832 -262483 -306610
35015 -306610 -295738 -490533 -910010 -1241109 -1151727 -735115 -412587 -343649 -265284 -38886
35005 -38886 46139 -231086 -588879 -646704 -484621 -446636 -598017 -711691 -631931 -380281
34995 -380281 -77863 19390 -327219 -895501 -1030347 -452523 272973 459742 163519 -134645
34985 -134645 -368787 -801399 -1316504 -1484331 -1283609 -1129555 -1154801 -1049627 -689279 -353798
34975 -353798 -202081 -63612 94056 23841 -263157 -333019 2820 299189 105895 -368847
34965 -368847 -590200 -429799 -215163 -225804 -444003 -680697 -708402 -387863 134012 466839
34955 466839 386601 87179 -104587 -106951 -40979 9075 24606 -4183 -6452 148010 412038
34944 412038 513288 298204 -45636 -265337 -348462 -377559 -304923 -127537 -92222 -401148
34934 -401148 -821342 -923207 -676991 -495759 -655773 -960160 -1061396 -878642 -576957 -322825
34924 -322825 -205617 -265627 -430846 -482582 -240920 192811 475731 360493 -44175 -394275
34914 -394275 -466776 -334383 -199402 -163788 -212614 -300775 -335852 -185131 114910 235646
34904 235646 -100458 -657491 -858372 -504299 -36264 74026 -94299 -184961 -156325 -227235
34894 -227235 -380108 -366737 -230219 -384691 -985899 -1551257 -1494947 -863821 -258489 -108355
34884 -108355 -291814 -453208 -423253 -248168 -31394 91528 -36564 -411234 -744423 -714149
34874 -714149 -358364 -70049 -143365 -444122 -609122 -473476 -193844 -13066 -30268 -189833
34864 -189833 -369384 -426303 -239243 195029 685803 931482 767778 362683 88576 123545
34854 123545 241117 110090 -251391 -496020 -413648 -163448 14974 85513 72021 -141403
34844 -141403 -618187 -1095411 -1167342 -746758 -182222 81221 -136678 -655453 -1076931 -1102371
34834 -1102371 -822227 -593803 -550863 -446032 -145462 6458 -342598 -936629 -1218829 -1149718
34824 -1149718 -1209870 -1570163 -1787592 -1488815 -889836 -386669 -24378 320171 552920 523034
34814 523034 357911 292214 290377 138672 -178126 -460316 -590509 -615197 -586677 -545265 -618134
34803 -618134 -911954 -1292777 -1449755 -1227330 -795086 -458584 -358515 -375313 -318870 -192148
34793 -192148 -176638 -297171 -272434 81890 446296 347674 -136229 -443979 -325685 -83422
34783 -83422 90290 428320 953469 1124619 621064 -2954 -70044 187873 67774 -394454
34773 -394454 -489445 -52842 253265 49630 -177148 33226 324162 149789 -294286 -365123
34763 -365123 65291 494279 540177 355766 272212 349448 350840 18009 -617642 -1135694
34753 -1135694 -1090301 -587522 -285243 -616935 -1227904 -1459097 -1204975 -921124 -868246 -785347
34743 -785347 -418899 -21488 -64468 -594189 -1109174 -1101721 -605931 -128509 -56121 -251024
34733 -251024 -336584 -264546 -330930 -621641 -797064 -619582 -374339 -428948 -601124 -396559
34723 -396559 213686 702276 698516 379431 65741 -156841 -247413 -53361 360020 536037
34713 536037 143948 -514127 -844176 -673610 -312482 -36220 119943 109129 -168914 -573452
34703 -573452 -728035 -476383 -93418 96584 92742 54286 -23649 -239825 -499429 -532093
34693 -532093 -218159 229671 454330 293219 -75674 -334366 -381498 -417166 -609195 -808930
34683 -808930 -785249 -632506 -654497 -866118 -946603 -749572 -512801 -431955 -375243 -209619
34673 -209619 -52257 58804 367507 897043 1084375 440425 -606129 -1082878 -673935
34664 -673935 -60723 -5961 -516675 -1028435 -1088117 -733396 -418515 -594121 -1174650 -1529490
34654 -1529490 -1262566 -788776 -715885 -894419 -724178 -269813 -226696 -661717 -699874 121906
34644 121906 998821 984236 345523 52656 349702 636961 549851 378029 434481 643248
34634 643248 812300 827704 547911 -58834 -655838 -820064 -593726 -390677 -385664 -386678
34624 -386678 -284822 -207528 -197505 -130805 -2965 45244 3652 -40227 -184107 -579393 -1031153
34613 -1031153 -1148198 -921249 -739085 -793104 -896784 -941969 -1047347 -1135116 -865963 -220234
34603 -220234 300486 329385 122832 111759 293359 373470 250303 53423 -110514 -202785
34593 -202785 -201999 -191585 -321584 -536072 -552894 -269086 41096 94362 -66804 -266990 -472019
34582 -472019 -676437 -752383 -624468 -411017 -229083 -60592 61082 -2410 -202544 -254102
34572 -254102 -83218 -28533 -341531 -755980 -837872 -540677 -149198 108234 134487 -112390
34562 -112390 -484124 -641169 -463688 -264128 -344611 -588721 -754275 -865250 -968398 -814657
34552 -814657 -239054 368054 456267 47784 -362467 -502248 -470986 -332579 -63939 155593
34542 155593 101501 -67946 -10764 197114 162529 -119728 -218349 -12598 80311 -177741
34532 -177741 -440464 -397405 -335907 -668154 -1212518 -1403082 -1087253 -723303 -764943 -1105979
34522 -1105979 -1235817 -864612 -302229 -122743 -439358 -727155 -554142 -243414 -410852
34513 -410852 -984893 -1231128 -811495 -264374 -197368 -491120 -668768 -666939 -757370 -906640
34503 -906640 -721296 -55773 684423 973134 725356 337402 233327 422134 533984 320569
34493 320569 7548 -29933 140970 55158 -475933 -1076484 -1344140 -1361366 -1435646 -1587593
34483 -1587593 -1593350 -1378927 -1095230 -895861 -862283 -1047457 -1379946 -1625249 -1650541 -1615592
34473 -1615592 -1677306 -1641253 -1218758 -566463 -208311 -354100 -615721 -563960 -313443 -295486
34463 -295486 -581735 -755941 -516583 -132526 -79770 -382698 -640833 -686128 -794202 -1059625
34453 -1059625 -1001023 -241668 694553 876543 206462 -443120 -425191 -40680 156532 156381
34443 156381 184265 125961 -178696 -430235 -261259 90552 97759 -202885 -273848 43991
34433 43991 309856 205539 -75078 -306898 -597840 -1037911 -1394897 -1428881 -1204380 -871530
34423 -871530 -445827 -38684 13963 -421657 -947462 -1066618 -798316 -542702 -455266 -327719
34413 -327719 -83961 -17326 -365000 -876217 -1035841 -659248 -91256 201837 99617 -190044
34403 -190044 -496864 -842167 -1217117 -1426730 -1309662 -983309 -689387 -488039 -307891 -215087
34393 -215087 -346708 -561181 -457249 112795 753369 927874 544234 -1762 -296086 -296325
34383 -296325 -278775 -480169 -816005 -976147 -811423 -523853 -374087 -329407 -205620 -54640
34373 -54640 -108535 -353756 -501207 -452587 -457988 -670741 -878281 -880125 -819879 -880697 -944929
34362 -944929 -873133 -836539 -965566 -918148 -335181 398025 471806 -194933 -737510 -534127
34352 -534127 -60604 -130362 -703578 -1035262 -810929 -504794 -556492 -745356 -633115 -241433
34342 -241433 49320 59136 -70322 -210344 -377831 -530244 -505381 -254974 42200 180738
34332 180738 104025 -157775 -534770 -821194 -756348 -385839 -165177 -443152 -929919 -969024
34322 -969024 -353305 393680 639389 332483 -67586 -202029 -171012 -304622 -698282 -1043938
34312 -1043938 -960698 -488743 -124009 -235048 -565632 -554769 -99926 311912 297574 78593
34302 78593 104443 431042 724314 716330 409984 -49908 -463244 -618307 -491487 -351529
34292 -351529 -447446 -656960 -684251 -541134 -525777 -716935 -824965 -662396 -465920 -537272
34282 -537272 -762368 -740103 -308092 277887 673032 771106 673165 487113 273011 130133
34272 130133 198006 495032 806273 838126 510511 21451 -398942 -691994 -874351 -880158
34262 -880158 -653216 -329420 -156551 -224464 -388043 -458977 -383033 -243536 -178330 -270336
34252 -270336 -444127 -522027 -458869 -421431 -519110 -594440 -480591 -342878 -480375 -841277
34242 -841277 -1058819 -1000020 -954471 -1160811 -1426334 -1399315 -1031360 -601364 -403446 -516332
34232 -516332 -755102 -786214 -445526 12703 176867 20039 -81221 65852 202440 103500
34222 103500 -21607 100340 327773 361672 284959 450945 920161 1353332 1424723 1062528
34212 1062528 366285 -385067 -705853 -280542 560593 1060286 844695 286917 -21098
34203 -21098 63712 207012 65193 -343422 -668834 -592412 -189679 143673 188709 148218
34193 148218 240751 297164 79626 -204409 -160808 111811 117755 -230018 -430408 -166616
34183 -166616 253258 474848 637873 981255 1308986 1296776 1056262 926080 875372 593647
34173 593647 110484 -137223 78880 464131 627459 547286 457291 460401 445289 328248
34163 328248 229812 339771 617338 725286 392601 -193531 -556769 -524625 -417886 -549230
34153 -549230 -795456 -866282 -768273 -724559 -779643 -767962 -590624 -271839 176911 690453
34143 690453 1022540 968238 677693 466623 335234 -3997 -566731 -893453 -589814 130208
34133 130208 646456 603450 233630 22382 146551 309553 146144 -298564 -645560 -707861
34123 -707861 -681207 -720307 -635332 -257277 157118 240129 59554 -42983 -42327 -207529 -522442
34112 -522442 -626380 -435432 -350173 -619081 -888838 -703454 -183214 128186 -50846 -495517
34102 -495517 -842381 -956552 -932285 -894760 -857967 -758058 -630043 -673666 -1002608 -1375646
34092 -1375646 -1396621 -1005146 -550086 -335870 -335354 -410050 -526473 -616788 -501251 -158525
34082 -158525 135690 148828 -6169 -100935 -129450 -182787 -171130 26195 237601 149829 -221396
34071 -221396 -493049 -413941 -182549 -148447 -334770 -411130 -129466 323526 497122 190843
34061 190843 -315562 -612785 -606771 -458228 -224926 138380 470434 463530 131004 -108650
34051 -108650 24367 316489 420233 299975 116969 -74991 -280586 -427576 -514930 -686595
34041 -686595 -933215 -970005 -685019 -438790 -557294 -765643 -572113 -58370 208222 709
34031 709 -319183 -419361 -400408 -454348 -531429 -550990 -629726 -866768 -1105538 -1105521 -823049 -408517
34019 -408517 -57257 71846 -37934 -156760 15578 469193 823177 728179 202141 -480216
34009 -480216 -1060198 -1378073 -1358928 -1059799 -662079 -348730 -239729 -411938 -814033 -1153417
33999 -1153417 -1090122 -647364 -257542 -275349 -584848 -823859 -866983 -892392 -1015456 -1065158
33989 -1065158 -816282 -346165 -24688 -119726 -500981 -815533 -892268 -846789 -837553 -913456
33979 -913456 -1098799 -1378418 -1535861 -1289925 -722396 -267551 -92035 156714 679843 985367
33969 985367 512292 -457874 -1099673 -1135591 -1015336 -1023961 -890180 -456762 -106817 -167618
33959 -167618 -364566 -282122 -31234 -29339 -324332 -549958 -485115 -330391 -392406 -675944
33949 -675944 -859363 -666779 -264758 -160279 -552251 -960452 -821201 -311559 -107579 -360244
33939 -360244 -496036 -158575 267731 358118 286896 340939 301392 -137226 -691741 -823146
33929 -823146 -523205 -220989 -69834 119995 326584 251262 -153674 -550417 -695110 -698845
33919 -698845 -741418 -818250 -824314 -662855 -284324 173133 372407 161172 -148910 -177050
33909 -177050 -8301 8405 -155279 -249899 -260427 -381616 -527938 -411026 -153736 -265218
33899 -265218 -839267 -1297095 -1181377 -762252 -563796 -677434 -866852 -1014874 -1108036 -1046439
33889 -1046439 -837927 -779898 -1086333 -1477704 -1488294 -1090918 -696580 -580897 -598093 -458178
33879 -458178 -61472 435106 713040 513869 -49770 -494640 -501083 -349518 -539479 -1044869
33869 -1044869 -1319976 -1087022 -722569 -681064 -873659 -901957 -658088 -350405 -100342 93620
33859 93620 72210 -349892 -911272 -1034544 -632314 -344147 -631593 -1035153 -840885 -203025
33849 -203025 63454 -270041 -542996 -300839 31664 -46119 -260122 -91594 291357 317862
33839 317862 -23970 -226079 -178048 -327162 -827624 -1198422 -1093682 -866984 -996604 -1349267
33829 -1349267 -1435169 -1141434 -796050 -627251 -535800 -390417 -247978 -215343 -284874 -380448
33819 -380448 -451036 -464180 -393182 -279714 -264876 -462606 -762954 -840917 -485149 98359
33809 98359 472551 492413 443724 571722 721000 646465 449013 394011 456653 408467 272386
33798 272386 307571 545701 713982 674880 601208 621360 596552 368544 -18160 -422137
33788 -422137 -699197 -668981 -286011 122178 139580 -140896 -194127 133571 329913 -30202
33778 -30202 -642035 -938094 -889010 -916982 -1186191 -1401640 -1286212 -933838 -643351 -593396
33768 -593396 -707950 -741347 -524504 -181722 -10635 -102260 -230656 -185326 -30872 59257
33758 59257 41339 -35413 -123712 -135378 4496 164937 82173 -273746 -624823 -762637 -745601
33747 -745601 -642316 -402149 -112239 -35897 -215177 -374851 -397835 -500771 -720302 -693554
33737 -693554 -286491 26710 -136123 -400715 -207867 295277 534109 414077 305755 288255
33727 288255 76372 -333078 -561347 -450492 -253430 -171289 -157865 -202783 -352457 -437020
33717 -437020 -236349 72827 106281 -85457 -64994 272661 552430 555727 471834 417136 252697
33706 252697 27310 50390 314263 360986 -32027 -506793 -698440 -684062 -624039 -449269
33696 -449269 -186290 -116132 -308158 -458254 -470079 -664047 -1073701 -1145129 -623022 -140714
33686 -140714 -288676 -609119 -287932 532070 986949 829382 646708 777699 869163 642974
33676 642974 328774 85481 -320960 -922838 -1228820 -930738 -478485 -475958 -817529 -902442
33666 -902442 -526636 -111226 -95647 -474788 -970437 -1374403 -1623332 -1709621 -1638406 -1427052
33656 -1427052 -1102684 -715263 -350649 -107195 -49552 -166667 -356196 -481971 -487377 -428174
33646 -428174 -376315 -361121 -431203 -641717 -891310 -927552 -676702 -425008 -451478 -605438
33636 -605438 -538808 -275592 -180637 -344020 -407400 -162116 57003 -138371 -586628 -824160
33626 -824160 -768320 -745338 -872626 -831796 -388493 191053 472580 384825 153264 -144673
33616 -144673 -610665 -1121860 -1273797 -912466 -450906 -370141 -568915 -553286 -207072 37557
33606 37557 -105805 -316100 -171436 172886 202586 -178194 -493731 -368532 -18775 83379
33596 83379 -184620 -524305 -645451 -575493 -528154 -579761 -565417 -321144 17963 76591 -336365
33585 -336365 -944875 -1259180 -1076825 -630848 -273588 -133152 -85553 33468 219932 278210
33575 278210 46671 -329587 -478666 -259604 5061 -52463 -311392 -319243 57264 448306
33565 448306 506144 324233 200990 231146 311452 366604 376779 311642 200269 135809 63992
33554 63992 -245792 -794353 -1109804 -763280 -47690 267188 -80802 -502852 -390041 59463
33544 59463 165855 -302943 -914947 -1202753 -1114239 -802320 -355209 81915 218703 -62016
33534 -62016 -442830 -480357 -102070 398820 766053 945945 930446 729468 519297 547633
33524 547633 807302 1016941 1003571 893563 831769 736081 483590 163184 -27361 -14425
33514 -14425 152730 407776 647192 738396 671772 569048 441997 144881 -282584 -466656
33504 -466656 -155281 349462 511250 212762 -187727 -377490 -387005 -398570 -509812 -689961
33494 -689961 -795964 -683877 -452630 -433302 -735208 -1007246 -941635 -782417 -918853 -1181222
33484 -1181222 -1095553 -736122 -667832 -976098 -1034243 -485422 148462 211930 -211998 -588895
33474 -588895 -703979 -709980 -698017 -645325 -590136 -517245 -272211 123665 331826 166694 -94560
33463 -94560 -197936 -343535 -708876 -929471 -627588 -151900 -118535 -411865 -373945 83492
33453 83492 318480 -13117 -481511 -613710 -466331 -260610 -52903 -9187 -394569 -979204
33443 -979204 -1057587 -449615 98076 -14963 -328318 -87804 541440 775745 453971 200486
33433 200486 413721 788657 910341 736869 382181 -66143 -369516 -239718 204868 472780
33423 472780 355480 185633 271275 447006 427414 280770 248066 311838 246410 -24333
33413 -24333 -362925 -637381 -821163 -931637 -1000812 -1052218 -1026698 -817189 -443308 -92891
33403 -92891 56022 -52743 -407278 -894115 -1198290 -1016892 -484459 -121458 -200220 -412570
33393 -412570 -359779 -118764 -60943 -311535 -679023 -977051 -1135599 -1104844 -909900 -701621
33383 -701621 -531793 -235759 213860 463120 245601 -121115 -177125 -87352 -371497 -927945
33373 -927945 -1042729 -526325 -121209 -408292 -940340 -991300 -646399 -475841 -490928 -220771
33363 -220771 303213 461009 62279 -272753 -44731 408516 536296 436412 558715 847991
33353 847991 792585 268118 -226277 -301132 -199207 -334524 -625179 -627732 -198517 315628
33343 315628 550160 507677 382859 230490 -19169 -341207 -600079 -708309 -656374 -429670
33333 -429670 -54104 307193 485530 533919 633409 769329 739987 533318 402720 438529
33323 438529 385748 132168 59207 504997 1092746 1105148 477920 -105790 -191658 -95154
33313 -95154 -242905 -475967 -420144 -191515 -210141 -472486 -535516 -231492 70465 42022
33303 42022 -155371 -211997 -161336 -245356 -460876 -546487 -395323 -238259 -345918 -674779
33293 -674779 -885155 -680953 -123850 374376 420775 53547 -277286 -227039 18894 -9897
33283 -9897 -432566 -845202 -858725 -588367 -415156 -417519 -335595 -79186 52133 -202954 -652550
33272 -652550 -877048 -735381 -430593 -162408 31895 100140 -98167 -576665 -1087572 -1317077
33262 -1317077 -1145635 -682715 -163864 138162 52272 -317665 -646178 -726637 -696485 -820910
33252 -820910 -1111801 -1287986 -1107872 -643818 -197888 15054 78600 252808 619830 913962
33242 913962 825711 446866 214457 351651 584862 575349 433808 541103 951955 1272651
33232 1272651 1156852 691890 235747 54571 169760 379083 366578 -21066 -520141 -654734
33222 -654734 -305889 111216 187113 40369 70952 339864 510186 388112 208998 273024
33212 273024 522694 654612 531604 321231 263545 408251 571034 503780 143348 -289309
33202 -289309 -511967 -517433 -552468 -701022 -680332 -240081 375746 643947 408518 26357
33192 26357 -169925 -238088 -308631 -220749 205798 718520 847661 562307 342966 489589
33182 489589 677893 435099 -151810 -502814 -273787 233368 450574 178991 -246738 -365161
33172 -365161 -87699 213582 118179 -349844 -707375 -548601 -35260 262805 16124 -487276
33162 -487276 -664349 -262700 407996 834304 800653 504137 233584 43730 -193449 -487925
33152 -487925 -639172 -504763 -243239 -154133 -313656 -504642 -514274 -366814 -213927 -125638
33142 -125638 -97154 -173279 -411775 -725254 -888715 -759082 -421803 -80857 137884 230990
33132 230990 228840 147605 23014 -76292 -99138 -55175 2427 23266 -15193 -112607 -258132
33121 -258132 -425017 -556420 -595506 -563238 -559760 -609025 -545133 -207280 232080 335224 -76929
33110 -76929 -640823 -884022 -801737 -744976 -844250 -897243 -827843 -858115 -1079063 -1202696 -984619
33099 -984619 -623863 -463160 -501507 -504433 -433178 -435336 -503704 -457372 -215991 165290 649377
33088 649377 1124887 1270960 878370 262156 -24619 109893 261718 199760 121753 158278
33078 158278 110696 -97491 -150400 162205 526921 540512 295320 177597 288381 406992
33068 406992 366022 145775 -243286 -653166 -738540 -359524 86708 104489 -242160 -501209
33058 -501209 -554611 -683416 -919326 -883402 -459939 -150394 -409897 -948190 -1094263 -706136
33048 -706136 -320373 -390228 -717287 -797605 -520302 -270653 -369827 -656135 -745745 -536420
33038 -536420 -234277 19395 245690 353440 129076 -353533 -648639 -516551 -311177 -474946
33028 -474946 -867620 -973922 -643515 -232406 -63243 -111534 -218331 -278292 -203273 -2508
33018 -2508 94822 -112864 -446484 -550156 -417927 -359902 -451999 -429718 -191598 4828 -24155
33007 -24155 -135024 -182537 -251502 -416288 -601393 -808754 -1125548 -1386060 -1251506 -798957
32997 -798957 -558323 -710448 -748786 -299484 219000 247594 -32551 -71849 120343 103613
32987 103613 -126320 -128418 143492 197439 -159960 -466559 -341170 -68139 -112650 -422547
32977 -422547 -571839 -381435 -93395 -38826 -327460 -773741 -1017559 -835794 -406765 -129605
32967 -129605 -158948 -314470 -449421 -602550 -712479 -550575 -138010 112132 -37278 -224227
32957 -224227 -652 444061 511000 52142 -447402 -576132 -464702 -415687 -427868 -316410
32947 -316410 -55708 244822 543800 812723 887790 608844 72667 -419426 -639819 -550306
32937 -550306 -236421 109769 233712 57796 -170481 -176973 -51316 -88602 -287289 -335586
32927 -335586 -134037 31877 -32614 -145036 -136157 -165584 -353094 -437492 -212062 -27687
32917 -27687 -350537 -963592 -1160483 -724278 -182092 952 -23789 81677 308591 458616
32907 458616 485636 411977 184905 -124732 -224532 31190 347498 285588 -267431 -1034531
32897 -1034531 -1564063 -1448702 -646755 275425 574645 212543 -49710 322070 927391
32888 927391 1099510 855960 672534 643563 500442 298563 414954 838597 1055662 781874
32878 781874 332953 94346 29613 -69940 -170371 -84050 202295 479117 527976 330199
32868 330199 119343 168772 438407 584542 467302 396136 599523 762580 552409 328695
32858 328695 671806 1321841 1375272 649922 52668 249026 697736 558053 -15144 -185923
32848 -185923 283246 796437 874589 682861 521120 328223 -64069 -515504 -689106 -459961
32838 -459961 -52872 188148 110115 -129805 -230559 -44756 305808 590490 650382 421318
32828 421318 -56035 -567030 -814330 -706054 -455178 -292706 -198062 -33336 175950 270395
32818 270395 223586 223450 458569 890435 1258519 1309160 1041110 706991 535668 509402 479421
32807 479421 392839 267656 65880 -193412 -303702 -139568 20475 -207029 -704421 -943193
32797 -943193 -730268 -432958 -335241 -239026 45634 263729 151227 -38903 102947 483274
32787 483274 671837 611243 702350 1166706 1696541 1839903 1501090 976754 638332 615554
32777 615554 708356 627433 362294 204892 338258 549200 465979 -37305 -753005 -1310191
32767 -1310191 -1389398 -988275 -538534 -497470 -759162 -807277 -533361 -440545 -826550 -1277436
32757 -1277436 -1328849 -1139595 -1044491 -906921 -502984 -140162 -191965 -328986 -732 521709
32747 521709 456422 -186594 -524857 -161214 258701 152531 -144963 -109085 60062 -143214
32737 -143214 -631970 -854286 -594279 -149122 175162 348452 436980 421185 226904 -140477
32727 -140477 -464331 -411751 27279 320567 -6499 -631630 -799216 -408261 -112569 -235560
32717 -235560 -320042 -62586 47214 -450557 -1129538 -1273240 -873819 -413078 -52560 294346
32707 294346 433557 158374 -198461 -191942 -41924 -258852 -677937 -680390 -296757 -218694
32697 -218694 -641799 -955486 -789261 -558200 -650614 -810389 -735692 -652723 -835155 -1086904
32687 -1086904 -1151317 -1153159 -1203554 -1054276 -613928 -323857 -484777 -662806 -372574 59043
32677 59043 8788 -387908 -474966 -182981 -97168 -458993 -864807 -1021829 -1083909 -1102335 -838905
32666 -838905 -344819 -85475 -220663 -358807 -317089 -495157 -1083909 -1506678 -1213836 -572853
32656 -572853 -340369 -571686 -699151 -492077 -288127 -325280 -424884 -387001 -237585 -25801
32646 -25801 233504 378827 228064 -81192 -209077 -78930 93492 191521 240327 100510
32636 100510 -426973 -1151066 -1594679 -1626873 -1551318 -1487429 -1176764 -584001 -168251 -249210
32626 -249210 -531533 -594130 -477436 -433978 -445423 -386163 -380521 -577705 -781623 -701215 -408227
32615 -408227 -195335 -143191 -167802 -321071 -671035 -1015714 -1076907 -884628 -669357 -506599
32605 -506599 -358301 -284084 -295809 -225331 -88459 -283889 -946787 -1401665 -921167 128956
32595 128956 645730 287392 -142611 44780 529704 669500 425897 144638 -104646 -449833
32585 -449833 -776568 -842117 -676120 -509670 -409933 -251062 42477 406719 689310 698525
32575 698525 385154 41881 47608 308897 286963 -246401 -828452 -932314 -656755 -477774
32565 -477774 -566734 -699924 -680862 -535723 -380566 -319273 -373674 -372330 -94896 326143 412273
32554 412273 -30383 -552345 -614245 -270081 7161 -12700 -144346 -124058 162937 643334
32544 643334 996958 835945 214059 -272061 -205159 77724 11356 -351835 -512781 -363735
32534 -363735 -279286 -402359 -413480 -131793 134446 45416 -304467 -580419 -631378 -566586
32524 -566586 -570667 -717077 -837951 -619521 -19803 498867 443953 -54422 -392743 -271172
32514 -271172 44064 251400 395754 598455 775521 817322 767827 645287 332792 -170418
32504 -170418 -601600 -719937 -579277 -384537 -242615 -170431 -173400 -195582 -152736 -105252 -208403
32493 -208403 -403268 -402211 -138085 20626 -247966 -699347 -793458 -428882 -102661 -261579
32483 -261579 -721056 -908668 -593822 -157474 -72618 -306059 -452668 -376694 -389219 -699512
32473 -699512 -1022082 -971260 -597779 -235240 -14923 122500 107857 -139710 -375128 -277371
32463 -277371 -34260 -195913 -852417 -1418159 -1409009 -1020745 -712715 -599473 -544585 -537668
32453 -537668 -630230 -705447 -643287 -582802 -722665 -942808 -900273 -489201 7725 255764
32443 255764 219570 137155 207164 352912 337040 103454 -128059 -193103 -222359 -354299 -415185
32432 -415185 -220032 -29277 -243895 -704005 -832377 -552035 -486376 -1005697 -1595301 -1548431
32422 -1548431 -901465 -275320 -71456 -220366 -508526 -753563 -771806 -510390 -168771 15112
32412 15112 9216 -110469 -315475 -532630 -610783 -527425 -391082 -138727 404766 1009496
32402 1009496 1062713 424594 -207263 -217895 79250 39440 -286535 -389678 -263468 -354802
32392 -354802 -675669 -738566 -418655 -167989 -226176 -265961 -59671 69860 -214568 -705616
32382 -705616 -958543 -866827 -669087 -598791 -710740 -875773 -858547 -599902 -426972 -697101
32372 -697101 -1235370 -1485422 -1249618 -874855 -641909 -443136 -224279 -249555 -622372 -936383
32362 -936383 -764376 -228132 225749 379148 287993 17531 -343757 -576875 -547630 -428345
32352 -428345 -469346 -645147 -705934 -462591 107383 845538 1359789 1245791 593764 41862
32342 41862 53244 347345 347570 -3857 -243345 -80444 281384 494200 415209 100970 -262496
32331 -262496 -392124 -122492 344679 581221 365025 -144368 -619840 -801284 -591246 -145592
32321 -145592 147222 5541 -402491 -651001 -601051 -525457 -639014 -756714 -579652 -148819
32311 -148819 198809 269094 209209 234323 319087 301254 225023 360363 773292 1058789 754885
32300 754885 -24140 -647946 -710624 -435490 -235249 -173544 -90435 -5236 -64143 -222158
32290 -222158 -303160 -308777 -356531 -348768 -42519 502644 858078 730431 302727 -48885 -177596
32279 -177596 -171197 -113242 -14652 107425 221308 306503 317184 193658 -27786 -208782 -287387
32268 -287387 -366322 -524242 -621865 -428677 77668 641042 958870 919585 627557 284815
32258 284815 70881 53345 137713 131341 -58835 -276372 -248467 73024 388931 384861 121888
32247 121888 -76493 -104170 -197699 -502444 -768642 -684776 -329558 -26910 131855 307330
32237 307330 486915 391141 -85420 -619514 -833481 -744900 -649715 -679408 -682605 -500391 -171197
32226 -171197 153278 355462 380070 235814 44381 7829 215175 489389 529605 243900
32216 243900 -150310 -420532 -586840 -732705 -666504 -103301 755717 1192641 783930 -12340
32206 -12340 -415095 -284324 -124602 -238531 -386680 -354206 -338096 -519856 -668252 -522436
32196 -522436 -282025 -330427 -658144 -940469 -1054217 -1117777 -1090042 -765246 -212310 180406
32186 180406 229277 190190 309839 458627 439409 389022 557162 847174 915546 679183
32176 679183 411922 307803 234579 35975 -153898 -101685 130752 199115 -102157 -578161
32166 -578161 -854744 -775744 -507790 -308734 -296398 -437947 -642037 -790882 -772005 -594191
32156 -594191 -431067 -426521 -473032 -323356 60560 418517 500841 317135 9090 -340311
32146 -340311 -628873 -651639 -344427 -16444 -56438 -417729 -681640 -680890 -740610 -1122786 -1509659
32135 -1509659 -1362479 -686152 -97880 -78177 -409512 -509932 -178048 187630 99656 -440685
32125 -440685 -957752 -1025706 -661765 -187431 163135 372396 457372 362506 90690 -207105
32115 -207105 -379258 -432613 -460072 -472538 -385993 -147200 164750 329499 113569 -455116
32105 -455116 -946981 -889291 -361501 -4506 -261234 -824991 -1096452 -992352 -931463 -1109868
32095 -1109868 -1232435 -1040274 -699368 -461455 -262134 52602 320052 237244 -121980 -301880
32085 -301880 -48832 347219 442582 215168 51344 201843 464217 490641 241745 -50880
32075 -50880 -277655 -538744 -822606 -902333 -707614 -529375 -596942 -664444 -357513 198292
32065 198292 491538 349470 155738 267190 569493 755006 729798 553691 238369 -160777
32055 -160777 -430077 -398835 -155192 85907 218094 231018 108435 -112457 -287132 -297843
32045 -297843 -167018 19040 176206 178787 -63275 -412935 -583770 -487281 -312806 -221651
32035 -221651 -219856 -378560 -816511 -1316217 -1351315 -761551 -62956 210879 145900 90131
32025 90131 24398 -228342 -442216 -227959 261294 423528 42012 -441541 -571034 -402071
32015 -402071 -282876 -434429 -851188 -1357024 -1669943 -1598318 -1204037 -657109 -58315 411925
32005 411925 419711 -85826 -572358 -522073 -183425 -212187 -669161 -969732 -814695 -532430
31995 -532430 -406131 -305304 -175752 -274720 -636898 -860474 -735880 -573471 -593337 -528144
31985 -528144 -205850 23421 -89037 -165600 126009 342507 -97999 -877798 -1141822 -745670
31975 -745670 -391185 -514799 -747253 -644632 -367544 -340335 -619049 -888475 -884156 -629985
31965 -629985 -375623 -376613 -638654 -881534 -846234 -556118 -178878 180548 377836 187126
31955 187126 -321687 -592138 -184162 564685 901393 590061 63753 -264842 -372649 -353225
31945 -353225 -292963 -451818 -1041302 -1714647 -1788126 -1138048 -396279 -58508 98363 428046
$$ [...]
##END NTUPLES=NMR SPECTRUM
##END=
