##TITLE=31Pdec_BAU-13.OCH3
 CDCl3, 24 sc
 13.3.2019
##JCAMPDX= 6.0         $$ Bruker NMR JCAMP-DX V2.0
##DATA TYPE= NMR SPECTRUM
##DATA CLASS= NTUPLES
##ORIGIN= UXNMR, Bruker Analytische Messtechnik GmbH
##OWNER= root
$$ XWIN-NMR		Version 3.5
$$ Wed Mar 13 14:47:54 2019 Russian Standard Time (UT+4h)  she@DPX200
##.OBSERVE FREQUENCY= 81.013821
##.OBSERVE NUCLEUS= ^31P
##.ACQUISITION MODE= SIMULTANEOUS
##.ACQUISITION SCHEME= undefined
##.AVERAGES= 24
##.DIGITISER RES= 17
##SPECTROMETER/DATA SYSTEM= spect
##.PULSE SEQUENCE= zgpg30
##.SOLVENT NAME= D2O
##.SHIFT REFERENCE= (INTERNAL, D2O, 0, 182.463)
##AUDIT TRAIL= $$ (NUMBER, WHEN, WHO, WHERE, WHAT)
$$ ##TITLE= Audit trail, XWIN-NMR		Version 3.5
$$ ##JCAMPDX= 5.01
$$ ##ORIGIN= Bruker BioSpin GmbH
$$ ##OWNER= she
$$ F:/spectra/data/she/nmr/P31/1/pdata/1/auditp.txt
$$ ##AUDIT TRAIL=  $$ (NUMBER, WHEN, WHO, WHERE, WHAT)
(   1,<2019-03-13 14:45:59.60 +0400>,<she>,<DPX200>,
      <created by zg, POWCHK disabled, PULCHK disabled
       configuration hash MD5:
       00 E9 B6 7A A2 85 ED C7 34 08 36 98 17 FE 4E 26
       data hash MD5: 32K
       2B 27 B0 DB 93 4A 8F 54 0F C2 D5 37 56 ED C1 F5>)
(   2,<2019-03-13 14:46:59.18 +0400>,<she>,<DPX200>,
      <Start of raw data processing
       efp BC_mod = 2 LB = 1 FT_mod = 6 PKNL = 1 PHC0 = -1805.604 PHC1 = 56.79897 SI = 64K 
       data hash MD5: 64K
       A5 25 A0 4C C5 63 7F 7F 51 64 AF 29 80 57 BC 7B>)
(   3,<2019-03-13 14:47:12.98 +0400>,<she>,<DPX200>,
      <pk PHC0 = 3.929219 PHC1 = 0 
       data hash MD5: 64K
       56 B7 A1 10 93 C7 0E 3C 6E 92 41 77 DA 01 5E 65>)
(   4,<2019-03-13 14:47:26.12 +0400>,<she>,<DPX200>,
      <abs ABSG = 5 
       data hash MD5: 64K
       20 5A 19 D5 C8 CC C0 CB EB 5A 1E B6 15 96 2C BC>)
$$ ##END=
$$ 
$$ hash MD5
$$ 4B AF AB 4F 68 B9 0F DD E4 61 3B 46 17 7A CB 71
##$RELAX= 
##$RELAX= 
##$RELAX= 
##$RELAX= 
##$RELAX= 
##$RELAX= 
##$RELAX= 
##$RELAX= 
$$ Bruker specific parameters
$$ --------------------------
##$DU= <F:/spectra>
##$EXPNO= 1
##$NAME= <P31>
##$PROCNO= 1
##$TYPE= <nmr>
##$USER= <she>
##$AMP= (0..31)
100 100 100 100 100 100 100 100 100 100 100 100 100 100 100 100 100 100 
100 100 100 100 100 100 100 100 100 100 100 100 100 100 
##$AQSEQ= 0
##$AQ_mod= 1
##$AUNM= <au_zg>
##$AUTOPOS= <>
##$BF1= 81.014009
##$BF2= 200.13
##$BF3= 200.13
##$BF4= 200.13
##$BF5= 200.13
##$BF6= 200.13
##$BF7= 200.13
##$BF8= 200.13
##$BYTORDA= 1
##$CFDGTYP= 0
##$CFRGTYP= 5
##$CHEMSTR= <none>
##$CNST= (0..31)
1 1 145 1 1 1 1 1 1 1 1 1 1 1 1 1 1 1 1 1 1 1 1 1 1 1 1 1 1 1 1 1 
##$CPDPRG= <waltz16>
##$CPDPRG1= <>
##$CPDPRG2= <waltz16>
##$CPDPRG3= <>
##$CPDPRG4= <mlev>
##$CPDPRG5= <mlev>
##$CPDPRG6= <mlev>
##$CPDPRG7= <mlev>
##$CPDPRG8= <mlev>
##$CPDPRGB= <>
##$CPDPRGT= <>
##$D= (0..31)
0 1 0 0 0 0 0 0 0 0 0 0.03 2e-05 3e-06 0 0 0 0 0 0 0 0 0 0 0 0 0 0 0 0 
0 0 
##$DATE= 1552473958
##$DBL= (0..7)
120 120 120 11 120 120 24 19 
##$DBP= (0..7)
150 150 150 150 150 150 150 150 
##$DBP07= 0
##$DBPNAM0= <>
##$DBPNAM1= <>
##$DBPNAM2= <>
$$ [...]
##$SUBNAM3= <"">
##$SUBNAM4= <"">
##$SUBNAM5= <"">
##$SUBNAM6= <"">
##$SUBNAM7= <"">
##$SUBNAM8= <"">
##$SUBNAM9= <"">
##$SW= 369.568048894756
##$SWIBOX= (0..15)
0 1 3 0 0 0 0 0 0 0 0 0 0 0 0 0 
##$SW_h= 29940.119760479
##$TD= 32768
##$TD0= 1
##$TE= 0
##$TE2= 300
##$TE3= 300
##$TEG= 300
##$TL= (0..7)
0 120 53 12 22 120 120 120 
##$TP= (0..7)
150 150 150 150 150 150 150 150 
##$TP07= 0
##$TPNAME0= <>
##$TPNAME1= <>
##$TPNAME2= <>
##$TPNAME3= <>
##$TPNAME4= <>
##$TPNAME5= <>
##$TPNAME6= <>
##$TPNAME7= <>
##$TPOAL= (0..7)
0.5 0.5 0.5 0.5 0.5 0.5 0.5 0.5 
##$TPOFFS= (0..7)
0 0 0 0 0 0 0 0 
##$TUNHIN= 0
##$TUNHOUT= 0
##$TUNXOUT= 0
##$USERA1= <user>
##$USERA2= <user>
##$USERA3= <user>
##$USERA4= <user>
##$USERA5= <user>
##$V9= 5
##$VALIST= <valist>
##$VCLIST= <CCCCCCCCCCCCCCC>
##$VD= 0
##$VDLIST= <DDDDDDDDDDDDDDD>
##$VPLIST= <PPPPPPPPPPPPPPP>
##$VTLIST= <TTTTTTTTTTTTTTT>
##$WBST= 1024
##$WBSW= 4
##$XGAIN= (0..3)
0 0 0 0 
##$XL= 0
##$YL= 0
##$YMAX_a= 13397
##$YMIN_a= -14321
##$ZGOPTNS= <>
##$ZL1= 120
##$ZL2= 120
##$ZL3= 120
##$ZL4= 120
##$ABSF1= 182.463
##$ABSF2= -187.1042
##$ABSG= 5
##$ABSL= 3
##$ALPHA= 0
##$AQORDER= 0
##$ASSFAC= 0
##$ASSFACI= 0
##$ASSFACX= 0
##$ASSWID= 0
##$AUNMP= <proc_1d>
##$AZFE= 0.1
##$AZFW= 0.5
##$BCFW= 0
##$BC_mod= 2
##$BYTORDP= 0
##$COROFFS= 0
##$CY= -3
##$DATMOD= 1
##$DC= 0
##$DFILT= <>
##$DTYPP= 0
##$F1P= 0
##$F2P= 0
##$FCOR= 1
##$FTSIZE= 65536
##$FT_mod= 6
##$GAMMA= 0
##$GB= 0
##$INTBC= 1
##$INTSCL= 5.30512e-09
##$ISEN= 30
##$LB= 1
##$LEV0= 0
##$LPBIN= 0
##$MAXI= 10000
##$MC2= 0
##$MEAN= 0
##$ME_mod= 0
##$MI= 50
##$NCOEF= 0
##$NC_proc= -5
##$NLEV= 6
##$NOISF1= 182.463
##$NOISF2= 159.3651
##$NSP= 0
##$NTH_PI= 0
##$NZP= 0
##$OFFSET= 182.463
##$PC= 4
##$PHC0= -1801.675
##$PHC1= 56.79897
##$PH_mod= 1
##$PKNL= yes
##$PPARMOD= 0
##$PSCAL= 0
##$PSIGN= 0
##$REVERSE= no
##$SF= 81.0140089999434
##$SI= 65536
##$SIGF1= 159.3651
##$SIGF2= -187.1042
##$SINO= 113.3802
##$SIOLD= 16384
##$SREGLST= <1H.CDCl3>
##$SSB= 0
##$STSI= 65536
##$STSR= 0
##$SW_p= 29940.119760479
##$SYMM= 0
##$S_DEV= 0
##$TDeff= 32768
##$TDoff= 0
##$TI= <>
##$TILT= no
##$TM1= 0
##$TM2= 0
##$TOPLEV= 0
##$USERP1= <user>
##$USERP2= <user>
##$USERP3= <user>
##$USERP4= <user>
##$USERP5= <user>
##$WDW= 1
##$XDIM= 65536
##$YMAX_p= 533710783
##$YMIN_p= -8876488
$$ End of Bruker specific parameters
$$ ---------------------------------
##NTUPLES= NMR SPECTRUM
##VAR_NAME=  FREQUENCY,     SPECTRUM/REAL,   SPECTRUM/IMAG
##SYMBOL=    X,             R,               I
##VAR_TYPE=  INDEPENDENT,   DEPENDENT,       DEPENDENT
##VAR_FORM=  AFFN,          ASDF,            ASDF
##VAR_DIM=   65536,         65536,           65536
##UNITS=     HZ,            ARBITRARY UNITS, ARBITRARY UNITS
##FACTOR=    0.456856943014862, 1,           1
##FIRST=     14782.0589164792, 0,            0
##LAST=      -15158.0608439998, 0,           0
##MIN=       -15158.0608439998, -8876488,    0
##MAX=       14782.0589164792, 533710783,    0
$$ Real data points
##PAGE= N=1
##DATA TABLE= (X++(R..R)), XYDATA
$$ [...]
$$ plain form
41492 494175 535020 265226 -93009 -46581 496373 1085253 1340175 1382275 1520521 1818170
41482 1818170 2130684 2272860 1984224 1081079 -123374 -914935 -990913 -808119 -778305 -566695
41472 -566695 270905 1344563 1843897 1691082 1532448 1660030 1702174 1409628 985039 520250
41462 520250 -137604 -791370 -937225 -623667 -457377 -479639 27584 1155348 1796671 1222999
41452 1222999 342066 401482 1145590 1387797 894833 447028 296786 -117618 -878992 -1212610
41442 -1212610 -681054 184567 739311 932066 952141 916407 1060640 1484956 1641332 974217
41432 974217 137758 420666 1658233 2022122 576627 -1188134 -1416160 -475356 -173807
41423 -173807 -1031782 -1791891 -1463633 -506293 188270 377715 186818 -363727 -1053341 -1285375
$$ packed form
41492D94175M0845k69794l58235M6428N42954N88880K54922M2100J38246K97649
41482A818170L12514J42176k88636r03145j204453p91561p5978J82794K9814K11610
41472e66695Q37600J073658M99334j52815j58634J27582M2144k92546m24589m64789
41462E20250o57854o53766j45855L13558J66290k2262N07223J127764O41323n73672
41452A222999q80933N9416P44108K42207m92964m47805j50242m14404p61374l33618
41442a212610N31556Q65621N54744J92755K0075l5734J44233M24316J56376o67115
41432I74217q36459K82908J237567L63889j445495j764761k28026R40804L01549
41423a73807q57975p60109L28258R57340O94563J89445j90897n50545o89614k32034
$$ plain form
41413 -1285375 -715779 249386 903439 959183 627847 222253 -107187 -371045 -624636 -855540
41403 -855540 -1044990 -1364605 -2058662 -2922110 -3178673 -2272241 -634700 716203 1228346
41394 1228346 1104337 742408 423342 461070 1023030 1681902 1721439 1115453 686690 972837
41384 972837 1408034 1118938 233169 -212334 328200 1129701 1089020 106894 -812327 -814963
41374 -814963 -157681 309048 299181 255044 445698 526137 228879 -71907 31793 216448
41364 216448 -103831 -752587 -922435 -331043 393948 614276 363046 -117329 -914431 -2018325
41354 -2018325 -2751955 -2326208 -987252 -43128 -424901 -1506411 -1789932 -744415 528855
41345 528855 757524 183355 108034 902407 1425484 803236 -120482 26894 1066989 1487044
$$ packed form
41413a285375N69596R65165O54053N5744l31336m05594l29440k63858k53591k30904
41403h55540j89450l19615o94057q63448k56563R06432J637541J350903N12143
41394A228346j24009l61929l19066L7728N61960O58872L9537o05986m28763K86147
41384I72837M35197k89096q85769m45503N40534Q01501m0681r82126r19221k636
41374h14963O57282M66729r867m4137J90654Q0439k97258l00786J03700J84655
41364B16448l20279o48756j69848N91392P24991K20328k51230m80375p97102j103894
41354b018325p33630M25747J338956R44124l81773j081510k83521J045517J273270
41345E28855K28669n74169p5321P94373N23077o22248r23718J47376J040095M20055
$$ plain form
41335 1487044 617285 -497472 -643311 59567 659598 699488 477772 400175 575295 846549
41325 846549 913532 612640 226963 213955 529260 681604 628374 1030176 2239501 3562960
41315 3562960 4037299 3555578 2737813 2052412 1595580 1405454 1393959 1199497 675832 297956
41305 297956 493491 828929 577620 -87082 -301380 123586 445787 240174 -32469 -64239
41295 -64239 -386985 -1352420 -2135825 -1652939 -143674 993467 859325 -144216 -1141440
41286 -1141440 -1713197 -1844117 -1551422 -937103 -304032 75250 165694 39994 -237313 -495573
41276 -495573 -500773 -284445 -191744 -410006 -683392 -730065 -701093 -877685 -1075996 -811009
41266 -811009 -82482 443076 255567 -294731 -430551 45965 507519 313829 -362221 -698584
$$ packed form
41335A487044q69759j114757j45839P02878O00031L9890k21716p7597J75120K71254
41325H46549O6983l00892l85677j3008L15305J52344n3230M01802J209325J323459
41315C562960M74339m81721q17765o85401m56832j90126j1495j94462n23665l77876
41305B97956J95535L35438k51309o64702k14298M24966L22201k05613k72643l1770
41295f4239l22746r65435p83405M82886J509265J137141j34142j003541r97224
41286a141440n71757j30920K92695O14319O33071L79282R0444j25700k77307k58260
41276d95573n200K16328R2701k18262k73386m6673K8972j76592j98311K64987
41266h11009P28527N25558j87509n50298j35820M76516M61554j93690o76050l36363
$$ plain form
41256 -698584 -170753 820615 1369869 1067789 422822 202357 513378 772363 558504 197967
41246 197967 319199 978190 1465276 1028976 -302594 -1690765 -2293989 -2075876 -1704044
41237 -1704044 -1623567 -1479528 -726869 377904 898238 413008 -400711 -656700 -324763
41228 -324763 -2410 68182 208577 606509 917012 678492 -165588 -1215043 -1860694 -1650122
41218 -1650122 -736524 65156 58463 -450764 -455715 439279 1418259 1417116 369671 -814838
41208 -814838 -1298815 -1021059 -490915 -212799 -325778 -593283 -687473 -550035 -420372 -435666
41198 -435666 -345876 160556 890166 1172853 612083 -322561 -687029 -99139 814053 1178169
41188 1178169 914388 677559 786667 716979 -69925 -1201668 -1780787 -1499652 -879633
$$ packed form
41256f98584N27831R91368N49254l02080o44967k20465L11021K58985k13859l60537
41246A97967J21232O58991M87086m36300j331570j388171o03224K18113L71832
41237a704044Q0477J44039P52659J104773N20334m85230q13719k55989L31937
41228c24763L22353P0592J40395L97932L10503k38520q44080j049455o45651K10572
41218a650122R13598Q01680o693n09227m951Q94994R78980j143j047445j184509
41208h14838m83977K77756N30144K78116j12979k67505r4190J37438J29663j5294
41198d35666Q9790N06432P29610K82687n60770r34644l64468N87890R13192L64116
41188A178169k63781k36829J09108o9688p86904j131743n79119K81135O20019
$$ plain form
41179 -879633 -465929 -259690 9000 452412 960630 1263628 1048640 334270 -314570 -330041
41169 -330041 144643 519790 657728 914424 1271578 1156788 372414 -467988 -800721 -820484
41159 -820484 -903943 -883902 -439343 215472 588769 564729 346554 57140 -184462 -144990
41149 -144990 125831 168831 -155544 -277469 184438 652075 447314 -50518 -7521 464677
41139 464677 546445 140860 -67402 47993 -116142 -515872 -199476 1007617 1720927 825517
41129 825517 -726348 -1019211 345522 1895118 2282665 1720297 1263765 1369448 1552891
41120 1552891 1191463 339403 -292256 -125412 594622 1049200 757573 -13559 -757395
41111 -757395 -1271088 -1553097 -1542082 -1236498 -817864 -416890 11775 398212 442365 32247
$$ packed form
41179h79633M13704K06239K68690M43412N08218L02998k14988p14370o48840j5471
41169c30041M74684L75147J37938K56696L57154j14790p84374q40402l32733j9763
41159h20484q3459K0041M44559O54815L73297k4040k18175k89414k41602L9472
41149a44990K70821M3000l24375j21925M61907M67637k04761m97832M2997M72198
41139D64677Q1768m05585k08262J15395j64135l99730L16396J207093P13310q95410
41129H25517j551865k92863J364733J549596L87547n62368m56532J05683J83443
41120A552891l61428q52060o31659J66844P20034M54578k91627p71132p43836
41111g57395n13693k82009J1015L05584M18634M00974M28665L86437M4153m10118
$$ plain form
41101 32247 -507280 -834342 -971633 -1022697 -862714 -468939 -243965 -568673 -1228036 -1676656
41091 -1676656 -1709809 -1515548 -1254068 -970080 -752091 -602977 -336779 13222 -74977 -976783
41081 -976783 -2192298 -2801733 -2557969 -1991909 -1518779 -1056540 -549500 -226106 -163950 -127763
41071 -127763 -16095 15469 15679 264286 617630 427896 -492546 -1332726 -1212622 -308096
41061 -308096 448011 535011 210336 -140861 -504447 -1033871 -1666120 -2022551 -1625038 -383564
41051 -383564 1006703 1484766 766034 -202938 -330294 315656 762858 495987 -55221
41042 -55221 -348972 -389025 -392139 -400755 -522370 -1030567 -1798956 -2028197 -1078260 580624
41032 580624 1714355 1606143 667503 -185004 -422672 -153993 188789 262325 73502 -61776
$$ packed form
41101C2247n39527l27062j37291n1064J59983L93775K24974l24708o59363m48620
41091a676656l3153J94261K61480K83988K17989J49114K66198L50001q8199r01806
41081i76783j215515o09435K43764N66060M73130M62239N07040L23394O2156L6187
41071a27763J11668L1564K10K48607L53344j89734r20442q40180J20104R04526
41061c08096P56107Q7000l24675l51197l63586n29424o32249l56431L97513J241474
41051c83564J390267M78063p18732r68972j27356O45950M47202k66871n51208
41042e5221k93751m0053l114q616j21615n08197p68389k29241R49937J658884
41032E80624J133731j08212r38640q52507k37668K68679L42782P3536j88823j35278
$$ plain form
41022 -61776 122383 536375 870601 959958 869195 704136 544268 495314 557108 484317 93057
41011 93057 -285568 -51196 816416 1535781 1444030 840181 518370 654197 644236 53033
41001 53033 -759629 -1156678 -1028869 -786223 -721783 -700946 -481833 -106706 141537 91555
40991 91555 -112060 -188796 -82319 -67584 -428803 -1070591 -1571118 -1639839 -1387987 -1070789
40981 -1070789 -704428 -130643 560282 890523 439582 -616600 -1559125 -1786450 -1359945
40972 -1359945 -821015 -525841 -316076 105917 638910 806470 306564 -608043 -1345232
40963 -1345232 -1489067 -1082565 -501901 -119866 -43414 -121284 -201914 -339939 -656195 -1016488
40953 -1016488 -1039999 -561611 23738 81513 -566649 -1395955 -1686439 -1202722 -328582 378141
$$ packed form
41022f1776J84159M13992L34226Q9357r0763j65059j59868m8954O1794p2791l91260
41011I3057l78625K34372Q67612P19365r1751o03849l21811J35827r961n91203
41001E3033q12662l97049J27809K42646O4440K0837K19113L75127K48243m9982
40991I1555k03615p6736J06477J4735l61219o41788n00527o8721K51852L17198
40981a070789L66361N73785O90925L30241m50941j056182r42525k27325M26505
40972a359945N38930K95174K09765M21993N32993J67560m99906r14607p37189
40963a345232j43835M06502N80664L82035P6452p7870q0630j38025l16256l60293
40953a016488k3511M78388N85349N7775o48162q29306k90484M83717Q74140P06723
$$ plain form
40943 378141 663917 656365 591380 533317 362631 21630 -286266 -262911 69545 266545
40933 266545 -51283 -687299 -1077491 -989363 -725917 -585710 -485757 -318120 -307375 -648799
40923 -648799 -1084123 -1296814 -1482417 -1926324 -2172347 -1406686 218209 1462166 1562812
40914 1562812 1185121 1269474 1610916 1371014 540170 -36077 90533 573234 1089781 1676884
40904 1676884 2107895 1805139 751122 -207250 -445131 -408837 -837414 -1546212 -1637392 -795260
40894 -795260 204793 407178 -233271 -873528 -808887 -291619 -156928 -675424 -1163419 -993765
40884 -993765 -564414 -661921 -1138566 -1078734 -297319 268517 -21201 -587274 -691028 -648523
40874 -648523 -1194543 -2149334 -2606055 -2241387 -1669891 -1528801 -1803163 -2059092 -1897356 -1221340
$$ packed form
40943C78141K85776p552o4985n8063j70686l41001l07896K3355L32456J97000
40933B66545l17828o36016l90192Q8128K63446J40207R9953J67637J0745l41424
40923f48799m35324k12691j85603m43907k46023P65661J624895J243957J00646
40914A562812l77691Q4353L41442k39902q30844n76247J26610M82701N16547N87103
40904A676884M31011l02756j054017r58372k37881L6294m28577p08798r1180Q42132
40894g95260J000053K02385o40449o40257O4641N17268J34691n18496m87995J69654
40884i93765M29351r7507m76645N9832P81415N65836k89718n66073j03754M2505
40874f48523n46020r54791m56721L64668N71496J41090k74362k55929J61736O76016
$$ plain form
40864 -1221340 -412681 -97226 -394197 -642186 -259601 450867 845394 914577 1076493 1310088
40854 1310088 1247977 931357 694238 438584 -159613 -813772 -870260 -382052 -43908 -5814
40844 -5814 293120 961450 1341338 1152734 952492 1044607 925354 341486 -84109 46729
40834 46729 130606 -299626 -571290 -25978 612632 273576 -578337 -467877 838806 1920114
40824 1920114 1703593 784751 375647 756595 1219277 1057748 284971 -404515 -352433 196592
40814 196592 240552 -596948 -1322111 -887818 243697 813861 639398 552827 689230 300781
40804 300781 -569490 -756998 147837 973563 770984 195343 175261 361988 32990 -451425
40794 -451425 -396895 -204718 -653718 -1325370 -1221855 -589622 -588217 -1282061 -1537452 -1026975
$$ packed form
40864a221340Q08659L15455k96971k47989L82585P10468L94527O9183J61916K33595
40854A310088o2111l16620k37119k55654n98197o54159n6488M88208L38144L8094
40844e814K98934O68330L79888j88604k00242R2115j19253n83868m25595J30838
40834D6729Q3877m30232k71664N45312O38610l39056q51913J10460J306683J081308
40824A920114k16521r18842m09104L80948M62682j61529p72777o89486N2082N49025
40814A96592M3960q37500p25163M34293J131515N70164j74463q6571J36403l88449
40804C00781q70271j87508R04835Q25726k02579n75641k0082J86727l28998m84415
40794d51425N4530J92177m49000o71652J03515O32233J405o93844k55391N10477
$$ plain form
40784 -1026975 -755053 -1183918 -1330927 -440390 705025 1016126 635528 336197 224065
40775 224065 -1365 -175894 -58230 -76719 -709145 -1505444 -1692764 -1453652 -1606980 -2189610
40765 -2189610 -2372727 -1793723 -1016286 -541275 -258284 -104983 -390279 -1051266 -1341747
40756 -1341747 -813945 -61721 91246 -261363 -375597 -11771 320232 245482 86093 325638
40746 325638 853173 1063751 649284 19950 -207521 -1701 79984 -291713 -722946 -618398
40736 -618398 90371 1029572 1904600 2510667 2483820 1661510 626636 239413 541894 757226
40726 757226 525975 428654 926605 1481693 1341217 703009 364108 467817 357227 -336665
40716 -336665 -1121864 -1331950 -920032 -358485 -71666 -164625 -473878 -680170 -501292 51063
$$ packed form
40784a026975K71922m28865j47009Q90537J145415L11101l80598k99331j12132
40775B24065k25430j74529J17664j8489o32426p96299j87320K39112j53328n82630
40765b189610j83117N79004P77437M75011K82991J53301k85296o60987k90481
40756a341747N27802P52224J52967l52609j14234L63826L32003p4750j59389K39545
40746C25638N27535K10578m14467o29334k27471K05820Q1685l71697m31233J04548
40736f18398P08769R39201Q75028O06067k6847q22310j034874l87223L02481K15332
40726G57226k31251r7321M97951N55088j40476o38208l38901J03709j10590o93892
40716c36665p85199k10086M11918N61547K86819r2959l09253k06292J78878N52355
$$ plain form
40706 51063 618709 756226 257492 -690981 -1574004 -1822762 -1209299 -58428 965140
40697 965140 1323613 920846 72823 -744454 -1140478 -908909 -53089 1101337 1872294
40688 1872294 1677912 749514 51959 127661 345182 -172630 -1176892 -1617099 -1201332
40679 -1201332 -706209 -646386 -648181 -461851 -535937 -999082 -1087567 -421111 61910 -513108
40669 -513108 -1418871 -1417789 -798284 -881715 -1815977 -2409515 -2162723 -1916583 -2188618 -2344488
40659 -2344488 -1982486 -1790389 -2238374 -2578259 -2076371 -1275673 -1006853 -957026 -369188 444062
40649 444062 543804 8171 -112034 532836 1072372 777190 18688 -469826 -566328 -587813
40639 -587813 -682795 -819571 -1011037 -1153276 -893913 -64660 857976 1105081 514588 -184474
$$ packed form
40706E1063N67646J37517m98734r48473q83023k48758O13463J150871J023568
40697I65140L58473m02767q48023q17277l96024K31569Q55820J154426P70957
40688A872294j94382r28398o97555P5702K17521n17812j004262m40207M15767
40679a201332M95123N9823j795J86330p4086m63145q8485O66456M83021n75018
40669e13108r05763J082O19505q3431r34262n93538K46792K46140k72035j55870
40659b344488L62002J92097m47985l39885N01888Q00698K68820M9827N87838Q13250
40649D44062R9742n35633j20205O44870N39536k95182p58502m88514r6502k1485
40639e87813r4982j36776j91466j42239K59363Q29253R22636K47105n90493o99062
$$ plain form
40629 -184474 -205390 305269 454379 -145199 -741816 -453111 430712 807371 323921 -213362
40619 -213362 -163342 32634 -262971 -749670 -636291 161166 942477 1144884 794723 223681
40609 223681 -159340 -7850 528385 688841 -29334 -1040729 -1304001 -699166 -145321
40600 -145321 -325799 -925483 -1296273 -1321164 -1302112 -1338118 -1160176 -518627 397501 965136
40590 965136 697117 -104038 -520047 -57239 775452 1204002 1131264 924892 678360 318297
40580 318297 150393 537299 1166618 1403020 1296491 1414242 1664432 1248018 36117
40571 36117 -944583 -909484 -426576 -475137 -971748 -994336 -174801 852161 1342670 1237639
40561 1237639 967209 803398 594194 106297 -451638 -478259 219454 922904 813963 196171
$$ packed form
40629a84474k0916N10659J49110n99578n96617K88705Q83823L76659m83450n37283
40619b13362N0020J95976k95605m86699J13379P97457P81311K02407l50161n71042
40609B23681l83021J51490N36235J60456p18175j011395k63272O04835N53845
40600a45321j80478n99684l70790k4891J9052l6006J77942O41549R16128N67635
40590I65136k68019q01155m16009M62808Q32691M28550p2738k06372k46532l60063
40580C18297j67904L86906O29319K36402j06529J17751K50190m16414j211901
40571C6117r80700L5099M82908m8561m96611k2588Q19535J026962M90509j05031
40561A237639k70430j63811k09204m87897n57935k6621O97713P03450j08941o17792
$$ plain form
40551 196171 230183 1322586 2475386 2577050 1749551 983256 913857 1398028 1880188 1754913
40541 1754913 772123 -497412 -1017799 -526640 60710 -49941 -421669 -245234 283701
40532 283701 390981 132731 264444 813643 927892 315999 -219617 -64572 331126 376608
40522 376608 312089 577668 862694 579294 -135816 -674480 -926928 -1203457 -1350745 -821985
40512 -821985 272062 987890 750436 101341 -170240 -117323 -297099 -704433 -735320 -155856
40502 -155856 517429 757858 674844 680334 862383 980361 860090 535759 157305 -52369
40492 -52369 54740 252304 46535 -645248 -1203820 -1076669 -576085 -409260 -620675 -646747
40482 -646747 -342708 -187051 -332712 -257120 278895 669954 430561 81258 311206 715852
$$ packed form
40551A96171L4012J092403J152800J01664q27499p66295o9399M84171M82160j25275
40541A754913r82790j269535n20387M91159N87350j10651l71728J76435N28935
40532B83701J07280k58250J31713N49199J14249o11893n35616J55045L95698M5482
40522C76608o4519K65579K85026k83400p15110n38664k52448k76529j47288N28760
40512h21985J094047P15828k37454o49095k71581N2917j79776m07334l0887N79464
40502a55856O73285K40429q3014N490J82049J17978j20271l24331l78454k09674
40492e2369J07109J97564k05769o91783n58572J27151N00584J66825k11415k6072
40482f46747L04039J55657j45661P5592N36015L91059k39393l49303K29948M04646
$$ plain form
40472 715852 289608 -999602 -2053323 -2119591 -1575477 -1023770 -450521 251453 626127
40463 626127 240375 -449768 -557642 18177 486175 311201 -127020 -234137 -50426 -7678
40453 -7678 -149992 -87120 320050 641027 384125 -400173 -1168702 -1424546 -1111654 -553992
40443 -553992 -84381 272653 717199 1248431 1497762 1187014 569633 44929 -527090 -1545871
40433 -1545871 -2683019 -2941316 -2059013 -1124672 -1170979 -1778284 -1890120 -1479452 -1322409
40424 -1322409 -1425939 -987626 382 429112 -197159 -865557 -570124 238743 534093
40415 534093 251814 28531 -9504 -223579 -594451 -786379 -872578 -1220541 -1817381 -2375765
40405 -2375765 -2902816 -3522748 -3983487 -3984853 -3704524 -3351533 -2628623 -1448883 -683381 -1090587
$$ packed form
40472G15852m26244j289210j053721o6268N44114N51707N73249P01974L74674
40463F26127l85752o90143j07874N75819M67998j74974m38221j07117J83711M2748
40453g678j42314O2872M07170L20977k56902p84298p68529k55844L12892N57662
40443e53992M69611L57034M44546N31232K49331l10748o17381n24704n72019j018781
40433a545871j137148k58297Q82303R34341m6307o07305j11836M10668J57043
40424a322409j03530M38313R88008M28730o26271o68398K95433Q08867K95350
40415E34093k82279k23283l8035k14075l70872j91928q6199l47963n96840n58384
40405b375765n27051o19932m60739j366K80329L52991P22910J179740P65502m07206
$$ plain form
40395 -1090587 -1865014 -1563027 -315878 340621 -74761 -307939 383535 892359 86359
40386 86359 -1329214 -1929443 -1584094 -1146201 -869808 -413117 69748 116505 -6041 372900
40376 372900 1069569 1218311 707600 364007 546035 581280 -51986 -862658 -1128040 -848617
40366 -848617 -449864 -102127 164908 127037 -321884 -797905 -811150 -343778 267366 800447
40356 800447 1186562 1304245 1096224 754409 481500 197457 -225037 -579370 -537099 -180339
40346 -180339 28060 -179434 -626230 -1034315 -1296465 -1336676 -1043828 -541831 -255754 -432668
40336 -432668 -759989 -751595 -418543 -234113 -438919 -724244 -722282 -495728 -296645 -72441
40326 -72441 419156 1045669 1220809 556492 -597174 -1446990 -1516563 -980268 -316317 164804
$$ packed form
40395a090587p74427L01987J247149O56499m15382k33178O91474N08824q06000
40386H6359j415573o00229L45349M37893K76393M56691M82865M6757j22546L78941
40376C72900O96669J48742n10711l43593J82028L5245o33266q10672k65382K79423
40366h48617L98753L47737K67035l7871m48921m76021j3245M67372O11144N33081
40356H00447L86115J17683k08021l41815k72909k84043m22494l54333M2271L56760
40346a80339K08399k07494m46796m08085k62150m0211K92848N01997K86077j76914
40336d32668l27321Q394L33052J84430k04806k85325J962K26554J99083K24204
40326g2441M91597O26513J75140o64317j153666q49816o9573N36295O63951M81121
$$ plain form
40316 164804 392447 342939 16644 -416597 -718932 -948688 -1457865 -2274960 -2751411 -2290483
40306 -2290483 -1317464 -905987 -1320325 -1608565 -1039146 -312051 -643644 -2021069 -3193601
40297 -3193601 -3319463 -2829468 -2507930 -2397027 -1950819 -853395 617693 1798381 2086741
40288 2086741 1465882 633278 298660 378936 290769 -61194 -223021 -133857 -321079 -871812
40278 -871812 -1017058 -285270 582472 555476 -303851 -1080663 -1303681 -1283886 -1343833 -1402726
40268 -1402726 -1305716 -1014988 -472907 270105 815781 727935 75302 -670259 -1208173 -1570871
40258 -1570871 -1843881 -2054278 -2194844 -2078732 -1428514 -424099 234664 266856 336532 992379
40248 992379 1584639 1173566 157904 -170599 398483 741520 301029 -89517 207486
$$ packed form
40316A64804K27643m9508l26295m33241l02335k29756n09177q17095m76451M60928
40306b290483R73019M11477m14338k88240N69419P27095l31593j377425j172532
40297c193601j25862M89995L21538J10903M46208J097424J471088J180688K88360
40288B086741o20859q32604l34618Q0276q8167l51963j61827Q9164j87222n50733
40278h71812j45246P31788Q67742k6996q59327p76812k23018J9795n9947n8893
40268a402726R7010K90728N42081P43012N45676q7846o52633p45561n37914l62698
40258a570871k73010k10397j40566J16112O50218J004415O58763L2192O9676O55847
40248I92379N92260m11073j015662l28503N69082L43037m40491l90546K97003
$$ plain form
40239 207486 490096 27758 -518236 -107193 937605 1392584 957529 446012 301607
40230 301607 69878 -526960 -1016287 -1035083 -965454 -1253141 -1681687 -1799468 -1620227 -1410686
40220 -1410686 -1122773 -581790 -69011 -155236 -889312 -1577297 -1556303 -912986 -215108 259288
40210 259288 694165 1183967 1397745 1018689 310950 -59232 247533 907451 1326835 1186457
40200 1186457 608508 10739 -157583 254377 927804 1342164 1241233 743324 94935
40191 94935 -456148 -648623 -432361 -201573 -408413 -877677 -922497 -279725 483973 693777
40181 693777 303613 -291463 -761038 -914116 -721150 -572339 -1037459 -1970861 -2350826 -1537917
40171 -1537917 -245019 371401 181596 -93556 -177122 -424164 -833930 -862912 -397404 -72316
$$ packed form
40239B07486K82610m62338n45994M11043J044798M54979m35055n11517j44405
40230C01607k31729n96838m89327j8796O9629k87687m28546j17781J79241K09541
40220a410686K87913N40983N12779q6225p34076o87985K0994O43317O97878M74396
40210B59288M34877M89802K13778l79056p07739l70182L06765O59918M19384j40378
40200A186457n77949n97769j68322M11960O73427M14360j00931m97909o48389
40191I4935n51083j92475K16262K30788k06840m69264m4820O42772P63698K09804
40181F93777l90164n95076m69575j53078J92966J48811m65120r33402l79965Q12909
40171a537917J292898O16420j89805k75152q3566k47042m09766k8982M65508L25088
$$ plain form
40161 -72316 -312867 -733837 -823513 -656903 -593430 -725769 -898540 -867126 -300264 855051
40151 855051 1882377 1821458 726213 -271089 -431454 -187046 -82099 139301 701280
40142 701280 924357 193732 -799696 -901473 -208986 194439 7681 -4153 480972 773267
40132 773267 418443 -64362 -159553 -140877 -314655 -283081 366415 1253146 1732349 1712182
40122 1712182 1346714 492614 -771165 -1564607 -1066376 264092 1170300 1180252 867075
40113 867075 608009 88452 -709532 -974663 -118017 1263999 2130485 2296923 2332646 2420996
40103 2420996 2095179 1172570 268729 31586 279980 325176 -71657 -507119 -635776 -603203
40093 -603203 -666033 -798309 -942249 -1291477 -1894910 -2215656 -1656556 -504814 225946 39798
$$ packed form
40161g2316k40551m20970q9676J66610O3473j32339j72771L1414N66862J155315
40151H55051J027326o0919j095245r97302j60365K44408J04947K21400N61979
40142G01280K23077p30625r93428j01777O92487M03425j86758j1834M85125K92295
40132G73267l54824m82805r5191J8676j73778L1574O49496Q86731M79203k0167
40122A712182l65468q54100j263779p93442M98231J330468R06208R952l13177
40113H67075k59066n19557p97984k65131Q56646J382016Q66486J66438L5723Q8350
40103B420996l25817r22609r03841k37143K48394M5196l96833m35462j28657L2573
40093f03203o2830j32276j43940l49228o03433l20746N59100J151742P30760j86148
$$ plain form
40083 39798 -495117 -683312 -618170 -727419 -898454 -698432 -193367 136784 200597 335928
40073 335928 528057 301076 -380595 -765832 -338666 279771 66832 -948264 -1596750
40064 -1596750 -1050742 105269 629630 184771 -341606 -109201 588949 884177 608423
40055 608423 347536 292945 -120761 -1091740 -1749678 -1294436 -311466 -50057 -638586 -990751
40045 -990751 -494535 185526 250634 -187624 -672912 -1239865 -2010906 -2497040 -2089885 -1049008
40035 -1049008 -331170 -437723 -904468 -988360 -526950 -26506 -53581 -573221 -895074 -419400
40025 -419400 579215 1191935 937744 238243 -234856 -231789 217265 1073636 2052909 2553215
40015 2553215 2260395 1529368 835011 223545 -330585 -495381 -39042 667403 1171910
$$ packed form
40083C9798n34915j88195O5142j09249j71035K00022N05065L30151O3813J35331
40073C35928J92129k26981o81671l85237M27166O18437k12939j015096o48486
40064a596750N46008J156011N24361m44859n26377K32405O98150K95228k75754
40055F08423k60887n4591m13706r70979o57938M55242R82970K61409n88529l52165
40045i90751M96216O80061O5108m38258m85288n66953p71041m86134M07155J040877
40035a049008P17838j06553m66745q3892M61410N00444k7075n19640l21853M75674
40025d19400R98615O12720k54191o99501m73099L067M49054Q56371R79273N00306
40015B553215k92820p31027o94357o11466n54130j64796M56339P06445N04507
$$ plain form
40006 1171910 1609099 2228561 2619742 2185725 1179724 450620 231431 -1860 -434777
39997 -434777 -516834 120047 1052325 1675675 1866794 1759885 1373866 779790 255850 9214
39987 9214 13601 204253 472841 468940 -64126 -682769 -595617 188176 725672 471909 54752
39976 54752 202517 529051 169560 -721278 -996257 -82623 1198687 1662349 1131626 394849
39966 394849 41543 -176433 -738263 -1509786 -1904517 -1762311 -1549535 -1556896 -1462140 -1071380
39956 -1071380 -940412 -1573342 -2368080 -2216757 -1030018 205796 867257 1225257 1413844
39947 1413844 978551 -56655 -664917 -112181 954260 1483433 1432053 1329761 1035717
39938 1035717 69173 -1080167 -1194250 -66492 984450 764619 -326195 -979749 -675520
$$ packed form
40006A171910M37189O19462L91181m34017j006001p29104k19189k33291m32917
39997d34777q2057O36881R32278O23350J91119j06909l86019n94076n23940k46636
39987I214M387J90652K68588l901n33066o18643Q7152P83793N37496k53763m17157
39976E4752J47765L26534l59491q90838k74979R13634J281310M63662n30723p36777
39966C94849l53306k17976n61830p71523l94731J42206K12776p361R4756L90760
39956a071380J30968o32930p94738J51323J186739J235814O61461L58000J88587
39947A413844m35293j035206o08262N52736J066441N29173n1380j02292k94044
39938A035717r66544j149340j14083J127758J050942k19831j090814o53554L04229
$$ plain form
39929 -675520 -120681 -142257 -650447 -895174 -520898 -11402 34771 -241042 -228751 181884
39919 181884 492166 502872 633224 1033560 1091319 393284 -403039 -419054 108572 182319
39909 182319 -449316 -990955 -811404 -162350 454803 905888 1117962 785611 -158518 -1146677
39899 -1146677 -1486385 -1112228 -528055 -102320 299575 934417 1609489 1713899 947740
39890 947740 -129507 -601043 -245220 291800 435612 295605 156846 -18660 -178584
39881 -178584 104276 872697 1264024 527632 -807820 -1588345 -1528320 -1184357 -783923 -185061
39871 -185061 164353 -472860 -1678364 -1981882 -863416 430421 632931 25214 -411547
39862 -411547 -475548 -532444 -599354 -593410 -915228 -1809786 -2580878 -2430202 -1759150 -1605323
$$ packed form
39929f75520N54839k1576n08190k44727L74276N09496M6173k75813J2291M10635
39919A81884L10282J0706J30352M00336N7759o98035p96323j6015N27626P3747
39909A82319o31635n41639J79551O49054O17153M51085K12074l32351r44129r88159
39899a146677l39708L74157N84173M25735M01895O34842O75072J04410p66159
39890I47740j077247m71536L55823N37020J43812j40007j38759j75506j59924
39881a78584K82860P68421L91327p36392j335452p80525O0025L43963M00434N98862
39871a85061L49414o37213j205504l03518J118466J293837K02510o07717m36761
39862d11547o4001n6896o6910N944l21818q94558p71092J50676O71052J53827
$$ plain form
39852 -1605323 -1959763 -1731614 -451162 1013294 1704485 1658803 1356046 876137 180011
39843 180011 -328830 -201551 337154 621983 418341 130784 142047 307869 247248 -62072
39833 -62072 -190004 184102 709301 599438 -406273 -1529727 -1774953 -1205125 -909697
39824 -909697 -1542966 -2403067 -2361921 -1313792 -118136 666442 1244998 1745362 1732591 987748
39814 987748 144299 -93601 24840 -221352 -752502 -752852 -44381 483856 165201 -462405
39804 -462405 -508586 -25691 200719 -152941 -601337 -587345 -69615 558178 755958 177335
39794 177335 -905886 -1681682 -1670194 -1298979 -1204165 -1279256 -1003374 -426223 -52019 132325
39784 132325 648915 1477384 1875473 1511122 982058 801369 571955 -259325 -1345997
$$ packed form
39852a605323l54440K28149J280452J464456O91191m5682l02757m79909o96126
39843A80011n08841J27279N38705K84829k03642k87557J1263J65822o0621l09320
39833f2072j27932L74106N25199j09863j005711j123454k45226N69828K95428
39824i09697o33269q60101M1146J048129J195656P84578N78556N00364j2771p44843
39814I87748q43449k37900J18441k46192n31150l50P08471N28237l18655o27606
39804d62405m6181M82895K26410l53660m48396J3992N17730O27793J97780n78623
39794A77335j083221p75796J1488L71215R4814p5091K75882N77151L74204J84344
39784A32325N16590Q28469L98089l64351n29064j80689k29414q31280j086672
$$ plain form
39775 -1345997 -1803638 -1386248 -738097 -529614 -743609 -865454 -574914 -172443 -278280
39766 -278280 -1044108 -1834254 -1934568 -1385467 -744963 -269045 106719 183949 -295939 -872906
39756 -872906 -669743 338946 1195113 1341616 1243292 1274470 1002186 221511 -236849 352623
39746 352623 1344104 1564654 944328 364834 257244 291590 196312 -35429 -566951 -1429984
39736 -1429984 -1942875 -1377447 -238918 46069 -1065553 -2492450 -2848048 -1896687 -480749
39727 -480749 443145 451706 -189290 -752737 -725280 -354921 -252914 -518649 -690615 -534271
39717 -534271 -358691 -441856 -578576 -371382 290938 1093726 1434676 830260 -514948 -1701959
39707 -1701959 -2017783 -1594923 -876187 123011 1420915 2397289 2413890 1888084 1794365 2169628
$$ packed form
39775a345997m57641M17390O48151K08483k13995j21845K90540M02471j05837
39766b78280p65828p90146j00314N49101O40504M75918L75764P7230m79888n76967
39756h72906K03163J008689Q56167J46503r8324L1178k72284p80675m58360N89472
39746C52623R91481K20550o20326n79494j07590L4346r5278k31741n31522q63033
39736a429984n12891N65428J138529K84987j111622j426897l55598R51361J415938
39727d80749R23894Q561o40996n63447K7457L70359J02007k65735j71966J56344
39717e34271J75580q3165j36720K07194O62320Q02788L40950o04416j345208j187011
39707a701959l15824M22860P18736R99198J297904R76374J6601n25806r3719L75263
$$ plain form
39697 2169628 2105144 1271487 406032 63592 -94190 -397519 -525131 -251173 30829 64178
39687 64178 195878 531672 474996 -195166 -611329 -56627 789776 861914 404031 499030
39677 499030 1227115 1550195 1031041 463009 491438 666851 418958 129294 460932 1117064
39667 1117064 1116569 206087 -717300 -761658 -108266 390694 345458 100962 -19909 -194068
39657 -194068 -591119 -831881 -437320 368505 836272 690458 477072 778003 1467195 1943384
39647 1943384 1824647 1254252 726798 655587 860592 552517 -738666 -2240745 -2547817
39638 -2547817 -1321744 214226 762987 340024 -195319 -347940 -128340 484285 1426249
39629 1426249 2137086 2019260 1274164 671180 486484 243570 -418925 -1159483 -1426276
$$ packed form
39697B169628o4484q33657q65455l42440j57782l03329j27612K73958K82002L3349
39687F4178J31700L35794n6676o70162m16163N54702Q46403P2138m57883R4999
39677D99030P28085L23080n19154n68032K8429J75413k47893k89664L31638O56132
39667A117064m95r10482r23387m4358O53392M98960m5236k44496j20871j74159
39657a94068l97051k40762L94561Q05825M67767j45814k13386L00931O89192M76189
39647A943384j18737n70395n27454p1211K05005l08075j291183j502079l07072
39638b547817J226073J535970N48761m22963n35343j52621K19600O12625R41964
39629A426249P10837j17826p45096o02984j84696k42914o62495p40558k66793
$$ plain form
39620 -1426276 -1173535 -842656 -800190 -960549 -932863 -504220 73872 408198 496595 611153
39610 611153 662584 223794 -611221 -1031732 -647047 -234348 -651874 -1452797 -1455547 -457649
39600 -457649 573033 995575 1205761 1628533 1918934 1650253 1105843 798922 674139
39591 674139 378045 23356 97190 694721 1293416 1328212 752470 40113 -228739 133993
39581 133993 730591 1004921 921459 970979 1379205 1671377 1370937 864799 1041201 2050803
39571 2050803 2915017 2617228 1293432 21376 -431607 -293008 -221480 -468713 -846147
39562 -846147 -1216652 -1572837 -1711992 -1332728 -586519 -107062 -249713 -644799 -766577 -592243
39552 -592243 -369888 -118837 157292 89067 -587870 -1346372 -1349698 -622956 -66750 -192161
$$ packed form
39620a426276K52741L30879M2466j60359K7686M28643N78092L34326Q8397J14558
39610F11153N1431m38790q35015m20511L84685M12699m17526q00923k750R97898
39600d57649J030682M22542K10186M22772K90401k68681n44410l06921j24783
39591F74139k96094l54689P3834N97531N98695L4796n75742p12357k68852L62732
39581A33993N96598K74330q3462M9520M08226K92172l00440n06138J76402J009602
39571B050803Q64214k97789j323796j272056m52983J38599P1528k47233l77434
39562h46147l70505l56185j39155L79264P46209M79457j42651l95086j21778J74334
39552e92243K22355K51051K76129o8225o76937p58502l326P26742N56206j25411
$$ plain form
39542 -192161 -524687 -516084 -380511 -569292 -916848 -872436 -325968 269704 457306 107732
39532 107732 -645737 -1479381 -2020382 -2196381 -2304985 -2514197 -2527213 -2027949 -1199044 -441414
39522 -441414 153087 607488 621182 -34396 -794133 -717798 219702 923438 575383 -333134
39512 -333134 -798263 -653065 -527265 -741846 -934962 -800664 -590919 -641371 -810045 -723561
39502 -723561 -365744 -77001 -17000 59439 369613 653612 432535 -259584 -682690 -196950
39492 -196950 856689 1456155 1132664 502087 357711 659660 845827 793304 830639 933166
39482 933166 644860 -77783 -621409 -590611 -343496 -323928 -435311 -500762 -759668 -1324345
39472 -1324345 -1666198 -1362924 -923072 -1026040 -1294884 -851313 70247 246473 -638151
$$ packed form
39542a92161l32526Q603J35573j88781l47556M4412N46468N95672J87602l49574
39532A07732p53469q33644n41001j75999j08604k09212j3016M99264Q28905P57630
39522d41414N94501M54401J3694o55578p59737P6335R37500P03736l48055r08517
39512c33134m65129J45198J25800k14581j93116J34298K09745n0452j68674Q6484
39502g23561L57817K88743O0001P6439L10174K83999k21077o92119m23106M85740
39492a96950J053639N99466l23491o30577j44376L01949J86167n2523L7335J02527
39482I33166k88306p22643n43626L0798K47115J9568j11383o5451k58906n64677
39472a324345l41853L03274M39852j02968k68844M43571R21560J76226q84624
$$ plain form
39463 -638151 -1387399 -1045502 -211854 79967 -79223 80617 625517 953111 882788 796344
39453 796344 816218 657655 316779 208904 497900 823631 837582 617264 468402 635675
39443 635675 1204484 1956212 2360645 2082913 1483044 1246499 1524525 1811363 1687808 1296325
39433 1296325 985450 823654 637237 332159 33598 -34081 208687 550236 684469 565468
39423 565468 343904 -66253 -937943 -2058714 -2603100 -2094968 -1125599 -654483 -915225
39414 -915225 -1467692 -1955574 -2239218 -2120005 -1593832 -1111829 -933560 -534879 571987
39405 571987 1748292 1924651 1222538 819519 1181604 1516848 1171773 502545 19765
39396 19765 -333007 -609052 -493407 -11881 235989 45254 -46628 112291 -218384 -1334589
$$ packed form
39463f38151p49248L41897Q33648K91821j59190J59840N44900L27594p0323q6444
39453G96344J9874j58563l40876j07875K88996L25731J3951k20318j48862J67273
39443F35675N68809P51728M04433k77732n99869k36545K78026K86838j23555l91483
39433A296325l10875j61796j86417l05078k98561o7679K42768L41549J34233j19001
39423E65468k21564m10157q71690j120771n44386N08132R69369M71116k60742
39414i15225n52467m87882k83644J19213N26173M82003J78269L98681J106866
39405E71987J176305J76359p02113m03019L62085L35244l45075o69228m82780
39396A9765l52772k76045J15645M81526K47870j90735r1882J58919l30675j116205
$$ plain form
39386 -1334589 -2179380 -1710409 -436548 396768 524569 534009 603205 551898 743570 1645638
39376 1645638 2630559 2474627 1143547 -40898 -206196 134143 206291 20547 -131784
39367 -131784 -323708 -581932 -549133 -134548 75195 -370685 -1025744 -1145306 -665891 -72203
39357 -72203 366582 685357 808795 592141 141425 -330150 -802396 -1221933 -1239781 -702905
39347 -702905 -202995 -475301 -1287612 -1620917 -1076997 -405569 -337351 -580655 -498358 -200748
39337 -200748 -227712 -519371 -571287 -453997 -700663 -1073469 -494425 1294136 2888514 2807713
39327 2807713 1295897 -273679 -1253241 -1978080 -2538587 -2515427 -1984305 -1661030 -1753451
39318 -1753451 -1623679 -954937 -343008 -253183 -260584 59174 293323 27581 -156582 525951
$$ packed form
39386a334589q44791M68971J273861Q33316J27801R440O9196n1307J91672R02068
39376A645638R84921j55932j331080j184445j65298L40339P2148j85744j52331
39367a31784j91924k58224L2799M14585K09743m45880o55059j19562M79415N93688
39357g2203M38785L18775J23438k16654m50716m71575m72246m19537j7848N36876
39347g02905M99910k72306q12311l33305N43920O71428O8218k43304Q2297K97610
39337b00748k6964k91659n1916J17290k46666l72806N79044J788561J594378q0801
39327B807713j511816j569576r79562p24839n60507K3160N31122L23275r2421
39318a753451J29772O68742O11929Q9825p401L19758K34149k65742j84163O82533
$$ plain form
39308 525951 1669680 2038018 1208395 73130 -323448 133922 731152 674121 -228163
39299 -228163 -1332671 -1772714 -1498564 -1313182 -1618660 -1792844 -1342656 -903445 -1186007
39290 -1186007 -1584331 -1047898 32234 179688 -964140 -2141953 -2398871 -2214471 -2284793
39281 -2284793 -2359281 -1954541 -1272822 -677936 -15930 838283 1429695 1426866 1275093 1424858
39271 1424858 1458929 770076 -336762 -1021815 -1058054 -844752 -585968 -257337 -144677 -532471
39261 -532471 -938825 -539539 560678 1282776 1004104 335439 189015 687076 1353798
39252 1353798 1854397 2068685 1804139 994296 89917 -185116 430912 1421880 1958902
39243 1958902 1623325 719710 -43109 -197486 118468 433200 498823 469524 588683 883379
$$ packed form
39308E25951J143729L68338q29623j135265l96578M57370N97230n7031r02284
39299b28163j104508m40043K74150J85382l05478j74184M50188M39211k82562
39290a186007l98324N36433J080132J47454j143828j177813k56918J84400p0322
39281b284793p4488M04740O81719N94886O62006Q54213N91412k829j51773J49765
39271A424858L4071o88853j106838o85053l6239K13302K58784L28631J12660l87794
39261e32471m06354L99286J100217P22098k78672o68665j46424M98061O66722
39252A353798N00599K14288k64546q09843r04379k75033O16028R90968N37022
39243A958902l35577r03615p62819j54377L15954L14732O5623k9299J19159K94696
$$ plain form
39233 883379 1195075 1360743 1305728 1056609 707368 330192 -46018 -319846 -315004 -51841
39223 -51841 120073 -80525 -433698 -506303 -308648 -238303 -337945 -132350 576692 1270113
39213 1270113 1458605 1416958 1626872 1846508 1448634 520669 -155597 -255481 -277726 -608192
39203 -608192 -1001475 -1279906 -1722980 -2283558 -2240038 -1331312 -487083 -524441 -786492 -224805
39193 -224805 685221 545532 -649199 -1399705 -1099615 -898409 -1553093 -1996599 -1141435
39184 -1141435 145232 260610 -752299 -1463856 -1215737 -654985 -360087 -233717 -236791
39175 -236791 -561019 -951505 -842422 -301261 27764 -4005 93863 448762 593108 387422
39165 387422 274563 385744 265400 -206482 -433978 -35495 523126 595046 108165 -572921
$$ packed form
39233H83379L11696J65668n5015k49119l49241l77176l76210k73828M842K63163
39223e1841J71914k00598l53173p2605J97655P0345r9642K05595P09042O93421
39213A270113J88492m1647K09914K19636l97874r27965o76266r9884k2245l30466
39203f08192l93283k78431m43074n60578M3520R08726Q44229l7358k62051N61687
39193b24805R10026j39689j194731p50506L00090K01206o54684m43506Q55164
39184a141435J286667J15378j012909p11557K48119N60752K94898J26370l074
39175b36791l24228l90486J09083N41161L29025l1769R7868L54899J44346k05686
39165C87422j12859J11181j20344m71882k27496L98483N58621P1920m86881o81086
$$ plain form
39155 -572921 -999706 -768022 60839 652707 297477 -415790 -316392 446995 515420 -402126
39145 -402126 -840067 151932 1462562 1657919 1038651 732716 774168 507396 120042 231103
39135 231103 440092 -166615 -1285968 -1644147 -948731 -241482 -195399 -320177 -84819 331904
39125 331904 715651 1161289 1369542 627697 -982390 -2214255 -2081016 -1000862 -30497
39116 -30497 409446 504848 322182 -203375 -833716 -1158213 -1093737 -926970 -921965 -1075417
39106 -1075417 -1184227 -1054086 -690497 -245934 266498 951737 1547227 1394682 361495
39097 361495 -620790 -620947 -1782 170819 -211391 -237901 419548 930569 629093 -35807
39087 -35807 -315050 -147913 121639 343806 437318 259867 -18837 8538 258552 185771
$$ packed form
39155e72921m26785K31684Q28861N91868l55230p13267R9398P63387O8425r17546
39145d02126m37941R91999J310630J95357o19268l05935M1452k66772l87354J11061
39135B31103K08989o06707j119353l58179O95416P07249M6083j24778K35358M16723
39125C31904L83747M45638K08253p41845j610087j231865J33239J080154R70365
39116c0497M39943R5402j82666n25557o30341l24497O4476J66767N005j53452
39106a075417j08810J30141L63589M44563N12432O85239N95490j52545j033187
39097C61495r82285j57O19165J72601l82210k6510O57449N11021l01476o64900
39087c5807k79243J67137K69552K22167R3512j77451k78704K7375K50014p2781
$$ plain form
39077 185771 -183475 -77207 757549 1503173 1520339 1239823 1147994 839426 -34725 -762103
39067 -762103 -598979 -76402 -95360 -339815 92042 950261 1182769 768668 679284 1025932
39057 1025932 807244 -217572 -880054 -361551 669259 1291626 1530325 1612349 1168249
39048 1168249 103396 -679405 -475316 32822 -153645 -690702 -470236 533188 1213518
39039 1213518 1022038 562659 387644 233452 -206169 -576550 -424066 72914 406901
39030 406901 458529 509259 686555 729961 389268 -44290 194984 1488012 3091572 3742643
39020 3742643 3192705 2587385 2915628 3660754 3639568 2670711 1537978 653154 -196411
39011 -196411 -889897 -878777 -194209 445994 734055 985591 1049424 196465 -1386671 -2174230
$$ packed form
39077A85771l69246J06268Q34756P45624J7166k80516r1829l08568q74151p27378
39067g62103J63124N22577j8958k44455M31857Q58219K32508m14101q9384L46648
39057A025932k18688j024816o62482N18503J030810O22367K38699Q2024m44100
39048A168249j064853p82801K04089N08138j86467n37057K20466J003424O80330
39039A213518j91480m59379j75015j54192m39621l70381J52484M96980L33987
39030D06901N1628N0730J77296M3406l40693m33558K39274J293028J603560O51071
39020C742643n49938o05320L28243P45126k1186r68857j132733q84824q49565
39011a96411o93486J1120O84568O40203K88061K51536O3833q52959j583136p87559
$$ plain form
39001 -2174230 -1220788 427428 1165283 857165 427976 208302 -57041 -89594 617871
38992 617871 1547735 1539099 496915 -440756 -575108 -353554 -179550 305253 1251558 1944539
38982 1944539 1823482 1411315 1498871 1955049 2078625 1761251 1574948 1832010 2145271 1982075
38972 1982075 1319180 661597 528669 936325 1406134 1539326 1433973 1379831 1408705 1466984
38962 1466984 1706913 2094034 2041388 1148270 102341 20274 965772 1974327 2486687
38953 2486687 2757060 2801143 2126933 850461 -35013 6034 436366 793324 1311434 1830543
38943 1830543 1380891 -200220 -1413439 -1055450 -59541 -49892 -891173 -1209556 -766313
38934 -766313 -603808 -1004628 -968772 54060 1285145 1837857 1718314 1260608 553314
$$ packed form
39001b174230R53442J648216P37855l08118m29189k19674k65343l2553P07465
38992F17871R29864q636j042184r37671j34352K21554J74004M84803R46305O92981
38982A944539j21057m12167Q7556M56178J23576l17374j86303K57062L13261j63196
38972A982075o62895o57583j32928M07656M69809J33192j05353n4142K8874N8279
38962A466984K39929L87121n2646q93118j045929q2067R45498J008555N12360
38953B486687K70373M4083o74210j276472q85474M1047M30332L56958N18110N19109
38943A830543m49652j581111j213219L57989R95909R649q41281l18383M43243
38934g66313J62505m00820L5856J022832J231085N52712j19543m57706p07294
$$ plain form
38925 553314 -174525 -436862 -173653 96328 84254 79335 289290 474087 458954 421980
38915 421980 466441 443742 347953 356415 375020 80092 -514433 -1062618 -1456182 -1795643 -1847496
38904 -1847496 -1270589 -420114 -115236 -426709 -464821 363070 1587659 2464583 2862083
38895 2862083 3009529 2949418 2662853 2333743 2140558 2052736 1994057 1924068 1721793 1326558
38885 1326558 950401 774554 590642 216950 13431 327450 695282 447598 -68125
38876 -68125 132925 1106705 1861252 1908199 1817932 1953900 1778618 927605 15707 -238466
38866 -238466 41574 341139 495957 542888 465046 468392 875849 1423042 1351448 528631
38856 528631 -242613 -359736 -124709 8326 104481 297406 420284 434266 497711 383522
$$ packed form
38925E53314p27839k62337K63209K69981j2074m919K09955J84797j5133l6974
38915D21980M4461k2699r5789Q462J8605k94928n94525n48185l93564l39461n1853
38904a847496N76907Q50475L04878l11473l8112Q27891J224589Q76924L97500
38895B862083J47446o0111k86565l29110j93185q7822n8679o9989k02275l95235
38885A326558l76157j75847j83912l73692k03519L14019L67832k47684n15723
38876f8125K01050R73780P54547M6947r0267J35968j75282q51013r11898k54173
38866b38466K80040K99565J54818M6931p7842L346M07457N47193p1594q22817
38856E28631p71244j17123K35027J33035R6155J92925J22878J3982O3445j14189
$$ plain form
38846 383522 -308085 -1158459 -1201674 -476277 -131879 -575023 -798619 -166745 464163 241972
38836 241972 -314026 -420457 -350105 -568554 -614513 -10670 631880 578480 187104 57021
38826 57021 -114250 -634608 -744692 181048 1222594 1190796 559612 534372 832774 146752
38816 146752 -1527518 -2731175 -2618836 -1694878 -563870 588114 1269614 876930 -211162
38807 -211162 -908495 -889367 -734984 -683466 -365639 264246 861867 1488285 2342258 2821698
38797 2821698 2105860 668055 -29930 566369 1633838 2373643 2691938 2508087 1693002
38788 1693002 827858 782048 1357638 1515174 1049691 794654 1016246 945286 222486 -463253
38778 -463253 -600268 -580198 -784662 -992741 -1073055 -1267777 -1463809 -1160020 -415300 177360
$$ packed form
38846C83522o91607q50374m3215P25397L44398m43144k23596O31874O30908k22191
38836B41972n55998j06431P0352k18449m5959O03843O42550n3400l91376j30083
38826E7021j71271n20358j10084R25740J041546l1798o31184k5240K98402o86022
38816A46752j674270j203657J12339R23958J131008J151984O81500l92684j088092
38807b11162o97333J9128J54383N1518L17827O29885N97621O26418Q53973M79440
38797B821698p15838j437805o97985N96299J067469P39805L18295j83851q15085
38788A693002q65144m5810N75590J57536m65483k55037K21592p0960p22800o85739
38778d63253j37015K0070k04464k08079q0314j94722j96032L03789P44720N92660
$$ plain form
38768 177360 632066 1524561 2569389 2533301 1052252 -613659 -1189217 -766025 -133120
38759 -133120 284266 385211 253263 442362 1450644 2621160 2648927 1510496 712742
38750 712742 1185728 2120478 2438650 2245145 2172842 2349419 2683850 3230945 3703222 3589096
38740 3589096 3258654 3865017 5556374 6899848 6782634 5829334 5181201 4889513 4368282
38731 4368282 3562483 2808436 2219837 1898448 2102533 2682125 3054534 3137781 3470352 4050710
38721 4050710 4056531 3171665 2197146 1875030 2065088 2438726 2903958 3021249 2225331 983758
38711 983758 436312 595122 414971 -80071 350255 1634225 1888166 483033 -524177
38702 -524177 535374 2376141 2949823 2444460 2179255 2025371 1073409 -213446 -609320
$$ packed form
38768A77360M54706Q92495J044828l6088j481049j665911n75558M23192O32905
38759a33120M17386J00945j31948J89099J008282J170516K7767j138431p97754
38750G12742M72986R34750L18172j93505p2303J76577L34431N47095M72277j14126
38740C589096l30442O06363J691357J343474j17214r53300o48133k91688n21231
38731D368282q05799p54047n88599l21389K04085N79592L72409Q3247L32571N80358
38721D050710N821q84866r74519l22116J90058L73638M65232J17291p95918j241573
38711I83758n47446J58810j80151m95042M30326J283970K53941j405133j007210
38702e24177J059551J840767N73682n05363k65205j53884r51962j286855l95874
$$ plain form
38693 -609320 -161794 200552 429016 1035637 1651690 1551493 1111262 1260502 1929448 2331783
38683 2331783 2299288 2213692 2196932 2324717 2880402 3563755 3479504 2717792 2590528 3385539
38673 3385539 3575945 2466301 1733279 2740849 4200151 4377643 3820753 3806581 3857623
38664 3857623 3130249 2628869 3533323 4777609 4806164 4342381 4896845 5973580 6360711
38655 6360711 6687355 7972620 9217597 9323295 9719507 11970636 14513297 15144335 14958048
38646 14958048 16198525 18143810 19152389 20780857 25324256 31199605 35704845 40347148
38638 40347148 47914520 56317427 61601608 65109271 70778100 77747711 84025962 94983048
38630 94983048 117810646 150237867 189021727 247959943 344948578 461124849 533710783
$$ packed form
38693f09320M47526L62346K28464O06621O16053j00197m40231J49240O68946M02335
38683B331783l2495q5596j6760J27785N55685O83353q4251p61712j27264P95011
38673C385539J90406j109644p33022J007570J459302J77492n56890j4172N1042
38664C857623p27374n01380R04454J244286K8555m63783N54464J076735L87131
38655F360711L26644J285265J244977J05698L96212K251129K542661O31038j86287
38646A4958048J240477J945285J008579J628468M543399N875349M505240M642303
38638D0347148P567372Q402907N284181L507663N668829O969611O278251J0957086
38630I4983048K2827598L2427221L8783860N8938216R6988635J16176271P2585934
$$ plain form
38623 533710783 511279917 408929779 291364494 207031978 156637797 121000745 93914613
38616 93914613 78911780 72724426 67461049 61645430 58046597 55097714 49004800 41020246
38608 41020246 35321676 31900156 27572637 22215744 18557329 16969707 15202674 12603224
38600 12603224 10649940 9765732 8910746 7956365 7685192 7832727 7476263 6871263 6874992
38591 6874992 7215749 7203399 7320263 8205566 8896384 8023564 6085098 4720494 4330725
38582 4330725 4096467 3751574 3681470 3731144 3406122 2864691 2505925 2134231 1615558 1554215
38572 1554215 2134551 2229373 1040979 -270740 -118535 1144172 1962123 1973776 1993099
38563 1993099 2159510 1856264 1158348 707536 349424 -517541 -1397175 -1148026 7524
$$ packed form
38623E33710783k2430866j02350138j17565285q4332516n0394181l5637052k7086132
38616I3914613j5002833o187354n263377n815619l598833k948883o092914p984554
38608D1020246n698570l421520m327519n356893l658415j587622j767033k599450
38600A2603224j953284q84208q54986r54381k71173J47535l56464o05000L729
38591F874992L40757j2350J16864Q85303O90818q72820j938466j364604l89769
38582D330725k34258l44893p0104M9674l25022n41431l58766l71694n18673o1343
38572A554215N80336R4822j188394j311719J52205J262707Q17951J1653J9323
38563A993099J66411l03246o97916m50812l58112q66965q79634K49149J155550
$$ plain form
38554 7524 571759 95194 -176790 557156 1358916 1169867 517169 595974 1442089 2076778
38544 2076778 2077564 2003541 2265433 2408590 1876522 984116 581277 888880 1246101 1142414
38534 1142414 919532 1075936 1435194 1625194 1894207 2588768 3159329 2732493 1554751
38525 1554751 786145 864016 1195182 1493113 2088938 2696962 2370625 1256517 942215
38516 942215 2207964 3743138 4143210 4010141 4810116 6552150 7948252 8279280 7842249
38507 7842249 6954098 5666938 4243458 2984391 1794761 634994 18710 322656 1014815
38498 1014815 1305941 1159999 991923 864930 667120 519338 330223 -366612 -1395053
38489 -1395053 -1615311 -588495 329200 -202038 -1389226 -1486229 -505306 -62042 -751564
$$ packed form
38554G524N64235m76565k71984P33946Q01760j89049o52698P8805Q46115O34689
38544B076778P86p4023K61892J43157n32068q92406m02839L07603L57221j03687
38534A142414k22882J56404L59258J90000K69013O94561N70561m26836j177742
38525A554751p68606P7871L31166K97931N95825O08024l26337j114108l14302
38516I42215J265749J535174M00072j33069P99975J742034J396102L31028m37031
38507G842249q88151j287160j423480j259067j189630j159767o16284L03946O92159
38498A014815K91126j45942j68076j26993j97810j47782j89115o96835j028441
38489a395053k20258J026816R17695n31238j187188r7003R80923M43264o89522
$$ plain form
38480 -751564 -1411959 -1155633 -564739 -429603 -595982 -633230 -625824 -710653 -600300 -92994
38470 -92994 518380 939274 1293291 1760033 2212561 2427760 2311716 1814809 954716 -28248
38460 -28248 -801778 -1176521 -1040801 -347426 570122 1081478 1034621 990927 1291127 1490002
38450 1490002 1232923 960979 1038012 975030 454178 312728 1290655 2472511 2409317 1345806
38440 1345806 817746 1302389 1848866 1949439 2122823 2480071 2338797 1671243 1454368
38431 1454368 2032706 2464500 2102537 1581485 1549312 1580740 1154062 699869 805369 1180257
38421 1180257 1249282 1110028 1126200 1141849 848102 481204 480313 791093 1066942 1274697
38411 1274697 1635189 2171604 2627839 2668225 2083961 1088716 341853 235696 305083 -56085
$$ packed form
38480g51564o60395K56326N90894J35136j66379l7248P406q4829J10353N07306
38470i2994O11374M20894L54017M66742M52528K15199j16044m96907q60093r82964
38460b8248p73530l74743J35720O93375R17548N11356m6857m3694L00200J98875
38450A490002k57079k71944P7033o2982n20852j41450R77927J181856o3194j063511
38440A345806n28060M84643N46477J00573J73384L57248j41274o67554k16875
38431A454368N78338M31794l61963n21052l2173L1428m26678m54193J05500L74888
38421A180257O9025j39254J6172J5649k93747l66898q91L10780K75849K07755
38411A274697L60492N36415M56235M0386n84264r95245p46863j06157O9387l61168
$$ plain form
38401 -56085 -505094 -212572 732494 1396414 1460106 1479019 1596751 1269729 581252 516580
38391 516580 1372694 2090310 1821422 1037591 390289 -350326 -1332109 -1714557 -850310 450495
38381 450495 931563 521755 -7140 -331853 -507325 -248118 585547 1233631 869744 -97078
38371 -97078 -517083 -39097 720011 1266067 1605249 1738246 1592319 1307154 931092 116519
38361 116519 -1195909 -2138313 -1763371 -316889 1035860 1526381 1213786 465730 -273491
38352 -273491 -522115 -288469 -260481 -835934 -1415619 -1389531 -1264033 -1838562 -2726177 -2833973
38342 -2833973 -2069956 -1424758 -1418957 -1544748 -1327064 -997532 -954782 -1279142 -1846611 -2333514
38332 -2333514 -2243762 -1558172 -1077383 -1396188 -1930919 -1857221 -1553221 -1941283 -2727834 -2672072
$$ packed form
38401e6085m49009K92522R45066O63920O3692J8913J17732l27022o88477o4672
38391E16580Q56114P17616k68888p83831o47302p40615r81783l82448Q64247J300805
38381D50495M81068m09808n28895l24713j75472K59207Q33665O48084l63887r66822
38371i7078m20005M77986P59108N46056L39182J32997j45927k85165l76062q14573
38361A16519j312428r42404L74942J446482J352749M90521l12595p48056p39221
38352b73491k48624K33646K7988n75453n79685K6088J25498n74529q87615j07796
38342b833973P64017O45198N801j25791K17684L29532M2750l24360n67469m86903
38332b333514Q9752O85590M80789l18805n34731P3698L04000l88062p86551N5762
$$ plain form
38322 -2672072 -1527143 -317403 408663 1172801 2111916 2333061 1327826 -75282 -805990
38313 -805990 -748138 -382321 -71428 -88319 -517151 -814902 -354098 383863 233075 -777227
38303 -777227 -1253160 -620815 -80526 -599709 -1329656 -1134112 -504528 -580041 -1139736 -1062611
38293 -1062611 -261518 282926 170724 -41484 -51013 -232722 -744899 -1153303 -1119335 -771363
38283 -771363 -326979 63214 146957 -151339 -363038 17753 756390 1187556 1154799 1004578
38273 1004578 794650 254523 -475109 -798783 -510846 -111345 -117933 -501590 -903545 -1029922
38263 -1029922 -782513 -336588 -84666 -207622 -394935 -286152 2621 146935 148253 149947
38253 149947 -10685 -517246 -1057915 -1185597 -1029406 -1052796 -1256325 -1245896 -968734 -736747
$$ packed form
38322b672072J144929J209740P26066P64138R39115K21145j005235j403108p30708
38313h05990N7852L65817L10893j6891m28832k97751M60804P37961j50788j010302
38303g77227m75933O32345N40289n19183p29947J95544O29584p5513n59695P7125
38293a062611Q01093N44444j12202k12208r529j81709n12177m08404L3968L47972
38283g71363M44384L90193Q3743k98296k11699L80791P38637M31166l2757j50221
38273A004578k09928n40127p29632l23674K87937L99501o588l83657m01955j26377
38263a029922K47409M45925K51922j22956j87313J08783K88773J44314J318J694
38253A49947j60632n06561n40669j27682J56191k3390k03529J0429K77162K31987
$$ plain form
38243 -736747 -614013 -431193 -324615 -598166 -1120633 -1511373 -1797784 -2177176 -2323561 -1836491
38233 -1836491 -1261319 -1586555 -2633721 -3043277 -2127128 -703611 217988 503619 247686
38224 247686 -740362 -2099145 -2636600 -1801699 -621812 -299972 -640732 -772443 -647969
38215 -647969 -723832 -773480 -247489 564605 907369 831007 956589 1188716 864094 115372
38205 115372 -128453 388864 910608 977609 976056 1094892 819856 -88117 -1046261 -1551645
38195 -1551645 -1788916 -1907697 -1577949 -791466 -254823 -370563 -594601 -410357 -140735
38186 -140735 -123637 51112 627220 844980 88783 -825838 -733430 44165 275390 -140271
38176 -140271 -194679 290572 347638 -285048 -560246 50945 538499 9764 -820015 -832242
$$ packed form
38243g36747J22734J82820J06578k73551n22467l90740k86411l79392j46385M87070
38233a836491N75172l25236j047166m09556R16149J423517R21599K85631k55933
38224B47686r88048j358783n37455Q34901J179887L21840l40760j31711J24474
38215f47969p5863m9648N25991Q12094L42764p6362J25582K32127l24622p48722
38205A15372k43825N17317N21744O7001j553J18836k75036r07973r58144n05384
38195a551645k37271j18781L29748P86483N36643j15740k24038J84244K69622
38186a40735J7098J74749N76108K17760p56197r14621R2408P77595K31225m15661
38176a40271n4408M85251N7066o32686k75198O11191M87554n28735q29779j2227
$$ plain form
38166 -832242 -255885 -51661 -252446 -176903 144642 71605 -266698 17862 1004762 1542993
38156 1542993 836565 -406338 -938738 -461721 394623 1103950 1647851 2081496 2212508
38147 2212508 1796114 882705 -51199 -369941 134643 948976 1378295 1328889 1213439 1164912
38137 1164912 892189 386019 116642 243797 265872 -81417 -176206 555824 1500852 1502608
38127 1502608 465482 -550698 -832697 -730814 -695488 -512040 7651 325451 -85792
38118 -85792 -754312 -751235 -25058 550766 434867 17586 -159610 -128429 -138536 -107864 143900
38107 143900 455596 564742 583490 805797 1148428 1211034 897007 586370 589610 749045
38097 749045 745392 543931 319130 123554 -91255 -207077 -13017 369069 406190 -248924
$$ packed form
38166h32242N76357K04224k00785P5543L21545p3037l38303K84560R86900N38231
38156A542993p06428j242903n32400M77017Q56344P09327N43901M33645J31012
38147B212508m16394r13409r33904l18742N04584Q14333M29319m9406j15450m8527
38137A164912k72723n06170k69377J27155K2075l47289r4789P32030R45028J756
38127A502608j037126j016180k81999J01883L5326J83448N19691L17800m11243
38118h5792o68520L077P26177N75824j15899m17281j77196L1181j0107L0672K51764
38107A43900L11696J09146J8748K22307L42631O2606l14027l10637L240J59435
38097G49045l653k01461k24801j95576k14809j15822J94060L82086L7121o55114
$$ plain form
38087 -248924 -1193217 -1610218 -1225334 -641582 -548132 -860363 -984826 -771988 -710834 -1107964
38077 -1107964 -1554861 -1483992 -925869 -413013 -380568 -936263 -1939246 -2947763 -3343010
38068 -3343010 -2933687 -2245532 -1789093 -1305627 -327939 744744 966329 271310 -283869
38059 -283869 27627 717844 1059399 1139241 1293165 1197690 447140 -372114 -208163 910353
38049 910353 1760599 1511377 665083 149670 129584 151932 32823 90412 627528 1516297
38039 1516297 2294631 2550897 2254186 1743585 1352037 1131309 1057640 1277012 1796412 2088530
38029 2088530 1540071 383523 -311010 163235 1283443 1888771 1386185 131224 -1132694
38020 -1132694 -1870312 -1910346 -1387494 -672288 -220203 -311438 -820450 -1228340 -1011323 -165338
$$ packed form
38087b48924r44293m17001L84884N83752R3450l12231j24463K12838O1154l97130
38077a107964m46897P0869N58123N12856L2445n55695j002983j008517l95247
38068c343010M09323O88155M56439M83466R77688J072683K21585o95019n55179
38059b83869L11496O90217L41555P9842J53924r5475p50550q19254J63951J118516
38049I10353Q50246k49222q46294n15413k0086K2348j19109N7589N37116Q88769
38039A516297P78334K56266k96711n10601l91548k20728p3669K19372N19400K92118
38029B088530n48459j156548o94533M74245J120208O05328n02586j254961j263918
38020a132694p37618m0034N22852P15206M52085r1235n09012m07890K17017Q45985
$$ plain form
38010 -165338 731064 1115942 1006238 803485 702414 569719 295712 -66426 -459125 -793016
38000 -793016 -820573 -405157 121199 279246 125965 188062 682033 1256921 1574490 1655334
37990 1655334 1558175 1268369 1070479 1424422 2171010 2439640 1751353 702224 100421
37981 100421 -83045 -367279 -810144 -1042007 -942665 -650180 -136382 571908 940346 436873
37971 436873 -525163 -867119 -209385 639510 759199 161442 -516244 -918722 -1171859 -1386613
37961 -1386613 -1369710 -911443 -205987 182180 -116454 -806710 -1245112 -1222192 -1086847 -1010814
37951 -1010814 -631010 255016 1123576 1374996 1191877 1166758 1370937 1451315 1411617 1529920
37941 1529920 1623765 1240868 610982 540403 1158735 1593203 1229465 553592 293302 367457
$$ packed form
38010a65338Q96402L84878j09704k02753j01071j32695k74007l62138l92699l33891
38000g93016k7557M15416N26356J58047j53281O2097M93971N74888L17569Q0844
37990A655334r7159k89806j97890L53943P46588K68630o88287j049129o01803
37981A00421j83466k84234m42865k31863R9342K92485N13798P08290L68438n03473
37971D36873r62036l41956O57734Q48895J19689n97757o77686m02478k53137k14754
37961a386613J6903M58267P05456L88167k98634o90256m38402K2920J35345P6033
37951a010814L79804Q86026Q68560K51420j83119k5119K04179Q0378l9698J18303
37941A529920R3845l82897o29886p0579O18332M34468l63738o75873k60290P4155
$$ plain form
37931 367457 230409 -229011 -678432 -887548 -838346 -602587 -459889 -749223 -1239118 -1114777
37921 -1114777 -65340 1090014 1456278 1305832 1523334 2132875 2294383 1723492 1189079
37912 1189079 1330037 1722288 1584555 932067 517796 838938 1613531 2190176 2192865 1732102
37902 1732102 1157579 717188 456006 342608 312029 153020 -394773 -1240200 -1839794 -1767045
37892 -1767045 -1246820 -840616 -727125 -636020 -417290 -279193 -423072 -781776 -1187878 -1503616
37882 -1503616 -1530576 -1107431 -391526 238374 629771 903613 1009481 656806 -129067 -805914
37872 -805914 -978089 -907617 -994138 -1080761 -792035 -345906 -382270 -955540 -1322861 -973077
37862 -973077 -340491 -100456 -163663 72885 682442 1076815 985503 926683 1354195 1833580
$$ packed form
37931C67457j37048m59420m49421k09116M9202K35759J42698k89334m89895J24341
37921a114777J049437J155354L66264j50446K17502O09541J61508n70891n34413
37912A189079J40958L92251j37733o52488m14271L21142P74593N76645K689m60763
37902A732102n74523m40391k61182j13398l0579j59009n47793q45427n99594P2749
37892a767045N20225M06204J13491R1105K18730J38097j43879l58704m06102l15738
37882a503616k6960M23145P15905O29900L91397K73842J05868l52675p85873o76847
37872h05914j72175P0472q6521q6623K88726M46129l6364n73270l67321L49784
37862i73077O32586K40035o3207K36548O09557L94373r1312n8820M27512M79385
$$ plain form
37852 1833580 1637700 899335 476662 653469 686076 -34017 -956143 -1071636 -290423 536107
37842 536107 833557 853135 913281 770779 118617 -743099 -1194270 -1030969 -550708 -80914
37832 -80914 235047 342079 342581 572143 1235932 2009928 2353302 2177101 1816653 1370769
37822 1370769 580830 -488472 -1161711 -902597 -38091 606705 563561 -78462 -1021975
37813 -1021975 -1863932 -2045308 -1254657 54094 933925 827242 -65782 -1221805 -2194816
37804 -2194816 -2604906 -2266991 -1545039 -1148857 -1292195 -1406406 -1006878 -491535 -611704
37795 -611704 -1347303 -1845958 -1529669 -850542 -756261 -1597046 -2716828 -3090643 -2348235 -1176187
37785 -1176187 -612137 -901182 -1243596 -813758 202028 870272 679731 97021 -74525
$$ packed form
37852A833580j95880p38365m22673J76807L2607p20093r22126j15493P81213Q26530
37842E36107K97450J9578O0146j42502o52162q61716m51171J63301M80261M69794
37832h0914L15961J07032N02K29562O63789P73996L43374j76201l60448m45884
37822A370769p89939j069302o73239K59114Q64506O44796m3144o42023r43513
37813a021975q41957j81376P90651J308751Q79831j06683q93024j156023r73011
37804b194816m10090L37915P21952L96182j43338j14211L99528N15343j20169
37795f11704p35599m98655L16289O79127R4281q40785j119782l73815P42408J172048
37785a176187N64050k89045l42414M29838J015786O68244j90541n82710j71546
$$ plain form
37776 -74525 380467 932106 972222 550578 368183 908259 1660306 1588738 478668 -670909
37766 -670909 -927620 -605494 -597831 -950607 -939888 -414233 -87429 -304415 -420296 127187
37756 127187 852385 957306 522859 270173 443224 647467 696265 927253 1547519 2188457
37746 2188457 2367060 2073675 1649655 1275456 854334 360136 18951 -40534 -172122 -877957
37736 -877957 -1973369 -2502719 -1904687 -958184 -912407 -1750136 -2099106 -1083926 492949
37727 492949 1263295 920915 118134 -696966 -1482638 -1935069 -1583766 -662882 -128899 -524807
37717 -524807 -1334115 -1721220 -1501809 -1111654 -936502 -963102 -922209 -589258 -64821 178893
37707 178893 -262356 -1150871 -1701470 -1398668 -556934 59582 23795 -471645 -956315 -1107243
$$ packed form
37776g4525M54992N51639M0116m21644j82395N40076P52047p1568j110070j149577
37766f70909k56711L22126P663l52776J0719N25655L26804k16986j15881N47483
37756A27187P25198J04921m34447k52686J73051K04243M8798K30988O20266O40938
37746B188457J78603k93385m24020l74199m21122m94198l41185n9485j31588p05835
37736h77957j095412n29350N98032R46503M5777q37729l48970J015180J576875
37727D92949P70346l42380q02781q15100p85672m52431L51303R20884N33983l95908
37717e24807q09308l87105K19411L90155J75152k6600M0893L32951N24437K43714
37707A78893m41249q88515n50599L02802Q41734O16516l5787m95440m84670j50928
$$ plain form
37697 -1107243 -886980 -447652 27343 440713 797490 1101352 1207944 832686 -126263
37688 -126263 -1190177 -1462040 -521804 899489 1527968 913030 -156236 -691733 -536450
37679 -536450 -132981 283681 813690 1446903 1926651 1999078 1550870 636166 -414948 -1104979
37669 -1104979 -1212823 -938918 -476641 183974 807645 810865 93985 -488419 -149015 636482
37659 636482 657191 -449925 -1791335 -2330309 -1854585 -910666 -294028 -509048 -1258402
37650 -1258402 -1633745 -1260511 -903600 -1332898 -2041681 -1967433 -1122139 -451094 -301460 -199975
37640 -199975 -40204 -200282 -439599 -71388 546289 173875 -1206248 -1958830 -1167866
37631 -1167866 28621 387053 392974 948962 1564070 1370635 902743 1180595 1771941 1504999
$$ packed form
37697a107243K20263M39328M74995M13370L56777L03862J06592l75258r58949
37688a26263j063914k71863R40236J421293O28479o14938j069266n35497J55283
37679e36450M03469M16662N30009O33213M79748P2427m48208r14704j051114o90031
37669a104979j07844K73905M62277O60615O23671L220p16880n82404L39404P85497
37659F36482K0709j107116j341410n38974M75724R43919O16638k15020p49354
37650a258402l75343L73234L56911m29298p08783P4248Q45294O71045J49634J01485
37640a99975J59771j60078k39317L68211O17677l72414j380123p52582P90964
37631a167866J196487L58432N921N55988O15108j93435m67892K77852N91346k66942
$$ plain form
37621 1504999 599136 294208 639711 500924 -235696 -334033 563110 1122821 431515 -546512
37611 -546512 -500553 377413 990539 898656 401448 -236665 -802523 -905849 -486770 -144681
37601 -144681 -351796 -751584 -782789 -523739 -307722 25755 750144 1450925 1415932 731080
37591 731080 264697 496675 955738 973023 503591 -61658 -548266 -1077700 -1590643 -1690715
37581 -1690715 -1190776 -598581 -621055 -1128216 -1120321 -72173 1133962 1188974 -13968 -1398007
37571 -1398007 -2173747 -2507955 -2728816 -2717585 -2348366 -1834841 -1321517 -712165 -173157 -192274
37561 -192274 -802306 -1314683 -1174313 -563337 111508 707359 1016452 692131 -19393 -185540
37551 -185540 587615 1486983 1666387 1403869 1347596 1306318 755943 2673 -265000 -241823
$$ packed form
37621A504999r05863l04928L45503j38787p36620r8337Q97143N59711o91306r78027
37611e46512M5959Q77966O13126r1883m97208o38113n65858j03326M19079L42089
37601a44681k07115l99788l1205K59050K16017L33477P24389P00781l4993o84852
37591G31080m66383K31978M59063J7285m69432n65249m86608n29434n12943j00072
37581a690715M99939N92195k2474n07161P895J048148J206135N5012j202942j384039
37571a398007p75740l34208k20861J1231L69219N13525N13324O09352N39008j9117
37561a92274o10032n12377J40370O10976O74845N95851L09093l24321p11524j66147
37551a85540P73155Q99368J79404k62518n6273m1278n50375p53270k67673K3177
$$ plain form
37541 -241823 -675843 -1437926 -1591169 -935526 -367641 -467603 -730409 -577588 -277620 -392035
37531 -392035 -956933 -1632733 -2119018 -2081200 -1238594 61150 824730 386025 -919930
37522 -919930 -2285473 -3206697 -3491760 -3012267 -1878733 -561220 486027 1078662 1061715
37513 1061715 297677 -831586 -1419280 -974098 -22367 615160 794272 875634 944405 766556
37503 766556 360718 92439 201679 573041 933799 1021414 667484 4088 -493495 -425679
37493 -425679 116181 697079 961087 785213 264157 -244048 -301503 132007 616373 815062
37483 815062 851762 855899 579456 -122229 -808777 -982233 -808740 -749092 -730025 -362821
37473 -362821 156129 130923 -571416 -1225708 -1215782 -736521 -289945 40538 509859 1211290
$$ packed form
37541b41823m34020p62083j53243O55643N67885r9962k62806J52821K99968j14415
37531c92035n64898o75800m86285L7818Q42606J299744P63580m38705j305955
37522i19930j365543r21224k85063M79493J133534J317513J047247N92635j6947
37513A061715p64038j129263n87694M45182R51731O37527J79112Q1362O8771j77849
37503G66556m05838k68279J09240L71362L60758Q7615l53930o63396m97583O7816
37493d25679N41860N80898K64008j75874n21056n08205n7455M33510M84366J98689
37483H15062L6700M137k76443p01685o86548j73456J73493N9648J9067L67204
37473c62821N18950k5206p02339o54292R926M79261M46576L30483M69321P01431
$$ plain form
37463 1211290 1883676 2055210 1399043 226198 -508399 -160961 740579 1167964 1009831
37454 1009831 1019298 1348355 1204265 341179 -207956 334403 1130627 939527 45526 -218938
37444 -218938 473563 1151723 1280238 1515707 2375673 3221010 3203485 2526300 2083085 2223709
37434 2223709 2440855 2114651 1209304 314150 108222 610083 1009846 626288 -46359
37425 -46359 123159 1231819 1994661 1456169 326635 -23143 616850 1213454 944354
37416 944354 46031 -672288 -604597 272692 1323648 1653678 1003143 102893 -222754 -26205
37406 -26205 143918 192413 332981 308688 -294836 -1005772 -743682 619675 1863776 1964393
37396 1964393 1259245 620087 218653 -239589 -649313 -649753 -307804 40011 416716 1033205
$$ packed form
37463A211290O72386J71534o56167j172845p34597L47438R01540M27385j58133
37454A009831R467L29057j44090q63086n49135N42359P96224j91100q94001k64464
37444b18938O92501O78160J28515K35469Q59966Q45337j7525o77185m43215J40624
37434B223709K17146l26204r05347q95154k05928N01861L99763l83558o72647
37425d6359J69518J108660P62842n38492j129534l49778O39993N96604k69100
37416I44354q98323p18319O7691Q77289J050956L30030o50535r00250l25647J96549
37406b6205J70123M8495J40568k4293o03524p10936K62090J363357J244101J00617
37396A964393p05148o39158m01434m58242m09724m40L41949L47815L76705O16489
$$ plain form
37386 1033205 1638780 1709232 1283995 1011835 1232796 1506136 1260782 549959 -96096 -346408
37376 -346408 -343825 -378813 -497312 -519623 -383201 -289262 -378934 -420662 -113338 373421 572119
37365 572119 462041 533559 924601 1059306 543251 -97958 -151539 212810 324137 216686
37355 216686 604419 1605374 2301890 1903832 792262 22879 148728 843120 1384865
37346 1384865 1223077 330689 -677362 -961295 -304950 561910 764520 315204 32132
37337 32132 432053 1065346 1162678 685437 324544 459140 594366 148830 -559402 -663958
37327 -663958 50085 936635 1517017 1990587 2455563 2391790 1502868 477904 174901 451029
37317 451029 581664 524491 877321 1711149 2354498 2396076 2091128 1667367 1025983 309871
$$ packed form
37386A033205O05575P0452m25237k72160K20961K73340k45354p10823o46055k50312
37376c46408K583l4988j18499k2311J36422R3939q9672m1728L07324M86759J98698
37365E72119j10078P1518L91042J34705n16055o41209n3581L64349J11327j07451
37355B16686L87733J000955O96516l98058j111570p69383J25849O94392N41745
37346A384865j61788q92388j008051k83933O56345Q66860K02610m49316k83072
37337C2132L99921O33293R7332m77241l60893J34596J35226m45536p08232j04556
37327f63958P14043Q86550N80382M73570M64976o3773q88922j024964l03003K76128
37317D51029J30635n7173L52830Q33828O43349M1578l04948m23761o41384p16112
$$ plain form
37307 309871 -16640 74281 47824 -285097 -439140 -133565 235508 363645 510913 745560
37297 745560 518985 -349198 -975153 -509250 600672 1267945 1244304 1067508 908182 484047
37287 484047 -13469 55949 680026 981776 405678 -551337 -1121339 -1228211 -1281984 -1407878
37277 -1407878 -1328558 -892872 -407576 -361502 -844531 -1293003 -1004874 -9157 842118 880802
37267 880802 432340 254055 436204 404470 -83318 -540718 -476742 -49094 234626 167821
37257 167821 -43042 -173191 -283176 -582183 -1012533 -1106971 -488607 537368 1265890 1510486
37247 1510486 1746359 2187090 2361521 1978621 1518609 1352802 944574 -203023 -1339581
37238 -1339581 -1303693 -290487 386649 248469 156143 676234 1137130 823063 131663 -128722
$$ packed form
37307C09871l26511R0921k6457l32921j54043L05575L69073J28137J47268K34647
37297G45560k26575q68183o25955M65903J109922O67273k3641j76796j59326m24135
37287D84047m97516O9418O24077L01750n76098r57015n70002j06872n3773j25894
37277a407878P9320M35686M85296M6074m83029m48472K88129R95717Q51275L8684
37267H80802m48462j78285J82149l1734m87788m57400O3976M27648K83720o6805
37257A67821k10863j30149j09985k99007m30350r4438O18364J025975P28522K44596
37247A510486K35873M40731J74431l82900m60012j65807m08228j147597j136558
37238a339581L5888J013206O77136j38180r2326N20091M60896l14067o91400k60385
$$ plain form
37228 -128722 97106 291298 202027 -49049 -304229 -377320 -84502 397351 593542 431656
37218 431656 436997 959829 1681108 2136459 2194015 1766645 721478 -541026 -1118477 -756801
37208 -756801 -354859 -723624 -1414049 -1460570 -790764 -121823 198916 465535 892159 1282243
37198 1282243 1359338 989890 239261 -457101 -508992 57316 453427 176579 -306166 -429070
37188 -429070 -459932 -836548 -1160036 -780898 26883 462545 476096 650285 1018426 1037151
37178 1037151 639658 296641 71085 -347380 -649715 -64658 1287552 2235032 2072095
37169 2072095 1357570 917896 904199 1090868 1227775 834437 -417357 -1809816 -2079265
37160 -2079265 -1218129 -709957 -1400683 -2232570 -1911289 -840186 -340520 -674034 -991314
$$ packed form
37228a28722K25828J94192q9271k51076k55180p3091K92818M81853J96191j61886
37218D31656N341N22832P21279M55351N7556m27370j045167j262504n77451L61676
37208g56801M01942l68765o90425m6521O69806O68941L20739K66619M26624L90084
37198A282243P7095l69448p50629o96362n1891N66308L96111k76848m82745j22904
37188d29070l0862l76616l23488L79138Q07781M35662J3551J74189L68141J8725
37178A037151l97493l43017k25556m18465l02335N85057J352210R47480j62937
37169B072095p14525m39674j3697J86669J36907l93338j251794j392459k69449
37160b079265Q61136N08172o90726q31887L21281J071103M99666l33514l17280
$$ plain form
37151 -991314 -834050 -610615 -722119 -1059441 -1313238 -1195432 -515916 470309 1062240 915286
37141 915286 483744 240483 739 -426151 -569123 -61856 511506 447429 86662 152690
37131 152690 421604 228143 -82627 408236 1420744 1603503 642906 -139715 240295
37122 240295 1103291 1386570 1150734 972417 712021 -109109 -1200672 -1716062 -1410401
37113 -1410401 -910053 -882517 -1384670 -1971723 -2149618 -1795354 -1289987 -1109547 -1266078 -1400137
37103 -1400137 -1348077 -1191891 -833036 -131237 520411 478761 -165602 -637132 -663419 -744860
37093 -744860 -990591 -735497 150947 634156 16425 -837998 -769756 -65728 163427 -266552
37083 -266552 -687918 -952808 -1436593 -1899025 -1629313 -701518 89533 553356 1177484 1814203
$$ packed form
37151i91314J57264K23435j11504l37322k53797J17806O79516R86225N91931j46954
37141I15286m31542k43261k39744m26890j42972N07267N73362o4077l60767O6028
37131A52690K68914j93461l10770M90863J012508J82759r60597p82621L80010
37122B40295Q62996K83279k35836j78317k60396q21130j091563n15390L05661
37113a410401N00348K7536n02153n87053j77895L54264N05367J80440j56531j34059
37103a400137N2060J56186L58855P01799O51648m1650o44363m71530k6287q1441
37093g44860k45731K55094Q86444M83209o17731q54423O8242P04028K29155m29979
37083b66552m21366k64890m83785m62432K69712R27795P91051M63823O24128O36719
$$ plain form
37073 1814203 1592530 445930 -508387 -593661 -448282 -711941 -939538 -580443 -72938
37064 -72938 -51324 -210853 84294 610733 633104 75549 -464083 -583784 -287495 326636
37054 326636 921902 853586 -34792 -906263 -951783 -522400 -433431 -576287 -251585 408746
37044 408746 531496 -39487 -550147 -706264 -1037354 -1595493 -1520132 -523721 241946 -325177
37034 -325177 -1646283 -2213421 -1506283 -346430 328476 268780 -309311 -1013066 -1340084
37025 -1340084 -991250 -185737 594052 1044547 1038022 554036 -8923 123258 1159830 2146424
37015 2146424 1964310 742526 -396841 -853810 -1029412 -1289291 -1314894 -793902 -63420
37006 -63420 382657 549074 679118 741152 638506 630999 1025677 1570650 1647074 1107225
$$ packed form
37073A814203k21673j146600r54317q5274J45379k63659k27597L59095N07505
37064g2938K1614j59529K95147N26439K2371n57555n39632j19701K96289O14131
37054C26636N95266o8316q88378q71471m5520M29383Q8969j42856L24702O60331
37044D08746J22750n70983n10660j56117l31090n58139P5361R96411P65667n67123
37034c25177j321106n67138P07138J159853O74906n9696n78091p03755l27018
37025a340084L48834Q05513P79789M50495o525m83986n62959J32181J036572R86594
37015B146424j82114j221784j139367m56969j75602k59879k5603N20992P30482
37006f3420M46077J66417J30044O2034j02646p507L94678N44973P6424n39849
$$ plain form
36996 1107225 527327 455169 668029 461995 -366587 -1124685 -1009796 -137108 576370 578600
36986 578600 284701 267713 334650 -20128 -538753 -368564 637487 1527744 1466384 780886
36976 780886 398271 643269 1022890 948762 314472 -457533 -686303 15021 1210263 1932700
36966 1932700 1758734 1275488 1195155 1402744 1325117 889196 526147 419580 343309 166888
36956 166888 -14956 -202019 -415025 -360917 248934 1035601 1213625 619283 -92340 -403991
36946 -403991 -492523 -649795 -797146 -882902 -1120529 -1398371 -1069936 77723 1169644 1280684
36936 1280684 754311 679332 1269678 1652659 1277347 650057 413145 446224 304342 -26204
36926 -26204 -296480 -489184 -630380 -419365 396858 1420278 1879236 1495770 694727 -4096
$$ packed form
36996A107225n79898p2158K12860k06034q28582p58098J14889Q72688P13478K230
36986E78600k93899j6988O6937l54778n18625J70189J006051Q90257o1360o85498
36976G80886l82615K44998L79621p4128o34290p72005k28770P01324J195242P22437
36966A932700j73966m83246q0333K07589p7627m35921l63049j06567p6271j76421
36956A66888j81844j87063k13006N4108O09851P86667J78024n94342p11623l11651
36946d03991q8532j57272j47351q5756k37627k77842L28435J147659J091921J11040
36936A280684n26373p4979N90346L82981l75312o27290k36912L3079j41882l30546
36926b6204k70276j92704j41196K11015Q16223J023420M58958l83466q01043o98823
$$ plain form
36916 -4096 -376651 -264781 538511 1897338 3113576 3428947 2716722 1556845 697786
36907 697786 502869 783676 1049927 982908 710431 534447 435367 108626 -441457 -696326
36897 -696326 -285674 404681 670530 385790 15741 -219763 -656353 -1472322 -2145166 -2031177
36887 -2031177 -1261872 -664312 -843688 -1625908 -2367768 -2567378 -2184873 -1587936 -1201039
36878 -1201039 -1063485 -789715 -126988 589645 840566 690702 727558 1144972 1326754 641801
36868 641801 -623925 -1509965 -1474595 -912395 -521046 -402347 -8637 1020224 2155685
36859 2155685 2384040 1416374 226123 21358 799877 1420300 1163410 615106 646192
36850 646192 1060851 920572 -19792 -904726 -855564 91438 1230628 1882398 1701077 787975
$$ packed form
36916d096l72555J11870Q03292J358827J216238L15371p12225j159877q59059
36907F97786j94917K80807K66251o7019k72477j75984r9080l26741n50083k54869
36897f96326M10652O90355K65849k84740l70049k35504m36590q15969o72844J13989
36887b031177P69305N97560j79376p82220p41860j99610L82505N96937L86897
36878a201039J37554K73770O62727P16633K50921j49864L6856M17414J81782o84953
36868F41801j265726q86040L5370N62200L91349J18699L93710J028861J135461
36859B155685K28355r67666j190251k04765P78519O20423k56890n48304L1086
36850F46192M14659j40279r40364q84934M9162R47002J139190O51770j81321r13102
$$ plain form
36840 787975 -225159 -588863 -227318 187050 179411 80722 320075 537718 41433 -1017799
36830 -1017799 -1618749 -1149663 -188761 247515 -121686 -698102 -802379 -334157 269134
36821 269134 516188 299577 -60675 -195612 -76283 34414 -61190 -316857 -527589 -412441
36811 -412441 256703 1314389 2092677 2059315 1546189 1366076 1648162 1641661 902591 28111
36801 28111 -262110 -190701 -362216 -560334 -26139 1153346 1867684 1425365 436478 -87663
36791 -87663 83185 509782 850982 1019100 925467 574309 209333 -20198 -326848 -857970
36781 -857970 -1260229 -1112815 -580395 -131180 237364 898412 1739715 2038600 1396425 314431
36771 314431 -431867 -619485 -506978 -296620 -59584 23056 -205164 -522185 -479718 -633
$$ packed form
36840G87975j013134l63704L61545M14368p639r8689K39353K17643m96285j059232
36830a017799o00950M69086R60902M36276l69201n76416j04277M68222O03291
36821B69134K47054k16611l60252j34937J19329J10697r5604k55667k10732J15148
36811d12441O69144J057686P78288l3362n13126j80113K82086o501p39070q74480
36801B8111k90221P1409j71515j98118N34195J179485P14338m42319r88887n24141
36791h7663J70848M26597L41200J68118r3633l51158l64976k29531l06650n31122
36781h57970m02259J47414N32420M49215L68544O61048Q41303K98885o42175j081994
36771C14431p46298j87618J12507K10358K37036Q2640k28220l17021M2467M79085
$$ plain form
36761 -633 458628 501001 325556 420006 825000 1044898 773912 368014 297786 380829 60194
36750 60194 -579935 -685283 189021 1270884 1469841 813115 381174 850642 1671721 1857060
36740 1857060 1163157 235359 -165694 160756 835360 1368658 1609583 1693240 1598669 1081205
36730 1081205 242103 -251348 -31873 184927 -552187 -1865038 -2235019 -1030700 501214
36721 501214 816973 -32389 -799050 -819195 -526514 -407661 -343048 -114501 106827 54598
36711 54598 -249607 -609435 -886773 -1032299 -1120275 -1360866 -1816262 -2143773 -1940985 -1314263
36701 -1314263 -748022 -437572 -175100 79807 14748 -481624 -1021825 -1235243 -1250293 -1415748
36691 -1415748 -1827215 -2349912 -2806724 -2896304 -2255931 -962360 270750 775051 650064
$$ packed form
36761f33M59261M2373j75445R4450M04994K19898k70986m05898p0228Q3043l20635
36750F0194o40129j05348Q74304J081863J98957o56726m31941M69468Q21079J85339
36740A857060o93903r27798m01053L26450O74604N33298K40925Q3657r4571n17464
36730A081205q39102m93451K19475K16800p37114j312851l69981J204319J531914
36721E01214L15759q49362p66661k0145K92681J18853O4613K28547K21328n2229
36711E4598l04205l59828k77338j45526q7976k40591m55396l27511K02788O26722
36701a314263N66241L10450K62472K54907o5059m96372n40201k13418j5050j65455
36691a415748m11467n22697m56812q9580O40373J293571J233110N04301j24987
$$ plain form
36682 650064 470013 459995 390988 179289 89310 290329 645205 1046395 1548299 1996381
36672 1996381 1956149 1342266 791683 966701 1645376 1963948 1529647 818160 361854 37492
36662 37492 -493723 -981065 -745645 374639 1661133 2233938 1894024 1146818 607825
36653 607825 511867 631584 540105 70756 -414973 -386355 170134 678268 719172 538956
36643 538956 543480 595667 272959 -324121 -562642 -151625 430698 578805 286453 -4862
36633 -4862 -29585 94049 140687 48756 -16428 231268 896953 1619730 1798215 1281010 654690
36622 654690 605577 1095453 1402042 936615 -152056 -1127265 -1264394 -431035 684013
36613 684013 1011430 96198 -1322150 -2015708 -1607333 -886584 -689599 -885705 -821823 -442833
$$ packed form
36682F50064j80051j0018o9007k11699q9979K01019L54876M01190N01904M48082
36672A996381m0232o13883n50583J75018O78675L18572m34301p11487m56306l24362
36662C7492n31215m87342K35420J120284J286494N72805l39914p47206n38993
36653F07825r5958J19717r1479m69349m85729K8618N56489N08134M0904j80216
36643E38956M524N2187l22708n97080k38521M11017N82323J48107k92352k91315
36633d862k4723J23634M6638r1931o5184K47696O65685P22777J78485n17205o26320
36622F54690m9113M89876L06589m65427j088671r75209j37129Q33359J115048
36613F84013L27417r15232j418348o93558M08375P20749J96985j96106O3882L78990
$$ plain form
36603 -442833 -381462 -937945 -1535740 -1462746 -784020 -159743 34251 31488 213115 674478
36593 674478 1247185 1645715 1574243 998871 362753 186689 333231 37197 -1074046 -2295563
36583 -2295563 -2550254 -1631581 -384590 300686 338876 257334 463994 885443 1202846 1256117
36573 1256117 1146325 990834 733707 318224 -98907 -361615 -633878 -1112275 -1449910
36564 -1449910 -1012739 130655 1060696 1179215 960822 1068064 1294947 1063996 494115
36555 494115 137507 -21815 -393066 -808935 -722310 -296006 -231202 -444426 -78126 887093
36545 887093 1250815 416096 -521175 -370157 361955 307929 -737923 -1699023 -1775449 -1164345
36535 -1164345 -414260 98193 155700 -119232 -163781 361134 998404 1138453 902833 729397
$$ packed form
36603d42833O1371n56483n97795P2994O78726O24277J93994k763J81627M61363
36593F74478N72707L98530p1472n75372o36118j76064J46542k96034j111243j221517
36583b295563k54691R18673J246991O85276L8190q1542K06660M21449L17403N3271
36573A256117j09792j55491k57127m15483m17131k62708k72263m78397l37635
36564a449910M37171J143394R30041J18519k18393J07242K26883k30951n69881
36555D94115l56608j59322l71251m15869Q6625M26304O4804k13224L66300R65219
36545H87093L63722q34719r37271J51018P32112n4026j045852r61100p6426O11104
36535a164345P50085N12453N7507k74932m4549N24915O37270J40049k35620j73436
$$ plain form
36525 729397 490193 -122384 -695889 -625247 -318826 -713529 -1620342 -1800997 -905610 -99198
36515 -99198 -294705 -875346 -824366 -190145 329200 528884 666295 843642 1078483 1489188
36505 1489188 1863638 1635165 850407 443738 817768 913301 -300114 -2029193 -2582635
36496 -2582635 -1747111 -937058 -1054112 -1508539 -1557183 -1348718 -1157430 -659426 335239 1223908
36486 1223908 1397422 1105075 909388 817516 601730 482008 743904 1042151 860246 426355
36476 426355 396993 767152 886733 539668 208844 164073 81423 -184360 -219816 151539
36466 151539 398993 164700 -5430 463514 1042766 739526 -341970 -1027344 -713466
36457 -713466 -79355 108363 48446 251198 533068 403410 46263 116362 673506 1039070
$$ packed form
36525G29397k39204o12577n73505P0642L06421l94703r06813j80655Q95387Q06412
36515i9198j95507n80641N0980O34221N19345J99684J37411J77347K34841M10705
36505A489188L74450k28473p84758m06669L74030R5533j213415j729079n53442
36496b582635Q35524Q10053j17054m54427m8644K08465J91288M98004R94665Q88669
36486A223908J73514k92347j95687r1872k15786j19722K61896K98247j81905m33891
36476D26355k9362L70159J19581l47065l30824m4771q2650k65783l5456L71355
36466A51539K47454k34293j70130M68944N79252l03240j081496o85374L13878
36457g13466O34111J87718n9917K02752K81870j29658l57147P0099N57144L65564
$$ plain form
36447 1039070 802486 395154 451288 994292 1489213 1462792 904870 211355 -185221 -234494
36437 -234494 -276270 -489611 -524714 -26493 651545 808791 457839 349444 719512 724359
36427 724359 -330765 -1740870 -2153098 -1333704 -363622 -45607 55527 648805 1502243
36418 1502243 1827097 1477071 1023213 750074 355802 -180317 -201689 622978 1447443 1164134
36408 1164134 -60771 -983814 -991849 -718002 -721549 -535904 296739 1047319 706766 -305992
36398 -305992 -473907 772657 2364520 3165862 3266670 3244810 3015909 2212213 1197605
36389 1197605 817114 1222876 1639727 1413013 813340 595441 1033569 1633039 1741004
36380 1741004 1265389 662528 268149 -73771 -551691 -895475 -780726 -514733 -733355
$$ packed form
36447A039070k36584m07332N6134N43004M94921k6421n57922o93515l96576m9273
36437b34494m1776k13341l5103M98221O78038J57246l50952j08395L70068M847
36427G24359j055124j410105m12228Q19394R70082L18015J01134N93278Q53438
36418A502243L24854l50026m53858k73139l94272n36119k1372Q24667Q24465k83309
36408A164134j224905r23043q035K73847l547J85645Q32643P50580l40553j012758
36398c05992j67915J246564J591863Q01342J00808k1860k28901q03696j014608
36389A197605l80491M05762M16851k26714n99673k17899M38128N99470J07965
36380A741004m75615o02861l94379l41920m77920l43784J14749K65993k18622
$$ plain form
36371 -733355 -1448266 -1997469 -1989113 -1654642 -1164486 -342547 670466 1232335 1106571 862363
36361 862363 886681 720391 3181 -645055 -540505 -175777 -567459 -1691055 -2513217 -2404742
36351 -2404742 -1668086 -830854 -277264 -430605 -1373287 -2323742 -2377734 -1739615 -1317431 -1186954
36341 -1186954 -588384 464350 880817 266930 -212440 470524 1598642 1743271 757403
36332 757403 -221638 -368448 113956 661894 940219 794395 238380 -417259 -779005 -728843
36322 -728843 -401123 20236 306225 265112 24883 -100114 -205825 -763387 -1673252 -1953741
36312 -1953741 -953536 583892 1348586 1034275 371341 -153878 -761093 -1535275 -1918136
36303 -1918136 -1369950 -118216 1014972 1336743 789387 -46085 -460892 -317256 -131478
$$ packed form
36371g33355p14911n49203Q356L34471M90156Q21939J013013N61869j25764k44208
36361H62363K4318j66290p17210o48236J04550L64728l91682j123596q22162J08475
36351b404742P36656Q37232N53590j53341r42682r50455n3992O38119M22184J30477
36341a186954N98570J052734M16467o13887m79370O82964J128118J44629r85868
36332G57403r79041j46810M82404N47938K78325j45824n56015o55639l61746N0162
36322g28843L27720M21359K85989m1113k40229j24997j05711n57562r09865k80489
36312a953741J000205J537428P64694l14311o62934n25219o07215p74182l82861
36303a918136N48186J251734J133188L21771n47356q35472m14807J43636J85778
$$ plain form
36294 -131478 -289607 -466366 -177112 394217 661937 568138 634178 1080170 1454201 1257670
36284 1257670 507367 -423579 -1145781 -1381185 -1151513 -914309 -1127036 -1603890 -1704075
36275 -1704075 -1251246 -830768 -967037 -1359494 -1227440 -266147 926945 1368173 680448
36266 680448 -359498 -499958 520303 1496361 1186944 -85008 -922327 -743772 -298887
36257 -298887 -227864 -103596 613243 1467926 1603216 1023935 561303 754683 1334353 1756411
36247 1756411 1825130 1774439 1967924 2460163 2753001 2233009 1015957 14654 -132233
36238 -132233 110599 -199157 -1240898 -2213716 -2258434 -1293937 -16822 716394 612977
36229 612977 176035 41078 99547 -256336 -942208 -978139 95455 1337446 1655304 1301417
$$ packed form
36294a31478j58129j76759K89254N71329K67720r3799O6040M45992L74031j96531
36284A257670p50303r30946p22202k35404K29672K37204k12727m76854j00185
36275a704075M52829M20478j36269l92457J32054R61293J193092M41228o87725
36266F80448j039946j40460J020261R76058l09417j271952q37319J78555M44885
36257b98887P1023J24268P16839Q54683J35290n79281m62632J93380N79670M22058
36247A756411O8719n0691J93485M92239K92838n19992j217052j001303j46887
36238a32233K42832l09756j041741r72818m4718R64497J277115P33216j03417
36229F12977m36942j34957N8469l55883o85872l5931J073594J241991L17858l53887
$$ plain form
36219 1301417 1190890 1249454 666576 -411840 -819851 -207376 340085 2347 -602193
36210 -602193 -632852 -379730 -466875 -529189 174477 1323818 1884212 1669677 1441243 1485959
36200 1485959 1216132 390515 -301139 -315317 -69670 -125632 -262965 -52931 185158 -169926
36190 -169926 -876763 -928343 120279 1537835 2315130 2229735 1780244 1386874 983411 333118
36180 333118 -473808 -967730 -812443 -322294 -225101 -774119 -1364422 -1319970 -808857 -519558
36170 -519558 -594666 -521509 -126906 42789 -333918 -678550 -349839 323004 557640 370879
36160 370879 488930 1085014 1493478 1371489 1293825 1737175 2184063 1898468 1103403 636956
36150 636956 724324 871195 853883 991968 1340221 1396472 935840 503047 634156 1055484
$$ packed form
36219A301417j10527N8564n82878j078416m08011O12475N47461l37738o04540
36210f02193l0659K53122q7145o2314P03666J149341N60394k14535k28434M4716
36200A485959k69827q25617o91654j4178K45647n5962j37333K10034K38089l55084
36190a69926p06837n1580J048622J417556P77295q5395m49491l93370m03463o50293
36180C33118q06926m93922J55287M90149R7193n49018n90303M4452N11113K89299
36170e19558p5108P3157L94603J69695l76707l44632L28711O72843K34636j86761
36160C70879J18051N96084M08464j21989p7664M43350M46888k85595p95065m66447
36150F36956Q7368J46871j7312J38085L48253N6251m60632m32793J31109M21328
$$ plain form
36140 1055484 1126473 725581 218020 -171002 -432654 -427622 -27824 458287 536575 244322
36130 244322 142956 500009 913794 902858 483771 -16863 -371814 -459160 -172746 420324
36120 420324 1061235 1629216 2232290 2785615 2842669 2171400 1224648 643830 472522 258305
36110 258305 -191472 -578769 -606450 -321274 57088 343654 422302 354490 421943 763619
36100 763619 1037130 809137 233674 -99165 -3629 100078 -88854 -351033 -463621 -588628
36090 -588628 -838347 -947729 -789937 -776079 -1221826 -1661868 -1407007 -591324 -38760 -140908
36080 -140908 -458652 -484449 -237024 62952 421729 918581 1461411 1931413 2318333 2539103
36070 2539103 2392535 1894889 1418358 1274710 1354854 1380849 1305185 1208553 983767 453221
$$ packed form
36140A055484P0989m00892n07561l89022k61652N032L99798M86111P8288k92253
36130B44322j01366L57053M13785j0936m19087n00634l54951q7346K86414N93070
36120D20324O40911N67981O03074N53325N7054o71269r46752n80818j71308k14217
36110B58305m49777l87297k7681K85176L78362K86566P8648o7812O7453L41676
36100G63619K73511k27993n75463l32839R5536J03707j88932k62179j12588j25007
36090e88628k49719j09382J57792J3858m45747m40042K54861Q15683N52564j02148
36080a40908l17744k5797K47425K99976L58777M96852N42830M70002L86920K20770
36070B539103j46568m97646m76531j43648Q0144K5995p5664r6632k24786n30546
$$ plain form
36060 453221 -255118 -762186 -913513 -952306 -1118424 -1273234 -1090111 -514990 143120 557563
36050 557563 649950 491991 154475 -201356 -264403 116707 617839 732257 409028 92294
36040 92294 40943 -37449 -471524 -1070170 -1377198 -1241954 -852032 -445932 -296550 -670467
36030 -670467 -1379152 -1673823 -1149412 -510492 -730424 -1561971 -1716826 -636215 753791
36021 753791 1350437 1134418 647900 -21262 -968836 -1680221 -1403623 -222438 928740
36012 928740 1327685 1016754 332826 -508183 -1206704 -1277614 -514954 618896 1314269 1132535
36002 1132535 385683 -160735 -8893 593496 970206 807150 413114 143475 -89321
35993 -89321 -491218 -870116 -810175 -239983 452453 792351 561645 -19654 -305262 243749
$$ packed form
36060D53221p08339n07068j51327l8793j66118j54810J83123N75121O58110M14443
36050E57563R2387j57959l37516l55831o3047L81110N01132J14418l23229l16734
36040I2294n1351p8392m34075n98646l07028J35244L89922M06100J49382l73917
36030f70467p08685k94671N24411O38920k19932q31547j54855J080611J390006
36021G53791N96646k16019m86518o69162r47574p11385K76598J181185J151178
36012I28740L98945l10931o83928q41009o98521p0910P62660J133850O95373j81734
36002A132535p46852n46418J51842O02389L76710j63056l94036k69639k32796
35993h9321m01897l78898N9941N70192O92436L39898k30706n81299k85608N49011
$$ plain form
35983 243749 1272730 1661850 824068 -482584 -1083724 -750876 -91636 510336 1079978
35974 1079978 1441508 1327228 1067828 1311992 1952259 2138865 1542086 815984 559210
35965 559210 590072 577983 611948 684793 339303 -582478 -1417360 -1519329 -1154973 -989270
35955 -989270 -1116259 -1191126 -1125429 -1032059 -820381 -458945 -318744 -620943 -847774 -391195
35945 -391195 457971 887215 739556 565070 614047 560905 233120 -122940 -370691 -604667
35935 -604667 -696263 -415768 -66363 -221215 -673933 -472525 698154 1956367 2451794
35926 2451794 2387900 2283414 1956888 1011965 -196517 -937169 -1149171 -1314346 -1477423
35917 -1477423 -1237014 -704827 -640335 -1390205 -2339680 -2740464 -2574043 -2227966 -1749666 -917548
$$ packed form
35983B43749J028981L89120q37782j306652o01140L32848O59240O01972N69642
35974A079978L61530j14280k59400K44164O40267J86606n96779p26102k56774
35965E59210L0862j2089L3965P2845l45490r21781q34882j01969L64356J65703
35955i89270j26989p4867O5697R3370K11678L61436J40201l02199k26831M56579
35945c91195Q49166M29244j47659j74486M8977n3142l27785l56060k47751k33976
35935f04667r1596K80495L49405j54852m52718K01408J170679J258213M95427
35926B451794o3894j04486l26526r44923j208482p40652k12002j65175j63077
35917a477423K40409N32187O4492p49870r49475m00784J66421L46077M78300Q32118
$$ plain form
35907 -917548 162067 1016243 1347191 1265462 982751 618170 374521 519039 949628 1111084
35897 1111084 747873 511985 1218349 2482649 2819956 1474822 -448285 -1291892 -843892
35888 -843892 -256571 -258675 -445971 -395094 -411506 -716663 -784715 -202714 428514 253902
35878 253902 -551804 -1037914 -805078 -349200 -174666 -244256 -319726 -256951 84198 708047
35868 708047 1236394 1288006 1090257 1161792 1393499 1113445 198709 -575194 -597684 -209043
35858 -209043 -8593 62491 383359 796063 746486 147206 -469985 -682885 -618136 -571074
35848 -571074 -533193 -283624 215217 690333 838161 681027 565837 741054 1022959 1037171
35838 1037171 705634 253065 -196723 -675766 -1012159 -841617 -134079 654971 1134144
$$ packed form
35907i17548J079615Q54176L30948q1729k82711l64581k43649J44518M30589J61456
35897A111084l63211k35888P06364J264300L37307j345134j923107q43607M48000
35888h43892N87321k104j87296N0877j6412l05157o8052N82001O31228j74612
35878B53902q05706m86110K32836M55878J74534o9590p5470O2775L41149O23849
35868G08047N28347N1612j97749P1535K31707k80054r14736p73903k2490L88641
35858b09043K00450P1084L20868M12704m9577n99280o17191k12900O4749M7062
35848e71074L7881K49569M98841M75116J47828j57134j15190J75217K81905J4212
35838A037171l31537m52569m49788m79043l36393J70542P07538P89050M79173
$$ plain form
35829 1134144 1324750 1311175 1011615 569834 456543 721271 606171 -462438 -1812988
35820 -1812988 -2195699 -1399226 -475533 -314009 -692372 -929827 -828385 -604953 -387313
35811 -387313 -224684 -284246 -601377 -810797 -517846 121007 481912 125193 -827189 -1900635
35801 -1900635 -2633321 -2754403 -2238195 -1304365 -300974 473107 841629 722850 159062
35792 159062 -576876 -1004730 -745263 82656 840856 927499 421087 45474 389023 1238495
35782 1238495 1790746 1467399 438046 -587479 -981588 -671837 -107464 229726 271902
35773 271902 273348 375330 502426 674241 1061432 1573125 1715740 1144371 159754 -580933
35763 -580933 -685202 -205351 526668 1028784 942533 455054 150917 195479 94567 -383934
$$ packed form
35829A134144J90606j3575k99560m41781j13291K64728j15100j068609j350550
35820a812988l82711P96473R23693J61524l78363k37455J01442K23432K17640
35811c87313J62629n9562l17131k09420K92951O38853L60905l56719r52382j073446
35801a900635p32686j21082N16208R33830J003391P74081L68522j18779n63788
35792A59062p35938m27854K59467Q27919P58200Q6643n06412l75613L43549Q49472
35782A238495N52251l23347j029353j025525l94109L09751N64373L37190M2176
35773B71902J446J01982J27096J71815L87191N11693J42615n71369r84617p40687
35763e80933j04269M79851P32019N02116q6251m87479l04137M4562j00912m78501
$$ plain form
35753 -383934 -614496 -62039 669069 576113 -257256 -836406 -753621 -531620 -484013 -258691
$$ packed form
35753c83934k30562N52457P31108r2956q33369n79150Q2785K22001M7607K25322
$$ [...]
##END NTUPLES=NMR SPECTRUM
##END=
