##TITLE=31Pdec_BAU-130119
 CDCl3, 24 sc
 14.1.2019
##JCAMPDX= 6.0         $$ Bruker NMR JCAMP-DX V2.0
##DATA TYPE= NMR SPECTRUM
##DATA CLASS= NTUPLES
##ORIGIN= UXNMR, Bruker Analytische Messtechnik GmbH
##OWNER= root
$$ XWIN-NMR		Version 3.5
$$ Mon Jan 14 14:51:03 2019 Russian Standard Time (UT+4h)  she@DPX200
##.OBSERVE FREQUENCY= 81.013821
##.OBSERVE NUCLEUS= ^31P
##.ACQUISITION MODE= SIMULTANEOUS
##.ACQUISITION SCHEME= undefined
##.AVERAGES= 24
##.DIGITISER RES= 17
##SPECTROMETER/DATA SYSTEM= spect
##.PULSE SEQUENCE= zgpg30
##.SOLVENT NAME= CDCl3
##.SHIFT REFERENCE= (INTERNAL, CDCl3, 0, 182.463)
##AUDIT TRAIL= $$ (NUMBER, WHEN, WHO, WHERE, WHAT)
$$ ##TITLE= Audit trail, XWIN-NMR		Version 3.5
$$ ##JCAMPDX= 5.01
$$ ##ORIGIN= Bruker BioSpin GmbH
$$ ##OWNER= she
$$ F:/spectra/data/she/nmr/P31/1/pdata/1/auditp.txt
$$ ##AUDIT TRAIL=  $$ (NUMBER, WHEN, WHO, WHERE, WHAT)
(   1,<2019-01-14 14:48:05.12 +0400>,<she>,<DPX200>,
      <created by zg, POWCHK disabled, PULCHK disabled
       configuration hash MD5:
       00 E9 B6 7A A2 85 ED C7 34 08 36 98 17 FE 4E 26
       data hash MD5: 32K
       D0 EB DE C4 63 7A C6 A7 9F E9 2B 43 E0 34 F5 D8>)
(   2,<2019-01-14 14:48:15.17 +0400>,<she>,<DPX200>,
      <Start of raw data processing
       efp BC_mod = 2 LB = 1 FT_mod = 6 PKNL = 1 PHC0 = -1485.856 PHC1 = 114.599 SI = 64K 
       data hash MD5: 64K
       D6 3B BF AC ED 25 69 71 7E CD 3D 2E 18 31 87 B0>)
(   3,<2019-01-14 14:48:30.96 +0400>,<she>,<DPX200>,
      <pk PHC0 = 5.43765 PHC1 = 0 
       data hash MD5: 64K
       61 80 E6 F1 A2 A5 62 A5 CC 40 28 D9 D6 6C 6C 60>)
(   4,<2019-01-14 14:48:36.40 +0400>,<she>,<DPX200>,
      <abs ABSG = 5 
       data hash MD5: 64K
       2F 3A 5C 0E 54 6C C2 48 EB 8A 84 DF FD B4 8A 6E>)
$$ ##END=
$$ 
$$ hash MD5
$$ 55 F2 F8 76 50 B1 AE 34 65 60 B2 FB 59 51 E9 1B
##$RELAX= 
##$RELAX= 
##$RELAX= 
##$RELAX= 
##$RELAX= 
##$RELAX= 
##$RELAX= 
##$RELAX= 
$$ Bruker specific parameters
$$ --------------------------
##$DU= <F:/spectra>
##$EXPNO= 1
##$NAME= <P31>
##$PROCNO= 1
##$TYPE= <nmr>
##$USER= <she>
##$AMP= (0..31)
100 100 100 100 100 100 100 100 100 100 100 100 100 100 100 100 100 100 
100 100 100 100 100 100 100 100 100 100 100 100 100 100 
##$AQSEQ= 0
##$AQ_mod= 1
##$AUNM= <au_zg>
##$AUTOPOS= <>
##$BF1= 81.014009
##$BF2= 200.13
##$BF3= 200.13
##$BF4= 200.13
##$BF5= 200.13
##$BF6= 200.13
##$BF7= 200.13
##$BF8= 200.13
##$BYTORDA= 1
##$CFDGTYP= 0
##$CFRGTYP= 5
##$CHEMSTR= <none>
##$CNST= (0..31)
1 1 145 1 1 1 1 1 1 1 1 1 1 1 1 1 1 1 1 1 1 1 1 1 1 1 1 1 1 1 1 1 
##$CPDPRG= <waltz16>
##$CPDPRG1= <>
##$CPDPRG2= <waltz16>
##$CPDPRG3= <>
##$CPDPRG4= <mlev>
##$CPDPRG5= <mlev>
##$CPDPRG6= <mlev>
##$CPDPRG7= <mlev>
##$CPDPRG8= <mlev>
##$CPDPRGB= <>
##$CPDPRGT= <>
##$D= (0..31)
0 1 0 0 0 0 0 0 0 0 0 0.03 2e-05 3e-06 0 0 0 0 0 0 0 0 0 0 0 0 0 0 0 0 
0 0 
##$DATE= 1547462884
##$DBL= (0..7)
120 120 120 11 120 120 24 19 
##$DBP= (0..7)
150 150 150 150 150 150 150 150 
##$DBP07= 0
##$DBPNAM0= <>
##$DBPNAM1= <>
##$DBPNAM2= <>
$$ [...]
##$SUBNAM3= <"">
##$SUBNAM4= <"">
##$SUBNAM5= <"">
##$SUBNAM6= <"">
##$SUBNAM7= <"">
##$SUBNAM8= <"">
##$SUBNAM9= <"">
##$SW= 369.568048894756
##$SWIBOX= (0..15)
0 1 3 0 0 0 0 0 0 0 0 0 0 0 0 0 
##$SW_h= 29940.119760479
##$TD= 32768
##$TD0= 1
##$TE= 0
##$TE2= 300
##$TE3= 300
##$TEG= 300
##$TL= (0..7)
0 120 53 12 22 120 120 120 
##$TP= (0..7)
150 150 150 150 150 150 150 150 
##$TP07= 0
##$TPNAME0= <>
##$TPNAME1= <>
##$TPNAME2= <>
##$TPNAME3= <>
##$TPNAME4= <>
##$TPNAME5= <>
##$TPNAME6= <>
##$TPNAME7= <>
##$TPOAL= (0..7)
0.5 0.5 0.5 0.5 0.5 0.5 0.5 0.5 
##$TPOFFS= (0..7)
0 0 0 0 0 0 0 0 
##$TUNHIN= 0
##$TUNHOUT= 0
##$TUNXOUT= 0
##$USERA1= <user>
##$USERA2= <user>
##$USERA3= <user>
##$USERA4= <user>
##$USERA5= <user>
##$V9= 5
##$VALIST= <valist>
##$VCLIST= <CCCCCCCCCCCCCCC>
##$VD= 0
##$VDLIST= <DDDDDDDDDDDDDDD>
##$VPLIST= <PPPPPPPPPPPPPPP>
##$VTLIST= <TTTTTTTTTTTTTTT>
##$WBST= 1024
##$WBSW= 4
##$XGAIN= (0..3)
0 0 0 0 
##$XL= 0
##$YL= 0
##$YMAX_a= 11257
##$YMIN_a= -15132
##$ZGOPTNS= <>
##$ZL1= 120
##$ZL2= 120
##$ZL3= 120
##$ZL4= 120
##$ABSF1= 182.463
##$ABSF2= -187.1042
##$ABSG= 5
##$ABSL= 3
##$ALPHA= 0
##$AQORDER= 0
##$ASSFAC= 0
##$ASSFACI= 0
##$ASSFACX= 0
##$ASSWID= 0
##$AUNMP= <proc_1d>
##$AZFE= 0.1
##$AZFW= 0.5
##$BCFW= 0
##$BC_mod= 2
##$BYTORDP= 0
##$COROFFS= 0
##$CY= -3
##$DATMOD= 1
##$DC= 0
##$DFILT= <>
##$DTYPP= 0
##$F1P= 0
##$F2P= 0
##$FCOR= 1
##$FTSIZE= 65536
##$FT_mod= 6
##$GAMMA= 0
##$GB= 0
##$INTBC= 1
##$INTSCL= 5.30512e-09
##$ISEN= 30
##$LB= 1
##$LEV0= 0
##$LPBIN= 0
##$MAXI= 10000
##$MC2= 0
##$MEAN= 0
##$ME_mod= 0
##$MI= 50
##$NCOEF= 0
##$NC_proc= -5
##$NLEV= 6
##$NOISF1= 182.463
##$NOISF2= 159.3651
##$NSP= 0
##$NTH_PI= 0
##$NZP= 0
##$OFFSET= 182.463
##$PC= 4
##$PHC0= -1480.418
##$PHC1= 114.599
##$PH_mod= 1
##$PKNL= yes
##$PPARMOD= 0
##$PSCAL= 0
##$PSIGN= 0
##$REVERSE= no
##$SF= 81.0140089999434
##$SI= 65536
##$SIGF1= 159.3651
##$SIGF2= -187.1042
##$SINO= 113.3802
##$SIOLD= 16384
##$SREGLST= <1H.CDCl3>
##$SSB= 0
##$STSI= 65536
##$STSR= 0
##$SW_p= 29940.119760479
##$SYMM= 0
##$S_DEV= 0
##$TDeff= 32768
##$TDoff= 0
##$TI= <>
##$TILT= no
##$TM1= 0
##$TM2= 0
##$TOPLEV= 0
##$USERP1= <user>
##$USERP2= <user>
##$USERP3= <user>
##$USERP4= <user>
##$USERP5= <user>
##$WDW= 1
##$XDIM= 65536
##$YMAX_p= 283803708
##$YMIN_p= -16323966
$$ End of Bruker specific parameters
$$ ---------------------------------
##NTUPLES= NMR SPECTRUM
##VAR_NAME=  FREQUENCY,     SPECTRUM/REAL,   SPECTRUM/IMAG
##SYMBOL=    X,             R,               I
##VAR_TYPE=  INDEPENDENT,   DEPENDENT,       DEPENDENT
##VAR_FORM=  AFFN,          ASDF,            ASDF
##VAR_DIM=   65536,         65536,           65536
##UNITS=     HZ,            ARBITRARY UNITS, ARBITRARY UNITS
##FACTOR=    0.456856943014862, 1,           1
##FIRST=     14782.0589164792, 0,            0
##LAST=      -15158.0608439998, 0,           0
##MIN=       -15158.0608439998, -16323966,   0
##MAX=       14782.0589164792, 283803708,    0
$$ Real data points
##PAGE= N=1
##DATA TABLE= (X++(R..R)), XYDATA
$$ [...]
$$ plain form
40426 803684 -493145 -1029946 -556209 254781 646950 419846 -6385 21271 741353 1619902
40416 1619902 1824662 1094582 -48706 -919426 -1249916 -1207357 -1146320 -1365989 -1841694 -2172169
40406 -2172169 -2005130 -1467642 -957693 -638009 -425221 -320845 -371006 -413649 -268881 -80506
40396 -80506 -70826 -110498 2590 32136 -335591 -792257 -801252 -603168 -960833 -1820862 -2169116
40385 -2169116 -1522197 -667528 -437798 -543432 -236850 516279 1213309 1668068 2013902
40376 2013902 2204932 2106051 1813792 1448515 963078 514195 518284 902749 923771 321101
40366 321101 -22431 612456 1430355 1107762 -286955 -1478431 -1840634 -1881598 -1926986 -1557405
40356 -1557405 -609840 326832 808849 1065242 1268980 1116748 574616 289824 733140
$$ packed form
40426H03684j296829n36801M73737Q10990L92169k27104m26231K7656P20082Q78549
40416A619902K04760p30080j143288q70720l30490M2559O1037k19669m75705l30475
40406b172169J67039N37488N09949L19684K12788J04376n0161m2643J44768J88375
40396h0506R680l9672J13088K9546l67727m56666q995J98084l57665q60029l48254
40385b169116O46919Q54669K29730j05634L06582P53129O97030M54759L45834
40376B013902J91030r8881k92259l65277m85437m48883M089L84465K1022o02670
40366C21101l43532O34887Q17899l22593j394717j191476l62203m0964m5388L69581
40356a557405R47565R36672M82017K56393K03738j52232n42132k84792M43316
$$ plain form
40347 733140 1497679 1902782 1804171 1438706 971458 564424 435288 529220 543110 429353
40337 429353 331380 -41624 -1147988 -2508363 -2868288 -1937864 -945575 -773076 -606252
40328 -606252 523563 1790579 1575267 -74668 -1430576 -1425484 -713895 -286150 -199127
40319 -199127 -18575 384792 871888 1252584 1265672 889497 686748 1178782 1901225 1861951
40309 1861951 960820 102144 -174844 -235197 -362401 -270929 57413 74994 -310761 -396289
40299 -396289 64356 250577 -353051 -935010 -624404 76005 211762 22216 416272 1281194
40289 1281194 1631829 1221437 737650 484478 139049 -131518 365554 1463590 1956489
40280 1956489 1334519 634846 903324 1710167 1942118 1339971 472565 -220048 -561224
$$ packed form
40347G33140P64539M05103r8611l65465m67248m07034j29136R3932J3890j13757
40337D29353r7973l73004j106364j360375l59925R30424R92289J72499J66824
40328f06252J129815J267016k15312j649935j355908N092P11589M27745Q7023
40319a99127J80552M03367M87096L80696J3088l76175k02749M92034P22443l9274
40309A861951r01131q58676k76988o0353j27204R1472L28342J7581l85755q5528
40299c96289M60645J86221o03628n81959L10606P00409J35757j89546L94056Q64922
40289A281194L50635m10392m83787k53172l45429k70567M97072J098036M92899
40280A956489o21970o99673K68478Q06843K31951o02147q67406o92613l41176
$$ plain form
40271 -561224 -305275 489751 1070408 761277 -49628 -384923 22479 561217 734134 634176
40261 634176 468859 259412 67083 -21627 -164696 -513767 -721407 -289333 556703 986151
40251 986151 720465 448405 798249 1435797 1577658 1016263 235164 -253368 -348342 -261527
40241 -261527 -173921 70691 856975 2120886 2966129 2537936 1241230 338007 219153
40232 219153 10171 -733956 -1042560 -97261 1148131 1169404 128643 -481420 -196978
40223 -196978 -46091 -533059 -761210 -170973 271164 -387439 -1451183 -1675169 -1221861
40214 -1221861 -1203962 -1728033 -1773240 -934856 839 419967 687892 1200887 1594596 1446868
40204 1446868 1018347 695014 295998 -423579 -1055131 -1023303 -507506 -212795 -362558 -518731
$$ packed form
40271e61224K55949P95026N80657l09131q10905l35295M07402N38738J72917r9958
40261F34176j65317k09447j92329q8710j43069l49071k07640M32074Q46036M29448
40251I86151k65686k72060L49844O37548J41861n61395p81099m88532r4974Q6815
40241b61527Q7606K44612P86284J263911Q45243m28193j296706r03223j18854
40232B19153k08982p44127l08604R45299J245392K1273j040761o10063K84442
40223a96978J50887m86968k28151N90237M42137o58603j063744k23986M53308
40214a221861J7899n24071m5207Q38384R35695M19128K67925N12995L93709j47728
40204A446868m28521l23333l99016p19577o31552L1828N15797K94711j49763j56173
$$ plain form
40194 -518731 -344433 25960 414978 864927 1302869 1359582 781218 -202441 -1105934 -1625919
40184 -1625919 -1720437 -1408286 -680680 379581 1461841 2092521 1974073 1316087 673884
40175 673884 349044 140054 -162021 -328085 -90087 258554 175192 -310820 -656910 -711800
40165 -711800 -930061 -1491509 -1851504 -1573233 -1076263 -1024519 -1348852 -1430767 -965425 -97064
40155 -97064 998778 2020303 2304113 1517348 506152 559401 1698896 2569048 2287725
40146 2287725 1525408 1301330 1563026 1627432 1312061 815079 41895 -1028843 -1719794
40137 -1719794 -1393776 -593471 -439912 -982286 -1173452 -549929 109174 58123 -444341 -823920
40127 -823920 -976391 -896005 -331282 607355 1173687 911436 272764 -202241 -649476 -1210390
$$ packed form
40194e18731J74298L70393L89018M49949M37942N6713n78364r83659r03493n19985
40184a625919r4518L12151P27606J060261J082260O30680j18448o57986o42203
40175F73884l24840k08990l02075j66064K37998L48641q3362m86012l46090n4890
40165g11800k18261n61448l59995K78271M96970N1744l24333q1915M65342Q68361
40155i7064J095842J021525K83810p86765j011196N3249J139495Q70152k81323
40146B287725p62317k24078K61696O4406l15371m96982p73184j070738o90951
40137a719794L26018Q00305J53559n42374j91166O23523O59103n1051n02464l79579
40127h23920j52471Q0386N64723R38637N66332k62251o38672m75005m47235n60914
$$ plain form
40117 -1210390 -1317579 -489278 696395 1278445 1136911 743949 204999 -500843 -802188
40108 -802188 -201768 638736 687462 235251 495524 1537457 2049526 1430401 691378 712272
40098 712272 897974 382444 -514835 -1000988 -1155874 -1560878 -2137401 -2275440 -1768807 -914522
40088 -914522 -35618 520445 362645 -383759 -975275 -1042118 -1097469 -1503928 -1696233 -1197843
40078 -1197843 -618769 -663979 -883311 -548089 -78067 -233243 -466617 293711 1541275
40069 1541275 1669045 575065 -49913 594510 1247854 799048 -9662 -97574 192889
40060 192889 86400 -77663 300003 585782 -201225 -1562565 -2053507 -1370854 -571241
40051 -571241 -342455 -347744 -317429 -531650 -940537 -892440 -191040 403443 197991 -524021
$$ packed form
40117a210390j07189Q28301J185673N82050j41534l92962n38950p05842l01345
40108h02188O00420Q40504M8726m52211K60273J041933N12069o19125p39023K0894
40098G12272J85702n15530q97279m86153j54886m05004n76523j38039N06633Q54285
40088i14522Q78904N56063j57800p46404n91516o6843n5351m06459j92305M98390
40078a197843N79074m5210k19332L35222M70022j55176k33374P60328J247564
40069A541275J27770j093980o24978O44423O53344m48806q08710q7912K90463
40060A92889j06489j64063L77666K85779p87007j361340m90942O82653P99613
40051e71241K28786n289L0315k14221m08887M8097P01400N94483k05452p22012
$$ plain form
40041 -524021 -1008165 -933388 -502519 -118703 -245456 -1070960 -1978148 -1859302 -428083 1137366
40031 1137366 1366989 145413 -1232483 -1555063 -838498 51135 535980 789087 1145458
40022 1145458 1425613 1175045 475663 35246 260097 665897 602445 212585 132199 481518
40012 481518 808697 934955 1134620 1416526 1368517 943178 694274 865628 889394 286071
40002 286071 -492402 -722411 -465926 -279090 -194601 207600 848642 1110439 848607 671883
39992 671883 922685 1057937 518345 -289159 -466601 190032 1046701 1532814 1622480 1421102
39982 1421102 842566 -89584 -1012919 -1547391 -1604389 -1259664 -667070 -253831 -520701 -1280134
39972 -1280134 -1548573 -749015 356625 647933 255065 235130 744338 748014 -124897 -723151
$$ packed form
40041e24021m84144P4777M30869L83816j26753q25504r07188J18846J431219J565449
40031A137366K29623j221576j377896l22580P16565Q89633M84845K53107L56371
40022A145458K80155k50568o99382m40417K24851M05800o3452l89860q0386L49319
40012D81518L27179J26258J99665K81906m8009m25339k48904J71354K3766o03323
40002B86071p78473k30009K56485J86836Q4489M02201O41042K61797k61832j76724
39992F71883K50802J35252n39592q07504j77442O56633Q56669M86113Q9666k01378
39982A421102n78536r32150r23335n34472n6998L44725N92594M13239k66870p59433
39972a280134k68439P99558J105640K91308l92868j9935N09208L676q72911n98254
$$ plain form
39962 -723151 -191572 462881 -125351 -1383545 -1569241 -525290 36997 -780985 -1745184
39953 -1745184 -1536702 -690161 -408098 -543660 -145445 644218 744447 17320 -427000
39944 -427000 -20196 410228 85328 -445765 -241312 494968 702883 17074 -754220 -686897
39934 -686897 312208 1673549 2762716 3144968 2693795 1763144 1049103 999698 1423700
39925 1423700 1816604 1920838 1773259 1381673 709186 -33945 -431734 -306350 127358
39916 127358 607457 989416 958295 60598 -1595383 -3053296 -3466390 -3127449 -2976115
39907 -2976115 -3246139 -3295984 -2754188 -2024789 -1445394 -741618 245007 984191 1018770 763105
39897 763105 859902 1149746 1015327 446935 -35310 -341990 -839933 -1440811 -1547979 -1083386
$$ packed form
39962g23151N31579O54453n88232j258194j85696J043951N62287q17982r64199
39953a745184K08482Q46541K82063j35562L98215P89663J00229p27127m44320
39944d27000M06804M30424l24900n31093K04453P36280K07915o85809p71294O7323
39934f86897R99105J361341J089167L82252m51173r30651p14041m9405M24002
39925A423700L92904J04234j47579l91586o72487p43131l97789J25384M33708
39916A27358M80099L81959l1121q97697j655981j457913m13094L38941J51334
39907b976115k70024m9845N41796P29399N79395P03776R86625P39184L4579k55665
39897G63105R6797K89844j34419n68392m82245l06680m97943o00878j07168M64593
$$ plain form
39887 -1083386 -731924 -836293 -830036 -270249 251600 -69453 -979286 -1499525 -1322513 -1082988
39877 -1082988 -1216276 -1295271 -808539 -50409 249820 -69091 -466926 -556853 -632421 -1092318
39867 -1092318 -1634653 -1490036 -503008 446789 415792 -443129 -1080846 -824941 -32423 560503
39857 560503 685507 527139 242099 -140567 -519185 -759133 -876684 -943119 -869191 -516948
39847 -516948 19882 480466 767835 985143 1112318 876500 82790 -1014573 -1776738
39838 -1776738 -1650892 -664248 458172 773603 -41253 -1276842 -1804507 -1228244 -301600
39829 -301600 -61801 -663351 -1295185 -1239434 -722308 -522624 -927412 -1424000 -1456452 -1134679
39819 -1134679 -949303 -1008795 -936998 -513503 -50842 38569 -174837 -225058 159287 760576
$$ packed form
39887a083386L51462j04369O257N59787N21849l21053r09833n20239J77012K39525
39877a082988j33288p8995M86732P58130L00229l18911l97835q9927p5568m59897
39867a092318n42335J44617R87028R49797l0997q58921o37717K55905P92518N92926
39857E60503J25004j58368k85040l82666l78618k39948j17551o6435P3928L52243
39847e16948N36830M60584K87369K17308J27175k35818p93710j097363p62165
39838a776738J25846R86644J122420L15431q14856j235589n27665N76263R26644
39829c01600K39799o01550o31834N5751N17126J99684m04788m96588l2452L21773
39819a134679J85376n9492P1797M23495M62661Q9411k13406n0221L84345O01289
$$ plain form
39809 760576 1177641 1250769 1081680 748374 232305 -291978 -345319 327769 1159238 1153512
39799 1153512 126501 -846554 -659955 405039 1053234 663978 -47975 -184170 169111
39790 169111 301255 -48683 -462388 -474204 -37504 539341 857020 731357 407365 290088
39780 290088 343824 99938 -512673 -790858 -167892 843046 1199202 630173 -199833 -695928
39770 -695928 -836668 -703605 -253167 249379 249854 -287412 -650603 -387412 -59296 -450825
39760 -450825 -1382012 -1951975 -1810682 -1515921 -1555458 -1650023 -1366520 -974291 -1136241 -1840933
39750 -1840933 -2190365 -1502791 -291583 284630 -132350 -681087 -462076 309265 727576
39741 727576 482882 160530 282892 584523 434101 -373242 -1460637 -2282741 -2542343
$$ packed form
39809G60576M17065P3128j69089l33306n16069n24283n3341O73088Q31469n726
39799A153512j027011r73055J86599J064994O48195l89256p11953j36195L53281
39790A69111J32144l49938m13705j1816M36700N76845L17679j25663l23992j17277
39780B90088N3736k43886o12611k78185O22966J010938L56156n69029q30006m96095
39770f95928j40740J33063M50438N02546M75n37266l63191K63191L28116l91529
39760d50825r31187n69963J41293K94761l9537r4565K83503L92229j61950p04692
39750a840933l49432O87574J211208N76213m16980n48737K19011P71341M18311
39741G27576k44694l22352J22362L01631j50422q07343j087395q22104k59602
$$ plain form
39732 -2542343 -2374723 -2205610 -2265259 -2279778 -1923364 -1486345 -1594321 -2211341 -2541341 -2180247
39722 -2180247 -1727657 -1778373 -1898383 -1328631 -305738 214622 36459 -1950 591172 1149848
39712 1149848 871705 34705 -401509 -68594 517831 789167 706898 489875 209540 -168068
39702 -168068 -617759 -1130240 -1774183 -2476415 -2851063 -2507034 -1548346 -533505 172514
39693 172514 769371 1507496 2020346 1644058 447899 -563028 -594424 -62535 -10710 -718901
39683 -718901 -1393861 -1243202 -400063 373090 562905 270232 -82463 -158275 122893 640816
39673 640816 1219754 1695770 1893190 1721347 1396643 1358245 1738884 2095913 1962618 1498471
39663 1498471 1183076 974089 328717 -836816 -1777721 -1840845 -1341948 -1088515 -1270862
$$ packed form
39732b542343J67620J69113n9649j4519L56414M37019j07976o17020l30000L61094
39722b180247M52590n0716j20010N69752J022893N20360j78163l8409N93122N58676
39712A149848k78143q37000m36214L32915N86425K71336q2269k17023k80335l77608
39702a68068m49691n12481o43943p02232l74648L44029R58688J014841P06019
39693A72514N96857P38125N12850l76288j196159j010927l1396N31889N1825p08191
39683g18901o74960J50659Q43139P73153J89815k92673l52695p5812K81168N17923
39673F40816N78938M76016J97420j71843l24704l8398L80639L57029j33295m64147
39663A498471l15395k08987o45372j165533r40905o3124M98897K53433j82347
$$ plain form
39654 -1270862 -1311232 -775460 1967 364164 155074 -128111 48785 669687 1265499 1471008
39644 1471008 1313126 995690 650153 339405 13132 -617647 -1733268 -2738137 -2552282
39635 -2552282 -1097005 106128 -310383 -1623083 -1953947 -949047 -143891 -466698 -896773
39626 -896773 -317315 690071 1032190 957094 1289824 1624202 954970 -249285 -352784
39617 -352784 961887 2097331 1825899 770190 28126 -374719 -820291 -983593 -463510
39608 -463510 193779 191199 -234228 -234354 195345 154547 -797951 -2036276 -2710264 -2533014
39598 -2533014 -1623188 -204402 1265172 2124659 2037286 1330786 649026 392830 570513
39589 570513 1003644 1499388 1852512 1828484 1310533 532207 -10328 -112785 -200615 -745861
$$ packed form
39654a270862m0370N35772P77427L62197k09090k83185J76896O20902N95812K05509
39644A471008j57882l17436l45537l10748l26273o30779j115621j004869J85855
39635b552282J455277J203133m16511j312700l30864J004900Q05156l22807m30075
39626h96773N79458J007386L42119p5096L32730L34378o69232j204255j03499
39617c52784J314671J135444k71432j055709p42064m02845m45572j63302N20083
39608d63510O57289k580m25427j26M29699m0798r52498j238325o73988J77250
39598b533014R09826J418786J469574Q59487q7373p06500o81760k56196J77683
39589E70513M33131M95744L53124k4028n17951p78326n42535j02457q7830n45246
$$ plain form
39579 -745861 -1416955 -1349560 -397049 463461 315343 -575724 -1246069 -1247512 -889106 -568079
39569 -568079 -388402 -284896 -91925 364517 895569 923757 233990 -538180 -642603 -141209
39559 -141209 426219 931091 1482378 1663781 894859 -456571 -1241079 -981355 -363038
39550 -363038 -91276 -103269 -221131 -690082 -1497562 -1897181 -1355382 -499893 -387565 -1095450
39540 -1095450 -1693594 -1475688 -657433 83118 289518 -47216 -590964 -948395 -1023579 -1020256
39530 -1020256 -1031104 -884571 -522777 -172575 65183 383797 747756 684410 30843 -580972
39520 -580972 -571882 -359292 -737946 -1566692 -1873585 -1229554 -273102 205002 17672 -685892
39510 -685892 -1714137 -2571353 -2556429 -1595678 -557685 -285366 -609833 -752549 -470735
$$ packed form
39579g45861o71094O7395R52511Q60510j48118q91067o70345j443L58406L21027
39569e68079J79677J03506J92971M56442N31052K8188o89767p72170j04423N01394
39559a41209N67428N04872N51287J81403p68922j351430p84508K59724O18317
39550c63038K71762j1993j17862m68951q07480l99619N41799Q55489J12328p07885
39540a095450n98144K17906Q18255P40551K06400l36734n43748l57431p5184L323
39530a020256j0848J46533L61794L50202K37758L18614L63959o3346o53567o11815
39520e80972R090K12590l78654q28746l06893O44031R56452M78104j87330p03564
39510f85892j028245q57216J4924R60751J037993K72319l24467j42716K81814
$$ plain form
39501 -470735 -304387 -718056 -1441538 -1842377 -1710765 -1413889 -1303322 -1241311 -915071 -443970
39491 -443970 -275700 -460198 -519679 -271034 -256799 -892200 -1631247 -1651091 -1079758 -762613
39481 -762613 -932291 -967445 -540454 -137692 -174767 -377714 -423184 -496539 -761117 -890727
39471 -890727 -620307 -201554 180094 841943 1852482 2426052 1854005 641568 -98599
39462 -98599 -127356 -159949 -644954 -1265402 -1612597 -1646316 -1497353 -1430614 -1890425 -2881782
39452 -2881782 -3445599 -2612106 -869447 229882 20386 -677757 -1075357 -1398665 -1895684
39443 -1895684 -2004120 -1359963 -753953 -1055058 -1778969 -1788230 -1017121 -412883 -374388 -361589
39433 -361589 -67022 112043 29488 257945 1122678 1978276 1997101 1209648 279804 -387423
$$ packed form
39501d70735J66348m13669p23482m00839J31612K96876J10567O2011L26240M71101
39491d43970J68270j84498n9481K48645J4235o35401p39047j9844N71333L17145
39481g62613j69678l5154M26991M02762l7075k02947m5470p3355k64578j29610
39471h90727K70420M18753L81648O61849J010539N73570n72047j212437p40167
39462i8599k8757l2593m85005o20448l47195l3719J48963O6739m59811r91357
39452b881782n63817Q33493J742659J099329k09496o98143l97600l23308m97019
39443a895684j08436O44157O06010l01105p23911r261P71109O04238L8495J2799
39433c61589K94567J79065q2555K28457Q64733Q55598J8825p87453r29844o67227
$$ plain form
39423 -387423 -850728 -1215552 -1470243 -1628983 -1709533 -1629657 -1332939 -924838 -531710 -150800
39413 -150800 232520 529965 670073 678253 566877 351919 218241 353388 528234 257164
39403 257164 -409801 -707551 -155349 638019 665576 -231633 -1316296 -1936049 -1975743 -1499312
39393 -1499312 -667841 -55232 -300381 -1188509 -1721311 -1453754 -1150859 -1612904 -2394215
39384 -2394215 -2405966 -1469446 -461021 8645 238441 591487 759099 311630 -509369
39375 -509369 -1057629 -1073907 -786399 -434999 -131044 -51329 -318952 -714916 -881355 -781086
39365 -781086 -588377 -199347 641632 1686084 2232967 2064625 1799266 1963204 2208681
39356 2208681 1943310 1321535 978087 1025217 994968 679415 350423 127632 -203700 -617751
$$ packed form
39423c87423m63305l64824k54691j58740q0550P9876K96718M08101L93128L80910
39413a50800L83320K97445J40108Q180j11376k14958j33678J35147J74846k71070
39403B57164o66965k97750N52202P93368K7557q97209j084663o19753l9694M76431
39393a499312Q31471O12609k45149q88128n32802K67557L02895m62045p81311
39384b394215j1751R36520J008425M69666K29796L53046J67612m47469q20999
39375e09369n48260j6278K87508L51400L03955P9715k67623l95964j66439J00269
39365g81086J92709L89030Q40979J044452N46883j68342k65359J63938K45477
39356B208681k65371o21775l43448M7130l0249l15553l28992k22791l31332m14051
$$ plain form
39346 -617751 -718923 -395513 -42106 76698 96001 -52552 -817391 -2153449 -3097178 -2822020
39336 -2822020 -1691184 -719818 -415101 -673874 -1285527 -1807646 -1439203 48733 1547235
39327 1547235 1727031 747356 -89153 -192431 -78368 17313 575596 1551466 1995784 1510108
39317 1510108 958070 1016812 1062990 376435 -474371 -497385 183509 739070 1018633 1391162
39307 1391162 1621899 1094760 -26706 -921040 -1277647 -1392272 -1277584 -710564 -33680
39298 -33680 188716 259733 956881 2044979 2410915 1816401 1234955 1191063 1130254 851879
39288 851879 1063768 1766067 1582766 -150402 -1903530 -1956868 -881560 -452477 -856053
39279 -856053 -774935 119765 664379 326590 94342 702825 1391108 1172813 258074 -571991
$$ packed form
39346f17751j01172L23410L53407J18804J9303j48553p64839j336058r43729K75158
39336b822020J130836R71366L04717k58773o11653n22119L68443J487936J498502
39327A547235J79796r79675q36509j03278J14063R5681N58283R75870M44318m85676
39317A510108n52038N8742M6178o86555q50806k3014O80894N55561K79563L72529
39307A391162K30737n27139j121466q94334l56607j14625J14688N67020O76884
39298c3680K22396P1017O97148J088098L65936n94514n81446m3892o0809k78375
39288H51879K11889P02299j83301j733168j753128n3338J075308M29083m03576
39279h56053Q1118Q94700N44614l37789k32248O08483O88283k18295r14739q30065
$$ plain form
39269 -571991 -1123501 -1501688 -1383904 -496532 608142 1099594 990793 1021930 1546324 2147303
39259 2147303 2339237 2114677 1715714 1274884 833432 460332 201299 14688 -165111
39250 -165111 -329126 -364305 -143508 276484 569172 400935 -180796 -745506 -905583 -658896
39240 -658896 -322206 -211277 -313332 -188054 601826 1748530 2168771 1157977 -582843
39231 -582843 -1605170 -1352408 -587208 -191891 -228692 -365449 -509022 -595715 -338109 277288
39221 277288 656620 326281 -286810 -346790 286733 934334 991957 548781 159031 294091
39211 294091 944010 1552174 1521312 980799 748971 1249444 1850636 1733996 1058673 640707
39201 640707 703742 690002 307060 23844 278117 745649 770627 227274 -358332 -416045
$$ packed form
39269e71991n51510l78187J17784Q87372J104674M91452j08801L1137N24394O00979
39259B147303J91934k24560l98963m40830m41452l73100k59033j86611j79799
39250a65111j64015l5179K20797M19992K92688j68237n81731n64710j60077K46687
39240f58896L36690J10929j02055J25278P89880J146704M20241j010794j740820
39231e82843j022327K52762P65200L95317l6801j36757j43573q6693K57606O15397
39221B77288L79332l30339o13091n9980O33523O47601N7623m43176l89750J35060
39211B94091O49919O08164l0862n40513k31828N00473O01192j16640o75323m17966
39201F40707O3035j3740l82942k83216K54273M67532K4978n43353n85606n7713
$$ plain form
39191 -416045 122049 818320 1181386 1106014 805630 374887 -259515 -863590 -856104 -106601
39181 -106601 659334 770066 549178 713567 1177396 1286534 1048026 1137480 1615694 1633513
39171 1633513 733481 -413592 -994891 -1025583 -866556 -498645 121307 571804 490292 154364
39161 154364 -33378 -201471 -551528 -692446 -164267 666823 976668 598833 127430 21151
39151 21151 201995 448329 620491 577938 385711 464204 1005632 1451458 1179431 486269
39141 486269 119050 16410 -513266 -1352524 -1414796 -259738 1127352 1714316 1728925 1918138
39131 1918138 2237881 2114734 1506306 831735 153544 -739483 -1611930 -1941433 -1727663
39122 -1727663 -1401288 -973139 -89076 977512 1271995 468976 -502539 -676266 -304244
$$ packed form
39191d16045N38094O96271L63066p5372l00384m30743o34402o04075P486P49503
39181a06601P65935J10732k20888J64389M63829J09138k38508Q9454M78214J7819
39171A633513r00032j147073n81299l0692J59027L67911O19952M50497q1512l35928
39161A54364j87742j68093l50057j40918N28179Q31090L09845l77835m71403j06279
39151B1151J80844K46334J72162m2553j92227P8493N41428M45826k72027o93162
39141D86269l67219j02640n29676q39258o2272J155058J387090N86964J4609J89213
39131A918138L19743j23147o08428o74571o78191q93027q72447l29503K13770
39122a727663L26375M28149Q84063J066588K94483q03019r71515j73727L72022
$$ plain form
39113 -304244 -247476 -564470 -538123 44885 511284 366922 90 -72007 -60347 -416692
39103 -416692 -882199 -779891 -180978 -12112 -763697 -1713159 -1854579 -1142925 -287927 358943
39093 358943 1043342 1821190 2220840 1897920 1154573 543649 278733 263217 416271 702501
39083 702501 1008354 1186177 1114799 686550 -8284 -447883 -41530 1070460 1966845 1982358
39073 1982358 1442603 1046192 909596 685792 298808 -5659 -122951 -36205 476119 1390984
39063 1390984 1852594 906655 -1052041 -2397477 -2146550 -987650 -87154 325050 583704
39054 583704 555456 -99627 -1026485 -1466712 -1317108 -1095142 -954372 -584305 -83944 3677
39044 3677 -267566 -109317 670056 1077413 369736 -608728 -413950 1036046 2359242 2436863
$$ packed form
39113c04244N6768l16994K6347N83008M66399j44362l66832p2097J1660l56345
39103d16692m65507J02308N98913J68866p51585r49462j41420P11654Q54998O46870
39093C58943O84399P77848L99650l22920p43347o10924k64916j5516J53054K86230
39083G02501L05853J77823p1378m28249o94834m39599M06353J111990Q96385J5513
39073A982358n39755l96411j36596k23804l86984l04467j17292Q6746N12324R14865
39063A390984M61610r45939j958696j345436K50927J158900R00496M12204K58654
39054E83704k8248o55083r26858m40227J49604K21966J40770L70067N00361Q7621
39044C677k71243J58249P79373M07357p07677r78464J94778J449996J323196P7621
$$ plain form
39034 2436863 1472415 367191 -208601 -37719 628153 1033765 496251 -684178 -1376282
39025 -1376282 -984401 -218869 -158049 -930379 -1716637 -1758710 -983632 121821 870046 793066
39015 793066 57745 -667425 -985416 -1158367 -1487473 -1723640 -1549521 -1259390 -1311959 -1455978
39005 -1455978 -1066385 -287394 -23542 -622279 -1300826 -1222181 -556805 -75323 -146897 -564107
38995 -564107 -1012586 -1297499 -1327733 -1189509 -1051994 -846898 -380836 83818 -103417 -978776
38985 -978776 -1588403 -1176321 -283526 27590 -338478 -639345 -654577 -876343 -1296565 -1114725
38975 -1114725 -100764 694496 320813 -645091 -910302 -285762 241075 92069 -229679
38966 -229679 -204440 -99072 -235278 -215103 376130 961764 576322 -638461 -1455574 -1276648
$$ packed form
39034B436863r64448j105224n75792J70882O65872M05612n37514j180429o92104
39025a376282L91881P65532O0820p72330p86258m2073P75078J105453P48225p6980
39015G93066p35321p25170l17991j72951l29106k36167J74119K90131n2569j44019
39005a455978L89593P78991K63852n98737o78547P8645O65376M81482p1574m17210
38995e64107m48479k84913l0234J38224J37515K05096M66062M64654j87235q75359
38985i78776o09627M12082Q92795L11116l66068l00867j5232k21766m20222J81840
38975a114725J013961P95260l73683r65904k65211O24540N26837j49006l21748
38966b29679K5239J05368j36206K0175N91233N85634l85442j214783q17113J78926
$$ plain form
38956 -1276648 -967233 -1475174 -2320244 -2276929 -1213523 -351799 -685106 -1893902 -2983024
38947 -2983024 -3323414 -2827287 -1757080 -772341 -614066 -1213922 -1509603 -694847 636538
38938 636538 1171270 531014 -331427 -362061 480003 1420813 1781874 1519782 1050006 658791
38928 658791 140696 -794978 -1777230 -1921416 -1010405 -21157 61483 -452346 -540076 -68142
38918 -68142 57095 -675018 -1648534 -2045511 -1790535 -1256785 -634418 -5339 388927 388362
38908 388362 192609 106927 178809 244115 142203 -198303 -673070 -986550 -972076 -865298
38898 -865298 -939512 -1001712 -696479 -168274 145792 253831 443216 475681 -170424 -1195642
38888 -1195642 -1600866 -1157575 -757925 -928809 -1063244 -698925 -465477 -914658 -1386112
$$ packed form
38956a276648L09415n07941q45070M3315J063406Q61724l33307j208796j089122
38947b983024l40390M96127J070207R84739J58275n99856k95681Q14756J331385
38938F36538N34732o40256q62441l0634Q42064R40810L61061k62092m69776l91215
38928F58791n18095r35674r82252j44186R11011R89248Q2640n13829q7730M71934
38918f8142J25237p32113r73516l96977K54976N33750O22367O29079L94266n65
38908C88362j95753q5682P1882O5306j01912l40506m74767l13480J4474J06778
38898h65298p4214o2200L05233N28205L14066J08039J89385L2465o46105j025218
38888a195642m05224M43291L99650j70884j34435L64319K33448m49181m71454
$$ plain form
38879 -1386112 -1089013 -510607 -563363 -949117 -658007 299503 954447 961449 862939 851792
38869 851792 508496 -151866 -533354 -533536 -694019 -1091879 -1159783 -859785 -917802 -1494478
38859 -1494478 -1714319 -1063877 -249349 -3883 26691 421032 821539 552682 -206280 -794058
38849 -794058 -1159384 -1661960 -2125273 -2043913 -1565913 -1334228 -1365091 -996162 -118606 407944
38839 407944 -1255 -664699 -508056 426832 1022676 601625 -218720 -450296 -56640 182450
38829 182450 -41076 -86997 613383 1647293 2187088 2046038 1612419 1073219 411552 -10776
38819 -10776 319059 1208279 1847442 1853076 1534791 1056876 188098 -846423 -1152779 -346198
38809 -346198 745959 1155094 994759 1009531 1370274 1579204 1294071 688107 171733 138261
$$ packed form
38879a386112K97099N78406n2756l85754K91110R57510O54944P002r8510j1147
38869H51792l43296o60362l81488j82j60483l97860o7904K99998n8017n76676
38859a494478k19841O50442Q14528K45466L0574L94341M00507k68857p58962n87778
38849g94058l65326n02576m63313Q1360M78000K31685l0863L68929Q77556N26550
38839D07944m09199o63444J56643R34888N95844m21051q20345k31576L93656K39090
38829A82450k23526m5921P00380J033910N39795j41050m33619n39200o61667m22328
38819a0776L29835Q89220O39163N634l18285m77915q68778j034521l06356Q06581
38809c46198J092157M09135j60335J4772L60743K08930k85133o05964n16374l3472
$$ plain form
38799 138261 735398 1576639 2002104 1890946 1782557 1932986 1856023 1210624 489470 259372
38789 259372 329017 309540 381823 751140 934436 479028 -118554 -170118 2435 -291057
38779 -291057 -670529 -183281 909091 1210958 234865 -874080 -1015379 -452785 -1762
38770 -1762 136213 157380 54436 -162349 -204797 37632 240704 187694 71991 -22533 -363344
38759 -363344 -958986 -1290113 -1033235 -521656 -129571 235235 628561 666829 158798 -365151
38749 -365151 -344203 -28550 -52043 -442058 -611051 -189440 569651 1128879 1132053 671606
38739 671606 266496 347262 660447 555982 -17256 -335082 19040 462389 229873 -596542
38729 -596542 -1346651 -1625066 -1415826 -725345 292979 1122058 1341695 1148211 1002367
$$ packed form
38799A38261N97137Q41241M25465j11158j08389J50429p6963o45399p21154k30098
38789B59372O9645j9477P2283L69317J83296m55408n97582n1564J72553k93492
38779b91057l79472M87248J092372L01867r76093j108945j41299N62594M51023
38770a762J37975K1167j02944k16785m2448K42429K03072n3010j15703r4524l40811
38759c63344n95642l31127K56878N11579L92085L64806L93326L8268n08031n23949
38749c65151K0948L15653k3493l90015j68993M21611P59091N59228L174m60447
38739F71606m05110Q0766L13185j04465n73238l17826L54122M43349k32516q26415
38729e96542p50109k78415K09240O90481J018324Q29079K19637j93484j45844
$$ plain form
38720 1002367 987427 924248 853414 939863 1112219 1215857 1305206 1423555 1406327 1292659
38710 1292659 1513700 2148280 2433921 1719561 561324 58246 309368 418131 -12611
38701 -12611 -315270 115701 932993 1440429 1499478 1428523 1400353 1324528 1116074 815687
38691 815687 527978 303714 -8681 -667365 -1558708 -2010626 -1494602 -399958 358133
38682 358133 446393 334843 437290 604508 590869 495992 528542 751125 1251807 2153892
38672 2153892 3210423 3752461 3355261 2360900 1528044 1311603 1596084 1939732 1950297
38663 1950297 1559021 1004367 480554 -94488 -782258 -1269686 -1153427 -492876 267712
38654 267712 844458 1203035 1215711 733087 11757 -413160 -368693 -164177 -55172 -14014
$$ packed form
38720A002367j4940o3179p0834Q6449J72356J03638Q9349J18349j7228j13668
38710A292659K21041O34580K85641p14360j158237n03078K51122J08763m30742
38701a2611l02659M30971Q17292N07436N9049p0955k8170p5825k08454l00387
38691H15687k87709k24264l12395o58684q91343m51918N16024J094644P58091
38682C58133Q8260j11550J02447J67218j3639r4877L2550K22583N00682R02085
38672B153892J056531N42038l97200r94361q32856k16441K84481L43648J0565
38663A950297l91276n54654n23813n75042o87770m87428J16259O60551P60588
38654B67712N76746L58577J2676m82624p21330m24917M4467K04516J09005M1158
$$ plain form
38644 -14014 -25098 -118155 -95084 248624 612418 489651 11992 -187870 -51516 -227536
38634 -227536 -867261 -1142133 -469622 500290 744055 149090 -657754 -1232336 -1420549 -1052671
38624 -1052671 -281596 161922 -170854 -635755 -343234 436735 612034 -94252 -788744
38615 -788744 -787518 -440973 -290028 -226126 7030 107768 -345511 -1094687 -1449423 -1215458
38605 -1215458 -889286 -938732 -1297199 -1653677 -1880249 -1922528 -1494147 -318655 1208007
38596 1208007 1985486 1291472 -184162 -897410 -203247 909404 1140523 485394 -13547
38587 -13547 190140 592121 633785 508614 627267 800830 477470 -417932 -1337026 -1758447
38577 -1758447 -1640501 -1237763 -821959 -664444 -920109 -1274819 -1014840 125234 1334226
$$ packed form
38644a4014j1084r3057K3071L43708L63794j22767m77659j99862J36354j76020
38634b27536o39725k74872O72511R69912K43765n94965q06844n74582j88213L67878
38624a052671P71075M43518l32776m64901K92521P79969J75299p06286o94492
38615g88744J226L46545J50945O3902K33156J00738m53279p49176l54736K33965
38605a215458L26172m9446l58467l56478k26572m2279M28381J175492J526662
38596A208007P77479o94014j475634p13248O94163J112651K31119o55129m98941
38587a3547K03687M01981M1664j25171J18653J73563l23360q95402r19094m21421
38577a758447J17946M02738M15804J57515k55665l54710K59979J140074J208992
$$ plain form
38568 1334226 1485399 565175 -268663 -291996 -172670 -742615 -1463832 -1142984 94089
38559 94089 761843 131530 -781299 -866814 -484687 -518561 -741780 -328113 457954 407925
38549 407925 -753602 -1807143 -1728988 -1027330 -818069 -1232138 -1478803 -1171393 -807714
38540 -807714 -839462 -869859 -205530 1027007 1838480 1570692 687608 28966 -322028 -793665
38530 -793665 -1207160 -853895 170591 723090 221793 -397780 -106511 608168 573157 -180622
38520 -180622 -561176 -205670 115298 -59635 -208137 97635 444596 378615 152773 162452
38510 162452 253891 94411 -243174 -487204 -559595 -442956 -72051 359381 435641 171810
38500 171810 184178 868967 1819711 2410618 2576181 2631349 2630902 2301850 1451123 203776
$$ packed form
38568A334226J51173r20224q33838k3333J19326n69945p21217L20848J237073
38559I4089O67754o30313r12829q5515L82127l3874k23219M13667P86067n0029
38549D07925j161527j053541P8155P01658K09261m14069k46665L07410L63679
38540h07714l1748l0397O64329J232537Q11473k67788q83084o58642l50994m71637
38530g93665m13495L53265J024486N52499n01297o19573K91269P14679l5011p53779
38520a80622l80554L55506L20968j74933j48502L05772L46961o5981k25842R679
38510A62452R1439j59480l37585k44030p2391J16639L70905M31432P6260k63831
38500A71810J2368O84789R50744N90907J65563N5168m47l29052q50727j247347
$$ plain form
38490 203776 -1016616 -1675956 -1567470 -1099146 -828587 -768711 -602734 -462642 -797860 -1469123
38480 -1469123 -1802456 -1695721 -1774131 -2165073 -2106884 -1277514 -539338 -645260 -1060586 -916784
38470 -916784 -396678 -229243 -413806 -439337 -299939 -313296 -334707 -128759 -136923 -828641
38460 -828641 -1604050 -1458689 -539528 94646 134412 242674 629665 686694 271345 132540
38450 132540 608829 969478 613154 18587 -121842 24795 -141661 -731603 -1434715 -2028519
38440 -2028519 -2326744 -2068074 -1324973 -656666 -477939 -618934 -772053 -939495 -1167609
38431 -1167609 -1303343 -1291776 -1250877 -1035821 -310946 675906 1061156 509008 -249472 -468688
38421 -468688 -327212 -293863 -249695 51231 233885 -156145 -772243 -942856 -717691 -642657
$$ packed form
38490B03776j220392o59340J08486M68324K70559N9876J65977J40092l35218o71263
38480a469123l33333J06735p8410l90942N8189Q29370P38176j05922m15326J43802
38470i16784N20106J67435j84563k5531J39398j3357k1411K05948q164o91718
38460h28641p75409J45361R19161O34174L9766J08262L86991N7029m15349j38805
38450A32540M76289L60649l56324n94567j40429J46637j66456n89942p03112n93804
38440b028519k98225K58670P43101O68307J78727j40995j53119j67442k28114
38431a167609j35734J1567M0899K15056P24875R86852L85250n52148p58480k19216
38421d68688J41476L3349M4168L00926J82654l90030o16098j70613K25165P5034
$$ plain form
38411 -642657 -755450 -655738 -435454 -671513 -1444667 -2107649 -2165415 -1804371 -1445191 -1280010
38401 -1280010 -1325380 -1472391 -1444115 -1114905 -822471 -920093 -1144792 -988451 -582606 -524709
38391 -524709 -824331 -785708 -122935 522700 507620 45440 -226828 -65090 361778 843720
38381 843720 1137313 954863 339458 -202532 -271158 -48759 56861 -28046 -130245 -197907
38371 -197907 -241020 -126558 229499 653705 996686 1372410 1747765 1591942 523395 -814627
38361 -814627 -1225806 -470073 318454 78106 -827644 -1243556 -860119 -485757 -715016 -1094875
38351 -1094875 -939397 -354956 98741 338776 629758 734581 52366 -1264531 -2121808
38342 -2121808 -1800705 -872373 -354254 -464550 -714315 -760603 -554274 -24625 686505 949339
$$ packed form
38411f42657j12793R9712K20284k36059p73154o62982n7766L61044L59180J65181
38401a280010m5370j47011K8276L29210K92434r7622k24699J56341M05845N7897
38391e24709k99622L8623O62773O45635j5080m62180k72268J61738M26868M81942
38381H43720K93593j82450o15405n41990o8626K22399J05620q4907j02199o7662
38371a97907m3113J14462L56057M24206L42981L75724L75355j55823j068547j338022
38361h14627m11179P55733P88527k40348r05750m15912L83437L74362k29259l79859
38351a094875J55478N84441M53697K40035K90982J04823o82215j316897q57277
38342b121808L21103R28332N18119j10296k49765m6288K06329N29649P11130K62834
$$ plain form
38332 949339 337642 -581519 -883876 -564985 -382150 -537818 -483391 -99284 -9578 -390520
38322 -390520 -487188 120768 683843 461640 -20176 202356 977998 1277627 681605 -281055
38312 -281055 -1090553 -1615697 -1600232 -745644 474967 921287 132499 -983827 -1219408
38303 -1219408 -424400 564544 1017632 916143 641111 471603 447057 501739 579484 601344
38293 601344 419180 -20348 -449499 -486842 -212896 -213955 -761505 -1286172 -1139451 -608528
38283 -608528 -528401 -992137 -1203712 -741777 -214207 -278053 -628583 -516339 125642 661583
38273 661583 666601 321158 -67986 -483286 -1018888 -1545466 -1700911 -1231955 -430583 -157184
38263 -157184 -1047464 -2541280 -3153882 -2120461 -428839 312827 -205373 -845558 -674304
$$ packed form
38332I49339o11697r19161l02357L18891J82835j55668N4427L84107Q9706l80942
38322c90520r6668O07956N63075k22203m81816K22532P75642K99629n96022r62660
38312b81055q09498n25144J5465Q54588J220611M46320p88788j116326k35581
38303a219408P95008R88944M53088j01489k75032j69508k4546N4682P7745K1860
38293F01344j82164m39528m29151l7343K73946j059n47550n24667J46721N30923
38283f08528Q0127m63736k11575M61935N27570o3846l50530J12244O41981N35941
38273F61583N018l45443l89144m15300n35602n26578j55445M68956Q01372K73399
38263a57184q90280j493816o12602J033421J691622P41666n18200o40185J71254
$$ plain form
38254 -674304 4920 425963 424659 305139 190666 58490 92110 446872 827792 772458
38244 772458 252830 -390744 -943083 -1295490 -1155025 -415726 269935 73162 -724609 -838846
38234 -838846 275985 1580082 1898151 1469814 1253161 1315166 1001348 349499 65926
38225 65926 94272 -483608 -1765198 -2480535 -1799276 -624092 -188051 -270684 47571 549779
38215 549779 238153 -714912 -861011 418808 1943241 2366384 1773051 1022462 396570
38206 396570 -251327 -644326 -390540 113969 34940 -629721 -944922 -414543 238311 100437
38196 100437 -604929 -817505 -100936 803381 1024659 669067 494223 783683 1097430 1085816
38186 1085816 934012 796987 375803 -517589 -1424637 -1805480 -1804706 -1879278 -1981389 -1811759
$$ packed form
38254f74304O79224M21043j304j19520j14473j32176L3620L54762L80920n5334
38244G72458n19628o43574n52339l52407J40465P39299O85661j96773p97771j14237
38234h38846J114831J304097L18069m28337k16653O2005l13818o51849k83573
38225F5926K8346n77880j281590p15337O81259J175184M36041q2633L18255N02208
38215E49779l11626r53065j46099J279819J524433M23143n93333p50589o25892
38206C96570o47897l92999K53786N04509p9029o64661l15201N30379O52854j37874
38196A00437p05366k12576P16569R04317K21278l55592j74844K89460L13747j1614
38186A085816j51804j37025m21184q93392r07048l80843P74p4572j02111J69630
$$ plain form
38176 -1811759 -1625999 -1916502 -2378993 -2151039 -1166688 -293237 76838 477257 1017184
38167 1017184 802705 -487815 -1554765 -1168466 -100314 -3132 -871058 -1128130 -133802
38158 -133802 913278 859674 62536 -575228 -943765 -1376177 -1774239 -1864868 -1777951 -1667364
38148 -1667364 -1213856 -226598 599778 322834 -918515 -1877731 -1620051 -512930 348542
38139 348542 369836 -99560 -381744 -279502 -162953 -324862 -516655 -335580 132146 441849
38129 441849 478013 528566 630341 394154 -279919 -810755 -649614 -49340 274285 18620
38119 18620 -519702 -940607 -1084758 -1017265 -946599 -1052586 -1224976 -1170822 -918525 -866671
38109 -866671 -1081886 -968932 -86065 1031125 1397010 747971 -306017 -1125697 -1482316
$$ packed form
38176a811759J85760k90503m62491K27954R84351Q73451L70075M00419N39927
38167A017184k14479j290520j066950L86299J068152R7182q67926k57072R94328
38158a33802J047080n3604p97138o37764l68537m32412l98062r0629Q6917J10587
38148a667364M53508R87258Q26376k76944j241349r59216K57680J107121Q61472
38139C48542K1294m69396k82184J02242J16549j61909j91793J81075M67726L09703
38129D41849L6164N0553J01775k36187o74073n30836J61141O00274L23625k55665
38119A8620n38322m20905j44151O7493P0666j05987j72390N4154K52297N1854
38109h66671k15215J12954Q82867J117190L65885o49039j053988q19680l56619
$$ plain form
38100 -1482316 -1272996 -460753 589099 1250154 1306654 1104572 929095 655615 168959
38091 168959 -307816 -558346 -697496 -857693 -817512 -278750 603981 1244052 1168881 430303
38081 430303 -471882 -984358 -883028 -366285 193486 549023 653654 637451 820406 1487441
38071 1487441 2370997 2594978 1579747 -84469 -1131536 -988211 -206889 459764 843730
38062 843730 1068816 1082175 888427 850740 1279653 1881707 1970607 1183661 -144648 -1175839
38052 -1175839 -1105945 131894 1549306 1875939 891178 -374707 -967044 -1005539 -984803
38043 -984803 -711573 281518 1584240 2064060 1224115 -268342 -1505033 -2172812 -2320804
38034 -2320804 -1926313 -1076166 -218579 130694 -170402 -819353 -1251683 -960327 -22602
$$ packed form
38100a482316K09320Q12243J049852O61055N6500k02082j75477k73480m86656
38091A68959m76775k50530j39150j60197M0181N38762Q82731O40071p5171p38578
38081D30303r02185n12476J01330N16743N59771L55537J04631j6203J82955O67035
38071A487441Q83556K23981j015231j664216j047067J43325P81322O66653L83966
38062H43730K25086J3359j93748l7687M28913O02054Q8900p86946j328309j031191
38052a175839O9894J237839J417412L26633r84761j265885n92337l8495K0736
38043i84803K73230R93091J302722M79820q39945j492457j236691o67779j47992
38034b320804L94491Q50147Q57587L49273l01096o48951m32330K91356R37725
$$ plain form
38025 -22602 691615 344735 -703520 -1103348 -178829 1125142 1404772 511975 -438677
38016 -438677 -534967 66737 700454 1035240 1161821 1211474 1186875 1074432 953908 965885
38006 965885 1149905 1298867 1096734 529003 48385 127935 678033 1107621 990828 494727
37996 494727 72930 -109035 -277433 -612215 -896903 -770589 -285429 26322 -226888 -809563
37986 -809563 -1226923 -1397154 -1581277 -1736129 -1457165 -690901 -713 174786 123690 347598
37976 347598 779565 970094 842385 794310 1141337 1842583 2669084 3251334 3090247 2010183
37966 2010183 585690 -349638 -664874 -969625 -1626562 -2183568 -1973418 -941710 290510
37957 290510 941958 604832 -397308 -1114117 -794766 280365 1109737 1124616 600652
$$ packed form
38025b2602P14217l46880j048255l99828R24519J303971K79630q92797r50652
38016d38677r6290O01704O33717L34786J26581M9653k4599j12443j20524J1977
38006I65885J84020J48962k02133n67731m80618P9550N50098M29588j16793m96101
37996D94727m21797j81965j68398l34782k84688J26314M85160L11751k53210n82675
37986h09563m17360j70231j84123j54852K78964P66264O90188J75499n1096K23908
37976C47598M31967J90529j27709m8075L47027P01246Q26501N82250j61087j080064
37966B010183j424493r35328l15236l04751o56937n57006K10150J031708J232220
37957B90510O51448l37126j002140p16809L19351J075131Q29372J4879n23964
$$ plain form
37948 600652 -86079 -971605 -2038024 -2862637 -3141450 -3064059 -2771825 -2001114 -792528
37939 -792528 20524 -204078 -841365 -767417 34644 567424 431848 301155 579837 631240
37929 631240 -93412 -967660 -1004959 -253366 435053 736504 1095562 1657592 1809566 1109370
37919 1109370 69062 -477305 -453818 -482797 -887414 -1273969 -1182239 -708252 -246630 61012
37909 61012 305091 479524 578578 877997 1620229 2404572 2433713 1585007 761237 808251
37899 808251 1438115 1685042 1224515 750579 1062107 2147870 3231975 3496746 2751248
37890 2751248 1544041 584460 5277 -586724 -1258659 -1404040 -606160 556771 1132856
37881 1132856 994137 823476 1037597 1343951 1365105 1134241 897118 872389 1204997 1711861
$$ packed form
37948F00652o86731q85526j066419q24613k78813P7391K92234P70711J208586
37939g92528Q13052k24602o37287P3948Q02061N32780j35576j30693K78682N1403
37929F31240p24652q74248l7299P51593O88419L01451L59058N62030J51974p00196
37919A109370j040308n46367K3487k8979m04617l86555R1730M73987M61622L07642
37909F1012K44079J74433R9054K99419P42232P84343K9141q48706q23770M7014
37899H08251O29864K46927m60527m73936L11528J085763J084105K64771p45498
37890B751248j207207r59581n79183n92001o71935j45381P97880J162931N76085
37881A132856j38719j70661K14121L06354K1154k30864k37123k4729L32608N06864
$$ plain form
37871 1711861 1771614 1021760 65351 -172852 280018 575457 402732 280074 376904 125235
37861 125235 -601108 -975628 -516768 46136 -22509 -258193 62724 532923 327766 -197370
37851 -197370 82103 1210650 1959892 1626203 938265 814130 1079534 938322 169936
37842 169936 -636566 -787135 -126118 876699 1555641 1657241 1470894 1279862 988115
37833 988115 569854 498002 1189118 2251937 2842065 2616500 1859048 910059 49784 -314999
37823 -314999 -34120 420750 658293 1134277 2342985 3528048 3353879 1849391 482613
37814 482613 122105 147389 -77173 -157824 247951 521403 171791 -161794 155372 444523
37804 444523 -274540 -1551411 -2038521 -1434880 -695514 -443527 -345235 -126120 -111787 -477524
$$ packed form
37871A711861N9753p49854r56409k38203M52870K95439j72725j22658R6830k51669
37861A25235p26343l74520M58860N62904o8645k35684L20917M70199k05157n25136
37851a97370K79473J128547P49242l33689o87938j24135K65404j41212p68386
37842A69936q06502j50569O61017J002817O78942J01600j86347j91032k91747
37833I88115m18261p1852O91116J062819N90128k25565p57452r48989q60275l64783
37823c14999K80879M54870K37543M75984J208708J185063j74169j504488j366778
37814D82613l60508K5284k24562q0651M05775K73452l49612l33585L17166K89151
37804D44523p19063j276871m87110O03641P39366K51987R8292K19115J4333l65737
$$ plain form
37794 -477524 -840264 -927128 -922113 -840142 -268605 840549 1703466 1544827 564414 -338057
37784 -338057 -546193 -134785 429397 678308 445703 58718 56954 514918 865992 612929
37774 612929 -72775 -758566 -1422230 -2192386 -2610113 -1887687 -116563 1394892 1474342
37765 1474342 443840 -372080 -270100 285392 645517 786557 930181 1004740 921926 924345
37755 924345 1160266 1275110 962534 608634 768118 1236963 1361084 1154136 1313906 2036582
37745 2036582 2572996 2251997 1377039 799179 1001055 1775450 2401080 2062422 615813
37736 615813 -965313 -1486212 -979149 -609451 -1029432 -1654665 -1850943 -1887347 -2116917 -2044093
37726 -2044093 -1031367 603521 1950989 2537888 2339571 1300998 -315318 -1504819
$$ packed form
37794d77524l62740q6864N015Q1971N71537J109154Q62917j58639r80413r02471
37784c38057k08136M11408N64182K48911k32605l86985j764M57964L51074k53063
37774F12929o85704o85791o63664p70156m17727P22426J771124J511455P9450
37765A474342j030502q15920J01980N55492L60125J41040J43624P4559q2814K419
37755I24345K35921J14844l12576l53900J59484M68845J24121k06948J59770P22676
37745B036582N36414l20999q74958n77860K01876P74395O25630l38658j446609
37736F15813j581126n20899N07063L69698m19981o25233j96278l6404k29570P2824
37726b044093J012726J634888J347468N86899j98317j038573j616316j189501
$$ plain form
37718 -1504819 -1397853 -443419 77445 -325543 -898207 -767118 135506 1290666 2140507
37709 2140507 2311147 1753533 845863 171489 157514 900964 2045870 2800903 2612554
37700 2612554 1985778 1972466 2592256 2636814 1537875 428711 499927 1219855 1314036 771161
37690 771161 574589 980710 1468028 2059428 3234652 4636888 5272365 5046959 4822671
37681 4822671 4909400 4821801 4617179 5030477 5962541 6217083 5235144 3867606 2921379 2153529
37671 2153529 1317489 1014217 1667059 2570384 2784636 2285370 1570830 827037 127004
37662 127004 -169976 151443 795914 1425186 1992148 2385286 2412734 2337214 2629186 3006537
37652 3006537 2687293 1845393 1664836 2481219 3057822 2412338 1292454 1000673 1657912
$$ packed form
37718a504819J06966R54434N20864m02988n72664J31089R02624J155160Q49841
37709B140507J70640n57614r07670o74374j3975P43450J144906P55033j88349
37700B612554o26776j3312O19790M4558j098939j109164P1216P19928R4181n42875
37690G71161j96572M06121M87318N91400J175224J402236O35477k25406k24288
37681D822671Q6729q7599k04622M13298R32064K54542r81939j367538r46227p67850
37671B153529q36040l03272O52842R03325K14252m99266p14540p43793p00033
37662A27004k96980L21419O44471O29272N66962L93138K7448p5520K91972L77351
37652C006537l19244q41900j80557Q16383N76603o45484j119884k91781O57239
$$ plain form
37643 1657912 2494857 3104686 3564123 3899223 4111472 4241352 4043488 3288950 2570666
37634 2570666 2769497 3480656 3290117 2012288 1110965 1282777 1364545 585976 79193
37625 79193 818996 1812052 1966673 2131113 3363491 4650509 4538106 3826254 4284061
37616 4284061 5627022 6255608 6323591 7453879 9686676 11297158 11762273 12558342 14671439
37607 14671439 17391464 20001311 22829023 26179213 29790763 33713904 38463154 44320559
37599 44320559 51742814 62123530 76852159 96313251 121023483 151770504 185802222
37592 185802222 214768923 231065544 236322633 239763230 248079365 260737335 274182130
37585 274182130 283803708 280327263 252712945 201269707 143543601 100261005 76888850
$$ packed form
37643A657912Q36945O09829M59437L35100K12249J29880j97864p54538p18284
37634B570666J98831P11159j90539j277829r01323J71812Q1768p78569n06783
37625G9193P39803R93056J54621J64440J232378J287018j12403p11852M57807
37616D284061J342961O28586O7983J130288K232797J610482M65115P96069K113097
37607A4671439K720025K609847K827712L350190L611550L923141M749250N857405
37599D4320559P422255J0380716J4728629J9461092K4710232L0747021L4031718
37592A85802222K8966701J6296621N257089L440597Q316135J2657970J3444795
37585B74182130R621578l476445k7614318n1443238n7726106m3282596k3372155
$$ plain form
37578 76888850 63897372 52446087 42741981 37502715 35035358 31996492 28186906 25062232
37570 25062232 22297535 18746368 14937186 12198102 10498863 8924436 7276254 5848382
37562 5848382 4587459 3594630 3499533 4341290 4999197 4626309 3764650 3249301 2923091
37553 2923091 2250574 1369555 742359 460707 493409 859393 1059277 271424 -1283150
37544 -1283150 -2143399 -1498340 -354735 -25537 -350671 -355135 108103 446415 520994 700662
37534 700662 1024709 1206089 1269109 1446970 1650510 1701841 1864106 2454224 3098770 3071320
37524 3071320 2347197 1730612 1852274 2464670 2822504 2476361 1626140 870326 650058
37515 650058 875797 1088443 898923 182593 -914950 -1865972 -1945190 -1052368 -129651 -93829
$$ packed form
37578G6888850j2991478j1451285r704106n239266k467357l038866l809586l124674
37570B5062232k764697l551167l809182k739084j699239j574427j648182j427872
37562E848382j260923r92829r5097Q41757O57907l72888q61659n15349l26210
37553B923091o72517q81019o27196k81652L2702L65984J99884p87853j554574
37544a283150q60249O45059J143605L29198l25134m464M63238L38312P4579J79668
37534G00662L24047J81380O3020J77861K03540N1331J62265N90118O44546k7450
37524C071320p24123o16585J21662O12396L57834l46143q50221p55814k20268
37515F50058K25739K12646j89520p16330j097543r51022p9218Q92822R22717L5822
$$ plain form
37505 -93829 -541445 -370831 428804 761701 387979 596031 2242636 4242496 4997763
37496 4997763 4526817 4092875 4299120 4716074 5068391 5574183 6081534 5921761 4890069
37487 4890069 3602950 2589134 1642176 412652 -815609 -1328621 -774728 463126 1601305
37478 1601305 2110723 2130912 2191639 2449358 2403169 1586403 317527 -603583 -843650 -792560
37468 -792560 -875145 -984349 -746253 -118714 468987 547176 108895 -354697 -361670 74698
37458 74698 593065 1028772 1517501 2024883 2146371 1614384 774691 287689 436994 889537
37448 889537 1073726 729247 177176 33628 496640 993641 817111 47139 -539085 -462473
37438 -462473 7774 441336 740415 857977 553708 -232462 -1135170 -1776196 -2096193 -2079869
$$ packed form
37505i3829m47616J70614P99635L32897l73722K08052J646605J999860P55267
37496D997763m70946m33942K06245M16954L52317N05792N07351j59773j031692
37487D890069j287119j013816r46958j229524j228261n13012N53893J237854J138179
37478A601305N09418K0189O0727K57719m6189q16766j268876r21110k40067N1090
37468g92560q2585j09204K38096O27539N87701P8189m38281m63592o973M36368
37458G4698N18367M35707M88729N07382J21488n31987q39693m87002J49305M52543
37448H89537J84189l44479n52071j43548M63012M97001j76530p69972n86224P6612
37438d62473M70247M33562K99079J17562l04269p86170r02708o41026l19997J6324
$$ plain form
37428 -2079869 -1578061 -681847 123068 477770 494767 381477 146245 -112944 -148452 -75284
37418 -75284 -384033 -1089220 -1453952 -1006968 -258108 92924 70476 -289 -177822 -464172
37408 -464172 -310268 561862 1334270 1040427 -22483 -773423 -907905 -946965 -985703 -572010
37398 -572010 179542 500854 178114 -159176 -167213 -232475 -524803 -586986 -256015 -70309
37388 -70309 -273425 -270481 338542 959148 921831 555705 586084 947749 993818 589310 229285
37377 229285 165028 49030 -505625 -1419623 -2203925 -2271773 -1361300 32973 845544 480190
37367 480190 -416049 -630241 154258 956317 700356 -451291 -1240212 -764058 449780
37358 449780 1038922 402070 -671432 -1129581 -974555 -982546 -1437705 -1868213 -1975629 -2016901
$$ packed form
37428b079869N01808Q96214Q04915L54702J6997j13290k35232k59189l5508P3168
37418g5284l08749p05187l64732M46984P48860L51032k2448p0765j77533k86350
37408d64172J53904Q72130P72408k93843j062910p50940j34482l9060l8738M13693
37398e72010P51552L21312l22740l37290q037o5262k92328o2183L30971J85706
37388g0309k03116K944O09023O20606l7317l66126L0379L61665M6069m04508l60025
37377B29285o4257j15998n54655r13998p84302o7848R10473J394273Q12571l65354
37367D80190q96239k14192P84499Q02059k55961j151647p88921M76154J213838
37358D49780N89142o36852j073502m58149J55026p991m55159m30508j07416m1272
$$ plain form
37348 -2016901 -2057639 -1619117 -521449 527339 765328 393778 170426 267770 171562 -365155
37338 -365155 -860145 -742648 -92730 463229 452616 7378 -381825 -466967 -421231 -368033
37328 -368033 -76381 525676 863325 382960 -445080 -606300 -66311 137021 -382155 -595459
37318 -595459 299746 1413980 1346678 194705 -743784 -867654 -669118 -413822 264760
37309 264760 1254688 1639649 986435 65665 -260987 -141079 -144664 -220637 74190 727606
37299 727606 1306429 1576506 1562322 1257053 799791 682878 1186962 1770078 1638576 873519
37289 873519 364475 551349 839315 496966 -366948 -1073632 -1285454 -1272668 -1436754 -1868873
37279 -1868873 -2303150 -2308599 -1621929 -468207 535676 942672 838383 537066 135349
$$ packed form
37348b016901m0738M38522J097668J048788K37989l71550k23352R7344r6208n36717
37338c65155m94990J17497O49918N55959j0613m45238l89203q5142M5736N3198
37328c68033K91652O02057L37649m80365q28040j61220N39989K03332n19176k13304
37318e95459Q95205J114234o7302j151973r38489j23870J98536K55296O78582
37309B64760R89928L84961o53214r20770l26652J19908l585p5973K94827O53416
37299G27606N78823K70077j4184l05269m57262j16913N04084N83116j31502p65057
37289H73519n09044J86874K87966l42349q63914p06684k11822J2786j64086m32119
37279a868873m34277n449O86670J153722J003883M06996j04289l01317m01717
$$ plain form
37270 135349 -381911 -773796 -665269 -48184 636538 979348 953139 767221 595006 475499
37260 475499 291109 -130112 -666091 -763651 -36800 1041110 1543143 1261497 924336 1068266
37250 1068266 1326937 1205952 939644 1007273 1292965 1375393 1241424 1022968 448666 -584520
37240 -584520 -1240570 -607542 777525 1375078 698893 -177316 -364258 -202803 -134596 199737
37230 199737 905896 973440 -375641 -2169513 -2705329 -1702953 -383275 302377 439181
37221 439181 303094 -129591 -692333 -955526 -870606 -810820 -854490 -678253 -228878 180331
37211 180331 513581 1036526 1590695 1597934 984855 385527 204598 200484 226925 568436
37201 568436 1168848 1363438 916835 551878 781482 945527 269920 -696489 -746209 167668
$$ packed form
37270A35349n17260l91885J08527O17085O84722L42810k6209j85918j72215j19507
37260D75499j84390m21221n35979r7560P26851J077910N02033k81646l37161J43930
37250A068266K58671j20985k66308O7629K85692Q2428j33969k18456n74302j033186
37240e84520o56050O33028J385067N97553o76185q76209j86942J61455O8207L34333
37230A99737P06159O7544j349081j793872n35816J002376J319678O85652J36804
37221D39181j36087m32685n62742k63193Q4920N9786m3670J76237M49375M09209
37211A80331L33250N22945N54169P239o13079n99328j80929m114K6441L41511
37201E68436O00412J94590m46603l64957K29604J64045o75607r66409m9720R13877
$$ plain form
37191 167668 828774 477213 -303528 -621756 -425945 -271918 -483928 -904991 -1155834 -918547
37181 -918547 -232861 389237 471690 252357 411114 992146 1141380 271454 -972238 -1441573
37171 -1441573 -921717 -253401 -103188 -237781 -188901 -71172 -284454 -705922 -744170 -201664
37161 -201664 399649 527689 284100 59630 -115595 -450627 -837653 -943882 -795862 -711724
37151 -711724 -611619 -40427 909569 1396716 1003312 458599 505997 619233 -162029 -1417956
37141 -1417956 -1593601 -228696 1202669 1207238 80887 -929917 -1472100 -2073103 -2753897
37132 -2753897 -2835198 -2146765 -1430151 -1242807 -1216401 -811844 -252571 -212860 -868865 -1673001
37122 -1673001 -1976963 -1664613 -1225671 -1230300 -1604484 -1563970 -596377 667220 1139231 772893
$$ packed form
37191A67668O61106l51561p80741l18228J95811J54027k12010m21063k50843K37287
37181i18547O85686O22098Q2453k19333J58757N81032J49234q69926j243692m69335
37171a441573N19856O68316J50213j34593M8880J17729k13282m21468l8248N42506
37161b01664O01313J28040k43589k24470j75225l35032l87026j06229J48020Q4138
37151g11724J00105N71192R49996M87147l93404n44713M7398J13236p81262j255927
37141a417956j75645J364905J431365M569j126351j010804n42183o01003o80794
37132b753897q1301O88433P16614J87344K6406M04557N59273L9711o56005q04136
37122a673001l03962L12350M38942m629l74184M0514R67593J263597M72011l66338
$$ plain form
37112 772893 595204 1088371 1450497 945421 89842 -309968 -563607 -1469151 -2749236
37103 -2749236 -3313222 -2902943 -2279333 -1767438 -875809 384929 1078030 787543 352169
37094 352169 414522 286438 -762035 -1979084 -2136115 -1464250 -1214551 -1548868 -1311279
37085 -1311279 -39269 1149055 1196515 568737 359279 714168 969556 855220 677870
37076 677870 485286 -118123 -1152979 -1850025 -1438509 -143624 921445 886787 -13652
37067 -13652 -793350 -797810 -239728 301723 575966 682255 697493 607451 440202 159304
37057 159304 -407769 -1190371 -1619133 -1225471 -404061 -57130 -462826 -983378 -933426 -237019
37047 -237019 814745 1852406 2318155 1726180 391552 -634410 -763832 -540751 -689436
$$ packed form
37112G72893j77689M93167L62126n05076q55579l99810k53639r05544j280085
37103b749236n63986M10279O23610N11895Q91629J260738O93101k90487m35374
37094C52169O2353j28084j048473j217049j57031O71865K49699l34317K37589
37085a311279J272010J188324M7460o27778k09458L54889K55388j14336j77350
37076F77870j92584o03409j034856o97046M11516J294885J065069l4658r00439
37067a3652p79698m460N58082N41451K74243J06289J5238r0042j67249k80898
37057A59304n67073p82602m28762L93662Q21410L46931m05696n20552M9952O96407
37047b37019J051764J037661M65749n91975j334628j025962j29422K23081j48685
$$ plain form
37038 -689436 -1004678 -812391 -178098 104080 -329164 -918514 -979273 -528500 -146495 -316898
37028 -316898 -1036785 -1868423 -2280492 -2067189 -1456981 -752330 -7095 773526 1303823 1207303
37018 1207303 488064 -443946 -1172676 -1466891 -1173408 -279367 863374 1663906 1777649
37009 1777649 1344324 736616 237053 -51947 -203361 -432500 -887081 -1384797 -1492031
37000 -1492031 -963503 -58078 622158 605544 -67155 -853007 -1148894 -814937 -240210 129246
36990 129246 220858 256453 429849 807010 1382868 2011146 2348265 2097514 1353728 600518
36980 600518 337631 714086 1446701 2065775 2329488 2393703 2450934 2296594 1567920 412498
36970 412498 -501340 -790391 -770996 -862804 -1014974 -1032644 -1028506 -1111304 -1007917 -518600 -45858
$$ packed form
37038f89436l15242J92287O34293K82178m33244n89350o0759M50773L82005j70403
37028c16898p19887q31638m12069K13303O10208P04651P45235P80621N30297r6520
37018A207303p19239r32010p28730k94215K93483Q94041J142741Q00532J13743
37009A777649m33325o07708m99563k89000j51414k29139m54581m97716j07234
37000a492031N28528R05425O80236j6614o72699p85852k95887L33957N74727L69456
36990A29246R1612L5595J73396L77161N75858O28278L37119k50751p43786p53210
36980F00518k62887L76455P32615O19074K63713O4215N7231j54340p28674j155422
36970D12498r13838k89051J9395r1808j52170j7670M138q2798J03387M89317M72742
$$ plain form
36959 -45858 -100065 -497856 -624496 -323874 25437 132873 -89251 -795888 -1868187 -2480968
36949 -2480968 -1876752 -554734 199778 45970 -97426 358203 838252 806202 746217 1201131
36939 1201131 1684839 1473861 870136 699544 959978 953912 543640 308330 488323 657650
36929 657650 552966 453287 526409 444130 -75210 -815616 -1379625 -1573292 -1341775 -737012
36919 -737012 -112396 46423 -305713 -669541 -619954 -241029 163911 460504 616518 547981
36909 547981 241447 -159636 -519422 -798467 -951436 -965636 -999515 -1183501 -1279820 -914206
36899 -914206 -199790 286882 268382 78578 69397 190339 380629 820001 1377776 1338083
36889 1338083 301545 -971018 -1325721 -701953 -157299 -375572 -829158 -660448 166182
$$ packed form
36959d5858n4207l97791j26640L00622L49311J07436k22124p06637j072299o12781
36949b480968O04216J322018P54512j53808j43396M55629M80049l2050n9985M54914
36939A201131M83708k10978o03725j70592K60434o066m10272k35310J79993J69327
36929F57650j04684r9679P3122q2279n19340p40406n64009j93667K31517O04763
36919g37012O24616J58819l52136l63828M9587L78925M04940K96593J56014o8537
36909E47981l06534m01083l59786k79045j52969j4200l3879j83986r6319L65614
36899i14206P14416M86672j8500j89804r181J20942J90290M39372N57775l9693
36889A338083j036538j272563l54703O23768N44654k18273m53586J68710Q26630
$$ plain form
36880 166182 977192 1284550 1145686 825682 509223 325749 349026 480717 484656 206533
36870 206533 -296118 -831515 -1199088 -1247877 -923696 -329205 299834 748657 978089 1106051
36860 1106051 1229728 1304056 1223951 986208 721691 596722 708429 983733 1110354 730187
36850 730187 -97428 -768836 -790993 -477154 -558125 -1102602 -1399770 -1105772 -842205 -1168303
36840 -1168303 -1548496 -1103836 -26804 640972 500390 133637 -66364 -378596 -788584
36831 -788584 -599081 357291 986766 284851 -1179058 -2040371 -1947078 -1584427 -1214365 -397364
36821 -397364 770497 1317356 713496 -376807 -1159404 -1710444 -2264185 -2232173 -902165
36812 -902165 1166187 2378420 1848984 298559 -916959 -1163564 -727540 -115100 447100
$$ packed form
36880A66182Q11010L07358j38864l20004l16459j83474K3277J31691L939k78123
36870B06533n02651n35397l67573m8789L24181N94491O29039M48823K29432J27962
36860A106051J23677P4328q0105k37743k64517j24969J11707K75304J26621l80167
36850G30187q27615o71408k2157L13839q0971n44477k97168K93998K63567l26098
36840a168303l80193M44660J077032O67776j40582l66753k00001l12232m09988
36831g88584J89503R56372O29475p01915j463909q61313R3293L62651L70062Q17001
36821c97364J167861N46859o03860j090303p82597n51040n53741L2012J330008
36812i02165K068352J212233n29436j550425j215518k46605M36024O12440N62200
$$ plain form
36803 447100 932139 1249244 1208104 753313 163388 -133474 -9408 224540 216767 -39448
36793 -39448 -337362 -576888 -732533 -661125 -250656 285764 570879 557801 590078 859449
36783 859449 1040036 675606 -165122 -842821 -812362 -203812 378883 577696 604428 794787
36773 794787 1095588 1254084 1349906 1728401 2376466 2765716 2484395 1718265 929993 362879
36763 362879 64292 79165 325533 520067 507630 445108 430037 273607 -37538 -34241 595995
36752 595995 1368802 1579301 1292553 1106550 1076353 647826 -282201 -1010106 -991771 -548413
36742 -548413 -297958 -396231 -644407 -859102 -807976 -258924 525020 805346 351099 259
36732 259 680480 2137312 3203827 3173898 2365380 1432488 712451 287464 117786 -105333
$$ packed form
36803D47100M85039L17105m1140m54791n89925k96862J24066K33948p773k56215
36793c9448k97914k39526j55645P1408M10469N36420K85115j3078L2277K69371
36783H59449J80587l64430q40728o77699L0459O08550N82695J98813K6732J90359
36773G94787L00801J58496R5822L78495O48065L89250k81321p66130p88272n67114
36763C62879k98587J4873K46368J94534j2437o2522j5071j56430l11145L297O30236
36752E95995P72807K10499k86748j86003l0197m28527r30027p27905J8335M43358
36742e48413K50455r8273k48176k14695N1126N49052P83944K80326m54247l50840
36732B59O80221J456832J066515k9929q08518r32892p20037m24987j69678k23119
$$ plain form
36722 -105333 -806290 -1911316 -2650285 -2324698 -1221381 -479797 -927447 -2152348 -2897272
36713 -2897272 -2410563 -1236713 -503713 -596806 -909187 -890040 -815569 -1207931 -1885964 -2126735
36703 -2126735 -1669642 -1061736 -900397 -1091737 -1056827 -470134 400681 999871 978682 416692
36693 416692 -318381 -861197 -1040585 -905487 -665932 -574427 -737712 -1009523 -1145406 -1083278
36683 -1083278 -1011631 -1164207 -1589821 -2072248 -2239121 -1886915 -1286716 -964784 -1027691 -990675
36673 -990675 -545928 -140679 -305978 -723059 -642592 -68295 270085 105071 -64988 30317
36663 30317 60489 -24931 271598 918562 998223 118383 -711678 -475764 346270 630661
36653 630661 289175 29035 22885 27977 388065 1570328 2913559 3200029 2453434 1841248
$$ packed form
36722a05333p00957j105026p38969L25587J103317P41584m47650j224901p44924
36713b897272M86709J173850P33000r3093l12381J9147P4471l92362o78033k40771
36703b126735M57093O07906J61339j91340L4910N86693Q70815N99190k1189n61990
36693D16692p35073n42816j79388J35098K39555R1505j63285k71811j35883O2128
36683a083278P1647j52576m25614m82427j66873L52206O00199L21932o2907L7016
36673i90675M44747M05249j65299m17081Q0467N74297L38380j65014j70059R5305
36663C0317L0172q5420K96529O46964P9661q79840q30061K35914Q22034K84391
36653F30661l41486k60140o150N092L60088J182263J343231K86470p46595o12186
$$ plain form
36643 1841248 1725140 1241524 126788 -510956 77055 1006736 1095803 547765 393497
36634 393497 914382 1473721 1491710 934469 176165 -206211 62312 388397 -105318 -1178344
36624 -1178344 -1557113 -842424 -247470 -706003 -1361286 -1011158 -64818 315443 263538 779414
36614 779414 1661435 1622482 504872 -288404 49914 649314 654166 615498 1237463 1830219
36604 1830219 1269681 -76047 -640688 207153 1344684 1413934 425001 -526854 -692234
36595 -692234 -348917 -168097 -310271 -354763 25609 618111 976879 937425 637549 204489
36585 204489 -313692 -775715 -956201 -765411 -371241 -124244 -313114 -768377 -749900 313732
36575 313732 1841371 2431817 1548250 318233 121050 890091 1504435 1407698 961808
$$ packed form
36643A841248j16108m83616j114736o37744N88011R29681Q9067n48038j54268
36634C93497N20885N59339J7989n57241p58304l82376K68523L26085m93715j073026
36624a178344l78769P14689N94954m58533o55283L50128R46340L80261n1905N15876
36614G79414Q82021l8953j117610p93276L38318N99400M852l8668O21965N92756
36604A830219n60538j345728n64641Q47841J137531O9250r88933r51855j65380
36595f92234L43317J80820j42174m4492L80372N92502L58768l9454k99876m33060
36585B04489n18181m62023j80486J90790L94170K46997j88870m55263J8477J063632
36575C13732J527639N90446q83567j230017j97183P69041O14344r6737m45890
$$ plain form
36566 961808 487586 -50479 -459233 -362937 81317 347853 479371 976285 1652062 1595729
36556 1595729 580832 -425720 -595345 -246357 -61412 -109053 -191344 -408143 -729755
36547 -729755 -637319 150055 1086293 1495938 1372592 1016655 488734 -48893 -129415 231640
36537 231640 220292 -570874 -1295157 -1058971 -332134 -170615 -604640 -913725 -1042018 -1489012
36527 -1489012 -2060396 -2029780 -1489155 -1289773 -1560264 -1482957 -732142 15551 287106 435940
36517 435940 705039 710616 294644 -69166 -167059 -400741 -797646 -686412 24627 250631
36507 250631 -760242 -2143918 -2551150 -1918666 -1226187 -1027770 -1113554 -1205464 -1141137 -717406
36497 -717406 -120929 -126768 -1060817 -1943156 -1551928 -66627 1208109 1489284 994256 73209
$$ packed form
36566I61808m74222n38065m08754R6296M44254K66536J31518M96914O75777n6333
36556A595729j014897j006552j69625L48988J84945m7641q2291k16799l21612
36547g29755R2436P87374R36238M09645j23346l55937n27921n37627q0522L61055
36537B31640j1348p91166p24283K36186P26837J61519m34025l09085j28293m46994
36527a489012n71384L0616N40625J99382k70491P7307P50815P47693K71555J48834
36517D35940K69099N577m15972l63810r7893k33682l96905J11234P11039K26004
36507B50631j010873j383676m07232O32484O92479J98417q5784r1910O4327M23731
36497g17406N96477n839r34049q82339L91228J485301J274736K81175m95028r21047
$$ plain form
36487 73209 -1034784 -1658870 -1083715 275030 1042656 555748 -436091 -1007571 -1164194
36478 -1164194 -1327021 -1498942 -1500573 -1472111 -1598671 -1737371 -1748887 -1816880 -2039684 -2088548
36468 -2088548 -1703423 -1194864 -990790 -937444 -537560 232812 782622 603368 -170977 -937179
36458 -937179 -1178452 -819255 -157913 440155 734598 598673 89004 -390163 -341479 152464
36448 152464 357556 -156535 -874093 -1119628 -1031135 -1053442 -917425 -131016 774491 705978
36438 705978 -258577 -857708 -597134 -401499 -861082 -1187212 -696985 -88443 -191678 -507392
36428 -507392 -198556 328469 161340 -461956 -617156 -333971 -358768 -601728 -286701 457168
36418 457168 593957 -134454 -840522 -978809 -937162 -903329 -416186 541135 1156136 981650
$$ packed form
36487G3209j107993o24086N75155J358745P67626m86908r91839n71480j56623
36478a164194j62827j71921j631K8462j26560j38700j1516o7993k22804m8864
36468b088548L85125N08559K04074N3346L99884P70372N49810j79254p74345p66202
36458i37179k41273L59197O61342N98068K94443j35925n09669m79167M8684M93943
36448A52464K05092n14091p17558k45535Q8493k2307J36017P86409R05507o8513
36438G05978r64555n99131K60574J95635m59583l26130M90227O08542j03235l15714
36428e07392L08836N27025j67129o23296j55200K83185k4797k42960L15027P43869
36418D57168J36789p28411p06068j38287M1647L3833M87143R57321O15001j74486
$$ plain form
36408 981650 493081 26194 -743894 -1715512 -1870989 -671202 934866 1695400 1533319
36399 1533319 1129251 779416 489291 569687 1239642 2016126 2222430 1796511 1097731 381956
36389 381956 -56819 150494 756655 835367 87218 -486291 -9316 872761 994052 440922
36379 440922 184651 379141 259518 -423435 -1009718 -996294 -575462 -100128 211930 153640
36369 153640 -136626 31708 933617 1623556 1142092 143862 13258 621263 546705 -446540
36359 -446540 -923951 -223909 343989 -387911 -1635170 -2101387 -1995937 -2286953 -2862806
36350 -2862806 -2873435 -2341499 -2044988 -2069328 -1742999 -949643 -382031 -392046 -531371 -426475
36340 -426475 -338038 -599069 -1065568 -1348116 -1207440 -643483 64815 423721 171040 -398427
$$ packed form
36408I81650m88569m66887p70088r71618j55477J199787J606068P60534j62081
36399A533319m04068l49835k90125Q0396O69955P76484K06304m25919o98780p15775
36389C81956m38775K07313O06161P8712p48149n73509M76975Q82077J21291n53130
36379D40922k56271J94490j19623o82953n86283J3424M20832M75334L12058n8290
36369A53640k90266J68334R01909O89939m81464r98230j30604O08005p4558r93245
36359d46540m77411P00042N67898p31900j247259m66217J05450k91016n75853
36350b862806j0629N31936K96511k4340L26329P93356N67612j0015j39325J04896
36340d26475Q8437k61031m66499k82548J40676N63957P08298L58906k52681n69467
$$ plain form
36330 -398427 -839672 -1088390 -1232475 -1081116 -528973 -91779 -362908 -1023742 -1127615 -420042
36320 -420042 319063 396797 18375 -262609 -323573 -372349 -512293 -743609 -1085870 -1455266
36310 -1455266 -1701687 -1911560 -2305879 -2693904 -2513662 -1696038 -984287 -940856 -1064298 -515391
36300 -515391 528049 970311 270950 -858152 -1457208 -1435055 -1265371 -1033905 -456058
36291 -456058 288192 464509 -216480 -1030425 -1096741 -488279 -556 -8271 -137860 -73629
36281 -73629 -41781 -220151 -213997 373929 1147634 1260491 517886 -330242 -506940 -71324
36271 -71324 325850 320799 201235 423266 999849 1524205 1698633 1584270 1285887 727917
36261 727917 -2669 -412439 -168075 287371 276841 -27368 215119 1137141 1771527 1394920
$$ packed form
36330c98427m41245k48718j44085J51359N52143M37194k71129o60834j03873P07573
36320d20042P39105P7734l78422k80984o0964m8776j39944k31316l42261l69396
36310a455266k46421k09873l94319l88025J80242Q17624P11751M3431j23442N48907
36300e15391J043440M42262o99361j129102n99056K2153J69684K31466N77847
36291d56058P44250J76317o80989q13945o6316O08462M87723p715j29589O4231
36281g3629L1848j78370O154N87926P73705J12857p42605q48128j76698M35616
36271g1324L97174n051j19564K22031N76583N24356J74428j14363k98383n57970
36261G27917p30586m09770K44364M55446j0530l04209K42487R22022O34386l76607
$$ plain form
36251 1394920 510770 -61238 -391853 -979555 -1607128 -1594810 -975832 -537292 -701964 -1100668
36241 -1100668 -1292011 -1260194 -1138374 -1012360 -1055049 -1360416 -1677605 -1807086 -2089105 -2827677
36231 -2827677 -3414667 -2944230 -1713761 -1092541 -1631972 -2285955 -1949958 -859759 115510
36222 115510 698472 965424 658235 -290400 -1052333 -762574 163255 548380 198458 155631
36212 155631 1094336 2355302 2910738 2592430 1934287 1338539 919906 839739 1227407 1825221
36202 1825221 2129138 1960682 1651989 1585970 1747140 1843381 1709342 1377415 820245 -68119
36192 -68119 -1118887 -1806086 -1798405 -1416278 -1207452 -1199182 -986873 -503008 -181590 -262527
36182 -262527 -441332 -415824 -291830 -145636 332098 1289138 2155211 2178811 1375878 491543
$$ packed form
36251A394920q84150n72008l30615n87702o27573J2318O18978M38540j64672l98704
36241a100668j91343L1817J21820J26014m2689l05367l17189j29481k82019p38572
36231b827677n86990M70437J230469O21220n39431o53983L35997J090199R75269
36222A15510N82962K66952l07189r48635p61933K89759R25829L85125l49922m2827
36212A55631R38705J260966N55436l18308o58143n95748m18633q0167L87668N97814
36202A825221L03917j68456l08693o6019J61170R6241j34039l31927n57170q88364
36192f8119j050768o87199P681L82127K08826Q270K12309M83865L21418q0937
36182b62527j78805K5508J23994J46194M77734R57040Q66073K3600q02933q84335
$$ plain form
36172 491543 109905 200112 453677 634959 582626 245310 -183967 -413214 -389718 -318221
36162 -318221 -354995 -467552 -563505 -563898 -382520 -31907 263197 238073 -111039 -504119 -634545
36151 -634545 -400830 7489 187914 -143796 -788389 -1204582 -1135854 -891141 -863110 -1019220
36141 -1019220 -1078555 -947043 -702777 -334095 217492 842875 1283796 1288585 726316 -194419
36131 -194419 -805632 -543326 200579 324875 -570542 -1572608 -1679220 -1055781 -490044
36122 -490044 -176900 141443 262091 -263730 -1155074 -1566746 -1239552 -689816 -254665 233197
36112 233197 756725 935377 725140 576219 696286 801407 730605 640423 495629 105042
36102 105042 -239768 3238 606897 715296 242957 101246 622019 862051 150511 -707237
$$ packed form
36172D91543l81638R0207K53565J81282n2333l37316m29277k29247K3496P1497
36162c18221l6774j12557r5953l93J81378L50613K95104k5124l49112l93080j30426
36151f34545K33715M08319J80425l31710o44593m16193O8728K44713K8031j56110
36141a019220n9335J31512K44266L68682N51587O25383M40921M789n62269r20735
36131a94419o11213K62306P43905J24296q95417j002066j06612O23439N65737
36122d90044L13144L18343J20648n25821q91344m11672L27194N49736M35151M87862
36112B33197N23528J78652k10237j48921J20067J05121p0802r0182j44794l90587
36102A05042l44810K43006O03659J08399m72339j41711N20773K40032p11540q57748
$$ plain form
36092 -707237 -674515 -66106 148201 -73453 -96481 61865 -131084 -528661 -455608 -18734
36082 -18734 -130609 -1027947 -1726528 -1310002 -71419 960028 1121263 513076 -258302
36073 -258302 -543705 -207620 172669 -42599 -751102 -1318712 -1469295 -1452632 -1377486 -968125
36063 -968125 -107475 835818 1359865 1203070 401997 -645863 -1259450 -1067951 -478404
36054 -478404 -133837 -67302 74547 197490 -67904 -428670 -77688 1019014 1807993 1464705
36044 1464705 336010 -778516 -1614836 -2290616 -2765770 -2940267 -2827447 -2255948 -938259
36035 -938259 738299 1582383 872767 -648267 -1632783 -1631109 -1196499 -860592 -658774 -454354
36025 -454354 -116005 506064 1268522 1561527 975389 -6620 -533566 -491645 -489069 -763187
$$ packed form
36092g07237L2722O08409K14307k21654k3028J58346j92949l97577P3053M36874
36082a8734j11875q97338o98581M16526J238583J031447J61235o08187p71378
36073b58302k85403L36085L80289k15268p08503n67610j50583J6663P5146M09361
36063i68125Q60650R43293N24047j56795q01073j047860o13587J91499N89547
36054d78404L44567O6535J41849J22943k65394l60766L50982J096702P88979l43288
36044A464705j128695j114526q36320o75780m75154j74497J12820N71499J317689
36035i38259J676558Q44084p09616j521034r84516J674M34610L35907K01818K04420
36025d54354L38349O22069P62458K93005n86138r82009n26946M1921K576k74118
$$ plain form
36015 -763187 -740714 112900 1451826 2323282 2094571 1007200 -62509 -402461 -117876
36006 -117876 127826 48572 26071 278795 329709 -150221 -501560 51274 981458 978886
35996 978886 -67043 -711421 -6589 1050336 878822 -500008 -1530852 -1138901 145099
35987 145099 1136880 1410232 1429056 1620319 1748111 1279530 169248 -957614 -1469771
35978 -1469771 -1384957 -1178104 -1107035 -1048107 -928332 -927553 -1176060 -1563739 -1917192 -2064463
35968 -2064463 -1711995 -699710 482749 916798 316592 -476641 -421455 545402 1582674
35959 1582674 1964730 1659864 1053355 502101 171107 38472 -6923 -16736 -19008 -192826
35949 -192826 -710305 -1297551 -1345056 -721353 -101386 -119625 -553264 -803470 -829002 -971838
$$ packed form
36015g63187K2473Q53614J338926Q71456k28711j087371j069709l39952K84585
36006a17876K45702p9254k2501K52724N0914m79930l51339N52834R30184k572
35996I78886j045929o44378P04832J056925j71514j378830j030844L91951J284000
35987A45099R91781K73352J8824J91263J27792m68581j110282j126862n12157
35978a469771Q4814K06853P1069N8928J19775P79k48507l87679l53453j47271
35968b064463L52468J012285J182459M34049o00206p93233N5186R66857J037272
35959A582674L82056l04866o06509n51254l30994j32635m5395r813k272j73818
35949a92826n17479n87246m7505O23703O19967j8239m33639k50206k5532j42836
$$ plain form
35939 -971838 -1105427 -741421 29570 479143 289761 -32611 -46033 9850 -132669 -160168
35929 -160168 178552 319708 -458243 -1827350 -2595547 -2135483 -1052811 -323598 -261673
35920 -261673 -517149 -665133 -511393 -90934 344784 462752 163403 -311172 -662421 -800192
35910 -800192 -780775 -696666 -721929 -1005620 -1343356 -1230174 -527365 160057 165432 -336285
35900 -336285 -593977 -399690 -340477 -763664 -1126245 -845066 -310907 -359221 -946933 -1145920
35890 -1145920 -540189 115912 -14736 -696771 -1082318 -942524 -820204 -1099706 -1524082
35881 -1524082 -1701976 -1622908 -1501725 -1427512 -1322074 -1042490 -482618 185524 405811 -214392
35871 -214392 -1169033 -1372967 -513385 375179 170547 -820892 -1226849 -384141 897667
$$ packed form
35939i71838j33589L64006P70991M49573j89382l22372j3422N5883j42519k7499
35929a60168L38720J41156p77951j369107p68197M60064J082672P29213O1925
35920b61673k55476j47984J53740M20459M35718J17968k99349m74575l51249j37771
35910h00192J9417Q4109k5263k83691l37736J13182P02809O87422N375n01717
35900c36285k57692J94287N9213m23187l62581K81179N34159m8314n87712j98987
35890a145920O05731O56101j30648o82035l85547J39794J22320k79502m24376
35881a524082j77894P9068J21183P4213J05438K79584N59872O68142K20287o20203
35871b14392r54641k03934Q59582Q88564k04632r91439m05957Q42708J281808
$$ plain form
35862 897667 1456353 1062808 298684 -340639 -734178 -811631 -496809 26210 377635 378188
35852 378188 133926 -253550 -754085 -1169928 -1197054 -880800 -712738 -1049376 -1636253 -1918083
35842 -1918083 -1645521 -974652 -173326 486147 707150 408159 -55965 -236886 -155493 -212479
35832 -212479 -534335 -778619 -696003 -529779 -649222 -1057174 -1488035 -1765607 -1809089 -1471651
35822 -1471651 -687701 265252 885264 847779 210128 -692270 -1458262 -1861176 -2001753 -2112174
35812 -2112174 -2152474 -1819709 -1056160 -251546 249279 520971 689962 575716 105184 -273456
35802 -273456 -151415 128157 -22810 -384518 -155740 769336 1568514 1695130 1483751 1249111
35792 1249111 665774 -371519 -1055047 -673326 208536 477631 32139 -340067 -417385
$$ packed form
35862H97667N58686l93545p64124o39323l93539p7453L14822N23019L51425N53
35852C78188k44262l87476n00535m15843k7126L16254J68062l36638n86877k81830
35842a918083K72562O70869Q01326O59473K21003k98991m64124j80921Q1393n6986
35832b12479l21856k44284Q2616J66224j19443m07952m30861k77572m3482L37438
35822a471651P83950R52953O20012l7485o37651r02398p65992m02914j40577j10421
35812b112174m0300L32765P63549Q04614N00825K71692J68991j14246m70532l78640
35802b73456J22041K79572j50967l61708K28778R25076P99178J26616k11379k34640
35792A249111n83337j037293o83528L81721Q81862K69095m45492l72206p7318
$$ plain form
35783 -417385 -775035 -1484651 -1713002 -1061551 -357754 -425185 -777667 -380611 725127 1454030
35773 1454030 1155915 220755 -796073 -1813390 -2747956 -3135073 -2701302 -1851327 -1120792
35764 -1120792 -503331 204984 721736 550321 -208075 -928269 -1328181 -1649604 -1896691
35755 -1896691 -1577602 -527691 575371 977858 726829 329512 -62157 -545465 -855831
35746 -855831 -589180 34920 312031 18474 -369407 -532358 -766243 -1351901 -2029964 -2429263
35736 -2429263 -2539789 -2390722 -1699184 -322650 1217219 2132900 2150830 1546809 602138
35727 602138 -541778 -1564888 -1950135 -1440847 -360494 603844 944028 749593 585685
35718 585685 807543 1068295 801200 106886 -336447 -289288 -253700 -541809 -716030 -376672
$$ packed form
35783d17385l57650p09616k28351O51451P03797o7431l52482L97056J105738P28903
35773A454030k98115r35160j016828j017317r34566l87117M33771Q49975P30535
35764a120792O17461P08315N16752j71415p58396p20194l99912l21423k47087
35755a896691L19089J049911J103062M02487k51029l97317l91669m83308l10366
35746h55831K66651O24100K77111k93557l87881j62951k33885n85658o78063l99299
35736b429263j10526J49067O91538J376534J539869R15681J7930o04021r44671
35727F02138j143916j023110l85247N09288J080353R64338L40184j94435j63908
35718E85685K21858K60752k67095o94314m43333M7159L5588k88109j74221L39358
$$ plain form
35708 -376672 122919 301897 307724 374249 84253 -947958 -2039154 -2062895 -965607 231223
35698 231223 827197 933429 678289 1739 -650052 -532602 157622 278274 -537290 -1117194
35688 -1117194 -388988 1025291 1673010 1161426 358187 88659 427221 1062498 1645174
35679 1645174 1846648 1623812 1362828 1352452 1296715 788170 38822 -381109 -358637 -238161
35669 -238161 -131775 157217 521369 480508 -90855 -653024 -682554 -329135 -120837 -244421
35659 -244421 -416065 -382279 -259976 -265979 -269433 117425 916725 1520248 1367618 772526
35649 772526 649882 1366915 2270534 2500130 1897467 927811 77761 -401943 -469594 -309735
35639 -309735 -178602 -61207 259229 684107 759420 355472 -53390 -67687 113677 161903
$$ packed form
35708c76672M99591J78978N827O6525k89996j032211j091196k3741J097288J196830
35698B31223N95974J06232k55140o76550o51791J17450O90224J20652q15564n79904
35688a117194P28206J414279O47719n11584q03239k69528L38562O35277N82676
35679A645174K01474k22836k60984j0376n5737n08545p49348m19931K2472J20476
35669b38161J06386K88992L64152m0861n71363n62169k9530L53419K08298j23584
35659b44421j71644L3786J22303o003l454L86858P99300O03523j52630n95092
35649G72526j22644P17033R03619K29596o02663r69656q50050m79704o7651J59859
35639c09735J31133J17395L20436M24878P5313m03948m08862j4297J81364M8226
$$ plain form
35629 161903 144955 198014 125203 -213683 -528864 -563086 -498143 -448265 -85390 637552 955649
35618 955649 274374 -768534 -1107706 -772436 -662967 -1066514 -1421179 -1434132 -1367280 -1183393
35608 -1183393 -475780 566334 1119904 943168 731038 948228 1175910 970105 514202
35599 514202 9958 -729761 -1589298 -1881252 -1367817 -800188 -786944 -853148 -398623 89588
35589 89588 -226280 -1025713 -1146877 -301920 525505 531020 77975 -101215 -13700 -168068
35579 -168068 -575157 -608930 67200 881895 998325 380293 -245338 -503912 -847954 -1597425
35569 -1597425 -2137886 -1761494 -857871 -381432 -402626 -210346 263683 317332 -96232 -91176
35559 -91176 591076 999388 595189 236285 643326 1025965 431908 -453017 -260945 898817
$$ packed form
35629A61903j6948N3059p2811l38886l15181l4222O4943M9878L62875P22942L18097
35618I55649o81275j042908l39172L35270J09469m03547l54665j2953O6852J83887
35608a183393P07613J042114N53570j76736k12130K17190K27682k05805m55903
35599E14202n04244p39719q59537k91954N13435N67629J3244o6204M54525M88211
35589H9588l15868p99433j21164Q44957Q27425N515m53045j79190Q7515j54368
35579a68068m07089l3773O76130Q14695J16430o18032o25631k58574l44042p49471
35569a597425n40461L76392R03623M76439k1194J92280M74029N3649m13564N056
35559i1176O82252M08312m04199l58904M07041L82639n94057q84925J92072J159762
$$ plain form
35549 898817 1683606 1580416 1289106 1180189 821774 184582 -41211 277970 284897 -507472
35539 -507472 -1376973 -1476880 -951110 -381336 156150 792151 1175762 856249 84399 -446225
35529 -446225 -569696 -780618 -1329155 -1669672 -1127212 79084 895009 697009 195160
35520 195160 589029 1883890 2714044 2111818 790607 124464 412825 921887 1263570
35511 1263570 1797734 2721252 3591336 3897125 3528112 2636669 1565328 856758 764183
35502 764183 842777 626559 506625 1126674 2050585 2058531 888054 -327901 -637629 -321658
35492 -321658 13887 411693 1006115 1306479 828084 -64221 -643197 -802346 -969148 -1324151
35482 -1324151 -1633859 -1678102 -1450121 -1075785 -761385 -617014 -426030 89048 723792 966774
$$ packed form
35549H98817P84789j03190k91310j08917l58415o37192k25793L19181O927p92369
35539e07472q69501r9907N25770N69774N37486O36001L83611l19513p71850n30624
35529d46225j23471k10922n48537l40517N42460J206296Q15925j98000n01849
35520A95160L93869J294861Q30154o02226j321211o66143K88361N09062L41683
35511A263570N34164R23518Q70084L05789l69013q91443j071341p08570r2575
35502G64183P8594k16218j19934O20049R23911P946j170477j215955l09728L15971
35492c21658L35545L97806N94422L00364m78395q92305n78976j59149j66802l55003
35482a324151l09708m4243K27981L74336L14400J44371J90984N15078O34744K42982
$$ plain form
35472 966774 765292 556975 480377 252428 -38211 155498 847331 1288812 1126267 932125
35462 932125 1112153 1194855 828575 571380 899450 1267865 1051588 642380 625864 628885
35452 628885 147401 -141744 729219 2204953 2687663 1706196 329418 -510438 -803004
35443 -803004 -545875 527501 1930724 2398975 1505295 363013 107976 464514 451988
35434 451988 -111876 -499460 -141256 699896 1205287 782162 -260922 -891428 -525490
35425 -525490 205785 386985 171372 342526 789066 628003 -87480 -150841 835861 1580565
35415 1580565 995761 -124552 -379078 130379 188248 -548515 -1230693 -1318419 -1202003 -1170244
35405 -1170244 -781202 296422 1486582 1882377 1328357 543420 271759 569749 951826
$$ packed form
35472I66774k01482k08317p6598k27949k90639J93709O91833M41481j62545j94142
35462I32125J80028Q2702l66280k57195L28070L68415k16277m09208j6516L021
35452F28885m81484k89145Q70963J475734M82710r81467j376778q39856k92566
35443h03004K57129J073376J403223M68251q93680j142282k55037L56538j2526
35434D51988n63864l87584L58204Q41152N05391m23125j043084o30506L65938
35425e25490P31275J81200k15613J71154M46540j61063p15483o3361R86702P44704
35415A580565n84804j120313k54526N09457N7869p36763o82178q7726J16416L1759
35405a170244L89042J077624J190160L95795n54020p84937k71661K97990L82077
$$ plain form
35396 951826 1072065 1057645 1103777 1009545 480285 -229465 -480397 -115547 343435 506339
35386 506339 577685 769181 810566 427308 -171843 -698368 -1227006 -1790805 -1990649 -1565023
35376 -1565023 -991530 -935948 -1357594 -1683423 -1599212 -1148102 -373433 498084 796611 79657
35366 79657 -1059547 -1567823 -1268117 -940268 -1095811 -1395564 -1364264 -985899 -429420 170667
35356 170667 471995 111540 -597437 -766145 -66725 781800 1033881 876117 884228 1012778
35346 1012778 778676 192306 -167793 -6845 276050 146997 -416980 -948959 -977601 -477612
35336 -477612 19989 -153454 -1064491 -1927118 -1850284 -825218 272085 655118 326587
35327 326587 -228193 -690552 -1016635 -1129993 -852666 -154930 713327 1354801 1405730 727250
$$ packed form
35396I51826J20239j4420M6132r4232n29260p09750k50932L64850M58982J62904
35386E06339P1346J91496M1385l83258n99151n26525n28638n63799j99844M25626
35376a565023N73493N5582m21646l25829Q4211M51110P74669Q71517K98527p16954
35366G9657j139204n08276K99706L27849j55543k99753L1300L78365N56479O00087
35356A70667L01328l60455p08977j68708O99420Q48525K52081j57764Q111J28550
35346A012778k34102n86370l60099J60948K82895j29053n63977n31979k8642M99989
35336d77612M97601j73443r11037q62627P6834J025066J097303L83033l28531
35327C26587n54780m62359l26083j13358K77327O97736Q68257O41474N0929o78480
$$ plain form
35317 727250 -350148 -1085634 -986222 -399645 -61460 -42600 278288 1009154 1274650 561427
35307 561427 -124038 562718 2277401 3274179 2716812 1540350 774517 252024 -418115
35298 -418115 -763680 -300194 412750 651219 769830 1381205 1866513 1119380 -460324
35289 -460324 -1176061 -346920 892907 1350330 1088296 621064 48219 -391470 -22556
35280 -22556 1184523 2104918 1895921 1243864 1318509 2075150 2489591 2034762 1060448 57421
35270 57421 -625642 -619188 105020 916706 1271974 1483678 2014381 2398664 1850377 690229
35260 690229 41054 125619 20862 -716274 -1333535 -1207243 -826125 -841551 -1033160 -965248
35250 -965248 -938876 -1435345 -2137853 -2382001 -2218617 -2161427 -2132984 -1595810 -676031 -208234
$$ packed form
35317G27250j077398p35486R9412N86577L38185J8860L20888P30866K65496p13223
35307E61427o85465O86756J714683R96778n57367j176462p65833n22493o70139
35298d18115l45565M63486P12944K38469J18611O11375M85308p47133j579704
35289d60324p15737Q29141J239827M57423k62034m67232n72845m39689L68914
35280b2556J207079R20395k08997o52057P4645P56641M14441m54829r74314j003027
35270E7421o83063O454P24208Q11686L55268K11704N30703L84283n48287j160148
35260F90229o49175Q4565j04757p37136o17261J26292L81118j5426j91609O7912
35250i65248K6372m96469p02508k44148J63384N7190K8443N37174R19779M67797
$$ plain form
35240 -208234 -451115 -571949 189227 1448520 2234420 2168267 1595419 872770 113338 -467216
35230 -467216 -527031 -76854 382769 419399 162528 54758 249295 455707 334977 -123098
35220 -123098 -621261 -829717 -636593 -244452 -23755 -132459 -269588 -5044 573821 811332
35210 811332 309427 -421514 -522602 93978 650842 589404 223095 35530 -161904 -811132
35200 -811132 -1635237 -1805560 -1128357 -425794 -483619 -1131670 -1714622 -2012938 -2185561 -2129051
35190 -2129051 -1574073 -778740 -475677 -921022 -1467204 -1368018 -681294 -77757 13668 -223046
35180 -223046 -343190 -144404 110758 -87303 -864502 -1551652 -1320894 -372864 74932 -625140
35170 -625140 -1561032 -1533309 -830161 -742242 -1487057 -1786587 -785213 668670 1254465 886443
$$ packed form
35240b08234k42881j20834P61176J259293P85900o6153n72848p22649p59432n80554
35230d67216n9815M50177M59623L6630k56871j07770J94537K06412j20730m58075
35220a23098m98163k08456J93124L92141K20697j08704j37129K64544N78865K37511
35210H11332n01905p30941j01088O16580N56864o1438l66309j87565j97434o49228
35200h11132q24105j70323O77203P02563n7825o48051n82952k98316j72623N6510
35190b129051N54978P95333L03063m45345n46182R9186O86724O03537R1425k36714
35180b23046j20144J98786K55162j98061p77199o87150K30758R48030M47796p00072
35170f25140r35892K7723P03148Q7919p44815k99530J001374J453883N85795l68022
$$ plain form
35160 886443 449612 410412 503582 456884 251074 -154043 -660974 -739267 36048 1210910
35150 1210910 1844229 1640223 1087023 531486 -147624 -851734 -1024379 -453231 246764
35141 246764 342621 -182653 -769394 -923127 -545475 -2936 13874 -813172 -1730745 -1543702
35131 -1543702 -233834 769510 454673 -356941 -274760 558232 765050 -40283 -592505
35122 -592505 100694 1224592 1296729 201087 -794100 -793955 -176645 352275 805551 1535213
35112 1535213 2304416 2453879 1935595 1503596 1617308 1715161 1093574 126178 -136020 485652
35102 485652 945835 425544 -568656 -1048978 -951148 -1013203 -1520328 -1899646 -1602197 -828873
35092 -828873 -212433 -135942 -501363 -905716 -941877 -532919 -42709 92689 -151880 -406451
$$ packed form
35160H86443m36831l9200R3170m6698k05810m05117n06931p8293P75315J174862
35150A210910O33319k04006n53200n55537o79110p04110j72645N71148O99995
35141B46764R5857n25274n86741j53733L77652N42539J6810q27046r17573J87043
35131a543702J309868J003344l14837q11614Q2181Q32992K06818q05333n52222
35122e92505O93199J123898P2137j095642r95187J45O17310N28920M53276P29662
35112A535213P69203J49463n18284m31999J13712R7853o21587r67396k62198O21672
35102D85652M60183n20291r94200m80322R7830o2055n07125l79318K97449P73324
35092h28873O16440P6491l65421m04353l6161M08958M90210J35398k44569k54571
$$ plain form
35082 -406451 -335285 106058 716923 1135166 1009520 374340 -220904 -211734 412537 1203987
35072 1203987 1713624 1641955 901198 -33467 -185123 862206 2150438 2303693 1216378
35063 1216378 56103 -368221 -370785 -415261 -353037 -45471 88168 -286866 -851374 -1207775
35053 -1207775 -1428993 -1563469 -1280062 -590521 -200605 -384439 -213465 1111229 2718074
35044 2718074 3013152 1842999 506438 -226327 -787311 -1405883 -1421422 -545563 307352
35035 307352 214093 -512680 -999701 -1085088 -1141902 -1128944 -671695 120948 653006 618823
35025 618823 256127 -139111 -504325 -833842 -1072691 -1173787 -1004670 -318715 863307
35016 863307 1951874 2239393 1659025 822167 308534 165006 100547 -76922 -298328 -379410
$$ packed form
35082d06451P1166M41343O10865M18243j25646o35180n95244R170O24271P91450
35072A203987N09637p1669p40757r34665j51656J047329J288232J53255j087315
35063A216378j160275m24324k564m4476O2224L07566J33639l75034n64508l56401
35053a207775k21218j34476K83407O89541L89916j83834J70974J324694J606845
35044B718074K95078j170153j336561p32765n60984o18572j5539Q75859Q52915
35035C07352r3259p26773m87021q5387n6814J2958M57249P92643N32058l4183
35025F18823l62696l95238l65214l29517k38849j01096J69117O85955J182022
35016H63307J088567K87519n80368q36858n13633j43528o4459j77469k21406q1082
$$ plain form
35006 -379410 -280743 -241473 -567885 -1226395 -1760650 -1698485 -956059 155441 1128883 1476718
34996 1476718 1084562 468934 343094 748364 976142 585223 70898 120456 569517 649831
34986 649831 78800 -666133 -1093243 -1173972 -1046143 -760467 -483943 -543092 -1023607 -1569597
34976 -1569597 -1767321 -1574392 -1269876 -1142147 -1312401 -1704276 -2055255 -2024560 -1409726 -339714
34966 -339714 704212 1171410 956114 583990 590813 753810 411374 -395742 -790242 -410051
34956 -410051 -149767 -856230 -1890465 -1961303 -1049962 -395355 -616811 -1002080 -915036 -815914
34946 -815914 -1285004 -1846817 -1543402 -283944 994750 1343770 638459 -405038 -878824
34937 -878824 -615662 -477230 -1240581 -2272895 -2155833 -793167 166553 -410737 -1476062
$$ packed form
35006c79410R8667L9270l26412o58510n34255O2165P42426J111500R73442L47835
34996A476718l92156o15628j25840M05270K27778l90919n14325M9558M49061Q0314
34986F49831n71031p44933m27110q0729J27829K85676K76524n9149m80515n45990
34976a569597j97724J92929L04516J27729j70254l91875l50979L0695O14834J070012
34966c39714J043926M67198k15296l72124O823J62997l42436q07116l94500L80191
34956d10051K60284p06463j034235p0838R11341O54607k21456l85269Q7044R9122
34946h15914m69090n61813L03415J259458J278694L49020p05311j043497m73786
34937h78824K63162J38432p63351j032314J17062J362666R59720n77290j065325
$$ plain form
34928 -1476062 -1342568 -132118 533887 -90782 -1055976 -1258463 -725477 -143374 35640
34919 35640 -285325 -959079 -1515874 -1449978 -815088 -179265 84716 77631 -33869 -206936
34909 -206936 -284711 -92890 156277 51378 -362277 -595317 -413473 -28187 375671 703082
34899 703082 595814 -206225 -1087150 -1030166 -110784 407950 -129505 -830947 -703129 -98225
34889 -98225 122293 28385 140800 149612 -584673 -1557949 -1524892 -419015 427745 291901
34879 291901 67430 674865 1518082 1432745 480324 -222961 -162496 36908 -274306 -898153
34869 -898153 -1240286 -1090619 -667292 -208111 196208 482530 513728 130781 -634957 -1354789
34859 -1354789 -1407778 -647700 256664 486343 40122 -341391 -240999 -73084 -316699 -717468
$$ packed form
34928a476062J33494J210450O66005o24669r65194k02487N32986N82103J79014
34919C5640l20965o73754n56795O5896O34890O35823K63981p085j11500j73067
34909b06936p7775J91821K49167j04899m13655k33040J81844L85286M03858L27411
34899G03082j07268q02039q80925N6984R19382N18734n37455p01442J27818O04904
34889i8225K20518r3908J12415Q812p34285r73276L3057J105877Q46760j35844
34879B91901k24471O07435Q43217q5337r52421p03285O0465J99404l11214o23847
34869h98153l42133J49667M23327M59181M04319K86322L1198l82947p65738p19832
34859a354789n2989P60078R04364K29679m46221l81513J00392J67915k43615m00769
$$ plain form
34849 -717468 -695773 -249403 82525 31530 -153907 -258743 -361647 -449791 -304327 28833
34839 28833 172115 119866 479045 1529797 2492248 2375585 1309552 372620 233689 634684
34829 634684 1138698 1607227 1819993 1400180 427879 -509781 -1176142 -1905307 -2600957 -2369683
34819 -2369683 -907408 446278 116015 -1548770 -2621927 -2093916 -939937 -456010 -583512
34810 -583512 -508255 -125134 -10077 -283295 -369278 85027 691513 901528 678790 360283
34800 360283 114196 -185365 -599944 -848065 -511459 452337 1483717 1862184 1416533
34791 1416533 664680 198559 107108 105249 -939 -212727 -521739 -864703 -971424 -631570
34781 -631570 -152123 -162056 -778366 -1288100 -952047 72592 913189 959897 374170 -263556
$$ packed form
34849g17468K1695M46370L31928n0995j85437j04836j02904q8144J45464L33160
34839B8833J43282n2249L59179J050752R62451j16663j066033r36932j38931M00995
34829F34684N04014M68529K12766m19813r72301r37660o66361p29165o95650K31274
34819b369683J462275J353686l30263j664785j073157N28011J153979M83927j27502
34810e83512P5257L83121J15057k73218q5983M54305O06486K10015k22738l18507
34800C60283k46087k99561m14579k48121L36606R63796J031380L78467m45651
34791A416533p51853m66121r1451j859j06188k11788l09012l42964j06721L39854
34781f31570M79447r933o16310n09734L36053J024639Q40597M6708n85727o37726
$$ plain form
34771 -263556 -465571 -59520 682487 1087343 680309 -117657 -326362 326454 939997 641271
34761 641271 -186207 -492179 -104576 106288 -363500 -869774 -593840 280666 854863 658591
34751 658591 55652 -320696 -145960 502673 1294401 1850369 1989985 1821281 1559788 1331291
34741 1331291 1160988 1013754 826842 646553 664479 879079 862066 305843 -271187 3279
34731 3279 1067859 1809430 1516219 732752 230746 -105814 -670513 -1085886 -718109 158375
34721 158375 694110 755493 939798 1422934 1751275 1756532 1702763 1465344 600681 -555717
34711 -555717 -923003 -222670 487240 388662 116512 657989 1764373 2328161 1899303 1020966
34701 1020966 320063 -42798 -174793 -270043 -533609 -906968 -1046234 -849007 -668004 -691773
$$ packed form
34771b63556k02015M06051P42007M04856m07034p97966k08705O52816O13543k98726
34761F41271q27478l05972L87603K10864m69788n06274K75934Q74506N74197j96272
34751F58591o02939l76348J74736O48633P91728N55968J39616j68704k61493k28497
34741A331291j70303j47234j86912j80289J7926K14600j7013n56223n77030K74466
34731C279J064580P41571k93211p83467n02006l36560n64699m15373L67777Q76484
34721A58375N35735O1383J84305M83136L28341N257n3769k37419q64663j156398
34711e55717l67286P00333P09910r8578k72150N41477J106384N63788m28858q78337
34701A020966p00903l62861j31995r5250k63566l73359j39266J97227J81003k3769
$$ [...]
##END NTUPLES=NMR SPECTRUM
##END=
