##TITLE=31Pdec_BAU-090119
 CDCl3, 24 sc
 14.1.2019
##JCAMPDX= 6.0         $$ Bruker NMR JCAMP-DX V2.0
##DATA TYPE= NMR SPECTRUM
##DATA CLASS= NTUPLES
##ORIGIN= UXNMR, Bruker Analytische Messtechnik GmbH
##OWNER= root
$$ XWIN-NMR		Version 3.5
$$ Mon Jan 14 15:02:58 2019 Russian Standard Time (UT+4h)  she@DPX200
##.OBSERVE FREQUENCY= 81.013821
##.OBSERVE NUCLEUS= ^31P
##.ACQUISITION MODE= SIMULTANEOUS
##.ACQUISITION SCHEME= undefined
##.AVERAGES= 24
##.DIGITISER RES= 17
##SPECTROMETER/DATA SYSTEM= spect
##.PULSE SEQUENCE= zgpg30
##.SOLVENT NAME= CDCl3
##.SHIFT REFERENCE= (INTERNAL, CDCl3, 0, 182.463)
##AUDIT TRAIL= $$ (NUMBER, WHEN, WHO, WHERE, WHAT)
$$ ##TITLE= Audit trail, XWIN-NMR		Version 3.5
$$ ##JCAMPDX= 5.01
$$ ##ORIGIN= Bruker BioSpin GmbH
$$ ##OWNER= she
$$ F:/spectra/data/she/nmr/P31/1/pdata/1/auditp.txt
$$ ##AUDIT TRAIL=  $$ (NUMBER, WHEN, WHO, WHERE, WHAT)
(   1,<2019-01-14 15:02:07.09 +0400>,<she>,<DPX200>,
      <created by zg, POWCHK disabled, PULCHK disabled
       configuration hash MD5:
       00 E9 B6 7A A2 85 ED C7 34 08 36 98 17 FE 4E 26
       data hash MD5: 32K
       8B 97 B9 E9 04 8B F4 31 B3 DF 17 B2 83 C8 D5 2F>)
(   2,<2019-01-14 15:02:09.96 +0400>,<she>,<DPX200>,
      <Start of raw data processing
       efp BC_mod = 2 LB = 1 FT_mod = 6 PKNL = 1 PHC0 = -1480.418 PHC1 = 114.599 SI = 64K 
       data hash MD5: 64K
       1A 83 4B 6B 3C 7C A0 5C 2C 72 90 2C BD BE F3 38>)
(   3,<2019-01-14 15:02:22.65 +0400>,<she>,<DPX200>,
      <pk PHC0 = 9.311401 PHC1 = 0 
       data hash MD5: 64K
       D6 8B 08 73 A3 31 D6 F7 29 10 52 15 EF 21 DF 11>)
(   4,<2019-01-14 15:02:26.42 +0400>,<she>,<DPX200>,
      <abs ABSG = 5 
       data hash MD5: 64K
       B6 4A E0 3F 2F 3A 9B 98 21 B2 C7 18 1C D2 83 B6>)
$$ ##END=
$$ 
$$ hash MD5
$$ 78 56 31 79 6C 44 EF EE F1 28 3D FB 6A 74 07 58
##$RELAX= 
##$RELAX= 
##$RELAX= 
##$RELAX= 
##$RELAX= 
##$RELAX= 
##$RELAX= 
##$RELAX= 
$$ Bruker specific parameters
$$ --------------------------
##$DU= <F:/spectra>
##$EXPNO= 1
##$NAME= <P31>
##$PROCNO= 1
##$TYPE= <nmr>
##$USER= <she>
##$AMP= (0..31)
100 100 100 100 100 100 100 100 100 100 100 100 100 100 100 100 100 100 
100 100 100 100 100 100 100 100 100 100 100 100 100 100 
##$AQSEQ= 0
##$AQ_mod= 1
##$AUNM= <au_zg>
##$AUTOPOS= <>
##$BF1= 81.014009
##$BF2= 200.13
##$BF3= 200.13
##$BF4= 200.13
##$BF5= 200.13
##$BF6= 200.13
##$BF7= 200.13
##$BF8= 200.13
##$BYTORDA= 1
##$CFDGTYP= 0
##$CFRGTYP= 5
##$CHEMSTR= <none>
##$CNST= (0..31)
1 1 145 1 1 1 1 1 1 1 1 1 1 1 1 1 1 1 1 1 1 1 1 1 1 1 1 1 1 1 1 1 
##$CPDPRG= <waltz16>
##$CPDPRG1= <>
##$CPDPRG2= <waltz16>
##$CPDPRG3= <>
##$CPDPRG4= <mlev>
##$CPDPRG5= <mlev>
##$CPDPRG6= <mlev>
##$CPDPRG7= <mlev>
##$CPDPRG8= <mlev>
##$CPDPRGB= <>
##$CPDPRGT= <>
##$D= (0..31)
0 1 0 0 0 0 0 0 0 0 0 0.03 2e-05 3e-06 0 0 0 0 0 0 0 0 0 0 0 0 0 0 0 0 
0 0 
##$DATE= 1547463726
##$DBL= (0..7)
120 120 120 11 120 120 24 19 
##$DBP= (0..7)
150 150 150 150 150 150 150 150 
##$DBP07= 0
##$DBPNAM0= <>
##$DBPNAM1= <>
##$DBPNAM2= <>
$$ [...]
##$SUBNAM3= <"">
##$SUBNAM4= <"">
##$SUBNAM5= <"">
##$SUBNAM6= <"">
##$SUBNAM7= <"">
##$SUBNAM8= <"">
##$SUBNAM9= <"">
##$SW= 369.568048894756
##$SWIBOX= (0..15)
0 1 3 0 0 0 0 0 0 0 0 0 0 0 0 0 
##$SW_h= 29940.119760479
##$TD= 32768
##$TD0= 1
##$TE= 0
##$TE2= 300
##$TE3= 300
##$TEG= 300
##$TL= (0..7)
0 120 53 12 22 120 120 120 
##$TP= (0..7)
150 150 150 150 150 150 150 150 
##$TP07= 0
##$TPNAME0= <>
##$TPNAME1= <>
##$TPNAME2= <>
##$TPNAME3= <>
##$TPNAME4= <>
##$TPNAME5= <>
##$TPNAME6= <>
##$TPNAME7= <>
##$TPOAL= (0..7)
0.5 0.5 0.5 0.5 0.5 0.5 0.5 0.5 
##$TPOFFS= (0..7)
0 0 0 0 0 0 0 0 
##$TUNHIN= 0
##$TUNHOUT= 0
##$TUNXOUT= 0
##$USERA1= <user>
##$USERA2= <user>
##$USERA3= <user>
##$USERA4= <user>
##$USERA5= <user>
##$V9= 5
##$VALIST= <valist>
##$VCLIST= <CCCCCCCCCCCCCCC>
##$VD= 0
##$VDLIST= <DDDDDDDDDDDDDDD>
##$VPLIST= <PPPPPPPPPPPPPPP>
##$VTLIST= <TTTTTTTTTTTTTTT>
##$WBST= 1024
##$WBSW= 4
##$XGAIN= (0..3)
0 0 0 0 
##$XL= 0
##$YL= 0
##$YMAX_a= 25556
##$YMIN_a= -25186
##$ZGOPTNS= <>
##$ZL1= 120
##$ZL2= 120
##$ZL3= 120
##$ZL4= 120
##$ABSF1= 182.463
##$ABSF2= -187.1042
##$ABSG= 5
##$ABSL= 3
##$ALPHA= 0
##$AQORDER= 0
##$ASSFAC= 0
##$ASSFACI= 0
##$ASSFACX= 0
##$ASSWID= 0
##$AUNMP= <proc_1d>
##$AZFE= 0.1
##$AZFW= 0.5
##$BCFW= 0
##$BC_mod= 2
##$BYTORDP= 0
##$COROFFS= 0
##$CY= -3
##$DATMOD= 1
##$DC= 0
##$DFILT= <>
##$DTYPP= 0
##$F1P= 0
##$F2P= 0
##$FCOR= 1
##$FTSIZE= 65536
##$FT_mod= 6
##$GAMMA= 0
##$GB= 0
##$INTBC= 1
##$INTSCL= 5.30512e-09
##$ISEN= 30
##$LB= 1
##$LEV0= 0
##$LPBIN= 0
##$MAXI= 10000
##$MC2= 0
##$MEAN= 0
##$ME_mod= 0
##$MI= 50
##$NCOEF= 0
##$NC_proc= -4
##$NLEV= 6
##$NOISF1= 182.463
##$NOISF2= 159.3651
##$NSP= 0
##$NTH_PI= 0
##$NZP= 0
##$OFFSET= 182.463
##$PC= 4
##$PHC0= -1471.107
##$PHC1= 114.599
##$PH_mod= 1
##$PKNL= yes
##$PPARMOD= 0
##$PSCAL= 0
##$PSIGN= 0
##$REVERSE= no
##$SF= 81.0140089999434
##$SI= 65536
##$SIGF1= 159.3651
##$SIGF2= -187.1042
##$SINO= 113.3802
##$SIOLD= 16384
##$SREGLST= <1H.CDCl3>
##$SSB= 0
##$STSI= 65536
##$STSR= 0
##$SW_p= 29940.119760479
##$SYMM= 0
##$S_DEV= 0
##$TDeff= 32768
##$TDoff= 0
##$TI= <>
##$TILT= no
##$TM1= 0
##$TM2= 0
##$TOPLEV= 0
##$USERP1= <user>
##$USERP2= <user>
##$USERP3= <user>
##$USERP4= <user>
##$USERP5= <user>
##$WDW= 1
##$XDIM= 65536
##$YMAX_p= 322197848
##$YMIN_p= -5701309
$$ End of Bruker specific parameters
$$ ---------------------------------
##NTUPLES= NMR SPECTRUM
##VAR_NAME=  FREQUENCY,     SPECTRUM/REAL,   SPECTRUM/IMAG
##SYMBOL=    X,             R,               I
##VAR_TYPE=  INDEPENDENT,   DEPENDENT,       DEPENDENT
##VAR_FORM=  AFFN,          ASDF,            ASDF
##VAR_DIM=   65536,         65536,           65536
##UNITS=     HZ,            ARBITRARY UNITS, ARBITRARY UNITS
##FACTOR=    0.456856943014862, 1,           1
##FIRST=     14782.0589164792, 0,            0
##LAST=      -15158.0608439998, 0,           0
##MIN=       -15158.0608439998, -5701309,    0
##MAX=       14782.0589164792, 322197848,    0
$$ Real data points
##PAGE= N=1
##DATA TABLE= (X++(R..R)), XYDATA
$$ [...]
40897a057883K94016K81511J9673j04547N7761K49339K06317q425j41970o0142
40887b64350J56598L23392K95217O2534k41515m26326l50204j1650L78728M89207
40877D11631K09066j35386j46222P9636Q2605k16667l54170r4780J31030n7099
40867i0356l06139j22409K30833J51181k15693j58277L47461M82594p3395n22659
40857b76859j69355M68183M57128j41379m47409r6220L62898L70766K1011k78209
40847B70555l16897j26781J30404K24100P9416n1382P7663K64778J18435k90114
40837C80177m69597k26734J13738K77668L46632L59211J24571l12480n02148k32061
40827a41023P2749j5491k57318j58331K45859N02870M27089J93660p3669l28247
$$ y = [-1057883, -763867, -482356, -462683, -567230, -509469, -260130, -53813, -62238, -204208, -264350, -107752, 215640, 510857, 573391, 331876, -94450, -444654, -456304, -77576, 411631, 620697, 485311, 339089, 418725, 501330, 284663, -69507, -164287, -33257, -90356, -396495, -518904, -288071, -136890, -352583, -510860, -163399, 319195, 245800, -276859, -446214, 21969, 479097, 337718, -109691, -205911, 156987, 527753, 548764, 270555, -46342, -173123, -42719, 181381, 260797, 209415, 287078, 551856, 670291, 380177, -89420, -316154, -202416, 75252, 421884, 781095, 905666, 593186, 91038, -141023, -68274, -83765, -341083, -499414, -253555, 249315, 676404, 870064, 796395, 468148]
40817D68148l68051q3554J79857K9495l04913k72143J09424K99469J53669P3557
40807B84958J60173J6980l65945l64384K11139N85503J65539m70776m71455j7359
40797b65627J29359o7690m4769J95280R4756l20894l51254J72104N35770K97011
40787C74046p6537j11341p0528k79069m10141p4652M13166N08948K73907J19393
40777F67192N6748j69050m55728m79394k82920j55625p6859J53974L68751K16408
40767a56503j70348k96491q1572P8214M6228J15386L35538L14549p1061l46772
40757b32832j49085K21630L16462J80539Q5108r244k63295m98951m01115l6769
40747g87552K33031K61479J86702J01605P328O844J77439L04857J20680k10798
$$ y = [468148, 100097, 16543, 196400, 225895, -79018, -351161, -241737, 57732, 211401, 284958, 445131, 462111, 96166, -268218, -57079, 528424, 693963, 223187, -248268, -265627, -136268, -203958, -248727, -53447, 41309, -279585, -630839, -458735, 77035, 374046, 297509, 186168, 115640, -163429, -573570, -648222, -235056, 273892, 547799, 667192, 723940, 554890, 99162, -380232, -663152, -818777, -895636, -741662, -372911, -156503, -326851, -623342, -704914, -626700, -580472, -465086, -129548, 185001, 113940, -232832, -381917, -160287, 156175, 336714, 421822, 412578, 149283, -349668, -750783, -787552, -554521, -293042, -106340, -4735, 2593, 9437, 186876, 491733, 612413, 401615]
40737D01615k30148J50834M96543M53473J48792j47554l90306n71406n00701r1371
40727b80229L54232M65300K68142M6573j11732k91032l83181j66799K29326L48315
40717D78915K8148l25961k76804J01112M11297M38678K42292o0121l50162m78443
40707B08951l97559k36282r5710P1837K39316K13509k497n0028K34825M02415
40697E88777J234o19887p15076k22889K17212K97318L41960M75016L13550j87122
40687D90093l83882M0745M14389P8163n32009n70670q9554J90940J01099J00156
40677a60530K78424K06580j71501l43072r3976J65905J52523J04044J88042J60105
40667D86544r2535k58163j67811j05243k27557k23901Q2017L21051J88634k9674
$$ y = [401615, 171467, 322301, 818844, 1272317, 1421109, 1273555, 883249, 311843, -188858, -280229, 74003, 539303, 807445, 854018, 742286, 451254, 68073, -98726, 130600, 478915, 507063, 181102, -95702, 5410, 416707, 855385, 1097677, 1037556, 687394, 208951, -188608, -424890, -520600, -448763, -209447, 4062, 1565, -48463, 186362, 588777, 590011, -29876, -744952, -967841, -750629, -453311, -111351, 363665, 677215, 490093, 106211, 146956, 561345, 639508, 107499, -463171, -552725, -361785, -260686, -160530, 117894, 324474, 152973, -190099, -284075, -118170, 34353, 138397, 326439, 486544, 394009, 135846, -31965, -137208, -364765, -588666, -506649, -185598, 3036, -26638]
40657b6638K889Q0992r1922k96338k06198k4741r1695j72501J72942P13778P57891
40646H18459J88053l64313m19322j49588Q5878J74665J08924j06375k67447j21180
40636e2246J74326J55982k42702n22571l37740K6344J44370N6989O4854J86948
40626c45446J85403J554j48141r2565Q8437J97351J46200L5972L4865J54337J89473
40615D47440j5372k97027l47986j43810K2173k8758j14892J6266L23180N22153
40605C83367M12827P6965j88854j39072J39652K69674L9023k79439k86512m3630
40595C84001K0335k25735m20445k76775J4065J21369J4722j35685k28749j92543
40585i25440N7507L78494L83168l6810m05164k36411K60974M60777J93053j01565
$$ y = [-26638, -23749, 57243, -34679, -331017, -537215, -561956, -653651, -826152, -653210, 60568, 818459, 1006512, 642199, 222877, 73289, 159167, 333832, 442756, 336381, 68934, -52246, 122080, 278062, 35360, -487211, -824951, -798607, -654237, -597248, -532394, -345446, -160043, -158489, -306630, -399195, -310758, -113407, 32793, 68765, 103630, 257967, 447440, 432068, 135041, -212945, -356755, -334582, -363340, -478232, -461966, -138786, 383367, 796194, 873159, 684305, 545233, 684885, 954559, 993582, 714143, 427631, 384001, 404336, 178601, -241844, -518619, -504554, -383185, -368463, -504148, -732897, -925440, -867933, -489439, -106271, -143081, -548245, -784656, -523682, -62905, 130148, 28583]
40575B8583r2112J8951o8913k71624l10702j37468Q2389K53073L82199M18828
40565C03204K79219J9306j85671k45855k19393j66112o3802R3104K20647K42370
40555B77017J90169J31111M1439j51364m12340n82183n44635l40267q7885J28881
40545a350057K57046K50541J35756L7599M9249J18521J38742R4251L4270j7943
40535b52025k6514Q2108K57032K57079k8378k93890j62130K24718L35974L3979
40525D27953j99216j1572K61637J40748k34262l54964j56780m0562j33462r0850
40515c91330K42910M89842L24895N348m0931J28745J29654j06770k70977k10937
40505C00449j24358j49460j19117J13989L73674L93995J89485j1477r2584j17141
$$ y = [28583, -63529, -44578, -113491, -385115, -695817, -833285, -750896, -497823, -115624, 303204, 582423, 601729, 416058, 170203, -49190, -215302, -279104, -186000, 34647, 277017, 467186, 598297, 639736, 488372, 76032, -506151, -1050786, -1391053, -1478938, -1350057, -1093011, -842470, -706714, -669115, -619866, -501345, -362603, -268352, -234082, -252025, -278539, -196431, 60601, 317680, 289302, -4588, -166718, 58000, 393974, 427953, 228737, 217165, 478802, 619550, 385288, 30324, -126456, -167018, -300480, -391330, -148420, 341422, 666317, 671665, 630734, 759479, 889133, 782363, 511386, 300449, 176091, 26631, -92486, 21503, 395177, 789172, 978657, 967180, 874596, 757455]
40495G57455j46070j80066k43756l40764l35953p8397L16834M92153K54018j65433
40485C30021l61452j91644J37199L43148L13577J15444j08475k28014j95686p9318
40475G4800M473J4852K2168R6141J86918J79932Q3057O4789K00436K55829n3642
40464A129753n55366o63966j42737M34601L46614k94002o77744m07991M0979J28744
40454f61115r414L0478K02449J88725K6641J9432J48027J08519q2518n2932K58489
40443A76781M01014R4525l02478l07843O332J90604Q1668o0651j6009J02267O9368
40432D35578j24684k68215j86938M8681J93221J08662p3775j39458p9291o4797
40422a51016j59669k17559j02745J14984K36539J30208j46915l50943k33859J53399
$$ y = [757455, 611385, 431319, 187563, -153201, -489154, -567551, -250717, 241436, 495454, 330021, -31431, -223075, -85876, 257272, 570849, 686293, 577818, 349804, 154118, 74800, 79273, 94125, 116293, 212434, 399352, 579284, 662341, 727130, 927566, 1183395, 1129753, 574387, -89579, -232316, 202285, 548899, 254897, -422847, -830838, -789859, -661115, -670529, -640051, -437602, -248877, -222236, -202804, -54777, 53742, -28776, -81708, 176781, 577795, 672320, 369842, 61999, 68331, 258935, 340603, 279952, 263943, 366210, 435578, 310894, 42679, -144259, -95578, 97643, 206305, 132530, -6928, -86219, -151016, -310685, -528244, -630989, -516005, -279466, -149258, -296173, -647116, -880975, -727576]
40412g27576M18927K67306r4155k10176J8303K57295K48969Q7112n7375j63363
40402D5267k04088o8288J96122L06441J00563k12280l10636j20246J89458L98908
40392C21221L46669M0060k60785k74331p3636Q215j09552j56097q769Q4525m0735
40381a23215j61478o4906Q4044N5347o6913j10803j33443k06627j76065L0519
40371h73540J38520o1778l05156k45384j821J08202J25854K62671L86640K32754
40361b33038m2359p7132M6831l9661k68828j99414J88856M07932K65679J34604
40351A83470K47480L24097J47930l7180j4323J4825j30876k26048p7089M4022
40341D76308j60959m45093l40400J37534N26792N44241L13100M8143j60195k77700
$$ y = [-727576, -308649, -41343, -135498, -345674, -327371, -70076, 178893, 266005, 208630, 45267, -158821, -227109, -30987, 275454, 376017, 163737, -146899, -267145, -77687, 321221, 667890, 707950, 447165, 172834, 99198, 107413, -2139, -158236, -167005, -82480, -123215, -284693, -349599, -265555, -210208, -277121, -387924, -521367, -727994, -904059, -873540, -735020, -796798, -1101954, -1347338, -1349159, -1240957, -1115103, -852432, -465792, -233038, -275397, -352529, -305698, -345359, -614187, -813601, -624745, -216813, 48866, 183470, 430950, 755047, 902977, 865797, 851474, 866299, 735423, 509375, 432286, 476308, 315349, -129744, -470144, -332610, 194182, 738423, 1051523, 1099666, 939471, 661771]
40331F61771k96583k60534j64048Q0968M23872N71654L23616j11940l59515l26016
40321E43245j81437j1935K13325L79382K52785j54825m94283m77373k16065l7848
40311a85029o2496j10113j0947J43521J50788J5381m8468N3640J50624Q8065l0482
40300A54484n5884o7426j81903k38197p429L56867M53421K19569O009J7087O7892
40289G24490M355l7904K5874J3021j57469k21005J1502K74540K18131o0698j87501
40278F07336n5309J12056J36152M8505n1061q3563o838J00345P7754o9484j33951
40267F81942m3815j629j12079j52743L1750J90117M7322k20293k69004j36071
40257A5497q6363q4567J04370L81161L77084N7077k05556k10992j48359j41440
$$ y = [661771, 365188, 104654, -59394, 21574, 445446, 1017100, 1340716, 1228776, 869261, 543245, 361808, 349873, 563198, 942580, 1195365, 1040540, 546257, 68884, -147181, -185029, -247525, -357638, -368585, -225064, -74276, -58895, -107363, -53723, 96901, 184966, 154484, 98600, 31174, -150729, -388926, -396355, -39488, 413933, 633502, 639511, 656598, 724490, 728845, 690941, 716815, 729836, 572367, 351362, 362864, 637404, 855535, 794837, 607336, 552027, 664083, 800235, 848740, 797679, 714116, 707278, 807623, 885377, 815893, 681942, 638127, 636498, 524419, 371676, 403426, 593543, 640865, 420572, 151568, 15497, -70866, -155433, -51063, 330098, 707182, 764259, 558703, 347711, 199352, 57912]
40247E7912l3409J94590K11904j64675n69218n14094m1686L55856L72636J63113
40237C2929r33q2057j81717k63841j71832Q3548K41593J25498p2577n7669R8152
40226b48906P1220j23796q3511K77192M31100K4601m38124k48165M09367O55601
40216G26579J64892m43753n71530l63943j98910k0652L56548O65000M62486j37073
40206F39644n03598l00677J11585J98734r2655l77508l63779j18714J56483L83652
40196b66833N30305M56120P9175l54113m48052j70026Q6972P1320K121J24489
40186A11478K52594J05082j47494j19869J24498J27789k37585n45998m24917k0583
40176g75005K77412K90392J09408o2073l8642J64333K51735j4429m12157m81848
$$ y = [57912, 24503, 219093, 430997, 266322, -302896, -816990, -858676, -502820, -130184, 32929, 31996, -50061, -231778, -495619, -667451, -583903, -342310, -216812, -289389, -347058, -248906, -177686, -301482, -384993, -107801, 323299, 347900, -90224, -338389, 70978, 726579, 891471, 447718, -123812, -487755, -686665, -707317, -350769, 314231, 776717, 639644, 136046, -164631, -53046, 145688, 53033, -324475, -688254, -806968, -650485, -266833, 263472, 719592, 798767, 444654, -3398, -173424, -86452, -15132, -13011, 111478, 364072, 469154, 321660, 201791, 326289, 454078, 216493, -329505, -754422, -775005, -497593, -207201, -97793, -159866, -198508, -34175, 217560, 203131, -209026, -690874]
40166f90874j45489K18455L19521K19348N1734j06305n6378L46262P47622N56729
40156A460625j64525o23406l82822L3927J2231k30662j38804K12350L10885J10049
40146E99848M3596K32300L10600P5044k36362l97940m68255n01712l91499j27889
40136h62269J16584K55674L41195L03606M097l72345l78341O6941M81517M86962
40126D43621L18362L46127M00815M6784o03521q77260m50945J57342K69961o8623
40116a7337k57154m1878J87726P5570j55264j10934J24563J58917l9099j09948
40106a84838M9848R3988j56397l42829j23287K43016K63238m3447k00277k536
40096d03521K24098J57965o6839j10437P8452K19227R5699j56724k27786n2204
$$ y = [-690874, -836363, -617908, -298387, -79039, -27305, -133610, -189988, 156274, 903896, 1460625, 1296100, 672694, 289872, 323799, 336030, 105368, -33436, 178914, 489799, 599848, 643444, 875744, 1186344, 1261388, 1025026, 627086, 158831, -342881, -734380, -862269, -745685, -490011, -148816, 154790, 158887, -213458, -591799, -524858, -43341, 443621, 761983, 1108110, 1508925, 1555709, 952188, 74928, -376017, -218675, 51286, -17337, -274491, -316369, -128643, -53073, -208337, -319271, -194708, -35791, -74890, -184838, -134990, -41002, -197399, -540228, -663515, -420499, -157261, -200708, -400985, -403521, -179423, -21458, -88297, -198734, -120282, 98945, 194644, 37920, -189866, -242070]
40086b42070Q3232n1387k52063j57652J62434K52882l3927k87852j77167N7590
40076f45980O0566l8300Q9244L34182L07708J1164j63928r2801q5628l11684m85768
40065a021225l03668J22354M37600M38593J80606j16684j98592P064K60986K73859
40055H0893Q2434m4614k8507l1605j14756j61786j52804j78484j60197P3676L78439
40044b57311L70586K9562k01340q6033P5203L3276M1399L30560N37737J91094
40034A064733m63886o91628k75223K01188J58687k76507n25688k55844L09206
40025g54962O35265L84994k15232n54103l13921J37482K48284M0989J2675L18871
40015e9658N12319K48420j61541k11265O9624K22497M5406k19956l46193l80433
$$ y = [-242070, -158838, -210225, -462288, -619940, -457506, -204624, -238551, -526403, -703570, -645980, -585414, -623714, -534470, -200288, 107420, 118584, -45344, -138145, -223773, -535457, -1021225, -1324893, -1202539, -764939, -326346, -145740, -262424, -461016, -453952, -192966, 80893, 163327, 118713, 90206, 58601, -56155, -217941, -370745, -549229, -709426, -635750, -257311, 113275, 142837, -58503, -144536, -69333, -36057, 5342, 335902, 873639, 1064733, 600847, -90781, -366004, -164816, -6129, -282636, -808324, -1064168, -754962, -119697, 265297, 50065, -504038, -817959, -680477, -432193, -391204, -378529, -59658, 452661, 701081, 539540, 328275, 397899, 620396, 665802, 445846, 99653, -280780]
40005b80780l82876k57979k889J66823J42571J21874K42352K66984l2076l82438
39995c98434l41642o293J22244k0846N5124N12529P97493M97703L3906l4788O0540
39984A277536k47998p81422p90351j53886L92964L58129R3520M3329N6744j53094
39974I5471l98039l35288l2123K14010L21867L21754J15890k60816m35383j79147
39964e71804J67727J92890O1956J63559L55250J90166k33650l35985J0258K75945
39954B76312J51701j6265O7924J11883j81367m83798l29487R5247K27304K3303
39944e7243j6891K73690M09678K4132m93200n00938q774L40342J55660k08760
39934h2304j87835K31510N37724L81106m4750l40572l77416k97834k11752r5777
$$ y = [-280780, -663656, -921635, -924524, -757701, -615130, -493256, -250904, 16080, -15996, -398434, -740076, -746369, -624125, -644971, -589847, -77318, 720175, 1217878, 1251784, 1216996, 1277536, 1029538, 248116, -542235, -696121, -303157, 54972, 148492, 191821, 248565, 95471, -302568, -637856, -669979, -455969, -134102, 187652, 303542, 42726, -392657, -571804, -404077, -211187, -149231, 14328, 369578, 559744, 326094, -9891, 367, 276312, 428013, 411748, 479672, 591555, 410188, -73610, -403097, -307850, -80546, -57243, -74134, 199556, 609234, 633366, 140166, -360772, -369546, -29204, 126456, -82304, -270139, -38629, 499095, 880201, 835451, 494879, 117463, -180371, -392123, -487900]
39924d87900N6833J61950J40669K319j55774j78559L0331L17974L23265r7901
39914A13207n60945n24879O174M23616K69416j85509l16226N7151M91926N06732
39904B80663J20940k47316k77869m4678J32800N5098j58445k26531l9070K17305
39894a87103K93422J72852M6058J9024j8417j75622l28220k46255O4427K97270
39884f2564J87925j67232m16957l27685J9054L45941M09078J57647k15790l90488
39874d61071j95660J96307M22352K86408q1224l87368m19917j72564J59884L29434
39864c23419K76327J81678J83665J54471n3694k65955j94067O4358J13968j07059
39854C0273j99055M0022K45475O1487k67876k67258M8702K33757O5663k28543
$$ y = [-487900, -431067, -269117, -128448, -126129, -281903, -460462, -430131, -112157, 211108, 113207, -447738, -972617, -966443, -542827, -273411, -458920, -775146, -717995, -226069, 280663, 401603, 154287, -123582, -168260, -35460, 19638, -138807, -365338, -404408, -187103, 106319, 279171, 325229, 344253, 325836, 150214, -178006, -424261, -359834, -62564, 125361, -41871, -458828, -786513, -767459, -421518, -12440, 145207, -70583, -461071, -656731, -460424, -38072, 248336, 167112, -220256, -640173, -812737, -652853, -323419, -47092, 134586, 318251, 472722, 419028, 153073, -40994, 23364, 137332, 30273, -168782, -128760, 116715, 178202, -89674, -356932, -308230, -74473, -8810, -237353]
39844b37353l47728k14822N4590K41715J64933o6163j00633J30529K15593p2914
39834b32253k46688K19068R23412R68200K80823k65052j64066O8562j38591n24490
39824H88925n57677l07306j70469j44587K8803K71133K82239O4071j60636l63840
39814a69344n62374m69013J28107P74225P72927J93855j64341R6404M78732M03326
39804A482504l9134m20118n74859n36385k65804J69686M33156K91834n0066k73087
39794B17727l53352l63303j67545K65586N01455J26703n05043n89678J3013N35858
39784c18579L75019r3355j22841L39172O61963M47859k4197k96463k93683k32080
39774D42815k20619j77882n5186M9565K5681r5135j58717m1220K23777M49550
$$ y = [-237353, -585081, -799903, -745313, -503598, -338665, -404828, -505461, -374932, -159339, -232253, -478941, -259873, 663539, 1631739, 1912562, 1647510, 1483444, 1552006, 1413415, 888925, 331248, 23942, -146527, -291114, -262311, 8822, 291061, 355132, 194496, -169344, -731718, -1200731, -1072624, -298399, 474528, 668383, 504042, 600446, 1079178, 1482504, 1443370, 1023252, 448393, -87992, -353796, -184110, 249046, 540880, 490814, 217727, -135625, -498928, -666473, -400887, 100568, 227271, -277772, -867450, -854437, -318579, 56440, -36915, -159756, 179416, 841379, 1289238, 1265041, 968578, 674895, 442815, 222196, 44314, -10872, 38693, 64374, -30761, -189478, -230698, -6921, 442629]
39764D42629M28470J04260l39615n77775m14639j3323K16292N6814k39326k54168
39754e90381L9292K35300O8179k16205k40670m0798N9975N768P9006L83868O00299
39743C83633M15351l9590l76695m16771k82791j50585r2877j02406j14006m1214
39733h17951J12843K45015L09621L52795L20023M9602l76459n23844j47881L37587
39723a38649L18120j74636m92612k65463J63939L22067K15846J24979J13102O0869
39713B47562k2375l6543k5677j02617k12933k11130j11848m1424J0199J59322
39703c47464L70614M52562L27612J19340m5608j45303j64474q7235k0134j10660
39693C49250k72163k12206J30494L84591J95480k63159m90247l13523n5075l024
$$ y = [442629, 871099, 975359, 635744, 57969, -356670, -369993, -153701, -96887, -336213, -590381, -551089, -315789, -247610, -463815, -704485, -745283, -685308, -679540, -600534, -216666, 383633, 798984, 759394, 382699, -34072, -316863, -467448, -560325, -662731, -776737, -817951, -705108, -460093, -150472, 202323, 522346, 571948, 195489, -328355, -476236, -138649, 179471, 4835, -487777, -753240, -589301, -267234, -51388, 73591, 186693, 247562, 225187, 188644, 162967, 60350, -152583, -363713, -475561, -516985, -506786, -347464, 23150, 475712, 803324, 922664, 877056, 731753, 567279, 480044, 459910, 349250, 77087, -135119, -4625, 379966, 575446, 312287, -177960, -491483, -546558, -549582]
39683e49582k3476J22781L24169K83268K6914r7783L4652J27242n2304k75298
39673g9417j90690J42559L56322K89325R9361p9223k69082m24835l78399j00028
39663f34107K08986L59989L32524J73255l8926j30254p325J05810o3811l28160
39653b2019k32036J69226K67682j34821m06151m4630M78059M29120n1804k49493
39643B03133k8678J02675k7946m6771J36169R3697k99463n40824l18785j9822
39633g46615l6550j46616k2811J53740R1810k8847R7722L22788L18975J38642
39623A42238J3581r3296k43637j81357J95951L86166j0219m64963k32185L66181
39613a21540L51470k96759n49684k2392L94462N6311l64673o9693N06298M66725
$$ y = [-549582, -573058, -450277, -126108, 157160, 184074, 86291, 120943, 248185, 195881, -79417, -270107, -127548, 228774, 518099, 617460, 538237, 269155, -155680, -534079, -634107, -425121, -65132, 267392, 440647, 401721, 271467, 264142, 369952, 306141, -22019, -254055, -84829, 182853, 48032, -358119, -402749, 75310, 504430, 452626, 203133, 174455, 277130, 249184, 202413, 338582, 432279, 132816, -408008, -726793, -746615, -783165, -929781, -952592, -798852, -707042, -735889, -638167, -315379, 3596, 142238, 155819, 62523, -181114, -362471, -166520, 219646, 209427, -255536, -487721, -121540, 229930, -66829, -616513, -638905, -244443, -188132, -552805, -622498, -116200, 350525]
39603C50525o6596k86075j01399j36815m97611n82350j78169J89131J90993J63549
39593i54817L58264M54125J97800p2424K0987K81947L08345J09176m9294j18269
39583E35840k00904k41448j37976j908p561j14951j66295j11062L2309K38283
39573a75673L48755J52644k33722l80121j52743M8431n5981j40240J43324M76315
39563C0989L23873j81127m09469j66453J40138K17544J92406J67431L6270j47955
39553B03647j26342R3003J68861j5383j69378j30466j16761k32340j95058J28984
39543c91233L49856J20183k52141k17643J91009M13050J69402j93707k24902O2990
39533B6864K62369P2042l58273n71881l02766K07391M91697M08140K15662J31881
$$ y = [350525, 283929, -2146, -103545, -240360, -737971, -1320321, -1498490, -1309359, -1118366, -954817, -596553, -142428, 55372, -17052, 3935, 285882, 594227, 703403, 654109, 535840, 334936, 93488, -44488, -46396, -53957, -168908, -335203, -446265, -413956, -175673, 173082, 325726, 92004, -288117, -440860, -392429, -448410, -588650, -445326, 30989, 354862, 173735, -235734, -402187, -262049, -44505, 147901, 315332, 351602, 203647, 77305, 170308, 339169, 323786, 154408, 23942, -92819, -325159, -520217, -391233, -41377, 78806, -173335, -390978, -199969, 213081, 382483, 188776, -36126, 26864, 289233, 361275, 3002, -568879, -871645, -664254, -172557, 235583, 451245, 583126]
39523E83126R7496K6895k1759m7427j74237l63269l57300r7934J10352P2591J7319
39512a54147J62192K91083J27650j41693j40739R1015J95639P0518p4321j40021
39502B87176k02717k14332o2964Q9516m1017l45245l82589m2107K67769K28911
39492d17599L2284j1177N5286J2327j22451j42622J2784K05109L06401K90442
39482B20784J73815K0196l7585P1949K08924J39035j44921l23207j03086L43753
39472E69657M77936M1161n49840o83424l24315J0941J8365o3281J0989P1791q0918
39461e00938k49605j55883R0598K06400J83571J60599Q0759j18832k00597M0618
39451d63310L23051K30814j32457l25100k47580j24008L1401L27817N03968K04438
$$ y = [583126, 680622, 707517, 685758, 638331, 464094, 100825, -256475, -354409, -244057, -171466, -154147, 8045, 299128, 426778, 285085, 144346, 235361, 431000, 501518, 427197, 287176, 84459, -129873, -192837, -103321, -144338, -489583, -872172, -914279, -646510, -417599, -385315, -396492, -341206, -328879, -451330, -593952, -581168, -376059, -69658, 220784, 394599, 414795, 377210, 449159, 658083, 797118, 652197, 328990, 225904, 569657, 1047593, 1088754, 538914, -144510, -468825, -457884, -439519, -502800, -491811, -420020, -500938, -750543, -906426, -815828, -609428, -425857, -265258, -184499, -303331, -503928, -463310, -140259, 90555, -41902, -367002, -614582, -738590, -707189, -379372, 124596, 329034]
39441C29034k95913l71196o6988n3322m46481n46631l3052M49987L63533J27145
39431e43884K90244N49187L41717j07844j59002J65453K70915k0150l05870l47581
39421A33185l02141k23868M1914L94802M54257J41670j41428p3572J75373K35772
39411H35964L624k99964l92642k10224J1774M391j54044j35331Q6998J32235j43927
39400b61146l15231m6199L08631K42805j00979k30409j37152j93338l80825l00160
39390a414003R2671L92032L98998K89105J29154j56729l30949m3443M27452L79764
39380A64052j75272l68078J86086O77629K95572n24129p60506k63826K31686K95170
39370b41616K01283J88213O5337k55235m25198j81824J72256J60188j96182m19337
$$ y = [329034, 33121, -338075, -405063, -458385, -904866, -1451497, -1484549, -1034562, -671029, -543884, -253640, 295547, 637264, 529420, 370418, 535871, 806786, 786636, 480766, 133185, -168956, -392824, -350910, 43892, 498149, 639819, 498391, 424819, 600192, 835964, 839588, 539624, 146982, -63242, -51468, -47077, -201121, -336452, -249454, -117219, -261146, -576377, -622576, -313945, -71140, -172119, -402528, -539680, -733018, -1113843, -1414003, -1321332, -929300, -530302, -241197, -112043, -268772, -599721, -643164, -215712, 164052, -11220, -379298, -193212, 484417, 779989, 255860, -504646, -768472, -536786, -241616, -40333, 147880, 213217, -42018, -467216, -649040, -476784, -316596, -512778, -932115]
39360i32115k35808R0144J63924K427l1474K21427M76254L99187L1462l41849
39350a56421n44809n03542j06468N58796R74504O74694n2648m29385k15810L9180
39340B38091q1572k70253j40170P2204m9918l35650k71169J85032N59057N40609
39330D46261K50430r9498l77649m14454j50760J05974N623k60413j71127K69479
39320c96134M29017Q250m20987k31874L13891M67308J04941j59380M3120L36289
39310D94441K82215N8574N9589J62698p4025n93806p84262l59481J84236K66744
39300c03077n106j38456l3499J6975m5259M6602L24648M36162K06660o3846q4222
39289C57582l030r3363k84382l01174r2199J41699K22917J13153j10258k43484
$$ y = [-932115, -1167923, -1077779, -913855, -911428, -942902, -721475, -245221, 153966, 185428, -156421, -701230, -1204772, -1311240, -752444, 222060, 896754, 844106, 414721, 198911, 238091, 156519, -113734, -253904, -181700, -231618, -567268, -838437, -653405, -94348, 446261, 696691, 597193, 219544, -194910, -345670, -239696, -234073, -494486, -665613, -396134, 32883, 41133, -379854, -611728, -297837, 169471, 274412, 115032, 158152, 494441, 776656, 835230, 894819, 1057517, 983492, 389686, -394576, -754057, -569821, -303077, -308183, -446639, -480138, -463163, -508422, -461820, -137172, 298990, 505650, 441804, 357582, 354552, 261189, -23193, -324367, -416566, -274867, -51950, 61203, -49055, -292539]
39279b92539r8271J95031K47369m6370k84029j19316K20404L03896J42465N9168
39269C27808Q1351o4086l90548n42219l14360P9160L43781M02481K86618L4928
39259B44914k01649k30219r2589k2406n3644L7922K95868M09898J81779j15633
39249D54241j15248J04344J50096j19245m33095m82055k27036J52278M17701L79158
39239B81139M6214k74853k22900J71930M31114J72114l81970o34087l39723J16386
39229f34636K43899K7699j94548k51280k39098j87945J4578L07648M10231K41668
39219b61784Q6851J40909J82579k6122k86323k70590q1174p2657k29811j90025
39209a008147J15440L08800J63240o3950q3211r51m1916j17758J9928L36859N04992
$$ y = [-292539, -390810, -195779, 51590, 5220, -278809, -398125, -177721, 126175, 268640, 327808, 409159, 345073, -45475, -587694, -902054, -822894, -479113, -76632, 209986, 244914, 43265, -186954, -279543, -301949, -355593, -317671, -21803, 388095, 569874, 454241, 338993, 443337, 593433, 474188, 41093, -440962, -667998, -515720, -98019, 281139, 327353, 52500, -170400, 1530, 432644, 604758, 222788, -411299, -751022, -634636, -390737, -363038, -557586, -808866, -1047964, -1235909, -1221331, -913683, -503452, -261784, -174933, -34024, 148555, 122433, -163890, -434480, -515654, -588311, -818122, -1008147, -892707, -583907, -420667, -484617, -567828, -568779, -610695, -728453, -708525, -371666, 133326]
39198A33326L11487q7803l27226j83813J91474L95862K24293m1645K0747L66435
39188A003137N01318J73786k71555m06705k90321k47197l01587j91585J35913
39179A05204M01835M10622L06556K93745K95644P3127l82278p42812p00970l52290
39169b91617q5596p6054p4937J49735L58711J54877l20504m38953M3376N73474
39159g488N34710O8496k04477o4554J32754P9253j05598j58278r682K36889M19434
39148I21459L58918J9403l36098l87218j86115q3318j82110j88809O7950L03109
39138C07171J96296j19910k87290k42081j79887j31429N5837L32891M04132J56157
39128D91887j41621j84581J9503K43902K94415R1927k74855m81370k13344L54647
$$ y = [133326, 444813, 357010, 29784, -154029, 37445, 433307, 657600, 615955, 636702, 1003137, 1504455, 1678241, 1406686, 999981, 709660, 462463, 160876, -30709, 105204, 507039, 917661, 1224217, 1517962, 1813606, 1886733, 1504455, 761643, 60673, -291617, -377213, -453267, -528204, -378469, -19758, 135119, -185385, -624338, -580962, -7488, 527222, 595718, 391241, 326687, 459441, 538694, 433096, 274818, 265136, 502025, 921459, 1280377, 1299780, 963682, 576464, 390349, 307031, 124921, -63888, 4062, 307171, 503467, 383557, 96267, -145814, -325701, -457130, -401293, -68402, 335730, 491887, 350266, 165685, 185188, 429090, 723505, 815432, 540577, 59207, -154137, 200510]
39118B00510O03795K44724k25358k00238J35401R2508m33901p72150m84376K2117
39108h16968J92056J22173K27698M97840O07145N14362M02165J89540l00302p53568
39098H82141n98052Q1316M79498J57535l61023m08602r1964N2624o4478r1611
39088C7384R5907K58170K49866J70509O8838j14360k91956k72724j04971o6155
39078C0508k50600m43431m51150k83579K6723M64849Q08170P05878J69436k99854
39068D76950l00512k2413Q9451m2679j38101n2773O8477J07827J32112J75741
39058D94080J27099m6834j61011n9499J26304J43054k9211j70776j60090j25808
39048A37308j94899k63064j70950l897o751k06913l27950j54805J73785L49609
$$ y = [200510, 804305, 1049029, 823671, 623433, 758834, 851342, 417441, -354709, -839085, -816968, -624912, -502739, -275041, 222799, 829944, 1344306, 1746471, 1936011, 1635709, 882141, 284089, 365405, 844903, 1002438, 641415, 232813, 140849, 193473, 128995, 37384, 133291, 391461, 641327, 811836, 880674, 766314, 474358, 201634, 96663, 30508, -220092, -663523, -1114673, -1398252, -1371529, -906680, -98510, 607368, 776804, 476950, 176438, 154025, 243476, 200797, 62696, 9923, 78400, 186227, 318339, 494080, 621179, 574345, 413334, 353835, 480139, 623193, 593982, 423206, 263116, 137308, -57591, -320655, -491605, -495502, -502253, -709166, -1037116, -1191921, -1018136, -668527]
39038f68527K59322N2468o3507J1437K21797L66281K48812p3886l12341l22888
39028b81032k83434l10725j52666L76941Q44134O07662k03483o90531l54793K57677
39018a90250M03015J39178n719L4325q4877l28266k59514J58297L97807J87065
39008D51061q3086m9148M9841j26612l84025l45813j31491j47311l79184m26073
38998a571841j58584J61442L87043N93566O58660L05844k82709m65136l9222L70234
38988d0703K16869j36601k4019M36727N18719M645n35203o17448l88975j48463
38978g14452J02592L49642L02996j38372n04674l05623K26193M00238Q086m27992
38968g01366l85203M8823M20550M82092L35680J81190J05505O0782n4101k49696
$$ y = [-668527, -409205, -356737, -420244, -408807, -187010, 179271, 428083, 354197, 41856, -281032, -564466, -875191, -1027857, -650916, 193218, 800880, 597397, -93134, -447927, -190250, 212765, 351943, 346224, 380549, 295672, -32594, -292108, -133811, 263996, 451061, 367975, 318827, 368668, 242056, -141969, -487782, -619273, -766584, -1145768, -1571841, -1730425, -1568983, -1181940, -588374, 70286, 376130, 93421, -371715, -410937, -40703, 176166, 39565, 15546, 452273, 970992, 975637, 440434, -177014, -565989, -714452, -611860, -262218, 40778, -97594, -602268, -907891, -681698, -281460, -273374, -701366, -1086569, -1037746, -617196, -135104, 200576, 381766, 487271, 548053, 493952, 244256]
38958B44256l52405j64873K14368L71761L9790m88871o06694r6072N61960O91353
38948D14573J54296n30469p55341l85285K24814O07913N26820R5364l11205l47203
38938c05723k1102L09983L40830J23824j09643k78211m16061m46608k71238l4687
38928a108636K535j23412j00918J54543L39029K40473O7023P6947J58039P2352
38918b22025q4049j9655K43578L48294J17243j82613j89737J01185L42280K34259
38908F88760j22937l09185o8622L35971M23836J33023j20914q7857k1176j61892
38898F89007k62806j0535L60250L57929j1686k79409k42092j60920k12369k31437
38888d068j06120J4456M8206J13244J86430M5749k52505k68492J58790N19997
$$ y = [244256, -108149, -273022, -58654, 313107, 352897, -135974, -742668, -838740, -276780, 414573, 568869, 38400, -716941, -1102226, -877412, -269499, 257321, 352685, 41480, -305723, -326825, -16842, 323988, 447812, 338169, 59958, -356103, -802711, -1073949, -1108636, -1106101, -1229513, -1330431, -1175888, -836859, -596386, -529363, -452416, -294377, -222025, -306074, -325729, -82151, 266143, 383386, 200773, 11036, 112221, 454501, 688760, 565823, 256638, 188016, 523987, 947823, 1080846, 959932, 872075, 850899, 689007, 426201, 415666, 775916, 1133845, 1122159, 842750, 600658, 439738, 227369, -4068, -110188, -95732, -47526, 65718, 252148, 297897, 45392, -223100, -64310, 455687]
38878D55687K79311l54536o86943m11454J13084L64759J60450k75458n24152l19789
38868a199041J59876M51719L61586J68109J44993J62791M771k03257k20012j27828
38858b96293j56713k21626n1019K99374M75377L61193K06520J80018J47275k1595
38848I22511k16489k65265j42183N1970J54639K6959k32016k71653L4846K57200
38838C20519m7001n79798o29008j26167K41331R5907j16854K8971K37180J10423
38828d64497q5077Q8765L89832K62422j76097k80329N1112K12418q3057l27930
38818d12438o7183L71303M14671J00944o3080J37231M21838M70407K62642M285
38808A640620r4394k3550l8550l48552o85410n19341J22649M85168R9553m46299
$$ y = [455687, 734998, 380462, -306481, -717935, -604851, -240092, -79642, -355100, -879252, -1199041, -1039165, -587446, -225860, -57751, 87242, 250033, 254804, 51547, -168465, -296293, -453006, -674632, -725651, -426277, 49100, 410293, 616813, 796831, 944106, 922511, 706022, 440757, 298574, 350544, 505183, 532142, 300126, 28473, 63319, 320519, 273518, -306280, -935288, -1061455, -820124, -724217, -841071, -812100, -574920, -464497, -549574, -460809, -70977, 191445, 15348, -264981, -213869, -1451, -84508, -412438, -479621, -108318, 306353, 407297, 344217, 481448, 903286, 1373693, 1636335, 1640620, 1546226, 1522676, 1484126, 1135574, 450164, -69177, 53472, 538640, 638193, 191894]
38798A91894l24313K64416M02033p7196l32205P8249M37966M7622n83785n07635
38788d02954J60648M13703j08533o33961m58933J09283L53100J52297l7021R6476
38778c55895M02022N34247L04506j31823l49581j06843K42269J15412m33922o68925
38768d48533k17141L24364K52367k03967l03412L0948J73672j20196l17847K3006
38758h06739N72335P25124L87293l4373j63058N0670L43348L11927j79585o83355
38748E23587n95296n60L47274Q3612k50754j10122J72667o523m34509l70723K27788
38737d13559N80233K71724j67864j48151J35284J43799j68549m19711m08849k33340
38727h28983Q842K46708L06332J11076r1229l0744J55470J38615n3085r8832M0261
$$ y = [191894, -132419, 131997, 534030, 456834, 124629, 202878, 640844, 688466, 104681, -402954, -242306, 171397, 62864, -571097, -1030030, -920747, -567647, -415350, -452371, -355895, 46127, 580374, 884880, 753057, 403476, 296633, 538902, 654314, 220392, -448533, -665674, -341310, -88943, -292910, -596322, -565374, -391702, -511898, -829745, -806739, -234404, 490720, 878013, 843640, 680582, 731252, 1074600, 1386527, 1206942, 523587, -71709, -72269, 275005, 358617, 107863, -2259, 170408, 163885, -270624, -641347, -413559, 166674, 438398, 270534, 122383, 257667, 401466, 232917, -186794, -595643, -828983, -820141, -573433, -267101, -156025, -247254, -277998, -122528, 16087, -36998, -135830, -95569]
38716i5569O3092q9769o9989K61936M96132K90657k5953O7543M26333M14902r2669
38705A646646m74555l08697k5876k11783o37655n67464R2794N80023L53066j57300
38695B89199k30096J11204K49248l6425l01901k00342J8701j245j51222j19984
38685c72863N2906R4041J4249P8424K81420K78009n7133l64280k97009q911J15633
38674a85514K6608Q141J94311L70491K85568l7142l49658m06383j28712L13529
38664I1239N63771L76027r0340l96459l01135N365J94324J73408O6632l2914j21337
38653E28581j77958j77278j70800k01168j72307J7748K41262K58932R3468K9952
38643B70432J52592J59391j60389n09726m52148m3617K59784K54277J52684Q7298
$$ y = [-95569, -32477, -122246, -192235, 69701, 565833, 856490, 830537, 898080, 1324413, 1739315, 1646646, 1172091, 863394, 837518, 625735, -11920, -579384, -486590, 93433, 446499, 289199, 59103, 170307, 419555, 383130, 81229, -119113, -100412, -101657, -252879, -372863, -319957, -225916, -211667, -133243, 148177, 426186, 369053, 4773, -292236, -301147, -185514, -158906, -150765, 43546, 414037, 699605, 662463, 312805, -93578, -222290, 91239, 655010, 1031037, 940697, 544238, 243103, 248468, 442792, 616200, 682832, 649918, 528581, 350623, 173345, 2545, -198623, -370930, -353182, -111920, 147012, 240480, 270432, 423024, 582415, 422026, -87700, -539848, -583465, -323681, -69404, 83280, 170578]
38633A70578r3616l70347l49119J40379N94996M49984p1202k48494P0810K87509
38623E81478L2325k66262j26667J69828M0390m08696m90087p555L98979J92723
38613A16456k79636l37722L5118K51123N7790j24943O8381L52232K50337j39094
38603B50042k71270L6448L49054K50055j19223l43745k94108j55634p2842l6754
38593d07977l9479q0475m4661J87710M89395N50804K52894j72646l99673l11073
38583B4819m2821J50079Q1396j75828l04654r6553K48833L53197J44105j09458
38573B73115k09128k03104j50807k4430R1725J8244j93006k48655n7089J23207
38563e79928J21816J05147J90774J70760r7698l47855k85552m1475J07652J98421
$$ y = [170578, 76962, -293385, -642504, -502125, 92871, 542855, 471653, 223159, 293969, 581478, 613803, 347541, 220874, 390702, 431092, 22396, -467691, -475246, -76267, 116456, -163180, -500902, -465784, -214661, -156871, -281814, -213433, 138799, 389136, 250042, -21228, 15220, 364274, 614329, 495106, 151361, -142747, -298381, -371223, -407977, -447456, -527931, -572592, -384882, 104513, 655317, 908211, 735565, 335892, 24819, -18002, 132077, 213473, 37645, -267009, -363562, -114729, 238468, 382573, 273115, 63987, -139117, -289924, -314354, -222629, -204385, -397391, -646046, -703135, -579928, -458112, -352965, -162191, 8569, -89129, -436984, -722536, -764011, -656359, -457938]
38553d57938L61452L99741P3671l58146l97207l7138K38502J58615q8074k83523
38543c90045l87461l03302P5764N10997N65530K16298r5701j13880l3189l3468
38533A1543k8933k2308j96690m38756k86231L39222Q15934O15775J7417l65749
38523D61224m03264l53918k73359k3469L07483M55707L55785J11211k59942o88932
38513c11474q33445m15334K98258P32217O67703L44496Q876k62089l66279k23225
38503c60296j2590J093j17832q8541Q1138J02903n4544p2326J60856L19621J76629
38492A36111K40J27453M03441L87190l634l65852l35633j8086J87675P8655j45093
38481D52467j67995K5946J31044p4050m23585n59456l43017L1003K66413K17063
$$ y = [-457938, -96486, 303255, 376926, 18780, -378427, -415565, -177063, -18448, -106522, -390045, -777506, -1080808, -1005044, -494047, 71483, 287781, 192080, 78200, 45011, 11543, -17390, -39698, -236388, -675144, -961375, -622153, 193781, 809556, 826973, 461224, 57960, -295958, -569317, -592786, -285303, 170404, 526189, 637400, 377458, -311474, -1144919, -1560253, -1261995, -529778, 137925, 482421, 491297, 229208, -137071, -360296, -372886, -371793, -489625, -578166, -497028, -394125, -448669, -520995, -360139, -40518, 136111, 136351, 263804, 667245, 1054435, 1050801, 684949, 349316, 331230, 518905, 597560, 452467, 284472, 310418, 441462, 367412, -56173, -615629, -958646, -927643, -661230, -444167]
38471d44167k5260k04840j31686J01270K32229J98200J99435L11497K90360l6152
38461D90886m12587m63398j92547R4831K22683K17682J02602o8511r2170J33047
38451C2518L39473K26187l0194K945L23758M54524J38686l13432m88034l58170
38441C28261j85119j69966k93568l28953k7224N06775P29168K65765m80776p33734
38431c89371l26529J53560K33004Q3695N7652J49534J61894O5903m2579j10527
38421C6236r6458R925O4431p4483k39852j40405J27272J61252q6396j94213N4554
38410c78137L55241M17158L38829K38202R826k82210k85968K6259J40363j99391
38400C80172m83601k33837J73169R8813l17902m19567r7534J25362J511j31017
$$ y = [-444167, -469427, -674267, -805953, -704683, -472454, -274254, -74819, 236678, 527038, 490886, 78299, -385099, -577646, -482815, -260132, -42450, 60152, -8359, -100529, 32518, 371991, 598178, 567984, 570929, 894687, 1349211, 1487897, 1174465, 686431, 328261, 143142, -26824, -320392, -649345, -676569, -169794, 559374, 825139, 344363, -389371, -715900, -562340, -329336, -245641, -187989, -38455, 123439, 189342, 146763, 36236, -60222, -50297, 14134, -60349, -300201, -440606, -313334, -152082, -238478, -432691, -378137, -22896, 394262, 733091, 971293, 981119, 698909, 412941, 439200, 579563, 380172, -103429, -337266, -164097, -65284, -383186, -802753, -900287, -774925, -773414, -904431]
38390i04431M176K39060L40006L10259K06374L4852r2887m4971N8210k943j25859
38379B1846j0829K71577K79893j18540m82451m00240j5646K63304K90718J79530
38369B79162N007k12235l50182k64623r914J72964J04430j58764l78180l33537
38359a145872j7185L26914L95586J14830k52894l24102K6880M92920O17507L02317
38349E36901p9975j70412m9496J0044R303J03825J77538l43k57043j94064R4396
38338A80674R3960k14855k09960L12101O46185K34787m25827n52413k05433M1553
38328i9228R2042J99113K19636j37234n47121m34012K9192J56913p4001o705M78809
38317a22596O79795K41505k58691k66032k6908K6686Q246J80363L50010J93435
$$ y = [-904431, -900255, -661195, -321189, -10930, 195444, 230296, 137409, 92438, 150648, 147705, 21846, 11017, 282594, 562487, 443947, -38504, -438744, -454390, -191086, 99632, 279162, 284169, 71934, -278248, -542871, -552785, -379821, -275391, -434155, -812335, -1145872, -1163057, -836143, -440557, -325727, -578621, -902723, -875843, -382923, 234584, 536901, 456926, 286514, 237018, 247062, 256365, 360190, 537728, 537385, 280342, 86278, 180674, 274634, 59779, -150181, 161920, 808105, 1042892, 617065, 64652, -140781, -99228, -7186, 191927, 411563, 274329, -272792, -706804, -677612, -520699, -594700, -601405, -122596, 557199, 798704, 540013, 273981, 247073, 273759, 282005, 462368, 812378, 1005813]
38307A005813j72363l93309l78061k46316n2339J37410J61421K5248k1933J03749
38297A69320J37515q3718l04595k30530O0951L02744L55092J82468j56541l57811
38287G4895j10200L56216M26029K617k83533o1060J86086m6271m29381l91116
38277b75718q1649k0585j12347J65531P16544P94779J31924n96952o81248k23020
38267a82741K05612L32141K68004J11905j36110l47716k88457M6436L12992J96271
38257E18337j62276l08164p2820J99436J64556l0651n0401O2651L8051o2012L1199
38246C27906J62820j07721o40866o85655n249O22168M75790r7223k94990k2374
38236b65394J99886J61305J09842J26745M735k40960k69062P7859N07815O01258
$$ y = [1005813, 833450, 440141, 62080, -184236, -236575, -99165, 62256, 87504, 65571, 169320, 306835, 223117, -81478, -312008, -251057, 51687, 406779, 589247, 432706, 74895, -35305, 320911, 746940, 749557, 466024, 404964, 591050, 544779, 115398, -275718, -357367, -377952, -490299, -324768, 391776, 1186555, 1318479, 721527, 40279, -182741, 22871, 355012, 623016, 734921, 598811, 251095, -37362, 9074, 322066, 518337, 356061, 47897, -24923, 174513, 339069, 308418, 258017, 320668, 358719, 296707, 327906, 490726, 383005, -257861, -943516, -948765, -326597, 149193, 51970, -243020, -265394, -65508, 95797, 205639, 332384, 337119, 96159, -172903, -95044, 412771, 1014029]
38226A014029K07416m27858p83021m91018J72105M86666J84284k07860j93015
38217c8272k0516j29835l32444j77732J91151K53646r198j50180m5489M5632J17180
38206b96057L74020N84469K73163l44641m29265K42061Q44777O65184L0979l29644
38196A615046k76197j22141j972R0195j0262l71787o36029m53245o1957M6787
38186a81562j04008o5260K33812L24598k1960l43744j32639L86510N39444J46922
38176G82113k57020k25654M634q435j79618r6459K19124L06427L9210j63958n6441
38165C63923P0068k941j1794J98982K36623j54313m66322j58122L86998L97408
38155H60510o6166k51936O2069L36772K53884J00367O4927p2561l56179m55702
$$ y = [1014029, 1221445, 793587, 10566, -480452, -308347, 178319, 362603, 154743, -38272, -58788, -188623, -521067, -698799, -507648, -254002, -263200, -413380, -458869, -413237, -296057, 77963, 662432, 935595, 590954, 161689, 403750, 1248527, 1913711, 1944690, 1615046, 1338849, 1216708, 1214736, 1304931, 1294669, 922882, 286853, -166392, -228349, -181562, -285570, -350830, -117018, 207580, 185620, -158124, -290763, 95747, 635191, 782113, 525093, 299439, 304073, 295638, 116020, 19561, 238685, 545112, 584322, 420364, 363923, 433991, 431050, 419256, 618238, 854861, 700548, 234226, 76104, 463102, 860510, 794344, 542408, 604477, 941249, 1195133, 1295500, 1360427, 1287866, 931687, 475985]
38145D75985k75080j33986j51523p5854R7722K2524k63444k19203K73079N80504
38135C30724L03178j09058j70338j05094k47435l44188r2480J86692J00584o2869
38125b10284J47137M74669L61651q2055k79383j45310r0339k01412j68810J8627
38115a75509L0552j21418m3157K98689M38400J89008l4659Q1272K45403Q8583
38105I97164k07011j89306J80251M66660L16114j42113m54009l34583L848Q4680
38095G21695k21810m94720l35337P3600K84616K69625L45788N04936L61429j26859
38085A382963m15556j37414L05090L00666r8221l16911j38647M5455q1464k79998
38075E65963j92514O0425Q5348j33448j99302N7506K92343J63117j74676l29061
$$ y = [475985, 200905, 66919, -84604, -160458, -62736, -40212, -303656, -522859, -249780, 330724, 633902, 524844, 354506, 249412, 1977, -342211, -434691, -247999, -147415, -210284, -63147, 411522, 773173, 691118, 411735, 266425, 176086, -25326, -194136, -175509, -144957, -266375, -309532, -10843, 427557, 616565, 581906, 663178, 908581, 997164, 790153, 600847, 781098, 1247758, 1563872, 1421759, 967750, 633167, 637015, 721695, 499885, 5165, -330172, -256572, 28044, 297669, 643457, 1148393, 1509822, 1382963, 967407, 829993, 1135083, 1435749, 1337528, 1020617, 881970, 927425, 845961, 565963, 373449, 433874, 519222, 385774, 186472, 243978, 536321, 699438, 524762, 195701]
38065A95701j93202N2504K51130K99751Q1526k97051m09265m7492L46304K70963
38055E50869k1478O8847M18467L22580k49081m50561P5914N13693J08417o40220
38045F97447p41512j35060M23277N30597M05724K02990j58560n06709m41041L8832
38035C15985M27801L60239Q275k25466j34286J81539M08892K78316j08337l51149
38025A161809k86000j62656j18859Q8497N04405O24000J30867m49274m56254q8646
38015I47889J6222j16781N5207N16962O47516K76834k0287J62590N40784O99950
38005C726886N90551L21467K155j21000Q7550K39707j36267p37489p87695k62237
37995B923628J6191k84538m51524P3102P46824P78719K91189l9873m4771p8779
$$ y = [195701, 2499, 55003, 306133, 605884, 687410, 390359, -18906, -66398, 279906, 550869, 529391, 598238, 1016705, 1339285, 1090204, 639643, 715557, 1229250, 1337667, 697447, -44065, -179125, 244152, 774749, 1180473, 1383463, 1224903, 718194, 277153, 315985, 743786, 1104025, 1112300, 886834, 752548, 934087, 1342979, 1621295, 1512958, 1161809, 875809, 713153, 594294, 682791, 1187196, 1811196, 1942063, 1492789, 1036535, 947889, 964111, 847330, 902537, 1419499, 2067015, 2343849, 2323562, 2486152, 3026936, 3726886, 4317437, 4638904, 4641059, 4520059, 4607609, 4847316, 4711049, 3973560, 3185865, 2923628, 2939819, 2655281, 2203757, 2276859, 3023683, 3802402, 4093591, 4053718, 4008947, 3930168]
37985C930168k71920l91268l20279j82711o3465L4124M5984n5077j36265r8799
37975B490492l6689k1200N5423K27969K91722J03091j74428l13201k81203j09775
37965B232201K06260M98485M35817k2036m60402n13073k62470K8460K52710L44224
37955B740176K07953K926J05840N14590O89306L22117j29830q3398L44589N94731
37945E309000M67764K15149M4181k4458L9053K16079L15025K35136J92390L68979
37935G378298N46488M44194K16168K10731L99410M67918L74131M03981O98663
37926A1139982J066628J266291J225835J024156Q69277J021217J533168K142764
37918B1289318K561570K747127K797115K812266K999890L614554M587385N496330
$$ y = [3930168, 3658248, 3266980, 2946701, 2763990, 2700525, 2734649, 2780633, 2725556, 2589291, 2490492, 2453803, 2432603, 2488026, 2715995, 3007717, 3110808, 2936380, 2623179, 2341976, 2232201, 2438461, 2936946, 3372763, 3350727, 2890325, 2377252, 2114782, 2143242, 2395952, 2740176, 2948129, 2951055, 3056895, 3571485, 4260791, 4582908, 4453078, 4369680, 4714269, 5309000, 5776764, 5991913, 6036094, 6011636, 6050689, 6266768, 6581793, 6816929, 7009319, 7378298, 7924786, 8368980, 8585148, 8795879, 9195289, 9663207, 10037338, 10441319, 11139982, 12206610, 13472901, 14698736, 15722892, 16592169, 17613386, 19146554, 21289318, 23850888, 26598015, 29395130, 32207396, 35207286, 38821840, 43409225, 48905555]
37910D8905555O112855O674241P404303Q129165Q661483R255020J0398925J2419302
37902A17960849J5424170J9268814K3485451K7673306L1697262L4369690L1985762
37895C01865304K0332544j17243k2074079l6534143m0099131l6244101l0163561
37888A56965590k4381881j9237197j5009026j2039500r997303q398622p340318
37881F0561743o929881o611526n828791m831711m124098l588289k844127k058986
37873B3744334j699863j751920j781875j577670j257822r66459q46505j040680
37865A2821540j360876j286160o61745m7543Q537l36022o34727q09135r19564
37856F774305p55860k55365P8720j56710n20911l65275P7552M3638m96176p77527
$$ y = [48905555, 55018410, 61692651, 69096954, 77226119, 85887602, 95142622, 105541547, 117960849, 133385019, 152653833, 176139284, 203812590, 235509852, 269879542, 301865304, 322197848, 322080605, 300006526, 263472383, 223373252, 187129151, 156965590, 132583709, 113346512, 98337486, 86297986, 76300683, 67902061, 60561743, 53631862, 47020336, 41191545, 36359834, 32235736, 28647447, 25803320, 23744334, 22044471, 20292551, 18510676, 16933006, 15675184, 14708725, 13862220, 12821540, 11460664, 10174504, 9512759, 9465216, 9473753, 9137731, 8503004, 7693869, 6774305, 6018445, 5763080, 5841800, 5685090, 5164179, 4798904, 4876456, 4920094, 4423918, 3646391]
37846C646391m38883N4069K90012M15460N20600K85783l47747p70485m84917J23690
37836C293973L05061m4700l71729l00325k1868J23566P8380J344O835O8234O9954
37825C208725q3035l31220m38822k04022K76103O19230M99448k7337n68532p57781
37815B192757n28960n0713M60098P60432O00953O101n30664m87841o928K32542
37805B647777l4854k63927N4220N71058N88859R8169k84736k85832k39394l50571
37795B500769l34930k2713K29294J01888j16431L5176M43039N79071L09247Q9591
37785C814001K77599N89799M55178k31029r13202r76660m49354K5056n3998m71401
37775B065989o46203m13571j45477j16371j45843j5552J39494J31358R0066J67931
$$ y = [3646391, 3207508, 3261577, 3551589, 3967049, 4487649, 4773432, 4425685, 3655200, 3170283, 3293973, 3599034, 3554334, 3182605, 2882280, 2860412, 2983978, 3062358, 3063702, 3070537, 3138771, 3208725, 3125690, 2794470, 2355648, 2151626, 2427729, 3046959, 3546407, 3519070, 2950538, 2192757, 1663797, 1613084, 2073182, 2833614, 3434567, 3440668, 2910004, 2422163, 2415235, 2647777, 2612923, 2348996, 2403216, 2974274, 3563133, 3661302, 3376566, 3090734, 2851340, 2500769, 2165839, 2143126, 2372420, 2474308, 2357877, 2393053, 2836092, 3415163, 3724410, 3814001, 4091600, 4681399, 5136577, 4905548, 3992346, 3015686, 2566332, 2591388, 2537390, 2065989, 1419786, 1006215, 860738, 744367, 598524, 582972, 722466, 853824, 943890, 1111821]
37765A111821J36803k46664o36126m28129K88339O97985L53780k28711l74239
37756F74859j53334l3760k9766J81409M92625M07894j00576m01472j01041L64478
37746A301316L57116j11039n19582n70070l88824j61987M4888J52853Q4471o9045
37736A20097j33734j08687j31810k10428k01845n9776J06750K28426L29984L74990
37726C13967K62784L3942r6181J3083K55372L97094K89328k8813l45512m35505
37716F59559l09756k31906l52158m37582j77740L26394O36328N09785J18387k41357
37706D99954l98874k92788O261K31416J54653p7653j11678R1483K07917P1731
37696C82422r6121q6349k359j1555q0591j15054j12138m8762J18891K39576O2842
$$ y = [1111821, 1248624, 1001960, 365834, -62295, 226044, 924029, 1277809, 1049098, 674859, 521525, 487765, 457999, 639408, 1132033, 1539927, 1439351, 1037879, 936838, 1301316, 1658432, 1547393, 1027811, 457741, 68917, -93070, -48182, 104671, 189142, 120097, -13637, -122324, -254134, -464562, -666407, -726183, -619433, -391007, -61023, 313967, 576751, 610693, 514512, 527595, 782967, 1180061, 1469389, 1440576, 1095064, 659559, 349803, 117897, -234261, -671843, -849583, -523189, 113139, 622924, 741311, 499954, 101080, -191708, -185447, 45969, 200622, 122969, 11291, 102774, 310691, 382422, 286301, 199952, 197593, 186038, 105447, -9607, -121745, -170507, -51616, 187960, 250802]
37685B50802l16686m49822j45038K44655L45211K26989J20634K8801r6855j28458
37675H0233j6467M5579Q11J08772M16085M73121K6943m18711l04470P9881O4036
37664E55813k93314l30431R3752L94740K31463o0097j56388j87975k62393j73068
37654a87898J11859K21814j0167j97331k3951K15577J13593j81074k35987r731
37644a83296J82226J92886J35830P3291l4150j34399j21811j7598Q2147J41951
37634C17077J24512k6252j73481j2810M41161O61026K46350m52676p43125m64354
37624h2572l8368K28904M07642N25336M01446L3274k66600k96202k02134j47289
37614E63437p7027J3982o2398l18685m06441j18749J96678J08794k16484k49892
$$ y = [250802, -65884, -515706, -660744, -416089, -70878, 156111, 276745, 305546, 208691, 80233, 63766, 109345, 110156, 218928, 635013, 1108134, 1135077, 716366, 411896, 491777, 555813, 262499, -67932, 25820, 420560, 652023, 591926, 435538, 247563, -14830, -187898, -76039, 145775, 135608, -61723, -85674, 129903, 243496, 62422, -173565, -183296, -1070, 191816, 327646, 400937, 366787, 232388, 110577, 92979, 175126, 317077, 441589, 415337, 241856, 229046, 670207, 1331233, 1577583, 1124907, 381782, -82572, -120940, 107964, 515606, 1040942, 1442388, 1475662, 1209062, 912860, 710726, 563437, 486410, 500392, 437994, 119309, -287132, -405881, -209203, -100409, -316893, -566785]
37604e66785Q5828L08185J20161j77474j74783R8590L24320L30194J54908j10110
37594C93034l21001k95282m6689J37135O3261o8738K4498K47491K65333J9032
37584D18074k08382k13685p2294P6339J59279R1787j27529k37707J7353L89336
37574B92571K95704l46783q46777n76894K06005P04269N44210O8407k16529j59448
37564c5265N5065J95008J79662Q5076j2571j54187l55019m22981j70373K13353
37554d22232L33384J72660J07696K48934K47444l6147k03154m123J68348n2136
37544E60674l28317j97506R6471M0411k19082j57402J59453K22577N0353J19313
37534C46945L63855J96844l58732n26771m0790L77995K10352p1721O1226K80232
$$ y = [-566785, -480957, -172772, -52611, -230085, -404868, -306278, 18042, 348236, 503144, 393034, 72033, -223249, -269938, -132803, -69542, -138280, -113782, 133709, 399042, 418074, 209692, -3993, -76287, 52, 159331, 251118, 123589, -114118, -96765, 292571, 588275, 241492, -605285, -1182179, -976174, -271905, 272305, 340712, 124183, -35265, 19800, 214808, 394470, 479546, 466975, 312788, -42231, -465212, -635585, -422232, -88848, 83812, 191508, 440442, 687886, 651739, 448585, 444462, 612810, 560674, 232357, 34851, 131322, 171733, -47349, -204751, -45298, 177279, 227632, 346945, 710800, 907644, 548912, 22141, -18649, 359346, 569698, 497977, 559203, 839435]
37524H39435Q0616k95220l48096j88883j78339j78176P1131K46844n0529m23320
37514d24537k01992L74681M49596n5592l06895O7803M17992J97407j84738j22798
37504B10927K27552L22370J12170k4688L5658P0234k3258r6545o2467k3752p5947
37493F72254j78929k26282j38756N2783J54840k2547l59312m59914j33450L24158
37483c15155M94082L31436J09179M11n1006j17825j84327k41538k89318k39499
37473e03560l069K98328L86386J62513j42557k34237p3860J31546J73990J9950
37463B15430j79785k07292N400K37276J91307q4399j77791J24576M56550L35987
37453I17259j32823m00984k70470r1916r7116m9701J96788L01449J9592k39110
$$ y = [839435, 920051, 624831, 276735, 87852, -90487, -268663, -197532, 49312, -1217, -424537, -626529, -251848, 197748, 142156, -164739, -96936, 321056, 518463, 333725, 210927, 438479, 760849, 873019, 848331, 883989, 954223, 930965, 834420, 771953, 748201, 672254, 493325, 267043, 128287, 181070, 335910, 313363, -45949, -505863, -639313, -315155, 178927, 510363, 619542, 619953, 568947, 451122, 266795, 25257, -264061, -503560, -506629, -208301, 178085, 340598, 198041, -36196, -110056, 21490, 195480, 215430, 35645, -171647, -166247, 71029, 262336, 177937, 146, 124722, 581272, 917259, 784436, 383452, 112982, 21066, -76050, -125751, 71037, 372486, 392078, 152968]
37443A52968J561M33366L55476k26265n83269l51258M5446J77233J62671K09028
37433C76957K00603O2445J5223J23984O9372k68996m67072k06367J64535J72314
37423B42998p3235j92169j75239j90007j08425J89455L64490J11999j74522N9197
37413E4542N46957N42057J7272l15907j87226q6278k53069k41957J66158M33158
37403F75707J48929k30323j26769K14016J84232j70283k92850m8920J62192J45648
37393F61579J28364J97474R7462k41422m43959k27645J33370J89600m8184j82887
37383B63752n4602M7122j33146l91396l23935J22628N84781P16475M76487J5336
37373A323502m56308o64046m52892p8524J1668j72601j33938K70191M55124J2679
$$ y = [152968, 154529, 587895, 943371, 717106, 133837, -217421, -171975, 5258, 167929, 376957, 577560, 640005, 655228, 779212, 848584, 579588, 112516, -93851, 70684, 242998, 169763, -22406, -197645, -387652, -496077, -306622, 57868, 169867, -4655, 54542, 601499, 1143556, 1160828, 844921, 657695, 571417, 318348, 76391, 242549, 675707, 824636, 594313, 467544, 681560, 865792, 695509, 402659, 353739, 515931, 661579, 789943, 987417, 1084879, 843457, 399498, 171853, 305223, 494823, 446639, 263752, 209150, 256272, 123126, -268270, -592205, -469577, 115204, 831679, 1308166, 1323502, 867194, 203148, -249744, -328268, -316600, -489201, -623139, -352948, 102176, 114855]
37363A14855n05819l73586J21617J23584l47190l87889K70310P58883M40233j37367
37353G7631k05785P7173J35884Q616Q2115K31175M1037l68364n06175l33823j99425
37342i59941p8943L45527Q68722Q25803J34521m39737l29555J32119L62117L12858
37332A173491K15842L6287l17807n87276m80851j94076j33896k72023k43946r23
37322h05178J36779Q0193J09009K84359K32816k02157n29145k55076L32875N34007
37312h1518K24864o3471k9042L5882r3096j37274J22722L50776J90625q8689l0534
37301D01245K18420J80921p5547m2694K88170L29043j32105n59420n17846k53735
37291a63548j04671N5174L50760M45481Q2366l49800l54360q1290J7425l1461
$$ y = [114855, -390964, -764550, -642933, -519349, -866539, -1254428, -984118, -225235, 214998, 77631, -128154, -50981, 84903, 93519, 175634, 406809, 447846, 79482, -426693, -760516, -959941, -1038884, -693357, 175365, 1001168, 1135689, 695952, 366397, 498516, 860633, 1173491, 1389333, 1425620, 1107813, 520537, 39686, -154390, -288286, -560309, -804255, -805178, -668399, -588206, -479197, -194838, 37978, -164179, -693324, -948400, -615525, -81518, 143346, 79875, 50833, 86715, -6381, -143655, -20933, 329843, 520468, 431779, 401245, 619665, 800586, 725039, 682345, 970515, 1299558, 1167453, 608033, 90187, -163548, -268219, -213045, 137715, 583196, 665562, 315762, -38598, -119888, -102463, -133924]
37281a33924R9838L29331K93716N3363J8758K14235K26503q7201l96868m60014
37271A57737l78519k52550p4500J479j87842l48677Q87O86904R20514L92564k68430
37260F49567m17329j94398l9921L6352K03924K75993J585l89651m76178k82869
37250f32925j36681o1949J57402M21727L71190Q184k35496j45861n349q0231k12953
37239e52942j36768R3729K24545J66955K7590j02546k00595k19808j03882J09556
37229f94166K85329L04457J71664K9415M1501K06429L19861K08927l0756j50488
37219F92173p8321J7759O159m5915n2332p3252j66256k11448p6322J13703Q8010
37208B13958j67593l26774j39501K19838L66671J74253j35026l09749k92159j29577
$$ y = [-133924, -34086, 295245, 588961, 642324, 661082, 875317, 1101820, 1014619, 617751, 157737, -220782, -473332, -547832, -546353, -734195, -1082872, -1081985, -395081, 525433, 917997, 649567, 232238, 37840, -2081, 34271, 238195, 514188, 515773, 126122, -350056, -632925, -769606, -831555, -674153, -252426, 118764, 126948, -108548, -254409, -259758, -339989, -552942, -689710, -595981, -371436, -204481, -176891, -279437, -480032, -699840, -803722, -694166, -408837, -104380, 67284, 96699, 138200, 344629, 664490, 873417, 842661, 692173, 613852, 631611, 637770, 591855, 539523, 466271, 300015, 88567, 12245, 125948, 213958, 46365, -280409, -419910, -200072, 166599, 340852, 205826, -103923, -396082, -525659]
37198e25659J18232L11492K76573O1538k6147J70934L56139J46740l26183n05624
37188E8035j50229L13968L50443j0256k95565k62519j47960k30072m03589l54313
37178a132057k7203K87922L46756K44700K07366K16951O1479k60451m38247k70527
37168g63311K2074J03426j2789n3271O2740J62520J82282K57481L82739L06719
37158F50610o4632m19826m17375j26105J27700J98368J70495J00989p083l2129
37148A81012J66053M42368M32795L7640l64401l46301L8417L20373J69274k54097
37138H23133n20588m07667q1320J59444K14195J90258J50875J8544k16719l53750
37128b3595k14620N3190J24500m0291j08719J34353M19929L45113k9742k38335
$$ y = [-525659, -407427, -95935, 180638, 242176, 216029, 386963, 743102, 889842, 563659, 58035, -92194, 221774, 572217, 561961, 266396, 3877, -144083, -374155, -777744, -1132057, -1159260, -871338, -524582, -279882, -72516, 144435, 205914, -54537, -492784, -763311, -741237, -637811, -650600, -703871, -641131, -478611, -296329, -38848, 343891, 650610, 585978, 166152, -251223, -377328, -249628, -51260, 119235, 220224, 213141, 181012, 347065, 789433, 1222228, 1259868, 895467, 549166, 587583, 907956, 1077230, 823133, 302545, -105122, -186442, -26998, 187197, 377455, 528330, 546874, 330155, -23595, -238215, -185025, -60525, -100816, -209535, -75182, 344747, 689860, 660118, 421783]
37118D21783p4273J25177J6741k18287j83506P8669J53871m9940j28856J38819
37108B80198L56641Q3284m49761o25735l09111L6840R4054Q2643K63159M63729
37098B75941L97227J63834P7437J40987P1063j77980k81220n4461J91791M9205
37088H53824l85895n93014l18203P8443J15017j54962k42007N7822L45921J73816
37078f9238l08462n21121k03222K71937L86106Q5149k26489k02397P7582K72984
37068d37171K26668J27931J88364K82957J16346k75748m67706k02450K43523M46119
37058B48833L56773J90119Q668k38434m14205l25710r3139p742n9873n9J57684
37047a77085J41102m2718n8620J62236K69349J04592k5908P4849J46068k164j08336
$$ y = [421783, 347510, 472687, 489428, 271141, 87635, 166304, 320175, 270235, 141379, 280198, 636839, 720123, 270362, -355373, -664484, -627644, -533590, -450947, -187788, 275941, 673168, 837002, 914439, 1055426, 1126489, 948509, 667289, 612828, 804619, 853824, 467929, -125085, -443288, -364845, -249828, -404790, -646797, -588975, -243054, -69238, -377700, -898821, -1102043, -830106, -444000, -358851, -585340, -787737, -710155, -437171, -210503, -82572, 105792, 388749, 505095, 229347, -238359, -440809, -197286, 248833, 605606, 795725, 804393, 565959, 151754, -173956, -267095, -274837, -334710, -334769, -177085, -35983, -78701, -137321, 24915, 294264, 398856, 372948, 447797, 593865, 591701, 483365]
37036D83365P400K3718k76457m49886p0259M21328K94743k80348m53096k6685
37026c26177K88797P4015j93437m1732K35658J88644k5793m0919K0574j57580
37016B2050m17607l68732q9941J0564p3852L8814L84426N22652K49906r1726j99679
37005a3125k15302l00584k79614m1733J13094l6909j43745J95083O76553O45767
36995E99485R6840l10010k40067m2643L803J15096L74421L53455j51471n68726
36985B30183l51681J17933J27997k15227k43382R0512J91914m4080k7298M21109
36975B97980O57575K74091k22960k57376k1186M7078J714M2873k110k39273k81910
36964B96496O9831K42623k43184p95996n62524J41386K61876k96210n34497l931
$$ y = [483365, 490765, 514483, 238026, -211860, -282119, 139209, 433952, 153604, -299492, -326177, -37380, 36635, -156802, -198534, 37124, 225768, 199975, 159056, 179630, 22050, -395557, -764289, -854230, -843666, -917518, -878704, -494278, 28374, 278280, 186554, -13125, -228427, -529011, -808625, -850358, -737264, -774173, -917918, -722835, -46282, 599485, 696325, 386315, 146248, 103605, 107408, 222504, 596925, 950380, 798909, 230183, -121498, -3565, 124432, -90795, -334177, -243665, -51751, -95831, -123129, 297980, 955555, 1229646, 1006686, 749310, 728124, 775202, 776916, 819789, 817679, 578406, 296496, 366327, 608950, 365766, -430230, -992754, -851368, -589492, -885702, -1420199, -1424130]
36954a424130N31298M04731L2879O6990L56881L84195J45743j6448n2392j16178
36944C13569j55398o6699R248l8238Q87K72635M67185K45550j82230l50006k17810
36933B98693j21978j85281k13175j07463O808M3370L0154l7326j43085j23082
36923e52365J25996L81719L35476N2118r9169L9884K35359K11262l5720k93318
36913D01242l46173j37795J60491K91304K11310J32673J73683J73688J8474j00381
36903I78516j6627M8506j93730n71918o29433k54910K12000M52691M14045J44698
36893E83838k41413m62713l14010k6558q353k07090j57859K55171N52073L73549
36883C46635J5453o2835P5196L5729k33256l68883j41904K46567M48994L32784
$$ y = [-1424130, -892832, -488101, -455222, -388232, -31351, 352844, 498587, 482139, 429747, 313569, 158171, 91472, 100720, 62482, 63369, 336004, 803189, 1048739, 866509, 516503, 298693, 176715, -8566, -221741, -329204, -322396, -279026, -248872, -286198, -429283, -552365, -426369, -44650, 290826, 342944, 243775, 283659, 519018, 730280, 694560, 401242, 55069, -82726, 77765, 369069, 580379, 713052, 886735, 1060423, 1078897, 978516, 961889, 1010395, 816665, 244747, -384686, -639596, -427596, 25095, 439140, 583838, 342425, -120288, -434298, -460856, -469209, -676299, -834158, -578987, -26914, 346635, 362088, 299253, 374449, 410178, 176922, -191961, -333865, -87298, 361696, 694480]
36873F94480K0702k65584l53434k18051R889J58191J35879l7540k39880k73291
36863c68639j9194L59490N00851K51179j07550j83746L2051J69414l0317l84883
36853B18656n04414k60493P3973J41935j04838l65978l34495l2564K34199K32569
36843g01450L8269r8142l8439J53990L42748M16735K78559r5235m91087n11014
36833g05066m848O00367O76445J68482k86916j87991J77703K19255o5939j75913
36823D15579J0505K6698l60447o82907m60657P5281L70377L31148K54074K15576
36813A95227O3860j04357j3150K31967J66479l21812p32009n94951n7146L75669
36803g90223M31797K32010M7671N7375K15817K82247R8229j67163k31903j21766
$$ y = [694480, 715182, 449598, 96164, -121887, -111998, 46193, 182072, 144532, -95348, -368639, -387833, -28343, 472508, 723687, 616137, 432391, 464442, 633856, 603539, 218656, -285758, -546251, -472278, -330343, -435181, -801159, -1135654, -1168218, -934019, -701450, -663181, -761323, -799762, -645772, -303024, 113711, 392270, 297035, -194052, -705066, -709914, -109547, 566898, 735380, 448464, 260473, 438176, 657431, 591492, 415579, 426084, 452782, 92335, -590572, -1051229, -975948, -605571, -274423, -20349, 195227, 259087, 154730, 141580, 373547, 540026, 218214, -513795, -1108746, -1165892, -790223, -358426, -126416, -78745, -21370, 194447, 476694, 574923, 407760, 175857, 54091]
36793E4091j04540k14356j91005L1167J45626l8836k58596j82723J09662K88813
36783c60697K24121M6723q6301r0854M6393K00328J74865k0276j25135l630J32789
36772A38326M9229j58676k36567j28400L6700J54506J57346o042k11385j83653
36762c88616J00621K63244M8853k30946j27085K57204M12195J54671k00776l69442
36752h0077l82625l06889o8917L05347N66560N14701K30492m3850j34288n8285
36742E42169m7292l42731p83242p86652q3382P01527O88928p8143o52044m54244
36732a295106N5206K08942N1907J7243J51250K05931K14412L93967N98666M25269
36722A027687j12435m94272l96771j00134k1794j48220j55438R1493L79523M16740
$$ y = [54091, -50449, -264805, -455810, -424643, -279017, -317853, -576449, -759172, -649510, -360697, -136576, -89853, -176154, -267008, -220615, -20287, 154578, 134302, 9167, 5537, 138326, 187555, 28879, -207688, -336088, -299388, -144882, 12464, 6422, -204963, -388616, -287995, -24751, 24102, -206844, -333929, -76725, 335470, 490141, 289365, -80077, -462702, -769591, -838508, -533161, 33399, 548100, 778592, 734742, 600454, 542169, 494877, 152146, -631096, -1417748, -1501130, -799603, -110675, -188818, -840862, -1295106, -1239900, -1030958, -979051, -961808, -810558, -604627, -390215, 3752, 602418, 1027687, 915252, 420980, 24209, -75925, -97719, -245939, -401377, -309884, 69639, 486379]
36712D86379J21972l12059n61426m24047m789L69198M50204K69704M4006o0793
36702C78349m9765l1029o4734r0822k5747Q1309O7819j21634l14033k98322r1713
36691e60322Q5895Q8167n142k4972P7754K00923K34764J92507J71115J83714J04062
36680G48465j37367l63405l25788p3141P1343k2199q6924R9296L05149J80879
36670C96308j51199k34782Q666J28127j56334m75082l12970K53753O63523N96691
36660G16701K60570k8346k05594l07216k59821m2321J27386L6714j60073r9814
36650C8186K38954M10163P7560m70148o12011j39896N02012P34845M32507m9088
36640A163084k88791j77402L7547L8898j89989l31524j66621O6768k3862l79513
$$ y = [486379, 608351, 296292, -265134, -689181, -693970, -324772, 125432, 395136, 439142, 378349, 328584, 297555, 232821, 141999, 116252, 197561, 265380, 143746, -170287, -468609, -560322, -474427, -386260, -391402, -416374, -338620, -137697, 97067, 289574, 460689, 644403, 748465, 611098, 247693, -78095, -151236, -79893, -102092, -189016, -89720, 215429, 396308, 245109, 10327, 18993, 147120, -9214, -484296, -797266, -543513, 120010, 716701, 977271, 948925, 743331, 436115, 176294, 133973, 261359, 298073, 138000, 38186, 277140, 687303, 764863, 294715, -317296, -457192, 44820, 779665, 1212172, 1163084, 874293, 696891, 734438, 773336, 583347, 251823, 85202, 151970, 128108, -251405]
36630b51405n07905j63858L25007N52670N14359L72930R5092l30031n82845l62028
36620c38014J00585K93825J16160q3721q7713j4444K4192M7412j4112k32153l68225
36609e56208j22005K72345K45809j91431l40651J28199O17943N05158N3069j04366
36599E07862N3555Q9860n8150p5719M6929j8919k96356l97892j48860J53248K14462
36588G0020R8107O40m962P9633K11266K50502J19685q899M8025J30381m6554l85712
36576E62132n06782l19692r3594L7029K00823L97187M22267K56607J02067k4100
36566A033944k75936n04359l30233J68815L95006P8358l29511l66741j52566K5124
36556b58099J81647L27602K08712j96671l87735m7451L80701L49526M4064k1524
$$ y = [-251405, -759310, -923168, -598161, -45491, 468868, 841798, 936890, 606859, 24014, -338014, -237429, 56396, 172556, 88835, 1122, -13322, 10870, 58282, 44170, -187983, -556208, -678213, -405868, -160059, -351490, -692141, -563942, 54001, 559159, 612228, 507862, 561417, 651277, 593127, 517408, 564337, 545418, 249062, -148830, -297690, -144442, 70020, 168127, 168767, 163805, 243438, 454704, 705206, 824891, 815992, 864017, 994398, 947844, 562132, 55350, -264342, -357936, -320907, -120084, 277103, 699370, 955977, 1058044, 1033944, 758008, 253649, -76584, 92231, 487237, 565595, 236084, -130657, -283223, -258099, -76452, 251150, 459862, 263191, -124544, -171995, 208706, 558232, 602296, 580772]
36546E80772J20605P9863j10705j09371J6642r3018l48380k96850M8086J60820
36536D8464j32343l92236l07391r0863L8784J91781L87843L42102k6320l21883
36526b62062k28991K8311Q6090k4630m7795N7351J38037J21561M1661n4125q6163
36515b30755j1804K0638j55154l47858j67099L27633N56486K20962k32257k65161
36505b84369J399R9031j2097K9135L07312M68603K77948m4583j76744j20872j04109
36494D40654k01175k57656j79321j15091k13984l05847r3314L07184L68400r2865
36484c43015n19322l54769J16563J98288j55745l48030j28301J34746K32812M14311
36474g52462O83251N52308j11705o51389n16596n1117J32716O2143J08245K17410
$$ y = [580772, 701377, 781240, 670535, 561164, 577806, 484788, 136408, -160442, -112356, 48464, -83879, -476115, -783506, -874369, -835585, -643804, -255961, 86141, 59821, -262062, -491053, -462742, -376652, -401282, -449077, -391726, -253689, -132128, -90467, -144592, -230755, -242559, -221921, -377075, -724933, -892032, -564399, -7913, 213049, -19208, -284369, -282970, -183939, -196036, -166901, 140411, 609014, 886962, 842379, 665635, 544763, 440654, 239479, -18177, -197498, -312589, -526573, -832420, -925734, -618550, -250150, -343015, -862337, -1217106, -1100543, -902255, -1058000, -1406030, -1534331, -1399585, -1166773, -752462, -69211, 483097, 371392, -279997, -796593, -847710, -714994, -652851, -544606, -327196]
36464c27196R1010j61272j80039J4982J01495O191r1984j29192r4822J53939N60558
36453e6330O49006J63767l73084l48686j3275n3712m58634o05917l50805j76096
36443a623766k48912j67822K17555N14218N12631M83203N13716K61125l24758
36434A37190o90406m72048l4909J58398J89813K96085L35266J08228j73776j97737
36424c43896l7244M8624M1980N8316O6468J9644K5805J26615J52869K0571j02205
36413G7547j12573j33686j78161m0229K55704L26277K6280k50617j70976P2421
36403a28013K07826L09956M00533J60331m52478q00760m03843K42258L42647n6249
36393a77792l08502k35132j67116j44719Q8147L78565K81252j03097j93357R3067
$$ y = [-327196, -236186, -397458, -577497, -562515, -461020, -454829, -546813, -676005, -770827, -616888, -56330, 592676, 756443, 383359, 34673, 21398, -32314, -490948, -1096865, -1447670, -1623766, -1872678, -2040500, -1822945, -1308727, -796096, -312893, 200823, 461948, 137190, -553216, -1025264, -1060173, -901775, -711962, -415877, -80611, 27617, -146159, -343896, -381140, -332516, -290536, -232220, -165752, -146108, -120303, 6312, 159181, 179752, 77547, -35026, -168712, -346873, -387102, -131398, 194879, 221159, -29458, -200434, -128013, 79813, 389769, 790302, 950633, 498155, -302605, -706448, -464190, -121543, -177792, -486294, -721426, -888542, -1033261, -945114, -566549, -285297, -388394, -581751, -488684]
36383d88684K02748p2372k56987q0997M3059k05763m59934k75983J86579N20986
36373h87348O38019N73025K03748l76042o31044k58990K47171K47417j15909k06314
36363e66267R5064K85241Q7861j81958j78693L0983K20428L05710K46841j2415
36353C32795l25377l48324J8539M00920L81037K4214k33295j43276J12700K31745
36343D51678J58563P1320J00451J70586J19521r2965l28107l99038k44898J743
36333H854J17327Q799j47492o9378K64584N00850K90887k55150o41994n29918
36323d52631q0958K63760K48958N040j43873k7225K02083K63464J09019l0332
36313C57305p842L0650l5170n859K92358N41366K74675l40465n91477k27905J45701
$$ y = [-488684, -285936, -358308, -615295, -696292, -653233, -858996, -1318930, -1594913, -1408334, -887348, -249329, 323696, 527444, 151402, -479642, -738632, -491461, -244044, -359953, -566267, -471203, -185962, -98101, -280059, -458752, -427769, -207341, 98369, 345210, 332795, 7418, -340906, -322367, 78553, 459590, 483804, 250509, 107233, 219933, 451678, 610241, 681561, 782012, 952598, 1072119, 979154, 651047, 252009, 7111, 8854, 126181, 134980, -12512, -81890, 182694, 683544, 974431, 719281, 77287, -452631, -533589, -269829, -20871, -15831, -159704, -186929, 15154, 278618, 387637, 357305, 349463, 380113, 344943, 339084, 631442, 1172808, 1447483, 1107018, 515541, 287636, 433337]
36302D33337j8698l89074l10437J61300L74434R2297k10887j22244J59750K39834
36292D09612R6794j9198K459Q5718J68436K14893J26566j45450m32253m65443
36282D2134j88867J44911K22715j4129l07512l42688r5274J21995L5952k15087
36272e95850k40242P4108L94746L87667J41564j8976K708K5091n9645j25804m0966
36261e5599J37194K62841K64079J42166o0831k26840k27270j06618o5103j59248
36251i5229j81521K963J65845J6494l05456l54648R67M03287N17844M03699K31573
36240H05818k5202l54004m55459j24490K92165K59048j77459m30298k34513l208
36230d47602j24232l30485j44928L19504M71727R9197l12275k35181K22382N06740
$$ y = [433337, 414639, 25565, -284872, -123572, 250862, 343159, 132272, 10028, 169778, 409612, 506406, 487208, 489667, 575385, 743821, 958714, 1085280, 939830, 507577, 42134, -146733, -1822, 220893, 206764, -100748, -443436, -538710, -416715, -380763, -595850, -836092, -761984, -367238, 20429, 161993, 143017, 145725, 170816, 111171, -14633, -55599, 81595, 344436, 608515, 750681, 689850, 463010, 235740, 129122, 64019, -95229, -276750, -273787, -107942, -91448, -396904, -751552, -750585, -347298, 170546, 574245, 805818, 780616, 426612, -28847, -153337, 138828, 397876, 220417, -209881, -444394, -447602, -571834, -902319, -1047247, -727743, -256016, -156819, -469094, -704275, -481893, 24847]
36220B4847L38199J2827k3505K53697M22538J50225l68875o32556m49327j46463
36210d18393q0950j45950N349L53652M68852J46803k26809j91144J21374J78487
36200B11271j54850m10082k15824J62544K50856N7173m6142K1319l4487k99492
36190d57714m37775k11871J59943L74093M32848M19517K21009j87742m70433l48284
36180e06409p4817n4104j69249k325L85554M75818J23745j94499j01022K17400
36170A00092M30574M76424L56111N04m05061m33239o2297J35340j95271o26806
36160b23629o01072k20067Q2094K44439M00159L68789j3514l43795j55711K26927
36150b35380J16690l75770m62452K5477L74225K08213N3169K96972M63412J11902
$$ y = [24847, 363046, 375873, 352368, 606065, 1028603, 1178828, 809953, 177397, -271930, -418393, -499343, -645293, -639944, -286292, 182560, 329363, 102554, -88590, 32784, 211271, 56421, -353661, -569485, -406941, -156085, -98912, -145054, -123735, -158222, -457714, -895489, -1107360, -947417, -573324, -140476, 279041, 500050, 312308, -158125, -506409, -581226, -635330, -804579, -806904, -421350, 54468, 178213, -16286, -117308, 100092, 530666, 1007090, 1363201, 1363705, 958644, 525405, 463108, 598448, 403177, -223629, -824701, -1044768, -962674, -718235, -318076, 50713, 37199, -306596, -462307, -235380, -118690, -494460, -956912, -931435, -557210, -348997, -295828, 1144, 464556, 576458]
36140E76458k83763j05378L21227K44890k65130m54319r4417K67981K60192J16855
36130E84596O0786n4175k70323k98456m7459J16711m4468k18930m5043L07859
36120I1098M15843J98852q9954k65483k93819j60066M6794Q1774j31880k89832
36110c96673j21681J52371J38159j00557j46617J01156L10104K78029J65122Q3511
36100D62924q2293k84285k10469J52099K95322p8814m83216l10309K02304K93303
36090d3434j38304l59970N2398N44746M16072j65878m75420k71484J3852M2006
36080c85416o331J17037K80308K34675N7259J7249J15348P5253j84532l60868
36070d0018k02083P6471O9631k16829l55883j33854J25526N9797j75846j56449
$$ y = [576458, 292695, 187317, 508544, 753434, 488304, 33985, -60432, 207549, 467741, 584596, 645382, 591207, 320884, 22428, -25031, 91680, 47212, -171718, -216761, 91098, 506941, 705793, 615839, 350356, 56537, -103529, -56735, 25039, -106841, -396673, -518354, -365983, -227824, -328381, -474998, -373842, -63738, 214291, 379413, 462924, 380631, 96346, -114123, 37976, 333298, 254484, -228732, -539041, -336737, -43434, -181738, -541708, -489310, 55436, 471508, 305630, -169790, -441274, -427422, -385416, -391747, -274710, 5598, 240273, 297532, 314781, 430129, 505382, 320850, -40018, -242101, -165630, -95999, -312828, -668711, -802565, -677039, -617242, -793088, -949537]
36060i49537J67686M33939M25666L01047K26837J41243J358n4389K8080N2099
36050G74029j31919l75411m59260l63367j40117K26933O09471O42911J76524l62615
36040E97179m08811K7196L92586K84100j65699n34552m95930l6000M73327N20570
36030F53966K3020m82526m79049j04064J85979L23544M98623N35901Q9951n68432
36020F76913p03903k08824J70177k2177k79723n1430L14505J74001l20251m44357
36010f95069P873N23035O65957N01963K39213l5882k17760k01036j02582j24400
36000E61312j90325o7035J71127J99709n3o3202J62768L29601R5819l70394o20090
35989B09237m66288j11948J36499J42154L809p1656p737N5722o19n6036N2808
$$ y = [-949537, -781851, -347912, 77754, 378801, 605638, 746881, 748239, 693850, 721930, 774029, 642110, 266699, -192561, -555928, -696045, -469112, 140359, 783270, 959794, 597179, 188368, 215564, 608150, 892250, 726551, 191999, -303931, -339931, 133396, 653966, 676986, 194460, -284589, -388653, -202674, 120870, 619493, 1155394, 1245345, 676913, -26990, -235814, -65637, -87814, -367537, -418967, -104462, 69539, -250712, -695069, -687196, -164161, 501796, 1003759, 1242972, 1207090, 989330, 788294, 685712, 561312, 370987, 303952, 475079, 674788, 674735, 611533, 774301, 1103902, 1199721, 829327, 209237, -257051, -368999, -232500, -90346, -86537, -158193, -165930, -110208, -110827, -166863, -114055]
35978a14055K21439K23837R8584Q4728K01464K24829R6530O503J5955l8648j72661
35967H48505j61967K6895Q9771j23154l17949k16305J2766P5793K3057N2695Q2689
35956C92796r6808l90342m85107k90065K6131L40093N89315N74434J35223m67497
35946C28173p10571m33893j5708J60095J25205R0746O6887n7913k18989k03451
35936h69419M3182L02560L20554Q8732j58695k15935j19805m3175k0907Q5566
35926e87342L24798N13112M57402K02970n3323j94852k21049j65770j04346j29478
35916D2122j97597j33319Q3642K13357J09814k8344M228O0562n5964j57162J9647
35905c9014K36741N2872l55076l19023K39377N25880J9999o78135o70784j4784
$$ y = [-114055, 107384, 331221, 429805, 514533, 715997, 940826, 1037356, 1043859, 1059814, 1021166, 848505, 686538, 713433, 803204, 680050, 362101, 145796, 158562, 234355, 257412, 310107, 392796, 295988, -94354, -579461, -869526, -843395, -503302, 86013, 660447, 795670, 328173, -382398, -816291, -831999, -671904, -546699, -455953, -389066, -446979, -665968, -869419, -826237, -523677, -203123, -114391, -273086, -489021, -608826, -652001, -672908, -587342, -262544, 250568, 707970, 910940, 857617, 662765, 441716, 275946, 171600, 42122, -155475, -288794, -205152, 8205, 118019, 89675, 93903, 154465, 98501, -58661, -39014, 197727, 250599, -104477, -423500, -184123, 341757, 361756, -316379, -987163, -1001947]
35895a001947M67534L89569J49366J21514J50011K1829q1264O4231K52732J15047
35885F48622k87216m85125k34536J43731J77509j56537m20765k71884J45335M29741
35875c11125M08145K34142Q2355l9601j48428j58565j3728J69237J97948N876
35865D26256k70806l68744j06321L50837N20731J44843l63869l66994R2910K95509
35855C54352q9859m68175k25267L06815L74507k0321j78441J55763M45346K76853
35845I31573l7787o5637Q0783P2325m7530m6374j472j51634l92780l65056k3856
35834d7445K58016K23197N4365M1124J58615J61547k7910k18852k22626p8058
35824C01973M3194N4624j2967j25525k44558k35456J6158L33699L28768q2537
$$ y = [-1001947, -534413, -144844, 4522, 126036, 276047, 297876, 216612, 280843, 533575, 648622, 361406, -123719, -358255, -214524, -37015, -193552, -614317, -886201, -740866, -311125, 97020, 331162, 413517, 373916, 225488, 66923, 53195, 222432, 420380, 426256, 155450, -213294, -319615, 31222, 551953, 696796, 332927, -34067, 58843, 354352, 264493, -203682, -428949, -122134, 252373, 232052, 53611, 209374, 654720, 931573, 893786, 828149, 908932, 981257, 933727, 887353, 885881, 734247, 341467, -23589, -47445, 210571, 433768, 488133, 529257, 687872, 849419, 821509, 602657, 380031, 301973, 345167, 399791, 386824, 261299, 16741, -218715, -202557, 131142, 459910, 377373]
35814C77373m53905l47998O8136K76120J27637o1490p9013n0503o2908J6297K02084
35803A1830K54405O6912j35129j72893j61484j77637l9804L02121M99877K85166
35793G33364o4590j28828J6515j2191k41705l20074r3931K10102L73719L86622
35783H59003K45644r0360m77506o12334l76315L2530L36038L85804J91617o9344
35773D24777j53732n9363q9871l74533n43559k51827J88060K05669j26993k04443
35763i85815J21062L39563K06682J47374M09174M90699m5536p09747p03462r5778
35753h25784L06304J38009j41126r3831P4607j8124k79366k94177P0394M96541
35743e66553O01448L24226p0258k83982k54729j46237j04332r7966l0051Q9148
$$ y = [377373, -76532, -424530, -356394, -80274, 47363, -14127, -93140, -143643, -206551, -190254, 11830, 266235, 333147, 198018, 25125, -136359, -313996, -353800, -51679, 448198, 733364, 668774, 539946, 556461, 544270, 302565, -17509, -111440, 98662, 472381, 859003, 1104647, 1014287, 536781, -75553, -451868, -419338, -83300, 302504, 494121, 424777, 271045, 211682, 121811, -252722, -796281, -1048108, -860048, -654379, -781372, -985815, -864753, -525190, -318508, -171134, 238040, 728739, 683203, -26544, -730006, -825784, -519480, -381471, -522597, -616428, -541821, -559945, -839311, -1133488, -1063094, -566553, 34895, 359121, 288863, 4881, -249848, -396085, -500417, -598383, -628434, -539286]
35733e39286J63142J44097O7691o79M263J11862K51092K84470J57467n0092k44863
35722C49164l87675m15779k52325K9652K06828J82590J31416K37794M05730L73614
35712H61009M9541l78513o10733m59766j7800L41607K75476j29870m23415l36196
35702h28660p6992L0205j4152J1154J87901M04067N18285M14224O5578k86703
35692D24907k56893J49862L76996J7462n51831o51663k52837N2502j5025o8149
35682g74669K27426N66414M44506j07067n52790n01438q5222K75570L35765K29663
35672E8158K42389L94471L61379q0049o36375p50287k54133M28807P51860N50386
35662A066606Q7653k29929j83327N6827P9999k64752n99259m55621R5552N21196
$$ y = [-539286, -376144, -232047, -164356, -165035, -160772, -48910, 202182, 486652, 644119, 594027, 349164, -38511, -454290, -706615, -676963, -470135, -287545, -156129, 81665, 487395, 861009, 910550, 532037, -78696, -538462, -556262, -214655, 60821, -69049, -492464, -828660, -905652, -875447, -889599, -878445, -690544, -286477, 231808, 646032, 711610, 424907, 168014, 317876, 694872, 712334, 160503, -491160, -743997, -691495, -706520, -774669, -547243, 19171, 463677, 356610, -196180, -697618, -782840, -507270, -171505, 58158, 300547, 695018, 1056397, 976348, 339973, -410314, -664447, -235640, 516220, 1066606, 1154259, 924330, 741003, 797830, 877829, 613077, 13818, -441803, -346251, 174945]
35652A74945M86786J62691j05798j43705K9117K21876J33929k91175o07225l54666
35642b93225K00647L11568j72151n23499j94596L73260M23443k8383l06012o3190
35632b72138L49082M61908K29701m7798p9066J67008L98171K48487k58396o28747
35622E68212m80967n3373J33348j2842j14881N1248K50804J88518o7173k19847
35612B43047j51173k5685k9767j32731j65888q6459k9118m2716M7255L27610N12505
35601D66880K85641j64092l45876j83381n9755j01028J4258L39614L83107o5870
35591E69498m12426j12177M19097M09099j05390m34105l27550j64874j47705n4187
35581c60720J74142K82990K32193K53497K91573J1781n01049o76438k91524J98345
$$ y = [174945, 661731, 824422, 718624, 574919, 604036, 825912, 959841, 668666, 61441, -293225, -92578, 218990, 46839, -476660, -671256, -297996, 125447, 97064, -208948, -272138, 76944, 538852, 768553, 720755, 641689, 808697, 1206868, 1455355, 1196959, 568212, 87245, 33872, 167220, 154378, 39497, 90745, 341549, 530067, 462894, 243047, 91874, 66189, 36422, -96309, -262197, -348656, -377774, -420490, -373235, -45625, 466880, 752521, 588429, 242553, 59172, -583, -101611, -87353, 252261, 635368, 569498, 157072, 44895, 463992, 873091, 767701, 333596, 6046, -158828, -306533, -360720, -186578, 96412, 328605, 582102, 873675, 885456, 384407, -292031, -583555, -385210]
35571c85210L62918K72859Q0868k60631n98256n08812K2110M09260L02463N4885
35561b47546J3706k1113j90260j11109L77580O43412J75224m63640m22473J35814
35551a10405M12132K86287K64503L51647O0342m93706n91686j44630R9194j72892
35541c9214l52592n8695K01352K1111j65838K7998J60467j59465l56108J92876
35531e28108Q86900O53116l20155p30242n3664P39106O24939j56846o54472m71361
35521a0787p806K17097P0652k21311l50472k15206Q090J39350K24268L15405K33766
35510D03046j10655l58010j35109K78615K90340o2149j69488J03072J86800j54827
35500B71635l48431M756L87286K06486k22204k46313L8318P2513j26379p4840
$$ y = [-385210, -22292, 250567, 331435, 70804, -527452, -1036264, -1014154, -604894, -302431, -247546, -233840, -254953, -445213, -556322, -178742, 464670, 639894, 176254, -246219, -110405, 301727, 588014, 852517, 1204164, 1264506, 770800, 179114, 34484, 133678, -39214, -391806, -450501, -249149, -228038, -393876, -365878, -205411, -364876, -720984, -528108, 358792, 1011908, 691753, -38489, -92153, 646953, 1271892, 1115046, 460574, -10787, -18593, 198504, 269156, 47845, -302627, -517833, -509743, -370393, -146125, 169280, 403046, 292391, -65619, -200728, 77887, 368227, 306078, 136590, 239662, 426462, 271635, -76796, -72040, 315246, 521732, 299528, 53215, 91533, 164046, 37667, -37173]
35490c7173J96357J64161j90259k87885L802R6157k47775l90228J25690O91894
35480A24741M90307k36669n27192q7670L90866K95151j62898m19403l03237n5777
35470d91781R5235J14540M3926q1933k10840k59754j63950L9187J80124R3135
35460f42111j69306l43870k45184L7731K92382M10365L83787K26349L4953o090
35450b0994J50541L00037K64503J58354J62898J68367n7453l96759m30853m2341
35440B56300L41029K86783p5207k60191q9609J14061J5712k64742l26763m7625
35430e0252K34374J58952j94998m43685l85398j34507J61539M35863N22598K41037
35420E45523j98319k59414J80379N22545K62627k17944k04389K36631L59236q2854
$$ y = [-37173, 159184, 323345, 133086, -154799, -150997, -54840, -302615, -692843, -567153, 124741, 615048, 378379, -148813, -236483, 154383, 449534, 286636, -132767, -436004, -491781, -396546, -282006, -238080, -320013, -530853, -790607, -954557, -915370, -735246, -642111, -811417, -1155287, -1400471, -1362740, -1070358, -659993, -276206, -49857, -14904, -20994, 129547, 429584, 694087, 852441, 1015339, 1183706, 1126253, 729494, 298641, 256300, 597329, 884112, 808905, 548714, 459105, 573166, 588878, 324136, -2627, -50252, 184122, 343074, 148076, -295609, -681007, -815514, -653975, -218112, 304486, 545523, 347204, 87790, 268169, 790714, 1053341, 835397, 631008, 867639, 1226875, 1144021]
35410A144021m68561k98103R7772J78260j6220j41774j99147l70950m81467j85199
35400g41368M00934P49939O05665K05516j71632m67380o10912m51560p8215J46374
35390d12639P1391j3646J37871K86370O0744m08240n76285k04920L19413M91149
35380b48792K82813O3464N6311J07155J20j98861k47949q4223R5203J06187j9782
35369h8354j53169k37173k36461n2329L27200O54338O10403J96902k28134l53967
35359D39256k11310j6229J00142R9262m8742k68979l20170n8042K88582L43743
35349C47513Q9921j07430m9840l750k56266n91110n15456M7897N88718N99129
35339A49326J36838l01580l41307n6147K01847K07971P8615P0306J97423J93523
$$ y = [1144021, 675460, 377357, 475129, 653389, 637169, 495395, 296248, -74702, -556169, -741368, -340434, 409505, 1015170, 1220686, 1049054, 581674, -29238, -480798, -559013, -412639, -341248, -354894, -217023, 69347, 130091, -278149, -854434, -1059354, -739941, -248792, 34021, 97485, 153796, 260951, 261071, 62210, -185739, -269962, -174759, -68572, -88354, -241523, -478696, -715157, -767486, -440286, 214052, 824455, 1021357, 793223, 439256, 227946, 211717, 311859, 411121, 362379, 93400, -226770, -284812, 3770, 347513, 437434, 330004, 280164, 276414, 20148, -570962, -1086418, -1038521, -449803, 149326, 286164, -15416, -356723, -412870, -211023, -3052, 75563, 145869, 343292, 536815]
35329E36815o9445l16857k42092J5927Q5561m2552m3036J25819J19452j41181
35319B8411k29467Q0938L47246J27496k78338k95016K1803J65069O3497R3168
35309A24807K64784J48099k78074m36370r6159J60799j43823n62553l83754K66488
35299i35756O07366L07103j73280l07440q7376J87716L27922L25197K39962J32379
35289F23793J6804j20265k12202j41859L4209Q0714n3148j02951O1642J33467
35279C20204j47003m54441k96210J78701L35840J3941k43282n7702K24364J41973
35269A6385j61442k46429r6605m7185j43254o7498K64393M76074K70553j23348
35259A41644k88162j87611j11924j68165j54144L8247K04390J50881p02k6182
$$ y = [536815, 467370, 150513, -91579, -75652, 9909, -32643, -75679, 50140, 169592, 28411, -201056, -120118, 227128, 354624, 76286, -218730, -196927, -31858, 31639, 124807, 389591, 537690, 259616, -176754, -272913, -112114, -255937, -818490, -1202244, -935756, -328390, -21287, -194567, -502007, -589383, -401667, -73745, 251452, 491414, 623793, 640597, 520332, 308130, 166271, 200480, 281194, 228046, 125095, 186737, 320204, 173201, -281240, -577450, -398749, -62909, -48968, -292250, -349952, -125588, 16385, -145057, -391486, -488091, -535276, -678530, -746028, -481635, -5561, 264992, 141644, -146518, -334129, -446053, -614218, -768362, -730115, -525725, -374844, -375546, -401728]
35249d01728P3483J78620L10321N00340N46348K54762j49875k58795j01454r0049
35239H61973l08468l72476j39426N042j51610k25549N6027K46493j30933o85516
35229h44443o45623j1084M82339M39777J71103J2482n3126n8175M5448Q3930j32650
35218e10022k68745J77717Q86849Q99520M9480o26001l61780K43521K51393j98779
35208E43153l22441l1246J04113l3847M495K74250K60908j79231m87750k94930
35198a62526J4282j5161k03703j49420P3141J10759l6515o2919Q9705J71047J04431
35187f6879J33576L79666N57405L37092j75685n42683n23756l01498j47950p1082
35177d21794O4325K14691K02174M7711q320J16119J98781P8879o7209j9533J14676
$$ y = [-401728, -328245, -149625, 160696, 661036, 1207384, 1462146, 1312271, 1053476, 952022, 861973, 553505, 181029, 41603, 46645, -104965, -330514, -274487, -27994, -158927, -844443, -1490066, -1501150, -1018811, -579034, -407931, -395449, -448575, -506750, -461302, -377372, -510022, -778767, -601050, 285799, 1185319, 1234799, 608798, 247018, 490539, 741932, 543153, 220712, 189466, 293579, 259732, 264227, 538477, 799385, 620154, 132404, -162526, -148244, -163405, -367108, -516528, -443387, -332628, -369143, -432062, -342357, -171310, -66879, 66697, 446363, 1003768, 1340860, 1165175, 622492, 98736, -202762, -350712, -421794, -357469, -142778, 59396, 107107, 98787, 214906, 413687, 492566, 425357, 405824, 520500]
35166E20500Q8155o4563r1185N3970J47498O1876p6929j35958j37823j20045n6859
35155A88637O036m8103j85502k10127p9112j2756j35361k14388J2937L94775N18872
35144B35908K60610r1224k71384l26157l57302k40583J48620N60743N38801Q808
35134D66840n34541n62758r3112L85437M52403J08470k98874l77425k8796L90059
35124i2297L81493p7440m35539k96809J2710k3851k65620j62112K63940L87049
35114c08476K9431k05297M2181K51143p0327m72984k69296L14738N04646K13132
35104B8891N1433K18422K54328l0351k13683o4602N9373q4606k01436r6562r2189
35093a70982l54681m06770J12521O90523O12236N0478k18306P116J72477o9869
$$ y = [520500, 608655, 544092, 452907, 506877, 654375, 716251, 639322, 503364, 365541, 245496, 188637, 194673, 146570, -38932, -249059, -328171, -340927, -476288, -690676, -677739, -282964, 235908, 496518, 405294, 133910, -192247, -549549, -790132, -641512, -80769, 458032, 466840, -67701, -630459, -723571, -338134, 114269, 222739, -76135, -453560, -482356, -92297, 289196, 211756, -223783, -520592, -507882, -531733, -797353, -959465, -695525, -308476, -279045, -484342, -442161, -191018, -261345, -734329, -1003625, -688887, -184241, 28891, 80324, 298746, 553074, 522723, 309040, 244438, 303811, 219205, 17769, -78793, -170982, -525663, -932433, -819912, -129389, 482847, 533325, 315019, 322135, 494612, 424743]
35083D24743l95848m28557k56865j22391k5260J16594K38554K76175K81669K24859
35073C33673m7565m61234o05556k50197K46858L70579J49174O1667K87868M49748
35063E35015K19704j63780k54152m0942J11252O6352N5119J57375O9535l63176
35053C92302p24457n37722q086K14905k8664k07851N8850M37788M20067N3384
35043G0516k22239k19242j00081J8224J62507K48555R3024k54669m58666k75731
35033i37802J65513N12751N06780J64321k28603l34007r6114J92460K67646K08907
35023D21852K01333J58674j02976m24725m42817j77856o4165k69788l96503r4397
35013a191368L73866N12628K87328O5741K2263R076k4071R1561L38634L58220
$$ y = [424743, 28895, -399662, -656527, -778918, -804178, -687584, -449030, -172855, 108814, 333673, 286108, -175126, -780682, -1030879, -784021, -413442, -264268, -202601, 85267, 535015, 754719, 590939, 336787, 295845, 407097, 473449, 528568, 685943, 755478, 392302, -332155, -869877, -877963, -663058, -691722, -899573, -840723, -402935, 17132, 70516, -151723, -370965, -471046, -452822, -290315, -41760, 51264, -203405, -662071, -937802, -772289, -259538, 247242, 411563, 182960, -151047, -247161, -54701, 212945, 421852, 623185, 781859, 678883, 254158, -188659, -366515, -430680, -700468, -1096971, -1191368, -817502, -304874, -17546, 48195, 70458, 79534, 55463, 147024, 485658, 843878]
35003H43878m6785m83307l78834K22107N95775K15451n27006p48241j75685M94556
34993A1909M86566q3208m45819k48088P1870M9150j38865q0345J40942J01236
34983a34652k12074l16559K9998M50164M91322J99662r9658l00720m63338m69630
34973h25485j45251L26980N03117K53947p0771j55227r5029r8146r2960Q9240
34963c09585L21363L04082M2482j07955N6839K78981J76179k43020n67646m66828
34953e15108o1101K43717K38095J12291J31415K37743J69426p4540j80488j7927
34943B83523J23538J0532j23400R564J81869j7231m11988l90925J32789N19439
34933C17710L59418M3720L2921J05300j45055m84803l68379J40166M40043L14293
$$ y = [843878, 797093, 313786, -65048, 157059, 752834, 968285, 441279, -306962, -482647, 11909, 498475, 415267, -30552, -278640, -206770, -157620, -296485, -376830, -235888, -134652, -346726, -663285, -633287, -183123, 308199, 507861, 408203, 107483, -355855, -825485, -970736, -643756, -140639, 113308, 42537, -112690, -207719, -305865, -398825, -309585, 11778, 315860, 358342, 250387, 307226, 586207, 762386, 519366, -48280, -515108, -576209, -332492, -94397, 17894, 149309, 387052, 556478, 481938, 301450, 283523, 407061, 417593, 294193, 303757, 485626, 468395, 56407, -334518, -201729, 317710, 677128, 720848, 753769, 859069, 714014, 229211, -139168, 998, 441041, 755334]
34923G55334J37639J31675M2570k69548m85141l48947r2272k6508q3602p0796
34913c09596m8081j06584n8130K64837O02342N49811J23498k99743m92094m84550
34903b58290k87241R9430M35613M11736J07389q2766l3983j9397j55097j51216
34893F6178J39701L19488j2678n62844o60607j96832K32732J97685p210P5411
34883d08976L11580K24673j60755k57452J81106N67790K56545m77425p29680j81346
$$ y = [755334, 892973, 1024648, 1067218, 797670, 312529, -36418, -128690, -155198, -238800, -309596, -357677, -464261, -522391, -257554, 344788, 894599, 1018097, 718354, 226260, -258290, -545531, -446101, -10488, 401248, 508637, 425871, 391888, 372491, 217394, 66178, 205879, 525367, 512689, -50155, -710762, -907594, -674862, -477177, -484387, -408976, -97396, 127277, -33478, -290930, -109824, 457966, 714511, 237086, -492594, -673940]
$$ [...]
##END NTUPLES=NMR SPECTRUM
##END=
