##TITLE=31Pdec_BAU 9-2021
 CDCl3, 24 sc
 9.03.2021
##JCAMPDX= 6.0         $$ Bruker NMR JCAMP-DX V2.0
##DATA TYPE= NMR SPECTRUM
##DATA CLASS= NTUPLES
##ORIGIN= UXNMR, Bruker Analytische Messtechnik GmbH
##OWNER= root
$$ XWIN-NMR		Version 3.5
$$ Wed Mar 10 10:24:34 2021 Russian Standard Time (UT+4h)  she@DPX200
##.OBSERVE FREQUENCY= 81.013821
##.OBSERVE NUCLEUS= ^31P
##.ACQUISITION MODE= SIMULTANEOUS
##.ACQUISITION SCHEME= undefined
##.AVERAGES= 24
##.DIGITISER RES= 16
##SPECTROMETER/DATA SYSTEM= spect
##.PULSE SEQUENCE= zgpg30
##.SOLVENT NAME= CDCl3
##.SHIFT REFERENCE= (INTERNAL, CDCl3, 0, 248.564)
##AUDIT TRAIL= $$ (NUMBER, WHEN, WHO, WHERE, WHAT)
$$ ##TITLE= Audit trail, XWIN-NMR		Version 3.5
$$ ##JCAMPDX= 5.01
$$ ##ORIGIN= Bruker BioSpin GmbH
$$ ##OWNER= she
$$ F:/spectra/data/she/nmr/P31/1/pdata/1/auditp.txt
$$ ##AUDIT TRAIL=  $$ (NUMBER, WHEN, WHO, WHERE, WHAT)
(   1,<2021-03-10 10:23:10.62 +0400>,<she>,<DPX200>,
      <created by zg, POWCHK disabled, PULCHK disabled
       configuration hash MD5:
       00 E9 B6 7A A2 85 ED C7 34 08 36 98 17 FE 4E 26
       data hash MD5: 32K
       4F 69 8B 15 D9 4D 71 62 42 EF C8 E9 AB 7B 11 3D>)
(   2,<2021-03-10 10:23:15.82 +0400>,<she>,<DPX200>,
      <Start of raw data processing
       efp BC_mod = 2 LB = 1 FT_mod = 6 PKNL = 1 PHC0 = -3356.124 PHC1 = 146.6007 SI = 64K 
       data hash MD5: 64K
       A6 73 32 16 DB 3E 0D D4 DA F5 E1 0F 2D 55 2B 63>)
(   3,<2021-03-10 10:23:45.85 +0400>,<she>,<DPX200>,
      <pk PHC0 = -185.4584 PHC1 = 357.3999 
       data hash MD5: 64K
       1A 55 17 C2 14 B8 FE C3 F9 58 AE 46 36 8F EE A9>)
(   4,<2021-03-10 10:23:49.06 +0400>,<she>,<DPX200>,
      <abs ABSG = 5 
       data hash MD5: 64K
       12 86 09 11 28 4D ED 09 D7 C8 C7 B8 F7 6F 76 53>)
$$ ##END=
$$ 
$$ hash MD5
$$ 05 73 BA 7F 04 87 BF D6 BF 78 2F D6 D0 19 AB 40
##$RELAX= 
##$RELAX= 
##$RELAX= 
##$RELAX= 
##$RELAX= 
##$RELAX= 
##$RELAX= 
##$RELAX= 
$$ Bruker specific parameters
$$ --------------------------
##$DU= <F:/spectra>
##$EXPNO= 1
##$NAME= <P31>
##$PROCNO= 1
##$TYPE= <nmr>
##$USER= <she>
##$AMP= (0..31)
100 100 100 100 100 100 100 100 100 100 100 100 100 100 100 100 100 100 
100 100 100 100 100 100 100 100 100 100 100 100 100 100 
##$AQSEQ= 0
##$AQ_mod= 1
##$AUNM= <au_zg>
##$AUTOPOS= <>
##$BF1= 81.014009
##$BF2= 200.13
##$BF3= 200.13
##$BF4= 200.13
##$BF5= 200.13
##$BF6= 200.13
##$BF7= 200.13
##$BF8= 200.13
##$BYTORDA= 1
##$CFDGTYP= 0
##$CFRGTYP= 5
##$CHEMSTR= <none>
##$CNST= (0..31)
1 1 145 1 1 1 1 1 1 1 1 1 1 1 1 1 1 1 1 1 1 1 1 1 1 1 1 1 1 1 1 1 
##$CPDPRG= <waltz16>
##$CPDPRG1= <>
##$CPDPRG2= <waltz16>
##$CPDPRG3= <>
##$CPDPRG4= <mlev>
##$CPDPRG5= <mlev>
##$CPDPRG6= <mlev>
##$CPDPRG7= <mlev>
##$CPDPRG8= <mlev>
##$CPDPRGB= <>
##$CPDPRGT= <>
##$D= (0..31)
0 1 0 0 0 0 0 0 0 0 0 0.03 2e-05 3e-06 0 0 0 0 0 0 0 0 0 0 0 0 0 0 0 0 
0 0 
##$DATE= 1615357390
##$DBL= (0..7)
120 120 120 11 120 120 24 19 
##$DBP= (0..7)
150 150 150 150 150 150 150 150 
##$DBP07= 0
##$DBPNAM0= <>
##$DBPNAM1= <>
$$ [...]
##$SUBNAM3= <"">
##$SUBNAM4= <"">
##$SUBNAM5= <"">
##$SUBNAM6= <"">
##$SUBNAM7= <"">
##$SUBNAM8= <"">
##$SUBNAM9= <"">
##$SW= 501.771253377433
##$SWIBOX= (0..15)
0 1 3 0 0 0 0 0 0 0 0 0 0 0 0 0 
##$SW_h= 40650.406504065
##$TD= 32768
##$TD0= 1
##$TE= 0
##$TE2= 300
##$TE3= 300
##$TEG= 300
##$TL= (0..7)
0 120 53 12 22 120 120 120 
##$TP= (0..7)
150 150 150 150 150 150 150 150 
##$TP07= 0
##$TPNAME0= <>
##$TPNAME1= <>
##$TPNAME2= <>
##$TPNAME3= <>
##$TPNAME4= <>
##$TPNAME5= <>
##$TPNAME6= <>
##$TPNAME7= <>
##$TPOAL= (0..7)
0.5 0.5 0.5 0.5 0.5 0.5 0.5 0.5 
##$TPOFFS= (0..7)
0 0 0 0 0 0 0 0 
##$TUNHIN= 0
##$TUNHOUT= 0
##$TUNXOUT= 0
##$USERA1= <user>
##$USERA2= <user>
##$USERA3= <user>
##$USERA4= <user>
##$USERA5= <user>
##$V9= 5
##$VALIST= <valist>
##$VCLIST= <CCCCCCCCCCCCCCC>
##$VD= 0
##$VDLIST= <DDDDDDDDDDDDDDD>
##$VPLIST= <PPPPPPPPPPPPPPP>
##$VTLIST= <TTTTTTTTTTTTTTT>
##$WBST= 1024
##$WBSW= 4
##$XGAIN= (0..3)
0 0 0 0 
##$XL= 0
##$YL= 0
##$YMAX_a= 12801
##$YMIN_a= -13299
##$ZGOPTNS= <>
##$ZL1= 120
##$ZL2= 120
##$ZL3= 120
##$ZL4= 120
##$ABSF1= 248.5645
##$ABSF2= -253.2056
##$ABSG= 5
##$ABSL= 3
##$ALPHA= 0
##$AQORDER= 0
##$ASSFAC= 0
##$ASSFACI= 0
##$ASSFACX= 0
##$ASSWID= 0
##$AUNMP= <proc_1d>
##$AZFE= 0.1
##$AZFW= 0.5
##$BCFW= 0
##$BC_mod= 2
##$BYTORDP= 0
##$COROFFS= 0
##$CY= -3
##$DATMOD= 1
##$DC= 0
##$DFILT= <>
##$DTYPP= 0
##$F1P= 0
##$F2P= 0
##$FCOR= 1
##$FTSIZE= 65536
##$FT_mod= 6
##$GAMMA= 0
##$GB= 0
##$INTBC= 1
##$INTSCL= 5.30512e-09
##$ISEN= 30
##$LB= 1
##$LEV0= 0
##$LPBIN= 0
##$MAXI= 10000
##$MC2= 0
##$MEAN= 0
##$ME_mod= 0
##$MI= 50
##$NCOEF= 0
##$NC_proc= -3
##$NLEV= 6
##$NOISF1= 182.463
##$NOISF2= 159.3651
##$NSP= 0
##$NTH_PI= 0
##$NZP= 0
##$OFFSET= 248.5645
##$PC= 4
##$PHC0= -3541.583
##$PHC1= 504.0006
##$PH_mod= 1
##$PKNL= yes
##$PPARMOD= 0
##$PSCAL= 0
##$PSIGN= 0
##$REVERSE= no
##$SF= 81.014009
##$SI= 65536
##$SIGF1= 159.3651
##$SIGF2= -187.1042
##$SINO= 113.3802
##$SIOLD= 16384
##$SREGLST= <1H.CDCl3>
##$SSB= 0
##$STSI= 65536
##$STSR= 0
##$SW_p= 40650.406504065
##$SYMM= 0
##$S_DEV= 0
##$TDeff= 32768
##$TDoff= 0
##$TI= <>
##$TILT= no
##$TM1= 0
##$TM2= 0
##$TOPLEV= 0
##$USERP1= <user>
##$USERP2= <user>
##$USERP3= <user>
##$USERP4= <user>
##$USERP5= <user>
##$WDW= 1
##$XDIM= 65536
##$YMAX_p= 457966683
##$YMIN_p= -1403605
$$ End of Bruker specific parameters
$$ ---------------------------------
##NTUPLES= NMR SPECTRUM
##VAR_NAME=  FREQUENCY,     SPECTRUM/REAL,   SPECTRUM/IMAG
##SYMBOL=    X,             R,               I
##VAR_TYPE=  INDEPENDENT,   DEPENDENT,       DEPENDENT
##VAR_FORM=  AFFN,          ASDF,            ASDF
##VAR_DIM=   65536,         65536,           65536
##UNITS=     HZ,            ARBITRARY UNITS, ARBITRARY UNITS
##FACTOR=    0.620285442955139, 1,           1
##FIRST=     20137.2065510759, 0,            0
##LAST=      -20513.1999529892, 0,           0
##MIN=       -20513.1999529892, -1403605,    0
##MAX=       20137.2065510759, 457966683,    0
$$ Real data points
##PAGE= N=1
##DATA TABLE= (X++(R..R)), XYDATA
$$ [...]
36204E35534k19064l83253l1227L45578K67759p8501k19329q7835J2297n3819
36194H8140j08032j0226J32256J54395N3025n5763j05164j34032j91902k32691
36184d09994j58119J3614J12489M3907l7172N7205K20044J69147j00371k46618
36174c35868n5983K53440L54717K33557R6371K4538m8209j16094j00066l1728
36164B74675k6485p1550k8677J20958K00750P6591j43824k31088r9784J00956
36154A72522J46454k6961k38186k41671r017K28363K59474J34174L9223K1336
36144D85711j8830r7172r4384K8054J21660N5762q3777j19969m2461o406q5983
36133A42205j61301j05404R083m021j70474k81920j59654Q0771J50401k4727j73501
$$ y = [535534, 316470, -66783, -98010, 247568, 515327, 436826, 217497, 129662, 141959, 88140, -19892, -30118, 102138, 256533, 309558, 253795, 148631, 14599, -177303, -409994, -568113, -554499, -442010, -398103, -435275, -378070, -158026, 11121, -89250, -335868, -391851, -138411, 216306, 449863, 546234, 570772, 522563, 406469, 306403, 274675, 248190, 176640, 147963, 268921, 469671, 546262, 402438, 171350, 71566, 172522, 318976, 292015, 53829, -187842, -196859, 31504, 290978, 425152, 464375, 485711, 466881, 369709, 275325, 303379, 425039, 480801, 397024, 277055, 234594, 228188, 142205, -19096, -124500, -115417, -119438, -289912, -571832, -731486, -650715, -500314, -525041, -698542]
36122f98542k9858K86571M00020J67085j46003k33174j21106l1966j1582P7376
36112c41179K30220K32381M348k04397j37722R3438J65674j650j64240j21069
36102b44196M0570J20927O0478o5408j73785k04232j22655J3761P5785K9633O960
36091d62162J14428K45689K06994M945j17878K2256K92036L57778P4771l00760
36081D38097l77918j05912J53048R6733j32294k02321q3833r023k0172Q0076K87741
36070A24222K94021p909k60269j49245J06067R9737j38333k39185q7361P5519
36060a82736J01219J05684J46618Q4223j15863k33309j15838O5512O6857p3859
36050a51492j17080K8360K02479K21834Q8611n2365j02554j04493j35632j53598
$$ y = [-698542, -728400, -441829, -41809, 125276, -20727, -253901, -375007, -406973, -418555, -341179, -110959, 121422, 125770, -78627, -216349, -122911, 42763, 41113, -123127, -244196, -203626, -82699, -22221, -87629, -261414, -465646, -588301, -574540, -498755, -469122, -462162, -347734, -102045, 104949, 109894, -7984, 14272, 306308, 664086, 738857, 438097, 60179, -45733, 107315, 204048, 71754, -130567, -214400, -223423, -243595, -163519, 124222, 418243, 410334, 150065, 820, 106887, 206624, 68291, -170894, -258255, -182736, -81517, 24167, 170785, 255008, 139145, -94164, -210002, -144490, -77633, -151492, -268572, -240212, -37733, 184101, 272712, 220347, 117793, 13300, -122332, -275930]
36040b75930m4749J54590K21284L2026k23331k58792m5480K04041L30783L26056
36030D20498J91820o5634k95775k87209n9914J13574O3371p2656j03846p6663
36020a72434j36853k13121p2039K90225N17952L06496j53878l50482q9472K50509
36010A76903K46291P946n1808J02045R1320j92313l28637k5193L63695L40939
36000G31188J107j77842r0502o0657k06393k52587n0908J57441J57937P6633Q4921
35989C70338J01185J0379p8783m5696j6571j35225k34512n9263K45419K18833
35979C76104k53012o50483m25400K54158O53634L76875j63172l26476m9719K16596
35969I105K09263Q9509O907j17538k50022j35418K22033L80197J03712j83050
$$ y = [-275930, -320679, -166089, 55195, 87221, -136110, -394902, -440382, -236341, 94442, 420498, 612318, 546684, 250909, -36300, -96214, 17360, 80731, 8075, -95771, -172434, -309287, -522408, -594447, -304222, 213730, 520226, 366348, 15866, -73606, 176903, 423194, 431140, 379332, 481377, 572697, 380384, 51747, 26554, 390249, 731188, 732295, 554453, 463951, 403294, 196901, -55686, -106594, 50847, 208784, 285417, 370338, 471523, 481902, 403119, 357423, 340852, 205627, -28885, -88148, 157271, 376104, 123092, -527391, -952791, -698633, -44999, 331876, 168704, -157772, -207491, 9105, 218368, 307877, 314784, 197246, -52776, -188194, 33839, 414036, 517748, 334698]
35959C34698k1300L22648K57217j97076m72910l57814k01865k03358j13154J92473
35949d60441M02843K83711M3736o4917j12555k01588j92703j4540R2883m0288
35939b63859j86233r6081P3774O4787n984J21764L27323K65496m1301k17082j36586
35928i3982o9426j28002k1067L88210O48355K67332m70536p18017j62189N19433
35918A60111N43682K8577k79928r4361J17779m9436l44986l19334J1015K76832
35908D9951K73473O7438j97744l30011j49539K02945K74524p2666l38886q5865
35898c06380L47779L44110l1063j80768M4934J92655K5466j53276j07643j6622
35888A59192m0071l9855P7156J63269J30199O3460m1364k45784l45193o9578L52193
$$ y = [334698, 313398, 636046, 893263, 696187, 223277, -134537, -336402, -539760, -652914, -460441, -57598, 226113, 269849, 204932, 92377, -109211, -301914, -316454, -223571, -263859, -450092, -546173, -472399, -407612, -413596, -291832, 35491, 300987, 259686, 42604, -93982, -163408, -291410, -312477, 75733, 724088, 991420, 520884, -197133, -359322, 160111, 703793, 732370, 452442, 358081, 475860, 426424, 81438, -237896, -226881, 49951, 323424, 390862, 193118, -136893, -286432, -83487, 191037, 118371, -220515, -306380, 41399, 385509, 354446, 173678, 218612, 411267, 436733, 283457, 175814, 159192, 119121, 79266, 156422, 319691, 449890, 513350, 471986, 226202, -118991, -188569, 163624]
35877A63624L83141J3150j95116j5222J38969R207r2034M8700J29391m9635j78849
35866C55326m9627L4398j21878j82711N9452K23458N0784o0618J76698K93530
35856G78812j05626m96944k69454J54848J5782m08578k33561M65745O99165J74716
35846G74905k72570q1475K40929J17943j85371j73210L1463J3446k16712l37290
35836h7942k45742q1920M9281R5143R985j06235n5583J28322J73226J6354o4188
35825a69299Q1100K18964J50668M7356J16274K23502J33960r4797k30283k05169
35815B72276j04776K6985J49220J40910k3202j39581l3872J52465J48085m8687
35805E39823j69848n9004J26501J26057j17166l92424m26714j59303J78488K94856
$$ y = [163624, 546765, 559915, 364799, 349577, 488546, 497753, 405719, 454419, 583810, 534175, 355326, 305699, 340097, 218219, 35508, 94960, 318418, 369202, 308584, 485282, 778812, 673186, 176242, -93212, 61636, 77418, -331160, -564721, -98976, 600189, 774905, 502335, 420860, 661789, 779732, 594361, 421151, 452614, 466060, 249348, -87942, -333684, -415604, -366323, -271180, -261195, -367430, -423013, -294691, -121465, -105111, -169299, -88199, 130765, 281433, 328789, 445063, 668565, 802525, 707728, 477445, 272276, 167500, 194485, 343705, 484615, 461413, 321832, 287960, 440425, 588510, 539823, 369975, 310971, 437472, 563529, 446363, 53939, -372775, -532078, -353590, -58734]
35795e8734J44310o3057j39735q9867P866J29018K37714K24983L8330j94347k82427
35784d5946j82230r723J13884J41118O5088p0146j27523J5111K57986L11413M9649
35773E18681k73710l29319j50054l8665p9158m9767J24145J93780M3314m0136
35763h0889J49281L13757J16178k14766k40466n7347j00871l30667k73861J13973
35753f05678L18675J30701k6155J37488L01808J42379j44123k57055k32851j50486
35743c85297Q5439L39493J90542l30387n48356j59650J93940m1663l65279o2516
35733a083734N31478N55534N4221j33300K18088M23574P4388l73652m12770j50554
35723b96727R2878K49976L09990J61533j27101k71532j83181o1381J19J00766
$$ y = [-58734, 85576, 22519, -117216, -207083, -199217, -70199, 167515, 392498, 430828, 236481, -45946, -228176, -237899, -124015, 17103, 82191, 12045, -115478, -100367, 157619, 469032, 518681, 244971, -84348, -234402, -273067, -352225, -401992, -277847, -84067, -40753, -80889, 68392, 382149, 498327, 283561, 43095, -14252, -115123, -445790, -719651, -605678, -287003, -156302, -182457, -44969, 256839, 399218, 255095, -1960, -234811, -385297, -299858, 39635, 230177, -100210, -648566, -808216, -614276, -655939, -1021218, -1083734, -552256, 3278, 57499, -75801, 142287, 565861, 640249, 266597, -146173, -296727, -203849, 46127, 356117, 517650, 390549, 119017, -64164, -125545, -125426, -24660]
35713b4660J82974M6842k08601k23629L3646J77483L8377p6915N2272J79341L3619
35702B10749k11877k16822J2037J54835K2619k08623j96371J56277M94900L77428
35692E95152r3427l03534O636K99947N1029l95945l51367J30803L79365J68296
35682D86955p0874o3724q352k4670L5711J25599j7270l05534l25579l7487J60044
35671d5181J57526K55970M38321K68390k52806m89000j64163J64375L7007j93422
35661A77017p1032J69406R4723j59231k10667j08967j14596j46631M394K01915
35651a63669K03494J10149J16845R5473j09522k55242p0401J96458J21864j88630
35641E6819k67025l3435J28025L776j87896j94898l8409J23698J94467J72413
$$ y = [-24660, 158314, 205156, -3445, -227074, -193428, -15945, 22432, -54483, -2211, 177130, 210749, -1128, -217950, -205913, -51078, -28459, -237082, -433453, -277176, 217724, 595152, 501725, 198191, 204827, 504774, 555803, 159858, -191509, -60706, 318659, 486955, 416081, 352357, 344005, 319335, 355046, 480645, 463375, 157841, -167738, -205225, -45181, 112345, 368315, 806636, 1075026, 822220, 333220, 169057, 333432, 370439, 177017, 105985, 275391, 370114, 210883, 216, -108751, -223347, -369978, -365584, -163669, 39825, 149974, 266819, 362292, 252770, -2472, -72873, 123585, 245449, 56819, -210206, -243641, -115616, -111840, -299736, -494634, -533043, -409345, -214878, -42465]
35631d2465J27935J06934J5050k30016m12637k13451K23152L46800J8576k15605
35621b75727K4502L41324K39207o7822r8841N0614j9161j92167l1373L59869M24102
35610G54527Q1025j44153q279J11557n0492k07521r9618K2939j24283l12857j66013
35599a43168J87258K61677p1990l94818l03251Q5242L08382J30239k00622k92150
35589d33201j08031K6406p8633j91639j9899L24197M69104L13855J27724J03123
35579E33006Q3903j30462m04675m02194n4300K93902K83195k1960k35534j55586
35569b10705K5608P0637J9523r004r7612l05357l55370K0452N08658M91360n6355
35558A01835m62404l04260N2549J17504j7796j0624J12427J25458Q8473J79895
$$ y = [-42465, 85470, 192404, 207454, -22562, -435199, -648650, -425498, -78698, -60122, -275727, -251225, 90099, 329306, 261484, 162643, 213257, 194096, 1929, -29444, 330425, 754527, 835552, 691399, 683120, 794677, 744185, 536664, 437046, 459985, 335702, 22845, -143168, 44090, 305767, 233777, -161041, -464292, -379050, -70668, 59571, -141051, -433201, -541232, -514826, -593459, -785098, -804997, -480800, -11696, 302159, 429883, 533006, 616909, 486447, 81772, -320422, -374722, -80820, 202375, 180415, -55119, -210705, -185097, -114460, -94937, -103941, -201553, -506910, -862280, -841828, -333170, 158190, 101835, -360569, -664829, -612280, -494776, -512572, -523196, -410769, -285311, -196838, -16943]
35548a6943K51987L1482l53854m88939k58190N5246K15093K38359J89231Q2216
35538e4312j2546j6808K6451N6106J16346J84038O6801k54970m08528j22655K55717
35527a64360J95911j99540l38933o0701J69712P6158K76K46596M95878K90174
35517G11171k08727m08370j15517K34250K04978j01512k70632j41079N2496N6052
35507A3110p7360j30256o5786m1368r6019n0917J79505L72623K72497m1052k50085
35496H4892k01025l6013M2349j4198j04022q3195J01432L04847K83654o47k77110
35485A00964k86952j03716J6794j429l0747k89K8342J6263p888m4352r6561o8161
35473d77732J36786M06169M84083K76662m3456k63878l29356k81867j51048J3626
$$ y = [-16943, 235044, 266526, -87328, -576267, -834457, -779211, -564118, -325759, -136528, -54312, -66858, -83666, -57215, -1109, 115237, 299275, 366076, 111106, -297422, -420077, -164360, 31551, -167989, -506922, -567623, -397911, -321753, -321477, -74881, 420997, 711171, 502444, 94074, -21443, 212807, 417785, 316273, 45641, -95438, -42942, 13110, -64250, -194506, -260292, -301660, -397679, -448596, -269091, 103532, 376029, 334977, 84892, -116133, -152146, -109797, -123995, -228017, -311212, -209780, 95067, 378721, 378074, 100964, -185988, -289704, -272910, -274339, -305086, -305375, -277033, -260770, -268658, -313010, -409571, -477732, -340946, 65223, 549306, 825968, 782512, 518634, 189278, -92589, -243637, -230011]
35463b30011J04770N8153m5424o0622M8365J74348K07747J44207K8535j22473
35453C07595k58581k42093j9928J87096R6737j97216k71081K7720L20354K46253
35443A96856k1429j10569k9005k3296q3850l9636K5599o2709j36355N1164K60405
35432B7175Q8210k38630j27288L20277L53544j56895m03917K9077M20370Q8459
35422D00382m63538l68288K23513M57350J12990k32033k03767j8240Q5632J32540
35412A26541J14091m3013j88826q8714J57779K36982J02132m4062j35854k16955
35402B0101j73479O7008K18390m264l40113l04638N5089K62263J78311R0373P0787
35391A39828j23071m39515m37877P240M22310L90856Q3966q4210J1813K17993
$$ y = [-230011, -125241, -67088, -112512, -173134, -124769, 49579, 257326, 401533, 430068, 307595, 49014, -193079, -213007, -25911, 70826, -126390, -397471, -369751, -49397, 196856, 175427, 64858, 35853, 12557, -71293, -110929, -85330, -148039, -284394, -233230, 27175, 115385, -123245, -250533, 69744, 423288, 266393, -137524, -108447, 311923, 400382, -63156, -431444, -207931, 249419, 362409, 130376, -73391, -91631, -5999, 126541, 240632, 197619, 8793, -79921, 77858, 314840, 416972, 372910, 237056, 20101, -153378, -86370, 132020, 127756, -212357, -516995, -461906, -199643, -21332, 69041, 139828, 16757, -422758, -860635, -853395, -431085, -40229, 43737, -40473, -28660, 189333]
35381A89333L49552K64485n9521l93144m24331j44371J40110K05699R7880o5736
35371A59956k10719k35539r8602M0654K5820j9609Q9976K22976J40248k5907M5368
35360A34622K60671K01508j59624l52481j29278J89246K47372J01984m0619j40454
35350C12947j86548r6299O4908P8051o6039j08925M4672J65693R1697n8420j75499
35339F6238l03385l68208j64550K16049L46744P9137j82891p8474J93228K39629
35329D3517M9150j10332j21649n4506L5665J03019Q0358K8578J01925K23727R7697
35318D77149k68823m09203n7819L65968L17285q7774k82614q8599J18493M9331
35308A33394j17673r3116R5168J91705P1464j25389j71604j0877J68906J43991
$$ y = [189333, 538885, 803370, 743849, 350705, -73626, -217997, -77887, 127812, 225692, 159956, -50763, -286302, -384904, -344250, -318430, -338039, -248063, -25087, 115161, 89254, 134622, 395293, 596801, 437177, 84696, -44582, 144664, 392036, 494020, 453401, 312947, 126399, 30100, 95008, 173059, 107020, -1905, 42767, 208460, 300157, 241737, 66238, -237147, -605355, -769905, -553856, -207112, -127975, -310866, -389340, -196112, 43517, 92667, -17665, -139314, -193820, -158155, -55136, 25222, 53800, 155725, 379452, 477149, 208326, -200877, -258696, 107272, 424557, 336783, 54169, -34430, 84063, 133394, 15721, -77395, 17773, 209478, 280942, 155553, -16051, -26928, 141978, 285969]
35298B85969p8645k78665k89863j35180Q1878K52750K41191K848k45773k16516
35288c80006M1783J84088Q3147j1382N0336M3998j87410l54334j37683K50562
35278d16901L29944N1414j71860j06309K0201m3017j79491j27120J20538L26496
35268a96105L24389J65140q486j05288r9541j1307O8580Q613k02922l57253k29436
35257f43616R3209K63774J44589J8512J52336L51819K46135j15264l15149j85538
35247A0807M172J7218o7833j43659k63305l73430k30470J66726L96374J84932
35237b98468j28880q4443J80839J73482j20497j88745J59723M31655J90144k56198
35227E8612k98770P8389L08142Q5363k45758k61269l1423J16111J18859J34556
$$ y = [285969, 207324, -71341, -361204, -496384, -414506, -161756, 79435, 82283, -163490, -380006, -338223, -154135, -70988, -82370, -32034, 11964, -175446, -529780, -667463, -416901, -86957, -35543, -207403, -313712, -293511, -336528, -516019, -643139, -522601, -196105, 128284, 293424, 284938, 179650, 80109, 68802, 137382, 145995, -56927, -414180, -643616, -550407, -286633, -142044, -123532, 28804, 380623, 626758, 511494, 196345, 10807, 14979, 32197, -35636, -179295, -442600, -816030, -1046500, -879774, -483400, -298468, -427348, -511791, -330952, -157470, -277967, -466712, -306989, 124666, 314810, 58612, -240158, -161769, 146373, 231736, -14022, -275291, -306714, -190603, -71744, 62812]
35217F2812J54663M7158q8205j2713J89477J63640j06927j92993P6588K59972
35207E53472m268l58946k66459J15037J75100j77972m06050k13182O0196O7652
35197d55420l2439L9985J91399J70630K2690j831J32524J91036J8277k33745k75407
35186b32301l1675K23686J66248j37188k63186j7305K49793J51815j37263j66178
35176a93554P6081J89113N4881l580J68282K74055P8651k03406k67732j46637
35166B6154m1333O594N0666O3020K0029j4498l1478j08998j98815j16588J39469
35155b05778L13101K58069J18901K3482r9085k38572j87014O4053J45354j56878
35145C5633m73441l32343J37775L86600K11034n4747r9411j6929m4012j85099
$$ y = [62812, 217475, 264633, 176428, 163715, 353192, 516832, 409905, 216912, 293500, 553472, 549204, 190258, -76201, 38836, 213936, 35964, -370086, -583268, -523072, -455420, -487859, -447874, -256475, -85845, -63155, -64986, 67538, 258574, 276851, 43106, -232301, -263976, -40290, 125958, -11230, -274416, -291721, -41928, 109887, -27376, -193554, -117473, 71640, 126521, 122941, 291223, 565278, 643929, 440523, 172791, 26154, -15179, -8585, 42081, 105101, 125130, 110632, 79154, -29844, -228659, -345247, -205778, 107323, 365392, 484293, 507775, 408690, 170118, -16896, 47157, 192511, 35633, -437808, -770151, -632376, -245776, -34742, -89489, -188900, -205829, -249841, -434940]
35135d34940k43895j05490J15893J93437N2631r1790K6031L15949L51940n9185
35125A20581n08469m34291J33319N53187L44846k40300n49291l01394J41902K74623
35115d65287N3019j22066K8254L01576L07998j4221l35937l39523l9896K84590
35105c41493L70546J86294n1326j03599N330K8581j20543k02493j6238K52467
35095G526K79503O7381r7975o8107M7327J14682Q5175o5233k67048l12434j25435
35084c34638L5484p4242k66655j89832J07199K70693K08785J26265N9393j30852
35074a88400l05869j28382L09099M59461J07757k87903k69700K7265K12128J91233
35064A26689R5434l6181k00378k76448j83419l9701K628n1910j00109l7471J96062
$$ y = [-434940, -678835, -784325, -668432, -474995, -422364, -514154, -488123, -172174, 179766, 120581, -387888, -822179, -688860, -135673, 209173, -31127, -580418, -881812, -739910, -465287, -412268, -534334, -506080, -204504, 103494, 89273, -246664, -586187, -626083, -341493, 29053, 215347, 164021, 60422, 65752, 94333, -26210, -228703, -244941, 7526, 287029, 354410, 256435, 188328, 235655, 350337, 435512, 370279, 103231, -209203, -334638, -299154, -373396, -640051, -829883, -722684, -451991, -243206, -116941, -57548, -188400, -494269, -622651, -313552, 145909, 253666, -34237, -303937, -276672, -64544, 126689, 222123, 185942, -14436, -290884, -474303, -514004, -511376, -563286, -663395, -700866, -504804]
35053e04804M61914M04284r1789n37387l88451J23062K77310l0686j71786J16294
35043c42039K90119j3867l10802r7692K85834K53851o5246j40725M9823J07256
35033A6512k8678o2106M8380N7150n7672p5625J5828K3728l7728J5392J20284
35022C5465L2530j94998k29464N339K03653J55943j919r5936j38170j39051k236
35011c68844K40767L35054J24411j86267k62876n7296J53789J29875m8370j15645
35001e5402R857J20423K8849j52306j81873l3014J26701K10694K34021J34070
34991D42020j36576l70998k87681L2960K12329J05529n6216q6440n4368k4622
34981b24063N0122J15108N6355o933J25228K81211J06740k68764l39542q1792
$$ y = [-504804, -42890, 361394, 269605, -267782, -656233, -533171, -255861, -286547, -458333, -342039, -51920, -65787, -376589, -474281, -188447, 65404, 158, -140567, -90744, 16512, -12166, -74272, -25892, 31258, -26414, -102039, -86211, -62483, -100211, -84819, 35465, 67995, -127003, -356467, -351128, -147475, 8468, 6549, -89387, -227557, -366608, -368844, -128077, 206977, 331388, 145121, -117755, -175051, -21262, 108613, 60243, -55402, -45545, 74878, 103727, -48579, -230452, -263466, -136765, 73929, 307950, 442020, 305444, -65554, -353235, -320275, -107946, -2417, -58633, -145073, -199441, -224063, -173941, -58833, -2478, -9411, 115817, 397028, 503768, 235004, -104538, -186330]
34971a86330l1697l21357l78422P5696M66144K82684j14829j76363l7348p4537
34961d96359j31931R4583L42710J97180j24570j21040J44857K40588J39334J05271
34951C90623O2318j97047m01147j58625K51594K33268j19704j84346J02875J82143
34941A61952q2230j70838J17739K97356O8049j85187j05165P6573O5311K3992
34931B67552J67588L05507J88930n3890j77988j99022k15641j64042k5792J4417
34921A07619j16233j84536k7169J46374Q5545j08517j80472j03020j7745K7207
34911c70947N7760M8975J1991N3700J82017K17543O9222p4305j8865J26341J24777
34900D28209k3626j17463q4001n7101j28315j99773j42431N921Q4488K8956k7476
$$ y = [-186330, -218027, -539384, -917806, -842110, -375966, -93282, -208111, -384474, -421822, -496359, -628290, -533707, -190997, 6183, -118387, -239427, -94570, 146018, 285352, 390623, 452941, 255894, -145253, -303878, -52284, 180984, 61280, -123066, -20191, 161952, 79722, -91116, 26623, 323979, 392028, 206841, 101676, 178249, 243560, 267552, 435140, 740647, 929577, 875687, 697699, 498677, 283036, 118994, 93202, 107619, -8614, -193150, -220319, -73945, 11600, -96917, -277389, -380409, -398154, -370947, -313187, -264212, -252221, -198521, -16504, 201039, 270261, 195956, 177091, 303432, 428209, 404583, 287120, 203119, 146018, 17703, -182070, -324501, -318580, -234092, -205136, -232612]
34889b32612O9289K44600K37908n1595l74955m04533j25305J71725K44128J15789
34879a05561m0930j07862p5682J2339J05565J44080O2494j28336k53035j04118
34869d91046K35337L70587J03753k05982j10299K37282K95555j6374k17729p6197
34859A24887O0876o1367j86163j08014q8817k91692l28530R2242N17948L76364
34849A07734r5768k21976N1439J65004q7857k94794j59010R9595J94481J44377
34839i6775O8208j0225n0633N700Q0544O2818L3210J06426J40751n6838l24123
34828d0937l24326q0548O2721o833m8020P2612J66841O1250j32361j81913r911
34817d61425K22639K35308o1552l27889j32269L66113M85223R803l81087r5906
$$ y = [-232612, -163323, 81277, 319185, 267590, -107365, -511898, -637203, -465478, -221350, -105561, -146491, -254353, -330035, -317696, -212131, -68051, -5557, -133893, -386928, -491046, -255709, 114878, 218631, 12649, -97650, 139632, 435187, 418813, 201084, 124887, 185763, 124396, -61767, -169781, -258598, -550290, -878820, -786578, -268630, 107734, 11966, -210010, -158571, 6433, -81424, -376218, -535228, -435633, -241152, -96775, -28567, -38792, -89425, -83725, -3181, 59637, 92847, 199273, 340024, 283186, -40937, -365263, -445811, -383090, -389923, -437943, -365331, -198490, -137240, -269601, -451514, -461425, -238786, -3478, -65030, -392919, -525188, -159075, 326148, 335951, -45136, -141042]
34807a41042M46358M62064l0172l82902l65704k85453k46141o1294J67354J18844
34797c18088j11620j24054O3269Q1657l6951Q3900L58713K83786j35281l13607
34787a68276r4312O564k04990k20203J86420M18492L6342m32960l00205K14842
34777e58286L88454Q9701j85130j53775k7704k3320o3945q33J56313K64464J83133
34766F9072o7464k58065k00395k5930P830o0991Q193J84215J96134N2152N7948
34755c7301K38295K36584n8385k76850j69884J3724O84p8424n327J46127J99663
34744B08906J31987l7062k68723l10691P8211N80657N34441r9244n61399l78842
34734a21759p547N644j26881J7752K30049P6179k47976k19804R9322J95481Q061
$$ y = [-141042, 305316, 767380, 737208, 354306, -11398, -296851, -542992, -604286, -436932, -318088, -429708, -553762, -490493, -408836, -445787, -361887, -3174, 280612, 145331, -168276, -262588, -256024, -461014, -681217, -494797, -76305, -39963, -472923, -773128, -558286, -169832, -80131, -265261, -419036, -446740, -470060, -534005, -534838, -378525, -114061, 69072, 1608, -256457, -456852, -482782, -474952, -535943, -527750, -343535, -147401, -95249, -37301, 200994, 437578, 379193, 102343, -67541, -53817, -53133, -131557, -136884, 9243, 208906, 340893, 303831, 35108, -275583, -197372, 383285, 917726, 818482, 257083, -121759, -129306, -123662, -250543, -232791, -2742, 73437, -174539, -394343, -295021, -99540, -91479]
34723i1479k7065J85274K35543j4610j58507K7103J65913o2027l19968j21217
34713a81040L61563M93362Q7986l40198l12569J882J23767m2628j60896j2036
34703A9193K28284K98064J62028p3572l08050l89578j80085J50921J83174j59039
34693f8660l63177k3712M84679M81973m1476m34908l17670P663J18162j2433j72113
34682c41672k10047o2054K14360L61800J76418j34337j67384R6287K84531K15843
34672D33745Q6969L2564p3185k58299k99407r9033J10079J03331n2838j69971
34662a86045j57860k3530J23637Q4549j61284k98550j08880J02877l4946k47985
34652i08017K5910O29009P54511J41242m99458m96489m0975L04244L57353K32511
$$ y = [-91479, -118544, 66730, 302273, 287663, 129156, 156259, 322172, 260145, -59823, -181040, 180523, 673885, 761871, 421673, 109104, 110986, 234753, 192125, 31229, 19193, 247477, 545541, 707569, 633997, 325947, -63631, -243716, -92795, 90379, -68660, -431837, -455549, 29130, 511103, 469627, 34719, -282951, -275288, -157126, -169559, -341672, -551719, -613773, -399413, -37613, 138805, 4468, -162916, -66629, 217902, 433745, 520714, 553278, 480093, 221794, -77613, -176646, -66567, 36764, -16074, -186045, -343905, -367435, -243798, -159249, -320533, -619083, -727963, -625086, -660032, -908017, -882107, -253098, 501413, 642655, 143197, -353292, -394267, -90023, 267330, 499841]
34642D99841j3132k76167l32388j75417q5023j31501j7265L55116O05051M48690
34632H77805J24433n1642j31918k30558k09540l1117n487k76364m34348j00881
34622d69617M01869M47319j7954m36489l85058J949L10817K84400l382k51802
34612a17948k35902l6660J22817J95946K40080J34611k40563n81770l99371K37506
34602f81254O65488M83963J0595k76731l08943k38706j05122P1120J83130K11367
34592A4907K26111J59514q1055k80904j44709J54835J74420o3008j28776J3141
34582D4476k4897k26411j14399L08825M12037N717k87112r5740J16501j3223r1772
34571C4002J82152L37914j5184l87355k08735J99380K19247n0653j44273r0711
$$ y = [499841, 486709, 210542, -121846, -297263, -382286, -513787, -531052, -175936, 429115, 877805, 1002238, 950596, 818678, 588120, 378580, 347463, 341976, 65612, -368736, -469617, -67748, 379571, 361617, -74872, -459930, -457981, -147164, 137236, 133854, -117948, -353850, -390510, -267693, -71747, 168333, 302944, 62381, -519389, -918760, -681254, -15766, 468197, 478792, 202061, -106882, -345588, -450710, -379590, -196460, 14907, 241018, 400532, 319477, 38573, -106136, 48699, 223119, 160111, 31335, 44476, 19579, -206832, -321231, -12406, 399631, 405348, 118236, 22496, 138997, 125774, 34002, 216154, 554068, 538884, 151529, -57206, 142174, 361421, 310768, 166495, 75784]
34561G5784j57062j76719Q9362L12389Q1541l18639l58755j55953j63058k80486
34551a051596p1380L62495M96456K39283j7450q9020j09125p9215R6666K44508
34541B1622J34950o3908m2424J17790J43347P9713J18918J64216N4035m9609K2127
34530G00777N4430j33815k56469p9144N6110j60795l31204k828M31423L18657
34520E97142j28272j86330J62136K96202O6652q7034m1622j09366k75837j86132
34510A07539Q5002P7832j91747k17842Q7359K58083J25847K4254M6611j02955
34500B99983l67958k55655K65203N38070K02578k64935l35985j56917j17633j98665
34490c91914j48123M5998J94459J84014K7283j53378j35214J52344M01213K68421
$$ y = [75784, -81278, -257997, -168635, 143754, 225295, -93344, -452099, -608052, -771110, -1051596, -1122976, -760481, -264025, -24742, -42192, -131212, -240337, -319552, -222886, 21622, 156572, 92664, 50240, 168030, 311377, 391090, 510008, 674224, 728259, 678650, 700777, 755207, 621392, 364923, 285779, 341889, 181094, -150110, -152938, 278485, 597142, 468870, 282540, 444676, 740878, 807530, 720496, 678874, 569508, 293671, 107539, 192541, 270373, 78626, -139216, -51857, 206226, 332073, 356327, 402938, 299983, -67975, -323630, -58427, 479643, 682221, 417286, 81301, -75616, -193249, -391914, -540037, -494039, -299580, -115566, -88283, -241661, -376875, -224531, 176682, 445103]
34480D45103j04189k77858j53862j5194q301k9648o3560j67594j80848P4226L57148
34469a24577K66244j22836l55890k60392k6001K40996N03159M90422L5960m19103
34459B27982l27905P4157J14058j92562j97058K12007M00009Q5395k28812j67616
34449c45j9710o1732r4141K0705M7213p2299j9058K35034K38480j21557l02379
34438a49789n192K85397J24097j71611j44660L1733j8607j66235q5696J17104
34428a83459J47711O7689Q1773Q1367j04017k73565j57839Q3617J28400L6548
34418i1775P6331J95767J25894j15337k43541j56541r372R1233J60531J68108
34408B01298O4457p7156j49530j63225j53245o9306Q1808J49322O4298k1401J0648
$$ y = [445103, 340914, 63056, -90806, -106000, -114301, -143949, -207509, -375103, -555951, -481725, -124577, 141667, 18831, -337059, -597451, -623452, -382456, 120703, 611125, 647085, 227982, -99923, -25766, 88292, -104270, -301328, -89321, 310688, 396083, 167271, -345, -20055, -81787, -175928, -155223, -108010, -180309, -199367, 35667, 274147, 152590, -149789, -154981, 130416, 254513, 82902, -61758, -30025, -48632, -214867, -300563, -183459, -35748, 31941, 113714, 195081, 91064, -182501, -340340, -256723, -128323, -91775, -15444, 180323, 306217, 190880, -52661, -209202, -218574, -127341, 33190, 201298, 265755, 188599, 39069, -124156, -277401, -346707, -264899, -115577, -51279, -72680, -62032]
34397f2032M9679l723j9876J11630K16731Q0627j91779l09629j81204M6646K20445
34386d2485K51674Q1176k06442l30985j08782K55503L72976J41975j58150k34117
34376B2343q4707P6935Q3487n0356j82639j81990k4563K02069L54842L17302J04124
34365F36847j07260j47082p4205r3335k22574k42113o1396J02699Q1536M2305
34355h4578J72989L03858J69151j11997j81982O032J44638O3520o7398o4309J9583
34344C69507L7856n6368k11521l28095k99758j14736J08015K47436K60289J15916
34334A28541j51500k96939q0009K89467L20619R823o2505L14326N10355K6272
34324A008450o08846n88947o3494J70563n9614j88797L0187K02772R1627j8023
$$ y = [-62032, -12353, -16076, -35952, 75678, 292409, 373036, 181257, -128372, -309576, -262930, -42485, 209189, 290365, 83923, -247062, -355844, -100341, 272635, 414610, 256460, 22343, -62364, 14571, 98058, 47702, -134937, -316927, -341490, -139421, 215421, 532723, 636847, 529587, 382505, 308300, 214965, -7609, -249722, -311118, -208419, -126883, -84578, 88411, 392269, 561420, 449423, 267441, 273473, 418111, 481631, 414233, 349924, 369507, 407363, 350995, 139474, -188621, -488379, -603115, -495100, -247664, 12625, 128541, -22959, -319898, -399907, -110440, 210179, 220002, 157497, 471823, 982178, 1008450, 399604, -189343, -252837, -82274, -141888, -330685, -300498, -97726, -6099, -24122]
34314b4122P9179J74491J02654M35n2346j67624k98735k19637L6953J67526J06188
34303i5038R5114J84195J36395q5049k08070j25771k9018O497J02289J89460M3915
34292B14919k08106j54784J96492L19148k6043l90559l06176P4986K85399J44613
34282A49889j85208m58609m68259j63280K11011L26432J96762J30320K36217K96913
34272B72188J72091o851j11006j71156k01379j49354n6356p357N8263K17278L13436
34261C29797J45154j74647l59021l43744k29858J895L40148M89752K16880j95499
34251B20857k84960o4690R6171P6490K7039k2184j02138o1020J41910J71667j35066
34240F4076l09072M4612M68687L30486j03000j40828J17152L8888l10924k91610
$$ y = [-24122, 55057, 229548, 332202, 332637, 280291, 112667, -186068, -405705, -368752, -201226, -95038, 76, 184271, 320666, 235617, 27547, -98224, -127242, -120745, -18456, 171004, 214919, 6813, -147971, 48521, 367669, 341626, -48933, -355109, -280123, 5276, 149889, -35319, -493928, -962187, -1125467, -914456, -588024, -391262, -260942, -24725, 272188, 444279, 437428, 326422, 155266, -46113, -195467, -251823, -259180, -200917, 16361, 329797, 474951, 300304, -58717, -402461, -632319, -630424, -290276, 199476, 416356, 220857, -64103, -128793, -32622, 43868, 70907, 48723, -53415, -114435, 27475, 199142, 64076, -244996, -200384, 268303, 598789, 495789, 354961, 472113, 511001, 200077, -91533]
34230i1533Q0363J42518j73345k36013O4917J13099k47038m08045j26005R9131
34220g81951M2450J21207M32363M44115J6335k45776m5351J33590j5455j22663
34210b1136J5445K9568j89655j86813J30402K08544r9084j83998J75488L52010
34200B30771M6774j26122J87104L75702J38l82903k55173k2976j10782j27330
34190a84797K45823M58162O3568l67624k12811J33253O2711j58043m6695J07907
34180A01454j01784k79743K8878L49901R1764k93775p8210L85766K58077k80901
34170A81427l33663J79645M57747J64852k04908k70121j65747k1230J90594L10629
34160D89225J45204j25561k18039k04431k16687p0782K64034L04018j78896n40723
$$ y = [-91533, -11170, 131348, -41997, -278010, -213093, -99994, -347032, -755077, -881082, -781951, -739501, -618294, -185931, 258184, 274519, 28743, -16608, 116982, 101527, -21136, -5691, 23877, -165778, -352591, -222189, -13645, -112729, -296727, -121239, 230771, 277545, 151423, 338527, 714229, 714367, 331464, 76291, 53315, -57467, -184797, 61026, 519188, 582756, 215132, 2321, 135574, 198285, 40242, -6453, 101454, -330, -280073, -251195, 98706, 190470, -103305, -181515, 204251, 462328, 181427, -152236, 27409, 485156, 650008, 445100, 174979, 9232, -11998, 178596, 489225, 634429, 508868, 290829, 86398, -130289, -201071, 62963, 366981, 188085, -352638]
34150c52638j90455L72033L14663j88763l44753r1897k5799k04596q6554L90195
34140d08564O20202K92810k22635n00298m43078r9527L22141L90098l1857m04062
34130d84770k22795J75759J63424j55360k04780O1239K07661J52639J71598K34001
34120I8616Q3790j58733j67478k1597l625k2505J08438J27744k12828m76592j41327
34109g86097M36132N15968J59311J3122J60399J41785o2855n8222Q5267m6713
34099E58097k99758j51231K34725J80634k66821l28988J61481M52329J36880k44391
34089D32957j86632N9549J12630N5987M5496m1888k36636k86341q8297J48147
34079A4972K98398M08075L52933l7444m97504n52421k47792o3863j12422n5899
$$ y = [-352638, -543093, -171060, 143603, -45160, -389913, -481810, -507609, -712205, -798759, -408564, 211638, 504448, 281813, -218485, -661563, -761090, -438949, -48851, -80708, -484770, -707565, -531806, -368382, -523742, -728522, -667283, -459622, -306983, -135385, 98616, 182406, 23673, -143805, -165402, -169027, -191532, -83094, 44650, -168178, -644770, -786097, -349965, 166003, 325314, 338436, 498835, 640620, 577765, 519543, 604810, 558097, 258339, 107108, 341833, 522467, 255646, -73342, 88139, 540468, 677348, 432957, 246325, 305874, 418504, 474491, 519987, 478099, 241463, -44878, -133175, 14972, 313370, 721445, 1074378, 1036934, 539430, -12991, -260783, -324646, -437068, -492967]
34069d92967J74969K60723J37355J07946K50070L17833K49582J79089O285l89377
34059H01508o24500k60050L26654L61529r8264k75417J865J01512j83790k81460
34049a30413K7692J68557j39635l28525r085L26884J91553r5055p5655O0611k7464
34038c0535j51572j1685K01863J84515O1554N2293P444k31735m01391k22725R0958
34027d51016J71732M1352o5588j16972j57677p3968J54698K53052N1552j70399
34017c63234q3157J85983K75140J22496l2935m4196J7406M4279J2562l1504k7238
34006G5602K861m6867j48848o4182K87957N52453L68240p3311k98683k37588j77221
33995B40413j66685j1326K10945K01965p900j21686j48304l14821m59990k07477
$$ y = [-492967, -317998, -57275, 80080, 188026, 438096, 755929, 1005511, 1184600, 1190885, 801508, 177008, -83042, 243612, 605141, 506877, 231460, 233325, 334837, 151047, -130413, -102721, 65836, -73799, -402324, -411409, -84525, 107028, 11973, -63682, -3071, -30535, -182107, -193792, 8071, 192586, 254140, 306433, 313877, 82142, -319249, -541974, -451016, -279284, -237932, -303520, -420492, -578169, -652137, -497439, -244387, -192835, -363234, -446391, -260408, 14732, 137228, 104293, 60097, 77503, 121782, 134344, 102840, 75602, 78463, 31596, -117252, -181434, 106523, 658976, 1027216, 953905, 655222, 417634, 240413, 73728, 62402, 273347, 475312, 467412, 345726, 197422, -117399, -577389, -784866]
33985g84866K56556L37956L2153m4068K46037L07524p5964k95969l382K46039
33975B22016m910k84032n9609K77059J13071k80763k39726J20664J57175j31720
33965a10775j46798J77726K26123j83871m08738l2175M12783K65451k40035l60463
33955d00772M0383L70870K42948l8918o0227R0478R1178l8840k7306J32009J60752
33944E62555j7594j60564j37493j06354j47923r5948R6475J83984M1404r5725
33934A22817m4756K0788m7918o3052J04315J90313j3928k33255j53300L9888K0909
33923e7179j00120n3747N5874J9990J1733K29970L66894P3195l20842k54473J14682
33912H5977J65627j37137k45129r113J47253O2722N7001K05631J50388j78532
$$ y = [-784866, -528310, -190354, -158201, -202269, 43768, 351292, 275328, -20641, -24023, 222016, 217106, -66926, -126535, 150524, 263595, -17168, -256894, -136230, 20945, -110775, -257573, -79847, 146276, -37595, -446333, -478508, -65725, 199726, -40309, -400772, -360389, 10481, 253429, 214511, 154284, 244762, 335940, 297100, 269794, 401803, 562555, 544961, 384397, 246904, 140550, -7373, -103321, -6846, 177138, 218542, 122817, 78061, 98849, 50931, -12121, 92194, 282507, 268579, 35324, -117976, -78088, -57179, -157299, -211046, -155172, -135182, -123449, 106521, 473415, 546610, 225768, -28705, 85977, 251604, 114467, -130662, -139775, 7478, 70200, 127201, 332832, 483220, 304688]
33902C04688l37536j04425J63391J52165L8410O4446J36494R0793k1043j04836
33892C82547j66701j77193q3011K7768N8077J10047K35909J86784j48549l24194
33882A01484M1289M77320K54180m01901n69589q6589K14847j04125m18817j41943
33872f33844L37714L60461J6948j24691Q6125K88138J97167r1479k86852j98007
33862d8320O3986J66816q117j38729N7898L20035K26953j09880k55573j77453
33852I7616j71549k09971k7840K27927J50263j57722j92892O7252J55981J9455
33842d1480J01949M19436M16108k5987k89011o2678J31158j13294l72755j68483
33832e037J93080J69492j16269j57267P6956J64104l9024k01118o0201J88195
$$ y = [304688, -32848, -137273, 26118, 178283, 216693, 281139, 417633, 508426, 487383, 382547, 215846, 38653, -44358, -16590, 41487, 151534, 387443, 574227, 425678, 101484, 142773, 620093, 874273, 472372, -97217, -183806, 31041, -73084, -491901, -633844, -296130, 64331, 81279, -43412, 42713, 330851, 528018, 436539, 149687, -48320, 15666, 182482, 174365, 35636, 93534, 413569, 640522, 530642, 275069, 97616, -73933, -283904, -311744, -83817, 66446, -91276, -284168, -216916, -60935, -41480, 60469, 479905, 896013, 870026, 581015, 518337, 649495, 536201, 163446, -5037, 188043, 357535, 241266, 83999, 160955, 325059, 286035, 84917, 24716, 212911]
33822B12911J64570j66658l92492j79419J87993J30570l13192m17850J08508N45874
33812a19185K45382l00525k50143K09794K40923k07315l98122j19146Q2911M300
33802f11126P2445L85587M54087J36659p1122N1069R6770j30390k47406o5089
33792G1484M4252j20308k07077J843J77416L9251k09094k96710k19547j5141K67436
33781d66195L37418l691l43500j62701K45675J84440k30317k40113K06263L75657
33771i7064J00285K9394L23680L11420j93679m25826j1043L47644J12372k06765
33761B90418n7080K24273J64098j8594r481l9755k90968l98442j49939L7134j08017
33750c56353j92985M1598J85390j8529j10766K09258M31625J28546k44690j44743
$$ y = [212911, 377481, 210823, -181669, -361088, -173095, -42525, -355717, -773567, -665059, -119185, 126197, -174328, -424471, -214677, 26246, -181069, -579191, -698337, -615426, -611126, -538681, -153094, 300993, 437652, 366530, 417599, 514369, 383979, 136573, 71484, 115736, -4572, -211649, -209806, -32390, 6861, -202233, -498943, -718490, -733631, -466195, -128777, -132468, -475968, -638669, -392994, -208554, -438871, -678984, -472721, -97064, 3221, 32615, 356295, 667715, 474036, 48210, 37167, 384811, 497183, 290418, 233338, 457611, 621709, 603115, 593634, 553879, 262911, -135531, -285470, -248336, -356353, -549338, -507740, -322350, -340879, -451645, -242387, 189238, 317784, 73094, -71649]
33740g1649J50539J41351k0181K9618J28075j3278j88531j25992m0735j56981
33730a67764j84331J32566M32256K97548m8033j54908l7807M2816P1782J05414
33720D89539K1085j73840k05304j2852R7308J2024k0908L0556j11782l71307l02066
33709e47547N5686J29610j46095j59714K32376L92300R7485j4444L31884M75667
33699H47208M8472l12923j57952n1021m34595p03639k95499K46469K30027k6766
33689f10219O4376K62323R5746j60293n0362J70010R0447m7559O8169J07564k04754
33678b14552l86192m4133K97256J10264j36446J45705N09302K43884l24134l91348
33668a90394j9375J36612n216n9351l3376j26364o8938L99186P73296M27754l16745
$$ y = [-71649, 78890, 220241, 200060, 229678, 357753, 344475, 155944, 29952, -10783, -167764, -352095, -219529, 212727, 510275, 462242, 307334, 269527, 312343, 384125, 489539, 510624, 336784, 131480, 118628, 215936, 227960, 207052, 237608, 125826, -245481, -547547, -491861, -362251, -508346, -668060, -435684, -43384, 54101, 39657, 371541, 847208, 895680, 582757, 424805, 373784, -60811, -764450, -1059949, -813480, -583453, -610219, -545843, -283520, -187774, -348067, -398429, -228419, -137972, -185531, -117362, -9798, -214552, -600744, -644877, -347621, -237357, -373803, -228098, 281204, 525088, 200954, -190394, -209769, -73157, -78373, -137724, -171100, -297464, -366402, 32784, 806080, 1233834, 917089]
33657I17089o34905l91302r5117R128M7321L7873j4454R0418K90865J09475m71619
33646a05228o56844n2728N11225K24163l81636l35538K00787L59423M4139j32722
33636c24959j9731K1309l8790N3207J72208M0263j47773p2625O6731k5435q5550
33625c61145K05129N03041L57937M3009N0890J99159K3453l49927m76244l41007
33615a45705j73051L4791K21910N2603l92893m17463J65481N19168J22725k98571
33605c11005n1242K99873L9626l22663k6727M44807K14824l51553k84303K69783
33595g8580L82632j9637k22435q8638o8448j38334N4149K78591J06621j29951
33585G5970J00570M11305J21762m13989l54018J37072K33897m3317O23L19615
$$ y = [917089, 282184, -109118, -204235, -195107, -147786, -109913, -124367, -33949, 256916, 366391, -105228, -762072, -814800, -303575, -79412, -461048, -796586, -595799, -236376, -192237, -324959, -344690, -323381, -362171, -308964, -136756, -96493, -244266, -316891, -250160, -275595, -361145, -156016, 347025, 704962, 747971, 798861, 998020, 1021473, 671546, 195302, -145705, -318756, -283965, -62055, -9452, -402345, -819808, -654327, -135159, -12434, -311005, -362247, -62374, -22748, -345411, -372138, 72669, 287493, -64060, -348363, -78580, 304052, 284415, 61980, -26658, -95106, -233440, -179291, 99300, 205921, 75970, 176540, 587845, 709607, 295618, -58400, 78672, 312569, 269252, 269875, 589490]
33575E89490K27577k39805l56925j8572J70431K7677q8781j47651l56881m23505
33565f16945J3088M72171K72104k33978k38294O7982p4320m39945j50975O18958
33555c10154P70257J00067m31187l33409j15940n9543J85144N52308M09351k33592
33545E33302n32139j63422J92993N8956j61873o2073J21439J08464M8145O6332
33535B10124N977j35059r8134J35742K63418J57672j6196j50241k25744j39897
33525G662P4688J14515q8783j23698J74709K93807q2256l91581j05486L13523
33515A87100J88604k40341l41289j69552j23179q7508J70752L28600J13990l4384
33505g207K14050L35621n4886l15324Q0808M34329L6500m56877j98804K58408
$$ y = [589490, 817067, 577262, 220337, 201765, 372196, 399873, 311092, 163441, -193440, -616945, -603857, -131686, 140418, -93560, -331854, -263872, -338192, -778137, -929112, -310154, 460103, 560170, 128983, -204426, -320366, -379909, -194765, 357543, 766894, 533302, 1163, -162259, 30734, 89690, -72183, -134256, -12817, 95647, 143792, 210124, 216101, 81042, -17092, 118650, 382068, 539740, 523544, 373303, 147559, 7662, 82350, 196865, 108082, -15616, 159093, 452900, 370644, -20937, -126423, 187100, 375704, 135363, -205926, -375478, -498657, -586165, -415413, -86813, 27177, -7207, 206843, 542464, 487578, 172254, 253062, 687391, 723891, 267014, 68210, 326618]
33495C26618L6161l40049M6454O08478K13976o47349n99575K19494M66158m0338
33485B90028k25237J47396K13409j91783k92763J4205O898l36361k64925K24967
33475d14166L37458j3392j22961P9449p511l08909j58336L16634L51388J0242
33465F9896L7002L54913K11977k90069l31930O3522J24634j40270m3126K98057
33455C54606J48342l07470k18976K74638K71356j55167j22313K85807J49782m49941
33445B30664m94199Q5919L25339M4767K0136L11298J66621l55679m07727m0706
33435a13567j29599n70039l46054N02943P87204K09678k38462j05220o212j60059
33425a69387n6328K60778J76738j52300j9452L26890M9907n38449l82336L18811
$$ y = [326618, 362779, 22730, 69184, 677662, 891638, 244289, -355286, -135792, 330366, 290028, 64791, 212187, 425596, 233813, -58950, -44745, -37847, -374208, -639133, -414166, -76708, -90100, -213061, -133612, -141123, -450032, -608368, -291734, 59654, 69896, 106898, 461811, 673788, 383719, 51789, 115311, 239945, 99675, 56549, 354606, 502948, 195478, -23498, 251140, 522496, 367329, 245016, 530823, 680605, 230664, -263535, -177616, 147723, 192490, 212626, 523924, 690545, 334866, -72861, -113567, -243166, -813205, -1159259, -656316, 130888, 340566, 102104, -3116, -9328, -169387, -225715, 35063, 211801, 59501, 40049, 366939, 416846, -121603, -503939, -185128]
33415a85128L91947j52953k09559K73294K66493k50099k62011K06045J17197m35055
33405b39829k92418M67548N26612k17820m47788J02027K42929l06905m41378R5250
33395e11772K41196k18657k42039L25733M08314j28134j93458K90304J81817m98088
33385c44784l96543N28007O90481k40584o76486r4M06935j52996m70669J42514
33375e14219N62611M3786m72869k65691j5477j58675l0235N18247N88076M6262
33365C01816q2484L61664K99747l97936n06874K12342M86887q7329l88787m1171
33355A57875k5490m88169l35599M35745M76183l03378m22205L11223L44663n72894
33345d22046p35809L23824Q67308J32325l73574J70952M76229j61286m93023J21577
$$ y = [-185128, 206819, 53866, -155693, 117601, 384094, 133995, -128016, 78029, 195226, -239829, -532247, -64699, 461913, 244093, -203695, -101668, 141261, -165644, -607022, -511772, -270576, -489233, -731272, -405539, 2775, -125359, -318817, -28513, 153304, -344784, -741327, -213320, 477161, 236577, -439909, -440003, -33068, -186064, -656733, -514219, 48392, 92178, -380691, -646382, -661859, -820534, -850769, -332522, 255554, 301816, 219332, 580996, 880743, 482807, -24067, 188275, 675162, 587833, 199046, 157875, 132385, -355784, -691383, -255638, 220545, -82833, -505038, -193815, 150848, -422046, -1157855, -834031, 33277, 165602, -207972, -37020, 439209, 277923, -215100, -93523]
33335i3523M46694j21455l71517K31925M52747k06494m83978R8285K93233k84188
33325c8271l32314M34931N66976k30140m01590L68492M55638m26960n20420M55164
33315C31506N42284o04787p74881O13026J169119j02085r37001m9762O15324j98139
33305F04604p15995J74819O59423l31080q82077J37450P54522k48645q56392K64671
33295d38700J078775R0144p45653J55499R17445q6651j008440j18926Q37578Q1705
33285G62776p82193m5970P08961j66154r99831m4160J021524K81455p51528j23542
33275a38662Q55458L46042m69208J1639N25779l39025j030959l6868R12234O0464
33265F96894q99655n7539R88289K20195r16035l79614N70055K6583p97665j17364
$$ y = [-93523, 353171, 231716, -139801, 92124, 544871, 338377, -145601, -47316, 245917, -38271, -370585, 64346, 631322, 401182, -408, 368084, 823722, 396762, -123658, 331506, 873790, 269003, -505878, 107148, 1276267, 1174182, 237181, 187419, 802743, 604604, -111391, 63428, 722851, 391771, -490306, -352856, 401666, 153021, -703371, -438700, 640075, 730219, -15434, 140065, 1057510, 970859, -37581, -156507, 681071, 762776, -19417, -65387, 643574, 477420, -522411, -566571, 454953, 736408, -15120, -138662, 716796, 1062838, 593630, 605269, 1131048, 792023, -238936, -275804, 636430, 696894, -202761, -260300, 727989, 948184, 32149, -347465, 222590, 249173, -548492, -665856]
33255f65856Q33334L33513m10249J49241O91241j93683r25447q418Q48470L5418
33245F87564p28280J66587R27040n8594q82970J13409R27403j50338j021514P7700
33235E8007R67596j27877q97853M07130J161620n56700j789981j48330J416967
33226D90579J38962j237858J59092J665494L31629j211576L0215J384879j87772
33217A563644j833641k42444J702512L77559j519197k64437J591774L77056j351281
33208D01545j4360J592210j88919k205618l70013K088270O14650j778512l57515
33199b18262K004402N05335j989534n82101J834480K92342k164784l95425K379414
33190A665867P21859k082539l74380K436306M69898k612367n29373K881586Q60086
$$ y = [-665856, 167478, 500991, 90742, 239983, 931224, 737541, -187906, -196324, 652146, 687564, -40716, 125871, 1052911, 994317, 111347, 224756, 1152159, 1001821, -19693, 58007, 1025603, 897726, -127, 407003, 1568623, 1011923, -778058, -926388, 490579, 629541, -608317, -449225, 1216269, 1547898, 336322, 366537, 1751416, 1563644, -269997, -512441, 1190071, 1567630, 48433, -216004, 1375770, 1752826, 401545, 387185, 1979395, 1790476, -415142, -785155, 1303115, 1917765, 139253, -218262, 1786140, 2291475, 301941, -280160, 1554320, 1846662, -318122, -713547, 1665867, 2387726, 305187, -69193, 2367113, 2837011, 224644, -304729, 2576857, 3436943]
33181C436943k713511o98067K956348Q19396k912855m60761L558061Q38942l466253
33172A358243k98470M593100J110057m418558n35449O039367K404096m316856
33164E935530L45589Q662305M324129l873130K979189J4602669Q468697k520312
33156C8924666J0807152L2870800K4009094N138335M3586889J28596910J45033027
33149D28966873K8999810j19244421j55679122p8542781p900801q897386l1078411
33142E6623761k0825980O05473j968111j3711743p752410M483594J226768p995511
33134A0685841m475366M020624J404205n595056k808982L742198J289437m692017
33126C570884k381765L408643J725880l292719j669355K818003R86194l519006
$$ y = [3436943, 723432, 25365, 2981713, 3801109, 888254, 427493, 3985554, 4824496, 1358243, 1059773, 5652873, 6762930, 2344372, 1808923, 7848290, 10252386, 5935530, 6281119, 14943424, 19267553, 15394423, 18373612, 32976281, 41444978, 38924666, 49731818, 82602618, 106611712, 111750047, 155336936, 283933846, 428966873, 457966683, 338722262, 183043140, 104500359, 96599558, 87702172, 56623761, 35797781, 36403254, 34435143, 20723400, 12970990, 17454584, 18681352, 10685841, 6210475, 10231099, 11635304, 6040248, 3231266, 6973464, 8262901, 3570884, 1189119, 4597762, 6323642, 3030923, 1361568, 4179571, 5165765, 1646759]
33118A646759j903060K539551J380511k570289j435388K280277J207233k327159
33110H18435j315497K122734J290558j952881j258654J768783J192284j567117
33102A098645j043786J348510N51906j823595q22491J838089J074750j615480
33094F06548j132253J453978J337260p70707o74295Q37720P2538j719830p86665
33085g75706J434591R45886j060615o98407R88534L91771j291555n02700J397073
33076H28872O80977j324950p21227J348429Q80048j268564j107640Q52704Q43871
33067A012520q56289q13401P27142O21283p67781m48681J033123O28693j062625
33058G3984q45760Q33275P50267q64648q85913O47108P99702n21817o59696M80178
$$ y = [1646759, -256301, 2283250, 3663761, 1093472, -341916, 1938361, 3145594, 818435, -497062, 1625672, 2916230, 963349, -295305, 1473478, 2665762, 1098645, 54859, 1403369, 1955275, 131680, -690811, 1147278, 2222028, 606548, -525705, 928273, 2265533, 1494826, 820531, 1658251, 1730789, 10959, -775706, 658885, 1604771, 544156, -154251, 834283, 1226054, -65501, -568201, 828872, 1509849, 184899, -536328, 812101, 1692149, 423585, -684055, 168649, 1012520, 156231, -657170, 69972, 691255, -76526, -525207, 507916, 1136609, 73984, -771776, 61499, 811766, -52882, -938795, -291687, 508015, -13802, -673498, -193320]
33048a93320N27664m36292j91912R17284N70015q06797p47414M38011L32962p81153
33038c70952n54916O78274N44608o23791m32282P87501N71421q14578q14965N29814
33028d99866P69013k35898l26683N15742K51515r28751q18199M60484O39103l15036
33018d88576k62241P97811P29478m69099n99945M75323O10077m65384p41072J35722
33008b77906L76444l03919k91632M99152M32779m72403n08461L15875L25223l90326
32998b95174j27568Q94681P49868m52869o61533K37883K77623p32098q53081K23384
32988g38884O49437j6763j90948M50824M61119k65227k14307N82652M33517o49128
32978E02292p98578J64937M04599l62220l78040O08539P47794l42612p84936M2582
$$ y = [-193320, 334344, -101948, -293860, 623424, 1193439, 386642, -360772, 77239, 410201, -370952, -925868, -247594, 297014, -326777, -759059, 28442, 599863, -214715, -1029680, -499866, 269147, 33249, -293434, 222308, 473823, -454928, -1273127, -812643, -173540, -488576, -750817, 46994, 776472, 307373, -292572, 182751, 792828, 327444, -413628, -277906, 98538, -205381, -497013, 2139, 434918, -37485, -545946, -230071, 95152, -295174, -422742, 471939, 1221807, 768938, 107405, 345288, 622911, -109187, -962268, -738884, -89447, -106210, -297158, 153666, 614785, 349558, 135251, 717903, 1151420, 502292, -296286, -131349, 273250, -88970, -467010, 141529, 889323, 546711, -238225, -195643]
32968a95643M63823k02514m78032K50734N85792n7568l70633J71062L20820l53624
32958A34217n76516R4873M31007k012r6939L99904L47745l12507k15819O60779
32948H64732O46695n01533r40699l0421N35473j40128o60144q6527M45850Q3064
32938B16362k45701J01912K42081k26267k38138N46589P81965j49506q89299m52871
32928c12873K11401J62775j8506K04492J79343l77595n17126J52145N75282J64354
32918D23692j66305J56187K86969k67026n82702p5983L74933R9668j96579O3223
32908A16077K42803j05353k88847J13646L63446q286l09100o2741J30582j16850
32898G5377k41318J4965M2029k91441k20098L62097M88038r1397l21024K44554
$$ y = [-195643, 268180, 65666, -412366, -161632, 424160, 366592, -4041, 167021, 487841, 134217, -442299, -347426, 83581, 81569, -15370, 384534, 732279, 419772, 203953, 864732, 1511427, 1009894, 69195, 38774, 574247, 434119, -226025, -312552, 133298, 216362, -29339, 72573, 314654, 88387, -149751, 396838, 1178803, 1029297, 139998, -312873, -101472, 61303, 42797, 247289, 426632, 49037, -468089, -315944, 259338, 423692, 257387, 413574, 700543, 433517, -149185, -225168, 149765, 249433, 52854, 116077, 358880, 253527, -35320, 78326, 441772, 433486, 124386, 61645, 192227, 75377, -165941, -150976, -108947, -400388, -620486, -258389, 229649, 138252, -182772, 61782]
32888F1782N85846P3972m34933k28512Q8164n3130j39111K00443L34471r4706
32878C94286l75832p3141J38797j81039l56377J00691N40713L69127K2405k0991
32868E58639p1751l48230l73309N9377L65005K03945J0678K7627r6701l59587
32858b4307k26878K40739L03454j10417k56243j0993m7031l46168j16613N14620
32848g9837M43473l57958n38417K99030Q06662K06928m18679j17691L61162R6959
32838G01632m21356m10930j67820j92888j34363L25474O10479K67022j61004j40693
32828B75553l5836k04682k46745Q9222K70795j8583k48220n9536J04085l4657
32818a08604o4695J39015P1695k68218j58089M13119M53021k78938o57416p1481
$$ y = [61782, 647628, 721600, 286667, 58155, 146319, 93189, -45922, 154521, 488992, 394286, 18454, -54687, 84110, -96929, -453306, -352615, 188098, 557225, 579630, 558639, 486888, 138658, -234651, -175274, 189731, 393676, 404354, 431981, 335280, -24307, -251185, -10446, 293008, 182591, -73652, -84645, -131676, -477844, -594457, -79837, 363636, 5678, -532739, -233709, 572953, 779881, 361202, 243511, 604673, 701632, 280276, -130654, -298474, -491362, -625725, -300251, 310228, 577250, 416246, 275553, 239717, 35035, -211710, -122488, 148307, 129724, -118496, -178032, -73947, -108604, -173299, -34284, 37411, -230807, -388896, 24223, 477244, 198306, -459110, -530591]
32808e30591N13299K33881l03105k78037L848Q405M554K33991K00888k68068m00014
32797e80949J50884M76135n1074n83827k35035M00468L38842j50042k16328O4843
32787c86083P2187j15903J2339L60112M20405J54113r1006j83066j55531L3205
32777A20772K55849K04672p2486j72310l3070M2148R1801L58328M77585r0647
32767A182642q20915o25132K96954N79415j05384n56630j46308K68532J02312
32758A75486L106L16214K72657l90956o37099L1371N11499N57n68075k24417L46327
32747a63330J65914k89752j32459K89557K10122q2392L8648K50371Q188k93412
32737A455j24099O7184k53481n51043j75210L68460L18268R960J09008K97943
$$ y = [-530591, -17292, 216589, -86516, -364553, -360705, -352300, -347746, -113755, 87133, -180935, -580949, -430065, 46070, -5004, -588831, -823866, -423398, -84556, -234598, -450926, -386083, -313896, -429799, -417460, -57348, 363057, 517170, 426164, 243098, 87567, 120772, 376621, 581293, 508807, 336497, 303427, 345575, 437376, 795704, 1273289, 1182642, 361727, -263405, 33549, 612964, 507580, -49050, -195358, 73174, 175486, 178592, 494806, 767463, 376507, -260592, -229221, 282278, 282835, -285240, -509657, -163330, 2584, -287168, -419627, -130070, 80052, -2340, 36308, 286679, 294867, 1455, -122644, -55460, -308941, -859984, -1035194, -666734, -348466, -338506, -229498, 68445]
32727F8445p924l91689j70853K75402J83791k06514j82484J07633O4586j51626
32717d11233j0122K81352J95221n2658M9522K61887O0514k97181k19790J28868
32707a3620J85692J2642J2729O2598j36218k88896j5327L16842J67901k06129
32697I8214k28102J2456Q2899L9763J22041J21621j39836k54346N6890K77303
32687A88903l3174l58805j11939K75252J18652k86102k30213J62391K89612J82417
32677A96994K50279L56834J24626k33737k86682j79228k38823k65260j4354J61081
32667a28270l1553j45258J78954L99211K5429l51248m5008M28375K30963k76403
32657B85192j98415K45828J35239m44945n16814J08257N64874L60910o0308k43806
$$ y = [68445, 60521, -331168, -502021, -226619, -42828, -249342, -431826, -324193, -259607, -411233, -421355, -140003, 55218, 2560, 52082, 313969, 374483, 77302, -142488, -13620, 172072, 184714, 197443, 260041, 123823, -165073, -180400, 136442, 304343, 98214, -129888, -117432, -34533, 5230, 127271, 248892, 109056, -145290, -88400, 188903, 155729, -203076, -315015, -39763, 78889, -207213, -437426, -275035, 14577, 196994, 447273, 804107, 928733, 694996, 408314, 229086, -9737, -274997, -289351, -128270, -159823, -305081, -126127, 273084, 298513, -52735, -97743, 330632, 561595, 285192, 86777, 332605, 467844, 22899, -493915, -385658, 179216, 540126, 479818, 236012]
32647B36012k37892j31714R2249K33207R5172o6207N4651K05668J7803k75632
32637B23317k55962q7761j39732k31156k5130K26693J27580p3835N8120K96516
32627A18650J71835j55511k41992j65458k00550j57117J57077L28809K9141k52715
32617c67831m1923J91469q3999l32765J31640P27821M31752m36802o40519L6770
32607c84387O20435N56624K23070p2368l86103m82890m6233M75060L22350l07661
32597E17897n15436j47819R8414k5831n0494J56504J67575o3701p6264J55505
32587B16350J29184k04027l00451n437K14255J51467J19881K10064J10310j92469
32577D49127l01437j19615L2617O4277J83939L16337J57540j84756k90258j38831
$$ y = [236012, -1880, -133594, -41345, 191862, 287034, 220827, 275478, 481146, 498949, 223317, -32645, -120406, -260138, -491294, -516424, -289731, -162151, -235986, -177866, 118650, 290485, 134974, -107018, -272476, -473026, -630143, -473066, -144257, -115116, -367831, -409754, -218285, -302284, -635049, -503409, 224412, 656164, 219362, -421157, -384387, 236048, 792672, 1015742, 943374, 557271, 74381, 28148, 503208, 825558, 517897, 2461, -145358, -46944, -72775, -123269, 33235, 200810, 137109, 60845, 216350, 345534, 141507, -158944, -164381, 49874, 201341, 321222, 531286, 641596, 449127, 147690, 28075, 60692, 124969, 308908, 625245, 782785, 598029, 307771, 168940]
32567A68940p2821j39809j25685q2825j51593r4840K61432M44187K8249m46005
32557b10770k25221L35447L22127j59393k25205J36901O3361n00417n65423J60295
32547h68298O77431L33580j88360j45862J01555m3357k99899r8809L52506L99654
32537B20141m0356m29351l60590O4065M43668M29173M0979k90045k21651L3704
32527a10263O6644q3013j05271l8869j13811j62784J07284L99351J72964l66883
32517b34651m76844p4777J59675k5916r7858K11339M01961J22556k17310j84951
32507d16776J0125L5750K0920J58844K38001L8864j98207j33699J35037K54455
32497A43314J11939j12442k16169j26846O6086J66466J02370M4234J03936R1931
$$ y = [168940, 96119, -43690, -169375, -252200, -403793, -498633, -237201, 206986, 235235, -210770, -435991, -100544, 221583, 62190, -163015, -26114, 37247, -463170, -1028593, -868298, -190867, 142713, -45647, -191509, -89954, -133311, -433210, -532019, -179513, 220141, 179785, -249566, -610156, -546091, -102423, 326750, 367729, 77684, -143967, -110263, -43619, -126632, -231903, -270772, -384583, -547367, -440083, -40732, 132232, -234651, -711495, -786272, -626597, -652513, -750371, -539032, -137071, -14515, -231825, -416776, -406651, -370901, -349981, -191137, 46864, 85728, -112479, -246178, -111141, 143314, 255253, 142811, -73358, -200204, -134118, 32348, 134718, 178952, 282888, 374819]
32487C74819j26405k67143n3114K19121Q1688k96378l19900Q6252L83364K88135
32477C70439J08160J09229J27726r861j57621j36640n174Q6173N1355j33608l50650
32466E9528l49652r8983O0719p4533j80585O5795L71283K68141r6730k19458p6167
32455b70642n5671j97496j58307J18076L09182K74059J70341N8847j09183j95520
32445e6314n3340J14277M4861j06244n8146O1972M167o1619J20453L01410J22938
32434D34415j71070j16329J37380J09001j38924j79206n2664j18353k63873r1873
32424d51496K62551L26053J46065J26434J82123n3263l42097j32393L62287L70114
32414G96378j71018n40217m48497l32826l68980j97994K12230L92338K46041J98443
$$ y = [374819, 248414, -18729, -71843, 147278, 228966, -67412, -387312, -301060, 82304, 370439, 478599, 587828, 715554, 705693, 548072, 411432, 406258, 492431, 543786, 410178, 59528, -290124, -389107, -328388, -402921, -583506, -517711, -146428, 121713, 24983, -194475, -270642, -326313, -523809, -682116, -564040, -254858, 19201, 189542, 248389, 139206, -56314, -109654, 4623, 49484, -56760, -114906, -52934, -48767, -110386, 10067, 311477, 434415, 263345, 147016, 284396, 393397, 254473, 75267, 22603, -95750, -359623, -451496, -188945, 137108, 283173, 409607, 591730, 538467, 196370, 63977, 426264, 796378, 625360, 85143, -363354, -696180, -1065160, -1263154, -1050924, -658586, -412545, -214102]
32404b14102L07642J42769k71166l25983J05797L85215J71348q7965k9726Q7116
32394B70945L5694K7907J45333R9052j41241j81265O7186J80079k1206j99337
32384B83147j86734k21641l16598j48490K26622L23014Q2149j8149J09961K578
32374A35859l65693l73346J24471M00048L2695l84043k31944K16030M06983L33692
32364B94752K19531J8184k57452k85613J0773J94196J345k36444k13224j09798
32354c63750r2267L6891L22666M09775J84776N1039J96105K26964p4707l00107
32344E97385j54296R479j23792k54572j03149N029k23232l97124p8899L95764
32334c27407M05840N764k38285j22795O2260J09940R4266P5595O975r5502j43215
$$ y = [-214102, 93540, 236309, -34857, -360840, -255043, 130172, 301520, 213555, 183829, 270945, 306639, 334546, 479879, 578931, 437690, 256425, 323611, 503690, 482484, 283147, 96413, -125228, -441826, -590316, -363694, -40680, 41469, 23320, 133281, 135859, -229834, -603180, -478709, -78661, -45966, -430009, -661953, -445923, -38940, 294752, 514283, 532467, 275015, -10598, 175, 194371, 195716, -40728, -253952, -363750, -456017, -419126, -96460, 313315, 498091, 549130, 745235, 972199, 897492, 597385, 443089, 452568, 328776, 74204, -28945, -23916, -247148, -644272, -723171, -327407, 78433, 84197, -154088, -276883, -214623, -104683, -10417, 65178, 72153, -23349, -166564]
32323a66564r6974K1753J44105J50280J5216q2494j6452M1383o9727j36694N8775
32312a37393K35903L9739k40379o8013L74627M11708M342k03336r595O8437k02235
32301B73805l73847j80465K1395k2771n2865Q8130J33819j0578l1055J61442K18983
32290B25993J9192j20804r2141j62998l25638k13966J54815L27549K50133L15845
32280C77980M51220J25382n21569o28949l7330L26819m9922m60215k44135J67930
32270d92789J67237j7037M0769J32595k8175j60541j9876O1906j14153j07227
32260e37291L03457N23555J26311l19628j75635K14281K00125q4071j26258K9763
32250A54609N0965J4352J04457J00879j46271k42599P6167L37108R0357k71110
$$ y = [-166564, -263538, -241785, -97680, 52600, 67816, -14678, -31130, 10253, -59474, -196168, -137393, 98510, 138249, -102130, -170143, 204484, 616192, 620534, 417198, 407603, 476040, 273805, -100042, -280507, -259112, -281883, -334748, -246618, -112799, -123377, -154432, 7010, 225993, 245185, 124381, 32240, -130758, -456396, -670362, -515547, -187998, 62135, 377980, 829200, 954582, 433013, -195936, -233266, 93553, 43631, -416584, -660719, -492789, -325552, -342589, -301820, -169225, -197400, -357941, -377817, -315911, -430064, -537291, -233834, 289721, 416032, 96404, -79231, 135050, 335175, 251104, 124846, 154609, 205574, 219926, 324383, 425262, 278991, 36392, 112559, 449667, 540024, 268914]
32240B68914j81146J29987R3367k28497l69533k59682j21596M2815K51393K45434
32230a28544l5051j40535J76674M56214K82025l1937p7636m8451j83830j84544
32220H4385J36024K90483n4290l59274j09457K50351J27550j44552J1345K84478
32210E17043N1940m34285m81578j50701Q78j7189J69835L83163J84615j96083
32200B7638j97674P1201R6810n4395M3163K44243R2466k29183j81232J03956N2875
32189F9868k59535k35281J38590K68467j208k14475j55215n5571L305J34961J84006
32178a22088m0055k19876K0373L37739J67878k35287j75175K65493L68189L4312
32168D01503j21646P9345J46884q7628k01581m1013L2993q6995o7640J26886J03168
$$ y = [268914, 87768, 217755, 311122, 82625, -286908, -546590, -668186, -625371, -373978, -128544, -163595, -304130, -127456, 328758, 610783, 578846, 501210, 452759, 268929, 84385, 220409, 510892, 456602, 97328, -12129, 238222, 365772, 221220, 232565, 517043, 568983, 134698, -346880, -497581, -496703, -513892, -344057, 39106, 223721, 27638, -170036, -98835, -2025, -56420, -13257, 230986, 323452, 94269, -86963, 16993, 69868, -189667, -424948, -286358, -17891, -19099, -233574, -388789, -444360, -441055, -306094, -122088, -162143, -382019, -361646, -23907, 143971, -91316, -266491, -998, 367191, 401503, 279857, 359202, 506086, 418458, 216877, 175864, 208857, 121862, 54222, 181108, 284276]
32157B84276j86251k88353m5394J58540J08493M6890J01682O6462j02018j53471
32147i144k5062P4728Q9740J04688r737l54043n44779j92286L08338K47349k44359
32136e54567l74163J5388K58444N0541j20149O9958K71518K00657J02050J58158
32126G7835J34461p3292j66698q074J16028L7065l5339Q761j2095j17078o8712
32115a07138J18816J29555o9747j56841o4887p1397j83392p1537K56221L65127
32105A44780J34118n1030n994p350j68504k03737k2082O5081n8944j07598L2989
32094b48271J16545Q5300J77888L36931J88044k08907l05602J0717J81406n0288
32084B83763j90717J01969L93107K11865k11376m17660l80443k66488o3455J54457
$$ y = [284276, 98025, -190328, -235722, -77182, 31311, 78201, 179883, 246345, 144327, -9144, -34206, 40522, 130262, 234950, 225213, -128830, -673609, -865895, -557557, -310208, -554567, -928730, -913342, -654898, -604357, -724506, -654548, -383030, -182373, -80323, 77835, 212296, 139004, -27694, -35768, 80260, 117325, 81986, 90747, 78652, -38426, -107138, 11678, 141233, 71486, -85355, -150242, -221639, -405031, -476568, -220347, 144780, 278898, 227868, 221874, 214524, 46020, -157717, -179799, -114718, -173662, -281260, -248271, -131726, -46426, 131462, 468393, 656437, 447530, 141928, 152645, 334051, 283763, 93046, 195015, 588122, 799987, 588611, 170951, -209492, -475980, -539435, -384978]
32074c84978J13460j35692j30662K09925L27038l9240l29027r9388J97644K0511
32064b50409k99740j68004K14465K42634j3666p694K40351J96904j63399k66302
32054b74860M6805K20621o6249l61113j99985J62640K37036Q7691J15114K97840
32044B65540K26460j36784k85534N1286M06053K21950k86251m20985m4463K38111
32034B35383L3681k72685j95512J12315K29454J66609J75162J68142p9754l61645
32024B11150k83366L6193J20430o8976j15335P4564J23660q9450j88853K5078
32014a54905K26241J30381p4437j17975m6460M151M9649O5198p1781k55745j60470
32003d06153K21855M40014K16904j46114k49119j28496l6394k860P3266J39606
$$ y = [-384978, -271518, -407210, -537872, -327947, -909, -40149, -369176, -468564, -270920, -250409, -550149, -718153, -503688, -261054, -274720, -282414, -42063, 154841, -8558, -274860, -228055, -7434, -73683, -434796, -634781, -472141, -235105, -147414, -32300, 265540, 492000, 355216, 69682, 120968, 527021, 748971, 462720, 41735, -2728, 235383, 269064, -3621, -199133, -86818, 142636, 309245, 484407, 652549, 572795, 211150, -72216, -36023, 84407, 15431, -99904, -25340, 98320, 8870, -179983, -154905, 71336, 201717, 127280, 9305, -37155, -33004, 16645, 81843, 10062, -245683, -406153, -184298, 255716, 472620, 326506, 77387, -51109, -87503, -90363, -17097, 122509]
31993A22509R4409O430j1765j3965j09301k54669l05949j88752N7061L04807L95629
31982I6444K87214J20629Q539j32292l38563l65786k6710L70517L36230r8289
31972B57933m05570k83148M3791K40688J97840m4855l16785k90163J47422N43160
31962I0313L73222j61767l77099j22795O2070j12639k66346p4617K09185K68010
31952a12463K16535K36614J88426m2666k06620p3055J57259J66065j7648j65491
31942C46956k28625k89626l16181j98009Q1301M22546O38281N12980N8804l33984
31932F94443l04974l0787L2911j56650k41072j09556o191J1399J39169K96552
31922C25244J50922k09761k77472K5342J72237m6065j44894J46736L19883n5348
$$ y = [122509, 216918, 223348, 211583, 197618, 88317, -166352, -472301, -661053, -603992, -299185, 96444, 383658, 504287, 512826, 380534, 41971, -323815, -350525, 19992, 356222, 257933, -147637, -430785, -386994, -146306, 51534, 6679, -310106, -600269, -452847, 90313, 463535, 301768, -75331, -198126, -136056, -248695, -515041, -589658, -380473, -112463, 104072, 340686, 529112, 486446, 279826, 206771, 364030, 530095, 512447, 346956, 118331, -171295, -487476, -685485, -604184, -181638, 456643, 969623, 1028427, 694443, 389469, 358682, 391593, 234943, -6129, -115685, -121876, -110477, 28692, 325244, 476166, 266405, -11067, 14275, 186512, 140447, -4447, 142289, 462172, 406824]
31912D06824n31020m68027l5864J35740m9639j67033m2260J04231J54394J91073
31902c01581J71358k7637k69535k67320k4606J58572J15254k1372p1223j0826
31892e48916P2338Q6146K0709p701J07907K65159K57735R4549k1321n2122j60337
31881A14146l28318k98418j8252K04692J59553J5903j8999J567r444K2602J03833
31870e1135O7359r6382j25510Q0108K28719P6575j94144k72749j30438P3146K26750
31859a17701K31150J6992k29898j81668J17993K11935r1651l84726k72053N5374
31849f44253J87398J10376Q9425J81199K27365J76264J08045M6800l1436r9521
31839C51662j26596j14419l5830R8214J27043n6073k35949j41099Q4095Q6849
$$ y = [406824, -124196, -592223, -628087, -492347, -541986, -709019, -751279, -647048, -492654, -301581, -130223, -157860, -427395, -694715, -719321, -560749, -445495, -466867, -538090, -548916, -476578, -390432, -369723, -377424, -269517, -4358, 253377, 347926, 326605, 274483, 114146, -214172, -512590, -530842, -326150, -166597, -150694, -169693, -168126, -177570, -154968, -51135, 16224, -80158, -205668, -125560, 103159, 179734, -14410, -287159, -417597, -344451, -117701, 113449, 130441, -99457, -281125, -163132, 48803, -42848, -427574, -699627, -644253, -456855, -346479, -257054, -75855, 151510, 327774, 435819, 482619, 451183, 351662, 225066, 110647, 74817, 173031, 300074, 244001, 8052, -133047, -48952, 37897]
31829C7897p9858o4267J03886N7801j63390j22289J68009J84236j24264j46225
31819a48464K74359M33402k8938m14684j27216K92045J21211k74589j17884L94326
31809D03568M53287L4494j58923K1538J2869l25534m26037m2431L06664K13145
31799D92640k8797m7684j374j55121l15704j32616K95875N07800K79710j20461
31789G74268k90373j61244l1251j34608k97511j98369J02451K08730m108k07078
31779b39093j63189l8501K3771J80066M47999M63066O9896k77460j69621J04114
31769D01048P4198j14333k9472K29753K09791r1200k51278j57583r4676j57077
31759A9171j58956j04970j89281l21450j91407J62573L57019K72046J71897J78110
$$ y = [37897, -41961, -106228, -2342, 55459, -107931, -230220, -62211, 122025, -2239, -148464, 125895, 559297, 530359, 115675, -11541, 280504, 401715, 127126, 9242, 403568, 856855, 891349, 732426, 753964, 766833, 441299, 15262, -27169, 279495, 492640, 463843, 416159, 414785, 259664, -56040, -188656, 107219, 615019, 894729, 774268, 483895, 322651, 291400, 156792, -140719, -339088, -236637, -27907, -32015, -239093, -402282, -440783, -417012, -236946, 211053, 674119, 744015, 466555, 296934, 401048, 475246, 360913, 331441, 561194, 770985, 679785, 428507, 270924, 176248, 19171, -139785, -244755, -434036, -755486, -946893, -784320, -427301, -155255, 16642, 194752]
31749A94752J11552o8623j44038o4333n8613j90862k03164M4063L10861L07621
31739B39216L3217k98384m45487k53031J63848L92582J77706j61721j22073K39326
31729c4801L73353N8160l02823l00890l5216J49023J10859n4646j84778j36689
31719c58448Q4585K41322J24198j12908j43784L5114J23845K1480o3733m5229
31709i3558r8290k55688k51392L8863L24700K99215O3075p6021l3700M2933N5533
31698A5670K9260j5962r1947j61621j49778m1677Q4102J32843R6011O1268Q5081
31687D3250Q5325l3959j70153j19169Q3962J59943J5081r7260j0348N6467j09914
31676i6775k98047j86487J29903K95476K20524Q5370m0363j85852k02047O5571
$$ y = [194752, 306304, 237681, 93643, 29310, -29303, -220165, -423329, -379266, -68405, 239216, 272433, -25951, -471438, -724469, -560621, -168039, 9667, -152054, -274127, -34801, 338552, 396712, 93889, -207001, -242217, -93194, 17665, -36981, -221759, -358448, -273863, -32541, 91657, -21251, -165035, -129921, -6076, 15404, -48329, -93558, -191848, -447536, -698928, -660065, -335365, -36150, 26925, -49096, -82796, -39863, 15670, 44930, 28968, -62979, -224600, -374378, -416055, -331953, -199110, -103099, -41831, 43250, 128575, 94616, -75537, -194706, -110744, 49199, 64280, -32980, -43328, 13139, -96775, -394822, -581309, -451406, -155930, 64594, 149964, 109601, -76251, -278298, -212727]
31666b12727L79140L26650n5157k96651j67699P8854J88740J99157J46730p5555
31656E11482l82810m23326r0675K29666K04226L7240Q5620K51147J69887j36193
31646D56264k52738l1819J64461L2576k02316j49091J45725K90286J38872o7583
31636E24637j53601k26310l31844k74688p330J48185j0932j73894j7037J95867
31626c26947L9794k77063j94916K30526L66048L4446k38301j54885o1651j68323
31616g51272j24426K20274L65241K920l38644j19278L09794L08913j6534j11636
31606b54648P2117J49717M8243k0834r2972k80325l08292R0693N41914M94033
31596D39646J14871j3352J06434O243k68108j97054J98956K93415p0910l05074
$$ y = [-212727, 166413, 493063, 437906, 141255, -26444, 52410, 241150, 440307, 587037, 511482, 128672, -294654, -385329, -155663, 48563, 85803, 171423, 422570, 592457, 456264, 203526, 171707, 336168, 368744, 166428, 17337, 163062, 453348, 592220, 524637, 371036, 144726, -187118, -461806, -469136, -320951, -331883, -505777, -522814, -326947, -287153, -564216, -759132, -528606, -162558, -128112, -366413, -521298, -582949, -751272, -875698, -655424, -290183, -287263, -625907, -745185, -435391, -126478, -143012, -254648, -182531, -32814, 15429, -5405, -98377, -378702, -686994, -596301, -54387, 439646, 554517, 541165, 647599, 653842, 385734, 188680, 387636, 681051, 610141, 305067]
31586C05067r8947R2077q7363k76617p2215K80754L25173P6545j30940j45336
31576B68198k9217J24389J86415O8574p7362m1563L9462j26537l92388l12497
31566b92526N4008J19883k61105m69537r6579L81081L58290P788j03262R2780
31556b09179K11078J02521k0381j2128O5009J47111K08674J81940N8870m5432
31546F88083q7941j65998k51664j33133J83977L21130M0640l49872l98325r3088
31536b46191K27441L37138K25833m4014l07293l28157j30346p0842l01563m23619
31526a061613m7882N37802P13826L87660K0841j29080k64803m88013n02880j16120
31516i50262L48664M47284K00399q590J2392R1140L1954j13763j69783p8277N1650
$$ y = [305067, 206120, 298197, 210834, -65783, -137998, 142756, 467929, 544474, 413534, 268198, 238981, 363370, 549785, 618359, 540997, 499434, 538896, 412359, 19971, -292526, -238518, -118635, -379740, -849277, -945856, -564775, -206485, -198697, -301959, -209179, 1899, 104420, 84039, 71911, 136920, 284031, 492705, 674645, 733515, 688083, 600142, 434144, 182480, 49347, 233324, 554454, 595094, 245222, -153103, -246191, -18750, 318388, 544221, 500207, 192914, -135243, -265589, -336431, -637994, -1061613, -1109495, -571693, 142133, 529793, 550634, 421554, 156751, -331262, -834142, -950262, -601598, -154314, 46085, 37495, 49887, 141027, 172981, 59218, -110565, -188842, -137192]
31505a37192P2992n3843k06830k09594n1767M7400q3149k66186j57646K41862
31495h03953N12199L84107J21033R1592K07277J42258p1090j22157j2682n6712
31485C91872k71362l01340o2217Q2538k6593o8953J16688J83213p0756k53017
31475b79927m5633J99575P6899j47145n0651J44835J3841k11504l3869L32000
31465a579K58844j70322k61014R6762K64947m162j85800J8450J70356m2666k14947
31454g1131K6588L28468K05600j74967l40370k51575j85054j71348l8695J70612
31444e01872K46346J69568J08291J20989R4201n6706k44637k51401M9406M17060
31434A51245L65204j90477o23931l53214K90847N06421J94058j1212J33420J35612
$$ y = [-137192, -64200, -118043, -324873, -534467, -586234, -538834, -621983, -888169, -1045815, -803953, -291754, 92353, 213386, 304978, 512255, 654513, 583423, 461266, 448584, 391872, 120510, -180830, -243047, -160509, -187102, -256055, -139367, 43846, -26910, -279927, -325560, -125985, -49086, -196231, -246882, -102047, -88206, -299710, -333579, -1579, 257265, 86943, -174071, -77309, 187638, 183476, -2324, 16126, 186482, 143816, -71131, -44543, 283925, 489525, 314558, -25812, -277387, -462441, -633789, -672484, -501872, -255526, -85958, 22333, 143322, 237523, 180817, -63820, -315221, -265815, 151245, 516449, 325972, -297959, -651173, -360326, 146095, 340153, 328941, 462361, 597973]
31424E97973k47486m85910j47042L68918M49344J12874k30460m14096m56462k73145
31414g25492Q9637K67185N0695k35474j99030O3465K07011J41323r710j46081
31404d96471j27619J73855N18969M31821m9536k71555M9550L27627N3411l63084
31394B46968l16316k6315p3381l26490j94266K82869M54145J23137j91303j30449
31384a51401M5084K1475j02271j11102k2143M1574M3700M006k6754K8176J29538
31373a00118J10264k7337m5401Q4613L1917k75839l34478J39539N48386K33278
31363C64824m16724n04861k7521K03948m8666j60687J38997K89143k2113k39099
31353d22759O9334M01935J69507k86303k60202J75209L56016R3503j69453j56794
$$ y = [597973, 350487, -135423, -282465, 86453, 535797, 648671, 418211, 4115, -452347, -725492, -635855, -368670, -317975, -553449, -752479, -689014, -482003, -340680, -350390, -496471, -624090, -450235, 68734, 500555, 451019, 179464, 229014, 556641, 610052, 246968, -69348, -95663, -169044, -495534, -689800, -406931, 47214, 170351, -20952, -151401, -106317, -84842, -187113, -298215, -320358, -278784, -235084, -231078, -257832, -229656, -100118, 10146, -17191, -62592, 22021, 53938, -221901, -556379, -416840, 131546, 364824, -51900, -556761, -584282, -380334, -429000, -589687, -450690, -161547, -183660, -422759, -353425, 48510, 218017, -68286, -328488, -153279, 202737, 296240, 126787, -30007]
31343c0007n9595l2451M0125J74556J51814r2070k89591k22654k0790P1492K2996
31332b86175l1649j8031L5675R2109J33251J41413J16304Q3185N6925K8199o305
31321C44901l5799o2423j06179j78717k63355l08358k44300n5386J59266K62259
31311d88091K35693J80918J35327J2624j99396l24228k31501p2972p1354j40587
31301i63567Q111L61678N17152K42504j46277k05495M1478K14749J37670m1345
31291A66658j99703l44758l76430j32186K56207M15337K57958J05669J45948J53655
31281D48355l9911k00334j05991N4733M1215k8984L959k2532k08562k21648J49073
31270a30627M32633J36199l38538k29696L31483M97419Q2691j99006k124J29086
$$ y = [-30007, -89602, -122053, -81928, 92628, 244442, 152372, -137219, -359873, -380663, -309171, -286175, -317824, -335855, -300180, -208071, -74820, 66593, 182897, 266082, 323007, 351206, 344901, 309102, 246679, 140500, -38217, -301572, -609930, -854230, -909616, -750350, -488091, -252398, -71480, 63847, 76471, -122925, -447153, -678654, -751626, -822980, -963567, -955456, -593778, -76626, 165878, 19601, -185894, -144416, 70333, 208003, 166658, -33045, -377803, -754233, -886419, -630212, -214875, 43083, 148752, 294700, 448355, 408444, 208110, 102119, 156852, 198067, 169083, 173042, 150510, -58052, -279700, -130627, 302006, 438205, 99667, -130029, 201454, 698873, 781564, 582558, 580434, 709520]
31260G09520j76008m56387k99636n3847r0135r6620K38282M96635K19454k23539
31250B67719k26271M5062L6328j80749j30192J05535K8945l05960l39686L921
31240f95348K02928P6243M5363K99309M37180J99083r0024j10275k8080o9570
31230B66809j04951n533Q911k40363m82294l55209N1600L46327L57855K25443
31220F8595R4848j0158p1342l8055Q3765J93251J55291p2612l19758l05030K831
31209b18374K52985J53740r5318j15330M4617L3547j35439o9729K76569M11051
31199E38319P0789l08339k32112J39276L16164K03662O4933j0000j32927k41467
31189D08298j53130L6426K8965j71635k17454L3003K78845K44324P3549L9948
$$ y = [709520, 533512, 77125, -222511, -276358, -366493, -463113, -224831, 271804, 491258, 267719, 41448, 86510, 122838, -57911, -188103, -82568, -53623, -359583, -699269, -695348, -492420, -416177, -370814, -71505, 365675, 564758, 474734, 364459, 336379, 266809, 161858, 156325, 165236, -75127, -557421, -912630, -861030, -514703, -156848, 68595, 163443, 153285, 81943, 43888, 127653, 320904, 476195, 403583, 83825, -221205, -218374, 34611, 188351, 93033, -22297, 22320, 55867, -79572, -149301, 127268, 538319, 609108, 300769, 68657, 207933, 524097, 727759, 792692, 782692, 649765, 408298, 255168, 291594, 320559, 148924, -68530, -35527, 243318, 487642, 561191, 601139]
31179F01139R8562L038k55584m03617k65785K1729K17231K35975J49110L8441
31169D40239o7253j67547k55756k82203j57765J27447L87579L72924Q3513j70296
31159C10882j28427R7240J93336M9996j67659k87565k75345j40827Q2716K47188
31149a8465J91337j2764j13620m1638j412j10940j80978j4168K70020M02132L07826
31138F77330J01621j22387k89083k63799k2910J76790N7485k76710m38459k60977
31128f61099L8036K30320L52218M80059M59659J02893m26350o72912m06375P9790
31118d23761L09185J77535Q03K2347R0544m4160k84204k80042P0849M55788N22763
31107F17647K47176j27850l56747l36361j34771M7715N4920m6437p1183O892M4610
$$ y = [601139, 699701, 702739, 447155, 43538, -222247, -200518, 16713, 252688, 401798, 440239, 372986, 205439, -50317, -332520, -490285, -362838, 24741, 397665, 481178, 310882, 182455, 279695, 473031, 523027, 355368, 67803, -207542, -348369, -265653, -18465, 172872, 160108, 46488, 4850, 3438, -107502, -288480, -302648, -32628, 369504, 677330, 778951, 656564, 367481, 103682, 80772, 257562, 315047, 38337, -400122, -661099, -623063, -392743, -40525, 439534, 899193, 1002086, 575736, -97176, -503551, -423761, -114576, 62959, 63762, 86109, 176653, 132493, -151711, -431753, -360904, 94884, 617647, 864823, 736973, 380226, 43865, -90906, -43191, 11729, -34708, -105891, -98999, -54389]
31096e4389j695p861O9440R2533k1155j54854j75602q7484O2303K31124K80114
31085B32474P5479k23415k62204j2462J14368j22172l78747k27594J86374L66326
31075b51573J91198J5426O5814J22756p9513m03033m57940j15017L02162L88667
31065b21053J43447n3148L0434J73701R5043p2425k1929J58855J06147j67221
31055A71851k39233K0281K27017J28705l4356n1613j07341l02862l25355q861
31045e21767K46050R7813j28286j1434J92354P763l50640k75513K03629M53943
31035h6088K55649L8707M6685m793k48298l14387K1405L74269L06413l7614k13689
31024A38259j18517n013k8764q2364l3004P2434O9901r8350k52485j67429P1587
$$ y = [-54389, -56084, -63945, 5495, 98028, 76873, -77981, -253583, -341067, -278764, -47640, 232474, 307953, 84538, -177666, -190128, -75760, -197932, -576679, -804273, -617899, -251573, -60375, -44949, 20865, 143621, 64108, -338925, -796865, -911882, -609720, -221053, -77606, -130754, -100320, 73381, 168424, 95999, 74070, 232925, 339072, 171851, -67382, -47101, 179916, 308621, 274265, 222652, 115311, -187551, -512906, -521767, -275717, -177904, -306190, -317624, -125270, -117507, -468147, -743660, -540031, -86088, 169561, 208268, 254953, 250160, 1862, -312525, -291120, 83149, 389562, 351948, 138259, 19742, 14729, -14035, -96399, -129403, -56969, 12932, -85418, -337903, -505332, -433745]
31013d33745J18239j01034j98979N9219K88338P0339k79294j38964L81759N37650
31003C03528R9741l05002j85033J53770K40455J37226J04489O7823j10020k11017
30993B95960j5037K09016O9576k74214l10412L0439K61976P2320k46751k63110
30983a70237m144J40836j4539k27853k02436j1238L2329j19459j37053J65532
30973e48262M62683L59567J4439q4232J16562J67196j26561l70602k19503Q2704
30963a46009J17492q0920j82452j13874o4882p6746r001J23708J25628l6987j47020
30952d91063o1277R5120J44079Q9419L7141J5466m231J4902J41188L16947L46123
30941F43814J15837k11858l32753j48581J13184J87075P8774j8435k6221l5021
$$ y = [-433745, -315506, -416540, -615519, -556300, -267962, -197623, -476917, -615881, -234122, 303528, 403269, 98267, -86766, 67004, 307459, 444685, 549174, 616997, 506977, 295960, 280923, 489939, 559515, 285301, -25111, 5328, 267304, 339624, 92873, -170237, -174381, -33545, -48084, -275937, -478373, -489611, -457282, -576741, -713794, -548262, -85579, 273988, 288427, 204195, 320757, 487953, 361392, -9210, -228713, -146009, -28517, -109437, -291889, -405763, -470645, -547391, -556392, -432684, -307056, -344043, -491063, -552340, -457220, -313141, -223722, -186581, -171115, -175346, -160444, -19256, 297691, 643814, 759651, 547793, 215040, 66459, 179643, 366718, 445492, 427057, 400836, 365815]
30931C65815q8808j00581j9615O4690N3140k9364r1286r4524o7407m4687l0469
30920h3096o625J9459j6534j49640k53749j25966K16630M63417L68875O4228j47899
30909C49100j86977j81071j71615r1228J3146M176r0862r0599M6951J63914J69153
30898f5912J47053J55324J31748O5645N0524Q3763J8575j76038k95397j79328
30888f4043L4783R5894j7536r2805Q410J58471J16901j55884l81182k33483K34319
30877b96155N47387L25426k22186m98529k18554K72487M40652J74806j60319k09075
30867A55940k2754P3991o0381j99540q8093J64138K22973K4063j27935j4519J92261
30856C20144K14269M3305j32498k00417j54340j7896J00441L6904j84751l07489
$$ y = [365815, 277007, 176426, 156811, 221501, 274641, 245277, 153991, 59467, -7940, -52627, -83096, -89721, -70262, -86796, -236436, -490185, -616151, -399521, 63896, 432771, 496999, 349100, 162123, -18948, -190563, -281791, -268645, -264469, -355331, -445930, -398979, -235065, -65912, 81141, 236465, 368213, 433858, 484382, 568145, 586720, 410682, 115285, -64043, -29260, 66634, 49098, -43707, -35297, 123174, 240075, 84191, -296991, -530474, -296155, 251232, 576658, 354472, -144057, -362611, -90124, 350528, 525334, 365015, 155940, 133186, 207177, 146796, -52744, -140837, 23301, 246274, 270337, 142402, 127883, 320144, 534413, 577718, 445220, 244803, 90463, 72567, 173008, 209912, 25161, -282328]
30846b82328j84475K6118J51205K37915L18568K32328o5215k93490k37630p6953
30836a73957k1637O5539L11833M29383J48291k22686k17192K5697K0875k01795
30826A64351j68928J53052K50691o1377l11271j30557K04696K62556N1027j42551
30816B71689j74796q3548M0383P0119m7149j47346o1543O7738O191j17258q184
30805a83704K00510Q8308k98137m16312p8471K53308K28823R8922J54693K05829
30795B53769N21k55111k12043P5520K74059K29081L5592j52229j93692n1272Q1837
30784H6032k475j48203l7207K05326J11107l16491m76956j01308K92724K26984
30774a60467k9951l1766J00306M4393o3626N1035J83394o342k94535k00859J79395
$$ y = [-282328, -466803, -440685, -289480, -51565, 267003, 499331, 434116, 140626, -97004, -173957, -195594, -130055, 181778, 611161, 759452, 536766, 319574, 345271, 366146, 164351, -4577, 148475, 399166, 337789, 26518, -104039, 100657, 363213, 414240, 271689, 96893, 13345, 53728, 123847, 76698, -70648, -132191, -64453, -58262, -175520, -183704, 16806, 105114, -193023, -609335, -687806, -434498, -205675, -106753, 47940, 253769, 254290, -821, -212864, -137344, 136715, 365796, 401388, 249159, 55467, 4195, 86032, 83557, -64646, -101853, 103473, 214580, -101911, -578867, -680175, -387451, -160467, -190418, -222184, -121878, -77485, -141111, -90076, 93318, 86976, -207559, -408418, -229023]
30763b29023L06551P3026r4719m321O0164m9415q4891N7874O6984k31308m70809
30752e99887k56702K07671L86007J50224j11048r6782L8190L3579l2599Q7637
30742a93710L23519L09493l4672k82014r1436K43020J99083j76624l29137l7826
30732g0304K67139J56045k35116m90027m38844j82968J34394L58245L40778J32392
30722b8266k5370l5963o0169j70281j71553M4582K39805J60769q2411k04492j33753
30711d67102j77R8055J18059K0861j20412j14689Q0239K43606J94089L6947l3034
30700E6442M129O1921R0011K5946j75310l37845j59464L09331N58582K47087k84925
30689C95905m22164n0053L54389L36455o2842m31943m33243j10536J91434K16528
$$ y = [-229023, 77528, 150554, 55835, 51514, 111678, 62263, -22628, 35246, 102230, -129078, -599887, -856589, -648918, -262911, -112687, -223735, -320517, -282327, -248748, -281347, -193710, 129809, 439302, 404630, 122616, 31180, 274200, 473283, 296659, -32478, -70304, 196835, 352880, 117764, -372263, -811107, -994075, -859681, -501436, -160658, -28266, -53636, -89599, -149768, -320049, -491602, -447020, -207215, -46446, -128857, -333349, -467102, -467279, -369224, -251165, -230304, -350716, -465405, -385166, -141560, 52529, 89476, 56442, 60571, 122492, 212503, 238449, 63139, -274706, -434170, -124839, 433743, 680830, 395905, -26259, -76312, 278077, 614532, 551690, 119747, -313496, -424032, -232598, -16070]
30679a6070N9670k9019J6874J05004K07595L01006K14189j31739m43503l94463
30669a10456j37572m8543p8641R7658L73144K96686j05477k85520o1618J48667
30659H8328J38831K06654L97785K55965k96050o04435k95126R1424K0614j90311
30649a86321p4874J14832j9280j81288O5049L95140K39393j86189k42365L3025
30639d2878O9639j89219k59933m2521O1306n5218n2174J68071L03999K44849J95520
30628D01441J67139n4671l73894l96811p1363K05156J98070Q0243J3514n0472
30618A18352j03614n2969J1930o5932j48470J4499K85293K92352M8745q1235j9768
30607B99183n3377k35761k42496N8994L52642L36515Q5939j49494k15669q8054
$$ y = [-16070, 43600, 14581, 31455, 136459, 344054, 645060, 859249, 727510, 284007, -110456, -248028, -296571, -375212, -277554, 95590, 392276, 286799, 1279, -60339, 88328, 227159, 433813, 831598, 1087563, 791513, 187078, -108048, -16624, 3990, -186321, -261195, -146363, -165643, -346931, -281882, 113258, 352651, 166462, -75903, -42878, 26761, -162458, -422391, -464912, -403606, -458824, -510998, -342927, -38928, 205921, 401441, 568580, 513909, 140015, -256796, -328159, -123003, 75067, 155310, 168824, 118352, 14738, -38231, -26301, -92233, -240703, -226204, 59089, 351441, 400186, 318951, 299183, 245806, 10045, -232451, -173457, 179185, 515700, 601639, 452145, 236476, 148422]
30597A48422R1936O3456j90993k74717P3050M49684K83574k97859o26158m17388
30587f96993N179L31211N23031M94985J45461k52870k67028L3684J61482j7356
30577D60786j52104p7392j7857n7202n663J06833Q697k30008k07192Q8011K00746
30566A17655J8145k8093K08597K67458p8278l43814j37943J65859P8468k04397
30556F3657k11659J0237R2855K2697N4285J57035Q0339j48968k56651j79629j00855
30545d16657p5318K2025J87051K39610J21783J38Q072N5733k1893k10538k96249
30534c86243j25473J57538K52658J11381J0402R7891J17388j56183m45587l32437
30524f98665O2001K20585N963j81443n7086J85618K66065J74295J7822j49002
$$ y = [148422, 240358, 303814, 112821, -161896, -88846, 360838, 644412, 346553, -279605, -696993, -691814, -360603, 162428, 657413, 802874, 550004, 282976, 316660, 478142, 460786, 308682, 231290, 213433, 156231, 150568, 257401, 266098, 36090, -171102, -83091, 117655, 135800, 107707, 316304, 583762, 505484, 161670, 23727, 189586, 268054, 63657, -148002, -137765, -44910, -22213, 32072, 189107, 269446, 120478, -136173, -315802, -416657, -491975, -469950, -282899, -43289, 78494, 78632, 86704, 142437, 120544, -89994, -386243, -511716, -354178, -101520, 9861, 20263, 118154, 235542, 79359, -366228, -698665, -636664, -416079, -410116, -591559, -648645, -463027, -196962, -22667, -4845, -153847]
30514a53847k32871j32890O4487J81206K25537K85458K36544n2664l18396j89924
30504h7360J65803K23832p4435k54732j21994k0644j43127j92899L5445K92510
30494a77601L36940K58315J21995j81408n02403m07596J18552M76283K74043j49185
30484A67935l32546l02993k35182l8149L03872M60326K58327K6163L1684L5399
30474C74836j70138k65427L1758L46426J79342k72348m09593j03082K56114L72529
30464C40417K45930m0649l09439k85856R005J37690j08877l07795q7559K04602
30454b02531R4707j53620J6923M30842M03004j21319m50767k24329J21010J25260
30444C9180o6905r3610P9128K39184K23956j4896l58769m77075j49543L37717
$$ y = [-153847, -386718, -519608, -455121, -273915, -48378, 237080, 473624, 420960, 102564, -87360, 78443, 302275, 227840, -26892, -148886, -169530, -312657, -505556, -470111, -177601, 159339, 417654, 539649, 358241, -144162, -551758, -433206, 43077, 317120, 167935, -164611, -467604, -702786, -740935, -437063, 23263, 281590, 307753, 339437, 374836, 204698, -60729, -28971, 317455, 496797, 224449, -185144, -288226, -32112, 340417, 586347, 545698, 236259, -49597, -40592, 97098, -11779, -319574, -407133, -202531, -107824, -261444, -244521, 186321, 589325, 468006, 17239, -207090, -86080, 39180, -27725, -121335, -42207, 196977, 420933, 406037, 47268, -429807, -579350, -241633]
30434b41633M63948J69298r6758o7121K1832p6004k12466j58276J552N1678Q958
30423a34992L8497J31768J10162p4124k20118j19422J63880L47168K77380J17102
30413F37301P6639Q0129o7586k56877j72764J47120K70896L9672j59124m0622
30403E54784R9157o7643k82663j35687J94307K08050r6606k64293j42868k8509
30393C8029p0669q8925l3947j08108l13356l45523q7553J93201K79778K66872
30383b70201K58172J72125K414p2277l750J5869q4385r9362P3141K10749J31344
30372C33839k554K2650J14351N9669j16176k19228j84765j00842l6359j1421m2770
30361a83606q2413j3602J71755L00769K35210M6060j24276k36047k76506j66189
$$ y = [-241633, 222315, 391613, 294855, 227734, 249566, 173562, -38904, -197180, -195628, -143950, -134992, -96495, 35273, 145435, 71311, -148807, -268229, -104349, 242819, 520199, 637301, 713940, 794069, 726483, 469606, 296842, 443962, 714858, 754530, 595406, 554784, 653941, 586298, 303635, 167948, 362255, 570305, 473699, 209406, 66538, 38029, -32640, -121565, -155512, -263620, -576976, -922499, -1010052, -816851, -537073, -270201, -12029, 160096, 162510, 90233, 86483, 102352, 17967, -81395, -8254, 202495, 333839, 331285, 353935, 468286, 527955, 411779, 192551, 7786, -93056, -129415, -140836, -183606, -266019, -279621, -107866, 192903, 428113, 474173, 349897, 113850, -162656, -328845]
30351c28845R8246L22919L08358R2706j28847k47228k69426j96294l8444R4991
30341b91864Q7846j6912p5691m7505k513M6174J45100K20858R9646j97767l58811
30330c91439j50001K26167L56606J55409n8683m4270O3800N7212M695O8224J52020
30319D39740M6013j63849j71950M5210J47858l5855k16275q6415J88152K00317
30309C92946j08085l62112k43661J33952L76281K29291j69867m29003l10325P713
30299d82870J64231P7133j2147L6984N8908p8593j87641l7003K61805L93736K59342
30288D53885K9627j35439k06090j82720q8919l0789p9271j27702l6177J28892
30278b74703J77265P2456n7374j42800k04735j92505k0935K11384K66502R6256
$$ y = [-328845, -230599, 92320, 400678, 493384, 364537, 117309, -152117, -348411, -386855, -291864, -204018, -220930, -296621, -344126, -346639, -300465, -155365, 65493, 165139, -32628, -391439, -541440, -315273, 41333, 196742, 138059, 93789, 157589, 214801, 219496, 287720, 439740, 485753, 321904, 149954, 195164, 343022, 307167, 90892, 4477, 192629, 392946, 284861, -77251, -320912, -186960, 189321, 418612, 248745, -180258, -490583, -482870, -318639, -241506, -253653, -216669, -157761, -236354, -423995, -460998, -199193, 194543, 453885, 483512, 348073, 141983, -40737, -129656, -160445, -239716, -367418, -403595, -274703, -97438, -24982, -82356, -225156, -429891, -622396, -643331, -431947, -165445, -69189]
30268f9189o8558m8752M0008K018j22610j29470K7282J59346J08511n0183j36218
30257b87815r8711j8933O5155J83921K73392J69106j27583l30875k02077R8032
30247b76388K06992N9316o0815L0987J81998J88540P7549k2821r3384j53366j35165
30236C443P196J59735J53370m1739k90147l96687k31269J31905L95741L18073
30226B09621K1438j51161r3395k3613r1996j73842j41523p1464m6847M884J35021
30215d22877K50215K86136K82417J99240n3661l04402k02080K02214L54137l2998
30205E58341m79167l94213P7852L22725J38084j30666k01146j20281K4760K09067
30195E356K79653P6808k13787k13962P2878K07512m5763l55825k84170J30540
$$ y = [-69189, -137747, -186499, -146491, -144473, -267083, -396553, -369271, -209925, -101414, -151597, -287815, -386526, -405459, -340304, -156383, 117009, 286115, 158532, -172343, -374420, -276388, -69396, -10080, -70895, -39908, 142090, 330630, 408179, 385358, 291974, 138608, 3443, 10639, 170374, 323744, 282005, -8142, -404829, -636098, -504193, -108452, 209621, 231059, 79898, -13497, -37110, -129106, -302948, -444471, -515935, -562782, -557898, -422877, -172662, 113474, 395891, 595131, 541470, 237068, 34988, 237202, 591339, 558341, 79174, -315039, -237187, 85538, 223622, 92956, -108190, -228471, -203711, 5356, 285009, 361817, 148030, -65932, 6946, 214458, 168695, -187130, -471300, -340760]
30185c40760M43924L30438j04741m61758m19846l6059L08069L14644Q2697p7063
30175C9545n5305j956k2093l2188M3690J17498P4840k8961j4584J79769L54709
30164F54964K27136j93223n01677l43392R5012K91756R0915j28913q0582J6742
30154A28738j15797l05478k24311N0695J79635J07677O0047P8936j3380j98235
30144b51473k13061M823J72494Q0878j19756j91592j34937q0547k8522J15890
30134f45803L11405L45071P5027l32613m84714j63284L65464N74941K59027k36295
30124F8226m24077j85238K05324M11036K96771k554j87644r4262Q0431L2050j74053
30113B6010j77507P8074K10778J9835j80519j07579K4552n1188j28566Q8520L75750
$$ y = [-340760, 103164, 433602, 328861, -132897, -552743, -588802, -280733, 33911, 116608, 39545, -15760, -17716, -39809, -71997, -28307, 89191, 164031, 135070, 120486, 300255, 654964, 882100, 688877, 187200, -156192, -61180, 230576, 321491, 192578, 111996, 128738, 12941, -292537, -516848, -466153, -286518, -178841, -118794, -39858, -53238, -251473, -464534, -459711, -287217, -206339, -326095, -517687, -652624, -733171, -761693, -645803, -334398, 10673, 85700, -246913, -731627, -894911, -529447, 45494, 304521, 68226, -355851, -541089, -335765, 75271, 372042, 369488, 181844, 87582, 168013, 200063, 26010, -151497, -73423, 137355, 157190, -23329, -130908, -106356, -157544, -286110, -197590, 178160]
30102A78160K89990j04225l26297j84712Q8105L05108M41325L59578n8370n10172
$$ y = [178160, 468150, 363925, 37628, -147084, -58979, 246129, 687454, 1047032, 988662, 478490]
$$ [...]
##END NTUPLES=NMR SPECTRUM
##END=
