##TITLE=31Pdec_BAU 10-2021
 CDCl3, 24 sc
 11.03.2021
##JCAMPDX= 6.0         $$ Bruker NMR JCAMP-DX V2.0
##DATA TYPE= NMR SPECTRUM
##DATA CLASS= NTUPLES
##ORIGIN= UXNMR, Bruker Analytische Messtechnik GmbH
##OWNER= root
$$ XWIN-NMR		Version 3.5
$$ Thu Mar 11 10:07:40 2021 Russian Standard Time (UT+4h)  she@DPX200
##.OBSERVE FREQUENCY= 81.013821
##.OBSERVE NUCLEUS= ^31P
##.ACQUISITION MODE= SIMULTANEOUS
##.ACQUISITION SCHEME= undefined
##.AVERAGES= 24
##.DIGITISER RES= 16
##SPECTROMETER/DATA SYSTEM= spect
##.PULSE SEQUENCE= zgpg30
##.SOLVENT NAME= CDCl3
##.SHIFT REFERENCE= (INTERNAL, CDCl3, 0, 248.564)
##AUDIT TRAIL= $$ (NUMBER, WHEN, WHO, WHERE, WHAT)
$$ ##TITLE= Audit trail, XWIN-NMR		Version 3.5
$$ ##JCAMPDX= 5.01
$$ ##ORIGIN= Bruker BioSpin GmbH
$$ ##OWNER= she
$$ F:/spectra/data/she/nmr/P31/1/pdata/1/auditp.txt
$$ ##AUDIT TRAIL=  $$ (NUMBER, WHEN, WHO, WHERE, WHAT)
(   1,<2021-03-11 10:05:32.65 +0400>,<she>,<DPX200>,
      <created by zg, POWCHK disabled, PULCHK disabled
       configuration hash MD5:
       00 E9 B6 7A A2 85 ED C7 34 08 36 98 17 FE 4E 26
       data hash MD5: 32K
       75 0E EA 8D 94 6A 4C 28 C0 5F 4A 90 03 DB 4E 06>)
(   2,<2021-03-11 10:05:43.18 +0400>,<she>,<DPX200>,
      <Start of raw data processing
       efp BC_mod = 2 LB = 1 FT_mod = 6 PKNL = 1 PHC0 = -4095.129 PHC1 = 236.201 SI = 64K 
       data hash MD5: 64K
       60 98 33 25 1B B2 18 AC 64 49 3D D2 E6 4F 74 43>)
(   3,<2021-03-11 10:06:21.07 +0400>,<she>,<DPX200>,
      <pk PHC0 = 74.72482 PHC1 = -219.8 
       data hash MD5: 64K
       CB 3D 85 52 68 1F 49 B0 9F F3 BA 9F 51 5D A4 6D>)
(   4,<2021-03-11 10:06:24.07 +0400>,<she>,<DPX200>,
      <abs ABSG = 5 
       data hash MD5: 64K
       EE B9 03 71 28 76 3C 61 8C 60 E7 AC 6A 20 2C 6A>)
$$ ##END=
$$ 
$$ hash MD5
$$ 0E 63 C4 9C 33 29 B7 3B 91 DA 0B 4A 28 88 52 27
##$RELAX= 
##$RELAX= 
##$RELAX= 
##$RELAX= 
##$RELAX= 
##$RELAX= 
##$RELAX= 
##$RELAX= 
$$ Bruker specific parameters
$$ --------------------------
##$DU= <F:/spectra>
##$EXPNO= 1
##$NAME= <P31>
##$PROCNO= 1
##$TYPE= <nmr>
##$USER= <she>
##$AMP= (0..31)
100 100 100 100 100 100 100 100 100 100 100 100 100 100 100 100 100 100 
100 100 100 100 100 100 100 100 100 100 100 100 100 100 
##$AQSEQ= 0
##$AQ_mod= 1
##$AUNM= <au_zg>
##$AUTOPOS= <>
##$BF1= 81.014009
##$BF2= 200.13
##$BF3= 200.13
##$BF4= 200.13
##$BF5= 200.13
##$BF6= 200.13
##$BF7= 200.13
##$BF8= 200.13
##$BYTORDA= 1
##$CFDGTYP= 0
##$CFRGTYP= 5
##$CHEMSTR= <none>
##$CNST= (0..31)
1 1 145 1 1 1 1 1 1 1 1 1 1 1 1 1 1 1 1 1 1 1 1 1 1 1 1 1 1 1 1 1 
##$CPDPRG= <waltz16>
##$CPDPRG1= <>
##$CPDPRG2= <waltz16>
##$CPDPRG3= <>
##$CPDPRG4= <mlev>
##$CPDPRG5= <mlev>
##$CPDPRG6= <mlev>
##$CPDPRG7= <mlev>
##$CPDPRG8= <mlev>
##$CPDPRGB= <>
##$CPDPRGT= <>
##$D= (0..31)
0 1 0 0 0 0 0 0 0 0 0 0.03 2e-05 3e-06 0 0 0 0 0 0 0 0 0 0 0 0 0 0 0 0 
0 0 
##$DATE= 1615442732
##$DBL= (0..7)
120 120 120 11 120 120 24 19 
##$DBP= (0..7)
150 150 150 150 150 150 150 150 
##$DBP07= 0
##$DBPNAM0= <>
##$DBPNAM1= <>
##$DBPNAM2= <>
$$ [...]
##$SUBNAM3= <"">
##$SUBNAM4= <"">
##$SUBNAM5= <"">
##$SUBNAM6= <"">
##$SUBNAM7= <"">
##$SUBNAM8= <"">
##$SUBNAM9= <"">
##$SW= 501.771253377433
##$SWIBOX= (0..15)
0 1 3 0 0 0 0 0 0 0 0 0 0 0 0 0 
##$SW_h= 40650.406504065
##$TD= 32768
##$TD0= 1
##$TE= 0
##$TE2= 300
##$TE3= 300
##$TEG= 300
##$TL= (0..7)
0 120 53 12 22 120 120 120 
##$TP= (0..7)
150 150 150 150 150 150 150 150 
##$TP07= 0
##$TPNAME0= <>
##$TPNAME1= <>
##$TPNAME2= <>
##$TPNAME3= <>
##$TPNAME4= <>
##$TPNAME5= <>
##$TPNAME6= <>
##$TPNAME7= <>
##$TPOAL= (0..7)
0.5 0.5 0.5 0.5 0.5 0.5 0.5 0.5 
##$TPOFFS= (0..7)
0 0 0 0 0 0 0 0 
##$TUNHIN= 0
##$TUNHOUT= 0
##$TUNXOUT= 0
##$USERA1= <user>
##$USERA2= <user>
##$USERA3= <user>
##$USERA4= <user>
##$USERA5= <user>
##$V9= 5
##$VALIST= <valist>
##$VCLIST= <CCCCCCCCCCCCCCC>
##$VD= 0
##$VDLIST= <DDDDDDDDDDDDDDD>
##$VPLIST= <PPPPPPPPPPPPPPP>
##$VTLIST= <TTTTTTTTTTTTTTT>
##$WBST= 1024
##$WBSW= 4
##$XGAIN= (0..3)
0 0 0 0 
##$XL= 0
##$YL= 0
##$YMAX_a= 17062
##$YMIN_a= -16905
##$ZGOPTNS= <>
##$ZL1= 120
##$ZL2= 120
##$ZL3= 120
##$ZL4= 120
##$ABSF1= 248.5645
##$ABSF2= -253.2056
##$ABSG= 5
##$ABSL= 3
##$ALPHA= 0
##$AQORDER= 0
##$ASSFAC= 0
##$ASSFACI= 0
##$ASSFACX= 0
##$ASSWID= 0
##$AUNMP= <proc_1d>
##$AZFE= 0.1
##$AZFW= 0.5
##$BCFW= 0
##$BC_mod= 2
##$BYTORDP= 0
##$COROFFS= 0
##$CY= -3
##$DATMOD= 1
##$DC= 0
##$DFILT= <>
##$DTYPP= 0
##$F1P= 0
##$F2P= 0
##$FCOR= 1
##$FTSIZE= 65536
##$FT_mod= 6
##$GAMMA= 0
##$GB= 0
##$INTBC= 1
##$INTSCL= 5.30512e-09
##$ISEN= 30
##$LB= 1
##$LEV0= 0
##$LPBIN= 0
##$MAXI= 10000
##$MC2= 0
##$MEAN= 0
##$ME_mod= 0
##$MI= 50
##$NCOEF= 0
##$NC_proc= -3
##$NLEV= 6
##$NOISF1= 182.463
##$NOISF2= 159.3651
##$NSP= 0
##$NTH_PI= 0
##$NZP= 0
##$OFFSET= 248.5645
##$PC= 4
##$PHC0= -4020.404
##$PHC1= 16.401
##$PH_mod= 1
##$PKNL= yes
##$PPARMOD= 0
##$PSCAL= 0
##$PSIGN= 0
##$REVERSE= no
##$SF= 81.014009
##$SI= 65536
##$SIGF1= 159.3651
##$SIGF2= -187.1042
##$SINO= 113.3802
##$SIOLD= 16384
##$SREGLST= <1H.CDCl3>
##$SSB= 0
##$STSI= 65536
##$STSR= 0
##$SW_p= 40650.406504065
##$SYMM= 0
##$S_DEV= 0
##$TDeff= 32768
##$TDoff= 0
##$TI= <>
##$TILT= no
##$TM1= 0
##$TM2= 0
##$TOPLEV= 0
##$USERP1= <user>
##$USERP2= <user>
##$USERP3= <user>
##$USERP4= <user>
##$USERP5= <user>
##$WDW= 1
##$XDIM= 65536
##$YMAX_p= 331289080
##$YMIN_p= -1424270
$$ End of Bruker specific parameters
$$ ---------------------------------
##NTUPLES= NMR SPECTRUM
##VAR_NAME=  FREQUENCY,     SPECTRUM/REAL,   SPECTRUM/IMAG
##SYMBOL=    X,             R,               I
##VAR_TYPE=  INDEPENDENT,   DEPENDENT,       DEPENDENT
##VAR_FORM=  AFFN,          ASDF,            ASDF
##VAR_DIM=   65536,         65536,           65536
##UNITS=     HZ,            ARBITRARY UNITS, ARBITRARY UNITS
##FACTOR=    0.620285442955139, 1,           1
##FIRST=     20137.2065510759, 0,            0
##LAST=      -20513.1999529892, 0,           0
##MIN=       -20513.1999529892, -1424270,    0
##MAX=       20137.2065510759, 331289080,    0
$$ Real data points
##PAGE= N=1
##DATA TABLE= (X++(R..R)), XYDATA
$$ [...]
$$ plain form
36210 102969 333528 368601 475642 647906 629523 397260 198976 114514 -23306 -229792
36200 -229792 -278862 -101352 83069 139454 178896 224377 78999 -282606 -526395 -407603
36190 -407603 -135300 -39747 -122972 -209597 -318072 -559897 -816973 -843912 -627451 -375209
36180 -375209 -192241 -14430 160239 206648 62593 -183425 -411700 -555578 -579129 -492188
36170 -492188 -379950 -318532 -272103 -144971 90236 358362 518015 415884 27296 -410640
36160 -410640 -555007 -322900 41440 312370 478721 516143 275518 -183621 -438303 -202681
36150 -202681 233589 420223 396307 488835 618789 375188 -201788 -501733 -210835 210395
36140 210395 230418 1349 -4185 207095 216221 -86152 -346246 -325299 -200054 -185202 -218063
$$ packed form
36210A02969K30559L5073J07041J72264j8383k32263j98284q4462j37820k06486
36200b29792m9070J77510J84421N6385L9442M5481j45378l61605k43789J18792
36190d07603K72303R5553q3225q6625j08475k41825k57076k6939K16461K52242
36180c75209J82968J77811J74669M6409j44055k46018k28275j43878k3551Q6941
36170d92188J12238O1418M6429J27132K35207K68126J59653j02131l88588m37936
36160d10640j44367K32107L64340K70930J66351L7422k40625m59139k54682K35622
36150b02681M36270J86634k3916R2528J29954k43601n76976k99945K90898M21230
36140B10395K0023k29069n534K11280R126l02373k60094K0947J25245J4852l2861
$$ plain form
36129 -218063 -184779 -166904 -247354 -286652 -131943 91554 134951 -12793 -141677 -148499 -124297
36118 -124297 -131118 -121180 -105669 -178350 -302623 -294087 -126013 -43654 -214390 -445483 -450316
36107 -450316 -247931 -66205 33786 158907 269117 168884 -154056 -452121 -554834 -544767
36097 -544767 -509604 -367041 -89892 106566 17326 -232632 -326744 -160676 63164 127518
36087 127518 45734 -7260 78309 234626 318230 296163 267524 267542 166211 -100737 -302140
36076 -302140 -146771 275923 551948 473069 239072 59985 -130762 -403018 -572134 -477054
36066 -477054 -293531 -270522 -304602 -94655 345511 626509 453668 -49222 -508859 -657006
36056 -657006 -526658 -392147 -465036 -601243 -467874 -82652 83619 -233679 -607299 -460368
$$ packed form
36129b18063L3284J7875q0450l9298J54709K23497M3397j47744j28884o822K4202
36118a24297o821R938J5511p2681j24273Q536J68074Q2359j70736k31093m833
36107d50316K02385J81726R9991J25121J10210j00233l22940k98065j02713J0067
36097e44767L5163J42563K77149J96458q9240k49958r4112J66068K23840O4354
36087A27518q1784n2994Q5569J56317Q3604k2067k8639J8j01331k66948k01403
36076c02140J55369M22694K76025p8879k33997j79087j90747k72256j69116R5080
36066d77054J83523K3009l4080K09947M40166K80998j72841n02890m59637j48147
36056f57006J30348J34511p2889j36207J33369L85222J66271l17298l73620J46931
$$ plain form
36046 -460368 93145 400125 186625 -153874 -230276 -138294 -112382 -103933 31600 213855
36036 213855 275196 230538 181273 102837 -63431 -230241 -269038 -204233 -145601 -112573 -61668
36025 -61668 -1228 43799 90186 112372 16700 -177055 -255645 -69674 234711 403401 395835
36014 395835 346543 303018 212563 111789 107241 186693 258871 361208 584760 780798 636104
36003 636104 147701 -261225 -291674 -184542 -314303 -574735 -550787 -213348 -113 -138005
35993 -138005 -313603 -214958 -18651 -28753 -144806 -94114 23117 -111243 -441835 -591074
35983 -591074 -476893 -376159 -334954 -77893 336979 367766 -177628 -689699 -592363 -184658
35973 -184658 -109376 -350967 -406332 -211917 -186371 -418983 -510808 -291968 -70550 -31123
$$ packed form
36046d60368N53513L06980k13500l40499p6402R1982K5912Q449J35533J82255
36036B13855O1341m4658m9265p8436j66268j66810l8797O4805N8632L3028N0905
36025f1668O0440M5027M6387K2186r5672j93755p8590J85971L04385J68690p566
36014C95835m9292m3525r0455j00774m548P9452P2178J02337K23552J96038j44694
36003F36104m88403m08926l0449J07132j29761k60432K3948L37439K13235j37892
35993a38005j75598R8645J96307j0102j16053N0692J17231j34360l30592j49239
35983e91074J14181J00734M1205K57061M14872L0787n45394n12071R7336M07705
35973a84658P5282k41591n5365J94415K5546k32612r1825K18840K21418L9427
$$ plain form
35963 -31123 33288 202802 204114 -38034 -132109 176636 567802 644767 480907 325208 142289
35952 142289 -160377 -376854 -302422 -128797 -130337 -201351 -125234 -51069 -210023 -358687 -67893
35941 -67893 521279 795464 538766 182978 115014 228949 300277 334612 333800 129528 -272810
35930 -272810 -504541 -286633 144346 322147 100430 -291987 -586540 -662850 -535044 -339056
35920 -339056 -236311 -201769 -38219 289891 526209 482987 334262 341297 464012 494458
35910 494458 427281 405719 393905 218109 -86730 -266182 -211184 -83001 -41034 -86865 -210884
35899 -210884 -424083 -569674 -387464 91669 471447 490209 353603 339799 313059 -25544
35889 -25544 -542999 -743541 -455339 -80019 -28967 -207182 -252325 -68910 117699 131244
$$ packed form
35963c1123O4411J69514J312k42148r4075L08745L91166P6965j63860j55699j82919
35952A42289l02666k16477P4432J73625j540p1014P6117P4165j58954j48664K90794
35941f7893N89172K74185k56698l55788o7964J13935P1328L4335q12k04272m02338
35930b72810k31731K17908M30979J77801k21717l92417k94553p6310J27806J95988
35920c39056J02745L4542J63550L28110K36318m3222j48725P035J22715L0446
35910D94458o7177k1562j1814j75796l04839j79452N4998J28183M1967m5831j24019
35899b10884k13199j45591J82210M79133L79778J8762j36606j3804k6740l38603
35889b5544n17455k00542K88202L75320N1052j78215m5143J83415J86609J3545
$$ plain form
35879 131244 45780 37336 178597 371834 405273 135207 -298559 -526724 -351004 -17327
35869 -17327 68646 -152569 -353621 -267376 25484 291940 433412 475980 425520 281248
35859 281248 129242 95450 210770 387165 512239 522119 408347 212154 17189 -87369
35849 -87369 -65106 29032 76334 3131 -125456 -179680 -156041 -197207 -356282 -463571 -363451
35838 -363451 -176587 -129257 -188483 -111879 144995 340124 329714 279908 362428 468922 410828
35827 410828 223212 66900 -31465 -129441 -172806 -86035 988 -145878 -529617 -873062
35817 -873062 -930429 -713430 -408375 -202791 -194636 -344780 -506081 -584396 -633693 -700197 -674126
35806 -674126 -473538 -286066 -369750 -632006 -697214 -450462 -214435 -244712 -336988 -179150
$$ packed form
35879A31244q5464q444J41261J93237L3439k70066m33766k28165J75720L33677
35869a7327Q5973k21215k01052Q6245K92860K66456J41472M2568n0460j44272
35859B81248j52006l3792J15320J76395J25074R880j13772j96193j94965j04558
35849h7369K2263R4138M7302p3203j28587n4224K3639m1166j59075j07289J00120
35838c63451J86864M7330n9226P6604K56874J95129j0410m9806Q2520J06494n8094
35827D10828j87616j56312r8365r7976m3365Q6771Q7023j46866l83739l43445
35817h73062n7367K16999L05055K05584Q155j50144j61301p8315m9297o6504K6071
35806f74126K00588J87472q3684k62256o5208K46752K36027l0277r2276J57838
$$ plain form
35796 -179150 129624 239899 122813 116715 372483 581207 410501 -14960 -277150 -189073
35786 -189073 44343 140602 38127 -117818 -143991 41286 324107 426953 167689 -285198
35776 -285198 -560204 -526173 -407226 -371174 -240476 167040 600521 618986 220218 -119451
35766 -119451 -81351 138622 209276 84804 -121343 -381937 -626481 -615959 -257568 125506
35756 125506 159259 -68945 -190859 -148655 -225789 -509413 -717163 -636894 -399791 -210415
35746 -210415 -111650 -123050 -287768 -440275 -271370 167185 361610 23815 -424706 -408752
35736 -408752 20439 378753 515945 680132 902558 874770 521102 195756 131892 124777
35726 124777 -13127 -89436 72683 233105 113011 -93261 -13563 274555 368865 207260
$$ packed form
35796a79150L08774J10275j17086o098K55768K08724j70706m25461k62190Q8077
35786a89073K33416R6259j02475j55945k6173J85277K82821J02846k59264m52887
35776b85198k75006L4031J18947L6052J30698M07516M33481J8465l98768l39669
35766a19451L8100K19973P0654j24472k06147k60594k44544J0522L58391L83074
35756A25506L3753k28204j21914M2204p7134k83624k07750Q0269K37103J89376
35746b10415R8765j1400j64718j52507J68905M38555J94425l37795m48521J5954
35736d08752M29191L58314J37192J64187K22426k7788l53668l25346o3864p115
35726A24777j37904p6309J62119J60422j20094k06272P9698K88118R4310j61605
$$ plain form
35716 207260 137181 306542 439444 331460 162277 130224 121851 -18075 -167662 -146872
35706 -146872 -47712 -76880 -219928 -316195 -347896 -403456 -443225 -354257 -193628 -148678 -265006
35695 -265006 -392768 -387262 -223481 31398 219683 165641 -79805 -180705 85892 489496
35685 489496 650670 561599 495223 507855 425196 278612 302945 444987 341098 -61755
35675 -61755 -313558 -130485 158302 149313 -23491 -14551 103743 26820 -149063 -13786 450476
35664 450476 734963 497935 21629 -206125 -105200 12248 -74535 -232089 -191137 79909
35654 79909 305402 256425 103086 217517 593124 737228 329709 -265641 -454744 -199732
35644 -199732 25762 -26588 -127997 -99795 -156298 -520630 -1012643 -1273737 -1211789 -999488
$$ packed form
35716B07260p0079J69361J32902j07984j69183l2053q373j39926j49587K0790
35706a46872R9160k9168j43048r6267l1701n5560l9769Q8968J60629M4950j16328
35695b65006j27762N506J63781K54879J88285n4042k45446j00900K66597M03604
35685D89496J61174q9071o6376J2632q2659j46584K4333J42042j03889m02853
35675f1755k51803J83073K88787q989j72804Q940J18294p6923j75883J35277M64262
35664D50476K84487k37028m76306k27754J00925J17448q6783j57554M0952K71046
35654G9909K25493m8977j53339J14431L75607J44104m07519n95350j89103K55012
35644a99732K25494n2350j01409K8202n6503l64332m92013k61094O1948K12301
$$ plain form
35634 -999488 -775750 -574103 -454119 -468786 -508866 -376057 -68607 144133 37944 -237402
35624 -237402 -276495 101047 595911 758970 509089 171809 34148 65577 113338 139856
35614 139856 153830 118530 73984 147109 286338 225728 -84234 -283720 -125353 95220
35604 95220 17365 -145143 35630 386961 324653 -165357 -420456 -127506 204415 99238
35594 99238 -156383 -81883 181619 171016 -105480 -246607 -155625 -114533 -220458 -243744 -76606
35583 -76606 109499 234669 449745 766259 886969 620402 224717 93240 233938 303835
35573 303835 114770 -127391 -149157 3589 63258 -52384 -145676 -98970 -108404 -376960 -728732
35562 -728732 -797308 -546468 -322164 -368263 -562314 -688126 -693386 -575365 -285273 99420
$$ packed form
35634i99488K23738K01647J19984j4667m0080J32809L07450K12740j06189k75346
35624b37402l9093L77542M94864J63059k49881l37280j37661L1429M7761K6518
35614A39856J3974l5300m4546P3125J39229o0610l09962j99486J58367K20573
35604I5220p7855j62508J80773L51331o2308m90010k55099K92950L31921j05177
35594I9238k55621P4500K63502j0603k76496j41127R0982M1092j05925k3286J67138
35583g6606J86105J25170K15076L16514J20710k66567l95685j31477J40698O9897
35573C03835j89065k42161k1766J52746N9669j15642r3292M6706r434k68556l51772
35562g28732o8576K50840K24304m6099j94051j25812n260J18021K90092L84693
$$ plain form
35552 99420 343484 356401 307170 287368 120797 -280208 -627157 -609842 -346045 -179065
35542 -179065 -179474 -159399 -64389 -15207 -9394 98655 309516 440624 410088 337181 325419
35531 325419 332050 281136 148317 -76836 -361265 -550140 -456469 -63028 431004 752753
35521 752753 729930 433509 190672 287558 579620 614771 266446 -35446 74003 334800
35511 334800 265897 -95518 -277738 -85226 188259 233360 59624 -145299 -207431 -54024
35501 -54024 141869 26587 -433337 -713499 -401406 105971 123541 -253828 -294152 171784
35491 171784 476326 235834 -33285 174287 502632 362620 -98906 -300409 -162582 -95575
35481 -95575 -226647 -246931 13395 361563 603569 711743 622051 257751 -196649 -393735
$$ packed form
35552I9420K44064J2917m9231j9802j66571m01005l46949J7315K63797J66980
35542a79065m09K0075R5010M9182N813J08049K10861J31108l0536p2907j1762
35531C25419O631n0914j32819k25153k84429j88875R3671L93441M94032L21749
35521G52753k2823k96421k42837R6886K92062L5151l48325l01892J09449K60797
35511C34800o8903l61415j82220J92512K73485M5101j73736k04923o2132J53407
35501e4024J95893j15282m59924k80162L12093N07377J7570l77369m0324M65936
35491A71784L04542k40492k69119K07572L28345j40012m61526k01503J37827O7007
35481i5575j31072k0284K60326L48168K42006J08174q9692l64300m54400j97086
$$ plain form
35471 -393735 -275188 -143122 -213312 -359062 -381062 -295195 -235764 -242934 -265225 -278929 -320810
35460 -320810 -432112 -583880 -653899 -542770 -331919 -204137 -164729 -21573 265151 435958
35450 435958 306114 72424 15679 88209 75209 2890 57504 200800 208738 51613 -81730
35439 -81730 -116011 -140972 -153495 -72257 -11053 -190385 -521126 -614696 -314072 86964 274568
35428 274568 276152 246156 168516 -24977 -243979 -349264 -339109 -282083 -195066 -102074 -70171
35417 -70171 -79300 -6707 156548 237048 140139 14618 28629 133399 181345 140907 71116
35406 71116 14831 22586 138660 271718 250559 97935 34994 104014 56837 -200749 -346981
35395 -346981 -107840 267499 347073 151765 67130 237591 450401 566942 657217 695775
$$ packed form
35471c93735J18547J32066p0190j45750k2000Q5867N9431p170k2291j3704m1881
35460c20810j11302j51768p0019J11129K10851J27782L9408J43156K86724J70807
35450D35958j29844k33690n6745P2530j3000p2319N4614J43296P938j57125j33343
35439h1730l4281k4961j2523Q1238O1204j79332l30741r3570L00624M01036J87604
35428B74568J584k9996p7640j93493k19002j05285J0155N7026Q7017R2992L1903
35417g0171r129P2593J63255Q0500r6909j25521J4011J04770M7946m0438o9791
35406G1116n6285P755J16074J33058k1159j52624o2941O9020m7177k57586j46232
35395c46981K39141L75339P9574j95308q4635J70461K12810J16541R0275L8558
$$ plain form
35385 695775 530686 231053 91427 175368 196495 -15008 -262045 -350415 -369768 -408948
35375 -408948 -334065 -114747 -47559 -309554 -558053 -387600 4510 73189 -241196 -422098
35365 -422098 -158975 236614 349293 211407 107225 110353 80672 -48376 -208703 -321310
35355 -321310 -325577 -199638 -74856 -169805 -456220 -569866 -265807 194302 363752 194865
35345 194865 11120 -12932 2284 -4365 79364 208534 109426 -266711 -536164 -396085 -91598
35334 -91598 -49364 -236861 -270382 -64246 55790 -76157 -189532 -31929 231574 306410
35324 306410 208587 150601 165139 132260 73028 117209 223015 222857 150134 217236 403171
35313 403171 370748 -46096 -527651 -659192 -449903 -225172 -151786 -149193 -180916 -311690
$$ packed form
35385F95775j65089k99633j39626Q3941K1127k11503k47037q8370j9353l9180
35375d08948P4883K19318O7188k61995k48499J70453L92110O8679l14385j80902
35365d22098K63123L95589J12679j37886j04182L128k9681j29048j60327j12607
35355c21310m267J25939J24782r4949k86415j13646L04059M60109J69450j68887
35345A94865j83745k4052J5216o649Q3729J29170r9108l76137k69453J40079L04487
35334i1598M2234j87497l3521K06136J20036j31947j13375J57603K63503P4836
35324C06410r7823n7986J4538l2879n9232M4181J05806j58p2723O7102J85935
35313D03171l2423m16844m81555j31541K09289K24731P3386K593l1723j30774
$$ plain form
35303 -311690 -461477 -403227 -103503 168717 191344 50534 -69605 -159163 -271472 -309231
35293 -309231 -149411 106929 229787 166579 57384 -27273 -147625 -277143 -253136 -47588
35283 -47588 87516 -99549 -521572 -833754 -816201 -558561 -282209 -109498 -56322 -145112
35273 -145112 -391531 -674266 -745682 -480541 -73852 125370 -14688 -305425 -512007 -590755
35263 -590755 -603149 -558271 -471483 -456770 -594353 -777782 -845095 -792071 -695549 -513989 -186537
35252 -186537 119955 131597 -136065 -351853 -304316 -123373 21344 179985 412275 551033
35242 551033 421726 156579 37311 99921 136148 57370 16401 128637 275544 282616 163278
35231 163278 77490 111774 191651 192563 69012 -135181 -348208 -490486 -464403 -231818 51810
$$ packed form
35303c11690j49787N8250K99724K72220K2627j40810j20139q9558j12309l7759
35293c09231J59820K56340J22858o3208j09195q4657j20352j29518K4007K05548
35283d7588J35104j87065m22023l12182J7553K57640K76352J72711N3176q8790
35273a45112k46419k82735p1416K65141M06689J99222j40058k90737k06582p8748
35263e90755j2394M4878Q6788J4713j37583j83429o7313N3024R6522J81560L27452
35252a86537L06492J1642k67662k15788M7537J80943J44717J58641K32290J38758
35242E51033j29307k65147j19268O2610L6227p8778m0969J12236J46907P072j19338
35231A63278q5788L4284P9877R12j23551k04193k13027j42278K6083K32585K83628
$$ plain form
35220 51810 102328 -156836 -403754 -262165 179234 419747 176491 -260594 -422281 -214365
35210 -214365 85009 227451 197180 104354 62310 127677 222825 169597 -73266 -273690 -175643
35199 -175643 154324 372582 248163 -87176 -275883 -82491 352766 603685 403352 -9962
35189 -9962 -168432 9083 159470 94138 83216 300159 393673 25184 -474296 -502028 -64722
35178 -64722 275634 248398 108902 45098 -48958 -111313 165222 719204 985499 695218
35168 695218 317887 321047 446388 216132 -204734 -245271 164825 511024 463945 202387
35158 202387 -65172 -400164 -807438 -1023791 -870187 -548975 -369037 -353000 -307734 -155427
35148 -155427 -9199 26345 -11520 -15476 45721 64240 -106139 -447883 -716146 -666634 -342845
$$ packed form
35220E1810N0518k59164k46918J41589M41399K40513k43256m37085j61687K07916
35210b14365K99374J42442l0271r2826m2044O5367R5148n3228k42863k00424R8047
35199a75643L29967K18258j24419l35339j88707J93392M35257K50919k00333m13314
35189i962j58470J77515J50387o5332j0922K16943R3514l68489m99480k7732M37306
35178f4722L40356k7236j39496o3804r4056o2355K76535N53982K66295k90281
35168F95218l77331L160J25341k30256m20866m0537M10096L46199m7079k61558
35158B02387k67559l34992m07274k16353J53604L21212J79938J6037M5266J52307
35148a55427J46228L5544l7865l956O1197J8519j70379l41744k68263M9512L23789
$$ plain form
35137 -342845 -50937 -36612 -251962 -448218 -441763 -280572 -179924 -281100 -463280 -458256
35127 -458256 -187855 101513 117188 -143104 -421838 -499827 -364720 -142292 27750 73378
35117 73378 30588 -12961 -35292 -62612 -23016 221372 620232 895979 890950 773310 730978
35106 730978 662841 417086 153085 141655 314272 360477 222930 131827 146907 51590 -215675
35095 -215675 -392756 -308328 -150435 -142356 -230017 -288014 -369016 -509035 -522524 -281429 -21572
35084 -21572 -51052 -257780 -243677 62282 247205 -28904 -553073 -803694 -568913 -163965
35074 -163965 -34958 -257063 -503414 -476266 -240870 -66895 -68221 -156799 -254730 -316061 -183298
35063 -183298 269497 798947 928138 573695 232934 322951 614388 620192 307441 43882
$$ packed form
35137c42845K91908J4325k15350j96256O455J61191J00648j01176j82180N024
35127d58256K70401K89368J5675k60292k78734p7989J35107K22428J70042M5628
35117G3378m2790m3549k2331k7320L9596K44388L98860K75747n029j17640m2332
35106G30978o8137k45755k64001j1430J72617M6205j37547r1103J5080r5317k67265
35095b15675j77081Q4428J57893Q079q7661n7997q1002j40019j3489K41095K59857
35084b1572k9480k06728J4103L05959J84923k76109n24169k50621K34781M04948
35074a63965J29007k22105k46351K7148K35396J73975j326q8578r7931o1331J32763
35063a83298M52795N29450J29191l54443l40761R0017K91437N804l12751k63559
$$ plain form
35053 43882 -10976 -38391 -129720 -139489 -23897 35078 -48835 -125022 -106344 -129013 -265908
35042 -265908 -341801 -225152 -91761 -177900 -411977 -502303 -315786 -9052 164611 71346
35032 71346 -211893 -439693 -414047 -212105 -82317 -83528 -25980 151964 213098 13240 -187506
35021 -187506 -87389 173946 235722 97090 93903 329129 523681 494506 407603 423643 431465
35010 431465 327265 266284 395557 566228 566129 448540 366248 252131 -29053 -335805 -392456
34999 -392456 -217228 -76962 -39536 75463 273687 302269 117106 61388 345190 656428
34989 656428 597646 281703 135951 251170 310313 131892 -93166 -172835 -185419 -233372
34979 -233372 -200842 31249 312459 398061 301206 252121 333689 349462 95962 -355596 -709599
$$ packed form
35053D3882n4858k7415r1329r769J15592N8975q3913p6187J8678k2669j36895
35042b65908p5893J16649J33391q6139k34077r0326J86517L06734J73663r3265
35032G1346k83239k27800K5646K01942J29788j211N7548J77944O1134j99858k00746
35021a87506J00117K61335O1776j38632l187K35226J94552k9175q6903J6040P822
35010D31465j04200o0981J29273J70671r9j17589q2292j14117k81184l06752n6651
34999c92456J75228J40266L7426J14999J98224K8582j85163n5718K83802L11238
34989F56428n8782l15943j45752J15219N9143j78421k25058p9669j2584m7953
34979b33372L2530K32091K81210Q5602r6855m9085Q1568J5773k53500m51558l54003
$$ plain form
34968 -709599 -724933 -413165 5057 304214 402184 321912 88776 -237066 -468923 -405488
34958 -405488 -95512 150858 117058 -65105 -127896 -24178 77792 71060 3747 -63386 -119141
34947 -119141 -135056 -97435 -94773 -205002 -306202 -200524 52080 146916 -47075 -300224
34937 -300224 -365146 -294626 -261092 -260856 -215964 -214149 -383157 -611159 -664694 -563264 -575254
34926 -575254 -808522 -1040648 -1033449 -824493 -612274 -507573 -499084 -542595 -582138 -558991 -460973
34915 -460973 -301543 -56335 256794 450849 323040 -20563 -214612 -106260 48915 7583
34905 7583 -87488 11260 209792 232075 109040 139930 368913 456696 174453 -265281 -516556
34894 -516556 -504003 -357689 -156760 52737 142951 52380 -30972 126386 437069 558866
$$ packed form
34968g09599j5334L11768M18222K99157R7970q0272k33136l25842k31857O3435
34958d05488L09976K46370l3800j82163o2791J03718J01970o732o7313o7133n5755
34947a19141j5915L7621K662j10229j01200J05678K52604R4836j93991k53149
34937c00224o4922P0520L3534K36M4892J815j69008k28002n3535J01430j1990
34926e75254k33268k32126P199K08956K12219J04701Q489m3511l9543K3147R8018
34915d60973J59430K45208L13129J94055j27809l43603j94049J08352J55175m1332
34905G583r5071R8748J98532K2283j23035L0890K28983Q7783k82243m39734k51275
34894e16556J2553J46314K00929K09497R0214r0571q3352J57358L10683J21797
$$ plain form
34884 558866 363508 126643 144349 330986 374079 201876 82733 230304 495261 573816
34874 573816 413529 243661 228404 259089 137338 -159523 -457730 -542550 -307165 129406
34864 129406 420971 286869 -109429 -268254 31214 442837 566990 490188 497605 494649
34854 494649 198554 -209653 -212635 188676 337257 -112875 -616707 -512163 47515 410064
34844 410064 359852 198068 78741 -146716 -440638 -482903 -193563 70112 13316 -218275
34834 -218275 -326094 -259302 -158377 -104840 -85848 -67278 -1159 120832 193585 134864 83404
34823 83404 238422 506211 588596 454569 393066 504950 508413 237639 -11487 92038
34813 92038 419032 613862 596692 511693 364221 66025 -271421 -426036 -383225 -282532
$$ packed form
34884E58866j95358k36865J7706J86637M3093j72203j19143J47571K64957P8555
34874E73816j60287j69868j5257L0685j21751k96861k98207q4820K35385M36571
34864A29406K91565j34102l96298j58825K99468M11623J24153p6802P417k956
34854D94649k96095m08207k982M01311J48581m50132n03832J04544N59678L62549
34844D10064n0212j61784j19327k25457k93922m2265K89340K63675n6796k31591
34834b18275j07819O6792J00925N3537J8992J8570O6119J21991P2753n8721n1460
34823H3404J55018K67789Q2385j34027o1503J11884L463k70774k49126J03525
34813I2038L26994J94830j7170q4999j47472k98196l37446j54615M2811J00693
$$ plain form
34803 -282532 -144459 43136 78066 -235026 -662252 -746682 -462575 -257935 -362187 -468212
34793 -468212 -278618 16979 78563 -67589 -155790 -118141 -86533 -89551 -42181 22005 -39295
34782 -39295 -244296 -444472 -503587 -394861 -170202 51754 143687 132145 202702 426703
34772 426703 630309 690497 764372 967636 1012188 550445 -187755 -534612 -230607 259831
34762 259831 425747 337766 360559 544601 641662 557233 443485 388875 308448 175210 136506
34751 136506 313634 607375 778507 684974 424856 250405 299209 415248 338075 76602
34741 76602 -73901 48430 233978 213540 13397 -181300 -325806 -438257 -393490 -102834
34731 -102834 203142 201119 -59395 -235848 -211007 -188149 -259937 -259059 -122112 -36337 -82220
$$ packed form
34803b82532J38073J87595L4930l13092m27226q4430K84107K04640j04252j06025
34793d68212J89594K95597O1584j46152q8201L7649L1608l018M7370O4186o1300
34782c9295k05001k00176n9115J08726K24659K21956R1933j1542P0557K24001
34772D26703K03606O0188P3875K03264M4552m61743p38200l46857L04005M90438
34762B59831J65916q7981K2793J84042R7061q4429j13748n4610q0427j33238l8704
34751A36506J77128K93741J71132r3533k60118j74451M8804J16039p7173k61473
34741G6602j50503J22331J85548k0438k00143j94697j44506j12451M4767K90656
34731a02834L05976k023k60514j76453K4841K2858p1788Q78J36947Q5775m5883
$$ plain form
34720 -82220 -72719 63870 58504 -301164 -800984 -1069165 -1010620 -772763 -506766 -373298 -531864
34709 -531864 -864602 -949625 -596217 -173979 -94292 -210441 -122887 140434 225938 94467
34699 94467 31894 62709 -98380 -440437 -534905 -203470 151741 132625 -119969 -246857
34689 -246857 -200235 -150998 -128004 -73249 -75983 -237863 -410480 -341226 -28948 274213 369234
34678 369234 258261 57911 -75948 -1930 274480 560811 674750 619457 486319 305056
34668 305056 113170 50024 204005 420771 416957 78913 -424065 -781398 -762385 -406417
34658 -406417 -53423 -52472 -358724 -564272 -419212 -140562 -63840 -180946 -239645 -157376 -77233
34647 -77233 -77696 -72129 3590 92791 122033 70998 -45594 -147849 -88406 180856 475454
$$ packed form
34720h2220R501J36589n366l59668m99820k68181N8545K37857K65997J33468j58566
34709e31864l32738q5023L53408M22238P9687j16149Q7554K63321Q5504j31471
34699I4467o2573L0815j61089l42057r4468L31435L55211j9116k52594j26888
34689b46857M6622M9237K2994N4755k734j61880j72617O9254L12278L03161R5021
34678C69234j10973k00350j33859P4018K76410K86331J13939n5293j33138j81263
34668C05056j91886o3146J53981K16766l814l38044n02978l57333J9013L55968
34658d06417L52994R51l06252k05548J45060K78650P6722j17106n8699Q2269Q0143
34647g7233m63N567P5719Q9201K9242n1035j16592j02255N9443K69262K94598
$$ plain form
34636 475454 547431 360029 77839 -162109 -330371 -409015 -384360 -329969 -350798 -424482 -403874
34625 -403874 -198991 105077 310601 266003 16019 -192042 -150739 44676 124872 53048
34615 53048 64738 219738 221504 -105348 -446337 -422316 -162827 -83905 -249246 -363057 -315678
34604 -315678 -301756 -391106 -401087 -272366 -193236 -231994 -188844 33526 217835 176019 53877
34593 53877 91098 261455 339281 204778 -52787 -252775 -278136 -191926 -181841 -269640 -177456
34582 -177456 280115 776773 804352 387391 51079 45928 80360 -55819 -129177 17354
34572 17354 83136 -173616 -464698 -460192 -375252 -555089 -783040 -604630 -153947 -14913
34562 -14913 -309015 -547485 -453970 -337384 -469886 -625334 -511782 -243814 -73371 31953
$$ packed form
34636D75454P1977j87402k82190k39948j68262p8644K4655N4391k0829p3684K0608
34625d03874K04883L04068K05524m4598k49984k08061M1303J95415Q0196p1824
34615E3048J1690J55000J766l26852l40989K4021K59489P8922j65341j13811M7379
34604c15678J3922q9350r981J28721P9130l8758M3150K22370J84309m1816j22142
34593E3877L7221J70357P7826j34503k57565j99988k5361Q6210J0085q7799R2184
34582a77456M57571M96658K7579m16961l36312n151L4432j36179p3358J46531
34572A7354O5782k56752k91082M506Q4940j79837k27951J78410M50683J39034
34562a4913k94102k38470R3515J16586j32502j55448J13552K67968J70443J05324
$$ plain form
34552 31953 233287 482470 626512 669859 683210 608698 386720 135651 -11882 -118663
34542 -118663 -279900 -391745 -318629 -173417 -171006 -276863 -261191 -66929 127184 203619
34532 203619 223078 224840 151753 40120 66638 296661 548720 620627 524120 398893 316317
34521 316317 277389 300448 384750 447225 399091 246119 47256 -161417 -330759 -365417 -223460
34510 -223460 4866 199771 330174 390136 312210 74840 -173513 -250156 -161968 -54052
34500 -54052 16817 88614 115532 161 -186150 -247003 -182260 -224046 -436748 -524105 -237594
34489 -237594 208471 386717 219422 29780 67400 238947 342567 342418 317119 300749 290122
34478 290122 305791 336525 281286 42233 -333792 -655232 -730467 -515511 -151653 136055
$$ packed form
34552C1953K01334K49183J44042M3347J3351p4512k21978k51069j47533j06781
34542a18663j61237j11845P3116J45212K411j05857J5672J94262J94113P6435
34532B03619J9459J762p3087j11633K6518K30023K52059P1907r6507j25227q2576
34521C16317l8928K3059Q4302O2475m8134j52972j98863k08673j69342l4658J41957
34510b23460K28326J94905J30403N9962p7926k37370k48353p6643Q8188J07916
34500e4052P0869P1797K6918j15371j86311o0853O4743m1786k12702q7357K86511
34489b37594M46065J78246j67295j89642L7620J71547J03620j49k5299j6370j0627
34478B90122J5669L0734n5239k39053l76025l21440p5235K14956L63858K87708
$$ plain form
34468 136055 212511 126721 34991 50377 177873 352509 492911 535205 456363 272731 27424
34457 27424 -195162 -287415 -246369 -256542 -494387 -832979 -926874 -665479 -345852 -263470 -322906
34446 -322906 -245757 -1616 208372 286634 302976 288308 211343 122992 90312 22945 -191378
34435 -191378 -409169 -360322 -61316 173148 167902 71058 46201 54265 38032 69524 182873
34424 182873 268437 253893 202013 129516 -59523 -336702 -458112 -274005 33576 177065
34414 177065 94943 -65958 -160166 -116363 62046 252294 291785 193737 151325 263648 429134
34403 429134 570683 734852 856642 686619 152428 -410466 -612554 -451591 -210971 -67819
34393 -67819 -8672 -5731 -52049 -87622 -61705 -10889 38366 142124 304322 398060 337508
$$ packed form
34468A36055P6456q5790r1730J5386J27496J74636J40402M2294p8842j83632k45307
34457B7424k22586r2253M1046j0173k37845l38592r3895K61395L19627Q2382n9436
34446c22906P7149K44141K09988P8262J6342j4668p6965q8351l2680o7367k14323
34435a91378k17791M8847K99006K34464n246r6844k4857Q064j6233L1492J13349
34424A82873Q5564j4544n1880p2497j89039k77179j21410J84107L07581J43489
34414A77065q2122j60901r4208M3803J78409J90248L9491r8048m2412J12323J65486
34403D29134J41549J64169J21790j70023n34191n62894k02088J60963K40620J43152
34393f7819N9147K941m6318l5573K5917N0816M9255J03758J62198R3738o0552
$$ plain form
34382 337508 196973 65920 -46658 -82505 55738 246753 186869 -136196 -310611 -84113
34372 -84113 233555 264157 139200 172899 235579 -22752 -485700 -678840 -531834 -467600
34362 -467600 -649953 -685126 -292075 178451 221194 -108594 -292397 -38383 393667 546588
34352 546588 280816 -117595 -298750 -238960 -170681 -165263 -33078 260938 384725 106490
34342 106490 -274641 -323600 -109406 -31258 -133176 -84882 169996 262264 11065 -263611
34332 -263611 -240724 -46801 19163 -76892 -167283 -174553 -149836 -165644 -280476 -463772 -521174
34321 -521174 -306077 -32977 -108993 -578889 -1006518 -1004538 -630870 -180347 135905 201707
34311 201707 -14223 -322384 -407309 -193406 93669 291543 445277 524756 361158 14132
$$ packed form
34382C37508j40535j31053j12578l5847J38243J91015n9884l23065j74415K26498
34372h4113L17668L0602j24957L3699O2680k58331m62948j93140J47006O4234
34362d67600j82353l5173L93051M70526M2743l29788j83803K54014M32050J52921
34352E46588k65772l98411j81155N9790O8279N418J32185K94016J23787k78235
34342A06490l81131m8959K14194P8148j01918M8294K54878R2268k51199k74676
34332b63611K2887J93923O5964r6055r0391p270K4717j5808j14832j83296n7402
34321e21174K15097K73100p6016m69896m27629J980L73668M50523L16252O5802
34311B01707k15930l08161q4925K13903K87075J97874J53734P9479j63598l47026
$$ plain form
34301 14132 -157928 -6027 152841 16260 -270022 -405539 -372435 -309685 -214545 -54430
34291 -54430 53052 45762 84658 255118 334953 147945 -72937 12405 365582 673059 757292
34280 757292 618418 279647 -106870 -212399 75394 399582 406188 263701 337951 556154
34270 556154 547604 281997 85402 74373 43458 -75752 -89755 54620 134264 15922 -163027
34259 -163027 -260946 -291817 -264201 -143494 -20322 -36177 -105635 -4901 223485 267500 23392
34248 23392 -223096 -201208 19874 218954 299486 266948 131632 -61801 -253525 -450615
34238 -450615 -640328 -663279 -397257 -26740 141504 102493 87578 103353 -82904 -449328
34228 -449328 -614790 -371786 22616 254804 338509 410485 440014 359848 255771 228450
$$ packed form
34301A4132j72060J51901J58868j36581k86282j35517L3104O2750R5140J60115
34291e4430J07482p290L8896J70460P9835j87008k20882Q5342L53177L07477Q4233
34280G57292j38874l38771l86517j05529K87793L24188O606j42487P4250K18203
34270E56154q550k65607j96595j1029l0915j19210j4003J44375P9644j18342j78949
34259a63027r7919l0871K7616J20707J23172j5855o9458J00734K28386M4015k44108
34248B3392k46488K1888K21082J99080Q0532l2538j35316j93433j91724j97090
34238d50615j89713k2951K66022L70517J68244l9011j4915J5775j86257l66424
34228d49328j65462K43004L94402K32188Q3705P1976K9529q0166j04077k7321
$$ plain form
34218 228450 247351 268384 290013 205290 -133156 -591969 -795895 -614922 -302278 -27540
34208 -27540 337655 777086 914390 566140 130996 38987 134954 32001 -214558 -276535
34198 -276535 -180770 -239922 -465232 -556502 -446536 -388853 -484447 -538906 -431966 -259707 -80175
34187 -80175 125853 223542 24978 -343468 -539391 -501990 -473745 -503463 -371916 -91264
34177 -91264 9879 -128231 -111871 246071 543506 417154 143507 177238 415611 422535
34167 422535 169132 22093 89267 89986 -109299 -290435 -298836 -262913 -272100 -194996 5125
34156 5125 84632 -117843 -360263 -293074 58229 339511 329607 157423 74826 165291 296140
34145 296140 269207 5677 -368115 -619958 -618608 -421503 -164162 63280 212469 251821
$$ packed form
34218B28450J8901K1033K1629q4723l38446m58813k03926J80973L12644K74738
34208b7540L65195M39431J37304l48250m35144r2009R5967j02953k46559o1977
34198b76535R5765n9152k25310r1270J09966N7683r5594n4459J06940J72259J79532
34187h0175K06028R7689j98564l68446j95923L7401K8245k9718J31547K80652
34177i1264J01143j38110J6360L57942K97435j26352k73647L3731K38373O924
34167D22535k53403j47039O7174P19j99285j81136q401L5923r187P7104K00121
34156E125P9507k02475k42420O7189L51303K81282r904j72184q2597R0465J30849
34145B96140k6933k63530l73792k51843J350J97105K57341K27442J49189L9352
$$ plain form
34135 251821 214354 203472 279953 384622 418725 349195 201315 28602 -58979 59012 339041
34124 339041 523307 386611 -3699 -372914 -534271 -490301 -305686 -49322 145919 148826
34114 148826 14050 -40657 81998 214162 150576 -73706 -233754 -175249 72375 385540
34104 385540 636590 717144 580996 290825 -24802 -263814 -377183 -347471 -206147 -51825
34094 -51825 13118 -34869 -147635 -260456 -308033 -249636 -139780 -102736 -154066 -135347 49272
34083 49272 228573 189122 35554 62555 270953 333004 138644 26166 231698 426591
34073 426591 183893 -303495 -445881 -134504 113537 -22573 -198843 -9304 358166 436954
34063 436954 173502 -90948 -150929 -60140 147579 452150 629485 464806 180410 215044
$$ packed form
34135B51821l7467j0882P6481J04669L4103o9530j47880j72713q7581J17991K80029
34124C39041J84266j36696l90310l69215j61357M3970J84615K56364J95241K907
34114A48826j34776n4707J22655J32164o3586k24282j60048N8505K47624L13165
34104C85540K51050Q0554j36148k90171l15627k39012j13369K9712J41324J54322
34094e1825O4943m7987j12766j12821m7577N8397J09856L7044n1330J8719J84619
34083D9272J79301l9451j53568K7001K08398O2051j94360j12478K05532J94893
34073D26591k42698m87388j42386L11377K48041j36110j76270J89539L67470P8788
34063D36954k63452k64450n9981R0789K07719L04571J77335j64679k84396L4634
$$ plain form
34053 215044 521013 549667 97612 -303647 -141217 330265 487390 204307 -113572 -184195
34043 -184195 -90731 51848 238757 369596 283313 73161 51894 316097 612997 710742
34033 710742 634355 463039 184643 -127030 -266647 -196006 -157830 -316888 -494798 -449225
34023 -449225 -230076 -52996 23390 76813 103242 41543 -64880 -127400 -165288 -223867 -220191
34012 -220191 -67175 108250 83377 -138134 -313143 -278701 -118227 17517 107010 218785
34002 218785 368434 470125 412066 195019 185 31801 254435 413731 389143 355006
33992 355006 455614 514188 298717 -72005 -282301 -289396 -309857 -370296 -245636 84079
33982 84079 277562 102827 -226457 -387881 -377134 -366418 -351236 -226426 -80626 -112371
$$ packed form
34053B15044L05969K8654m52055m01259J62430M71482J57125k83083l17879p0623
34043a84195R3464J42579J86909J30839q6283k10152k1267K64203K96900R7745
34033G10742p6387j71316k78396l11673j39617P0641L8176j59058j77910M5573
34023d49225K19149J77080P6386N3423K6429o1699j06423o2520l7888n8579L676
34012b20191J53016J75425k4873k21511j75009L4442J60474J35744Q9493J11775
34002B18785J49649J01691n8059k17047j94834L1616K22634J59296k4588l4137
33992C55006J00608N8574k15471l70722k10296p095k0461o0439J24660L29715
33982H4079J93483j74735l29284j61424J0747J0716J5182J24810J45800l1745
$$ plain form
33972 -112371 -297774 -406791 -349929 -279160 -322484 -425200 -492737 -498424 -397924 -129968 211024
33961 211024 378109 263588 44041 -84196 -163665 -312526 -449693 -415367 -284795 -289479
33951 -289479 -425986 -425195 -187942 26819 6040 -82368 -778 127142 34781 -164268 -86615
33940 -86615 273869 441865 171481 -120319 63400 546573 691252 247582 -379231 -705239
33930 -705239 -668798 -473030 -230910 41615 262021 332074 300313 314432 409750 451787 320202
33919 320202 87752 -42284 17916 107366 -4533 -313622 -553610 -510238 -254859 6696
33909 6696 189724 303060 292183 125823 -18313 97274 419106 641341 650374 673249 854423
33898 854423 941193 634008 88526 -222946 -104099 176280 301630 262078 207407 165703
$$ packed form
33972a12371j85403j09017N6862P0769m3324j02716o7537n687J00500K67956L40992
33961B11024J67085j14521k19547j28237p9469j48861j37167L4326J30572m684
33951b89479j36507P91K37253K14761k0779q8408Q1590J27920r2361j99049P7653
33940h6615L60484J67996k70384k91800J83719M83173J44679m43670o26813l26008
33930g05239L6441J95768K42120K72525K20406P0053l1761J4119R5318M2037j31585
33919C20202k32450j30036O0200Q9450j11899l09089k39988M3372K55379K61555
33909F696J83028J13336j0877j66360j44136J15587L21832K22235R033K2875J81174
33898H54423Q6770l07185n45482l11472J18847K80379J25350l9552n4671m1704
$$ plain form
33888 165703 72780 -44847 -91557 -60893 -39116 -75763 -156444 -268251 -373666 -357088 -156912
33877 -156912 48990 -21072 -363794 -616798 -500104 -185937 -61569 -229148 -432532 -417876
33867 -417876 -168712 182611 469730 525083 313866 62879 49036 223241 268677 88034
33857 88034 -35179 107447 299031 228363 -27445 -126648 37946 237622 280082 246345
33847 246345 316157 517166 705276 722352 560622 393848 391887 490666 466671 273827 124516
33836 124516 150585 206719 168498 187598 398026 565418 353419 -167781 -595314 -711639
33826 -711639 -632824 -508309 -403313 -444827 -723486 -1020435 -977533 -604780 -289081 -222793
33816 -222793 -179211 14833 155445 39771 -144800 -104573 102465 190300 82071 -60633
$$ packed form
33888A65703r2923j17627m6710L0664K1777l6647q0681j11807j05415J6578K00176
33877a56912K05902p0062l42722k53004J16694L14167J24368j67579k03384J4656
33867d17876K49164L51323K87119N5353k11217k50987j3843J74205M5436j80643
33857H8034j23213J42626J91584p0668k55808r9203J64594J99676M2460l3737
33847B46345O9812K01009J88110J7076j61730j66774j961R8779k3995j92844j49311
33836A24516K6069N6134l8221J9100K10428J67392k11999n21200m27533j16325
33826g11639P8815J24515J04996m1514k78659k96949M2902L72753L15699O6288
33816b22793M3582J94044J40612j15674j84571M0227K07038Q7835j08229j42704
$$ plain form
33806 -60633 -152343 -250647 -338972 -290708 -83032 136532 251167 314452 426366 546784 505709
33795 505709 204342 -216343 -451779 -321283 48808 381774 535438 536847 410938 165904
33785 165904 -55631 -36320 208655 351964 113769 -398276 -817317 -908747 -737835 -512045
33775 -512045 -366365 -304091 -285669 -324707 -447716 -564767 -499831 -232303 9132 24575
33765 24575 -99486 -172951 -204335 -283187 -290445 -58555 237851 239352 -17304 -81976 214667
33754 214667 442063 180719 -365625 -664218 -537861 -254401 -77533 -19703 20404 111907
33744 111907 269972 425563 447452 308438 175562 229294 440913 604749 538289 216358
33734 216358 -200173 -439337 -340159 -41349 155962 119594 -37549 -168178 -197286 -70439
$$ packed form
33806f0633r1710r8304q8325M8264K07676K19564J14635O3285J11914J20418m1075
33795E05709l01367m20685k35436J30496L70091L32966J53664J409j25909k45034
33785A65904k21535J9311K44975J43309k38195n12045m19041r1430J70912K25790
33775e12045J45680O2274J8422l9038j23009j17051O4936K67528K41435J5443
33765B4575j24061p3465l1384p8852p258K31890K96406J501k56656o4672K96643
33754B14667K27396k61344n46344k98593J26357K83460J76868N7830M0107R1503
33744A11907J58065J55591K1889j39014j32876N3732K11619J63836o6460l21931
33734B16358m16531k39164R9178K98810J97311l6368j57143j30629k9108J26847
$$ plain form
33724 -70439 170305 304248 197563 89643 273965 564160 533614 262111 262119 569103 582846
33713 582846 90461 -246112 101194 648043 656094 271058 157022 338879 236353 -278068
33703 -278068 -645713 -492945 -85145 184553 215938 38130 -263384 -391318 -105895 296355
33693 296355 284211 -83892 -214838 46731 158805 -172599 -458191 -248187 88971 -30227
33683 -30227 -439105 -494823 -95141 215411 123452 -41461 86127 325701 243801 -200356
33673 -200356 -581125 -541113 -203289 33826 18727 -3964 182187 378337 229915 -202249
33663 -202249 -425719 -141407 368139 621669 515627 323250 240100 164238 -54048 -308452
33653 -308452 -305423 59360 482760 540075 202753 -97086 -18113 262266 359234 227896
$$ packed form
33724g0439K40744J33943j06685j07920J84322K90195l0546k71503QL06984J3743
33713E82846m92385l36573L47306N46849Q051l85036j14036J81857j02526n14421
33703b78068l67645J52768M07800K69698L1385j77808l01514j27934K85423M02250
33693B96355j2144l68103j30946K61569J12074l31404k85592K10004L37158j19198
33683c0227m08878n5718L99682L10552r1959j64913J27588K39574q1900m44157
33673b00356l80769M0012L37824K37115j5099k2691J86151J96150j48422m32164
33663b02249k23470K84312N09546K53530j06042j92377q3150p5862k18286k54404
33653c08452L029L64783M23400N7315l37322k99839P8973K80379R6968j31338
$$ plain form
33643 227896 95954 -12431 -273271 -594446 -598643 -209473 139762 103561 -100607 -87769
33633 -87769 102851 152062 14324 -43828 99911 259616 259589 154049 62691 -5470 -70614
33622 -70614 -82777 -25550 -25816 -226917 -566569 -784835 -692784 -375039 -71276 93565 161709
33611 161709 151223 -16356 -316432 -506776 -382373 -67750 116997 45403 -118064 -178873
33601 -178873 -100506 59956 227641 291491 163325 -88752 -266653 -238140 -45017 164597
33591 164597 243093 147888 41335 194220 639600 1013060 930794 465557 46557 -59534
33581 -59534 44293 142137 129685 7093 -125177 -92318 114362 197655 -69951 -415513
33571 -415513 -368080 43683 307574 176128 -38320 -28057 93471 138348 194782 352032
$$ packed form
33643B27896j31942j08385k60840l21175m197L89170L49235l6201k04168J2838
33633h7769J90620M9211j37738n8152J43739J59705k7j05540r1358o8161o5144
33622g0614j2163N7227k66k01101l39652k18266R2051L17745L03763J64841O8144
33611A61709j0486j67579l00076j90344J24403L14623J84747p1594j63467o0809
33601a78873P8367J60462J67685O3850j28166k52077j77901K8513J93123K09614
33591A64597P8496r5205j06553J52885M45380L73460q2266m65237m19000j06091
33581e9534J03827R7844j2452j22592j32270L2859K06680Q3293k67606l45562
33571d15513M7433M11763K63891j31446k14448J0263J21528M4877N6434J57250
$$ plain form
33561 352032 414057 200269 -128730 -336966 -464524 -619475 -649592 -362857 78906 312975
33551 312975 227739 -5379 -242315 -432113 -458799 -207245 217818 542180 586193 362336
33541 362336 1078 -291337 -338386 -221112 -255102 -559957 -818613 -683779 -253638 117021
33531 117021 314533 459874 536170 397994 115515 -49445 -28905 19779 96739 406970
33521 406970 901489 1115728 710367 -34942 -515643 -482540 -222970 -125795 -263755 -423544
33511 -423544 -403866 -207325 11054 119880 127569 151862 292665 514701 632103 452364
33501 452364 7333 -390441 -436283 -184699 10407 -71117 -282607 -350620 -181134 149662
33491 149662 520845 746009 610350 140237 -278443 -277230 52358 287600 195855 -76796
$$ packed form
33561C52032O2025k13788l28999k08236j27558j54951l0117K86735M41763K34069
33551C12975q5236k33118k36936j89798k6686K51554M25063L24362M4013k23857
33541C62336l61258k92415m7049J17274l3990l04855k58656J34834M30141L70659
33531A17021J97512J45341P6296j38176k82479j64960K0540M8684P6960L10231
33521D06970M94519K14239m05361p45309m80701L3103K59570R7175j37960j59789
33511d23544J9678J96541K18379J08826P689K4293J40803K22036J17402j79739
33501D52364m45031l97774m5842K51584J95106q1524k11490o8013J69486L30796
33491A49662L71183K25164j35659m70113m18680J213L29588K35242r1745k72651
$$ plain form
33481 -76796 -302707 -421819 -459106 -406557 -285561 -190743 -180218 -206715 -210283 -193887 -163391
33470 -163391 -83607 47453 153321 168860 121535 66626 -16197 -197894 -479722 -739025
33460 -739025 -808443 -616578 -274750 -23767 -42450 -262780 -401479 -243412 97475 276236
33450 276236 120727 -149644 -214655 -86635 -63408 -256349 -419033 -362146 -293247 -500158
33440 -500158 -853892 -940336 -655238 -368222 -425457 -721061 -878558 -704989 -345155 -62758
33430 -62758 42468 104924 282242 493247 491898 260441 133969 355622 687559 729107
33420 729107 488077 316082 356553 416755 378698 370397 463955 528704 481876 413223 379898
33409 379898 327338 264206 259628 244811 103922 -32351 80882 364191 489929 429676 487746
$$ packed form
33481g6796k25911j19112l7287N2549J20996R4818J0525k6497l568J6396L0496
33470a63391P9784J31060J05868J5539m7325n4909q2823j81697k81828k59303
33460g39025o9418J91865L41828K50983j8683k20330j38699J58067L40887J78761
33450B76236j55509k70371o5011J28020K3227j92941j62684N6887O8899k06911
33440e00158l53734q6444K85098K87016n7235k95604j57497J73569L59834K82397
33430f2758J05226O2456J77318K11005j349k31457j26472K21653L31937M1548
33420G29107k41030j71995M0471O0202l8057q301R3558O4749m6828o8653l3325
33409C79898n2560o3132m578j4817j40889j36273J13233K83309J25738o0253N8070
$$ plain form
33398 487746 707931 738074 458508 254751 408288 667087 720126 670357 690117 607471
33388 607471 246682 -136365 -175470 83983 339991 479172 536099 449236 198138 -26458
33378 -26458 -87203 -104494 -138411 19037 421611 689511 545593 306011 397807 686350
33368 686350 760489 620021 562582 596504 489408 245709 45476 -140928 -400158 -511824
33358 -511824 -250566 104034 100562 -169006 -244881 -79532 -39148 -177025 -138950 156177
33348 156177 335480 191237 -37810 -134142 -178613 -227348 -150966 55081 178935 136435
33338 136435 76084 73175 50985 31985 113319 187922 67259 -128607 -107825 87577 151895
33327 151895 68633 106172 260937 236437 27061 -27067 135887 174966 -18067 -115825 31976
$$ packed form
33398D87746K20185L0143k79566k03757J53537K58799N3039m9769J9760q2646
33388F07471l60789l83047l9105K59453K56008J39181N6927q6863k51098k24596
33378b6458o0745j7291l3917J57448M02574K67900j43918k39582R1796K88543
33368F86350P4139j40468n7439L3922j07096k43699k00233j86404k59230j11666
33358e11824K61258L54600l472k69568p5875J65349M0384j37877L8075K95127
33348A56177J79303j44243k29047r6332m4471m8735P6382K06047J23854m2500
33338A36435o0351k909k2190j9000Q1334P4603j20663j95866K0782J95402O4318
33327A51895q3262L7539J54765k4500k09376n4128J62954L9079j93033r7758J47801
$$ plain form
33316 31976 138089 62417 116262 483959 821550 760775 412876 87665 -94541 -58766
33306 -58766 313153 827201 975343 637211 364506 578680 892952 705255 138472 -145553
33296 -145553 112020 516758 658543 583414 588189 813890 1100007 1134265 781441 292988
33286 292988 45849 60659 20730 -203223 -386249 -400046 -432045 -560480 -510692 -124017
33276 -124017 280152 352199 231759 258618 413353 441584 359091 425160 685977 890571
33266 890571 846196 605381 331859 183554 264217 493898 596066 403623 114450 64751
33256 64751 304942 568562 622815 500513 396450 441439 589379 695500 714181 772440
33246 772440 964290 1143880 1086365 818626 605746 618330 779940 913557 870843 585304
$$ packed form
33316C1976J06113p5672N3845L67697L37591o0775l47899l25211j82206L5775
33306e8766L71919N14048J48142l38132k72705K14174L14272j87697n66783k84025
33296a45553K57573M04738J41785p5129M775K25701K86117L4258l52824m88453
33286B92988k47139J4810l9929k23953j83026j3797l1999j28435M9788L86675
33276a24017M04169P2047j20440K6859J54735K8231q2493O6069K60817K04594
33266H90571m4375k40815k73522j48305Q0663K29681J02168j92443k89173m9699
33256F4751K40191K63620N4253j22302j04063M4989J47940J06121J8681N8259
33246G72440J91850J79590n7515k67739k12880J2584J61610J33617m2714k85539
$$ plain form
33236 585304 194978 18278 182480 403495 399415 346963 572136 965093 1148857 1089631
33226 1089631 1034863 958706 649133 293076 339775 749504 1009737 964429 974899 1165084
33216 1165084 1219193 1097785 1208592 1600550 1736438 1429726 1279377 1703371 2201773 2139033
33206 2139033 1713191 1565578 1855102 2259642 2536041 2591564 2326023 1848010 1562321 1681835
33196 1681835 1950474 2122161 2320799 2645100 2871551 2879204 2923923 3164334 3364583 3373760
33186 3373760 3422501 3647350 3830358 3896372 4118417 4554417 4882402 5057076 5447524 6052948
33176 6052948 6367764 6357639 6713893 7733011 8826583 9576932 10342697 11370780 12345719
33167 12345719 13315624 14925812 17190378 19303131 21273081 24302146 28837713 33922054
$$ packed form
33236E85304l90326j76700J64202K21015m080n2452K25173L92957J83764n9226
33226A089631n4768p6157l09573l56057M6699M09729K60233m5308J0470J90185
33216A165084N4109j21408J10807L91958J35888l06712j50349M23994M98402o2740
33206B139033m25842j47613K89524M04540K76399N5523k65541m78013k85689J19514
33196A681835K68639J71687J98638L24301K26451P653M4719K40411K00249R177
33186C373760M8741K24849J83008O6014K22045M36000L27985J74674L90448O05424
33176F052948L14816j0125L56254J019118J093572P50349P65765J028083R74939
33167A2345719R69905J610188K264566K112753J969950L029065M535567N084341
$$ plain form
33159 33922054 39346394 46536542 56219741 67458196 80428436 97580369 120290551
33152 120290551 147744688 181689168 227062314 281006717 323949608 331289080 297246827
33145 297246827 241558373 189789347 152100963 123890422 100038103 80894691 67076489
33138 67076489 56332493 46917497 39447956 34123306 29422163 24611477 20833271 18709090
33130 18709090 17112435 15177069 13511953 12574170 11636018 10244598 9134079 8808249
33122 8808249 8568758 7780596 6901526 6458714 6086761 5380382 4755181 4662500 4727725 4408472
33112 4408472 3865661 3528519 3354569 3107768 2888466 2868053 2901180 2815843 2709774 2639609
33102 2639609 2421511 2025151 1752627 1761144 1808870 1702033 1582263 1563981 1518093 1425269
$$ packed form
33159C3922054N424340P190148R683199J1238455J2970240J7151933K2710182
33152A20290551K7454137L3944480M5373146N3944403M2942891P339472l4042253
33145B97246827n5688454n1769026l7688384k8210541k3852319j9143412j3818202
33138F7076489j0743996r414996p469541n324650m701143m810686l778206k124181
33130A8709090j596655j935366j665116r37783r38152j391420j110519l25830
33122H808249k39491p88162q79070m42812l71953p06379o25201r2681O5225l19253
33112D408472n42811l37142j73950k46801k19302k0413L3127q5337j06069p0165
33102B639609k18098l96360k72524Q517M7726j06837j19770j8282m5888r2824
$$ plain form
33092 1425269 1504341 1763720 1855212 1616419 1352060 1323998 1343175 1141878 827750 695002
33082 695002 822705 1069568 1278582 1362286 1356022 1413147 1560622 1551021 1239166 947658 1044509
33071 1044509 1310022 1250071 922798 819405 964931 870661 469843 324350 658453 938668
33061 938668 784280 596369 795678 1053621 877429 479442 415749 685289 822209 685436
33051 685436 565966 605265 636446 591541 616222 730128 728679 502104 199610 14151 -13974
33040 -13974 53884 157114 253171 308270 281790 131659 -82812 -136773 143854 591492 831434
33029 831434 739018 532075 382844 242532 131553 243680 571396 758454 588560 351976
33019 351976 438489 786976 1032752 1006192 775367 370832 -168064 -568142 -516178 -89839
$$ packed form
33092A425269P9072K59379R1492k38793k64359k8062J9177k01297l14128j32748
33082F95002J27703K46863K09014Q3704o264N7125J47475r601l11855k91508R6851
33071A044509K65513n9951l27273j03393J45526r4270m00818j45493L34103K80215
33061I38668j54388j87911J99309K57943j76192l97987o3693K69540J36920j36773
33051F85436j19470L9299L1181m4905K4681J13906j449k26575l02494j85459k8125
33040a3974O7858J03230R6057N5099k6480j50131k14471n3961K80627M47638K39942
33029H31434r2416k06943j49231j40312j10979J12127L27716J87058j69894k36584
33019C51976Q6513L48487K45776k6560k30825m04535n38896m00078N1964M26339
$$ plain form
33009 -89839 296840 409409 404777 490238 619693 636626 543467 490893 573940 735812 853292
32998 853292 867995 826324 794116 751891 622174 403139 203789 110975 83642 33608 -25482
32987 -25482 27188 257172 526752 572757 308022 2980 10298 300914 496527 432391 380925
32976 380925 517866 518198 77681 -437688 -407661 101732 419190 301330 240519 571191
32966 571191 910306 842075 614067 665682 866897 775960 401014 150615 151316 139675 10663
32955 10663 -13416 159257 276154 143441 -61999 -71058 94912 212163 206843 229431 381386
32944 381386 502112 330700 -127332 -522587 -567951 -429068 -500276 -824153 -1012956 -807196
32934 -807196 -416796 -166507 -85049 -45239 -44176 -85105 -11589 242555 428796 326507 140139
$$ packed form
33009h9839L86679J12569m632Q5461J29455J6933r3159n2574Q3047J61872J17480
32998H53292J4703m1671l2208m2225j29717k19035j99350r2814k7333n0034n9090
32987b5482N2670K29984K69580M6005k64735l05042P318K90616J95613o4136n1466
32976C80925J36941L32m40517n15369L0027N09393L17458j17860o0811L30672
32966E71191L39115o8231k28008N1615K01215r0937l74946k50399P01j1641j29012
32955A0663k4079J72673J16897j32713k05440r059J65970J17251n320K2588J51955
32944C81386J20726j71412m58032l95255m5364J38883p1208l23877j88803K05760
32934h07196L90400K50289Q1458L9810J063m0929P3516K54144J86241j02289j86368
$$ plain form
32923 140139 200629 409874 387088 91957 -138271 -177742 -276333 -518778 -560958 -161947
32913 -161947 345654 441371 97266 -227405 -195264 67170 239478 207333 109140 96605
32903 96605 159536 183426 106913 -32909 -180396 -298169 -321096 -192029 7137 87859 5547
32892 5547 -52135 54933 189277 147244 -29539 -157020 -208511 -265566 -256898 -42839 262168
32881 262168 357468 179627 -32655 -149765 -313405 -578851 -719033 -583072 -373340 -313536
32871 -313536 -267808 8240 397274 541020 366817 162120 112523 86773 -21324 -34606
32861 -34606 206494 471047 352239 -165645 -602762 -544018 -135793 144580 127146 123337
32851 123337 417788 818683 904505 589621 203914 44918 94254 205278 319553 389594
$$ packed form
32923A40139O0490K09245k2786k95131k30228l9471r8591k42445m2180L99011
32913a61947N07601R5717l44105l24671L2141K62434J72308l2145r8193j2535
32903I6605O2931K3890p6513j39822j47487j17773k2927J29067J99166Q0722q2312
32892E547n7682J07068J34344m2033j76783j27481n1491n7055Q668K14059L05007
32881B62168R5300j77841k12282j17110j63640k65446j40182J35961K09732N9804
32871c13536M5728K76048L89034J43746j74203k04697m9597k5750j08097j3282
32861c4606K41100K64553j18808n17884m37117N8744M08225K80373j7434l809
32851A23337K94451M00895Q5822l14884l85707j58996M9336J11024J14275P0041
$$ plain form
32841 389594 306129 67847 -133888 -164092 -136186 -180593 -171592 76744 443220 606108 491485
32830 491485 346620 348586 412409 459986 601836 887089 1089058 962367 596417 306068
32820 306068 231953 234221 158024 36116 7875 149032 390413 523977 326757 -192066
32810 -192066 -680836 -740827 -381317 -46855 -111672 -460358 -683497 -597650 -397779 -303483
32800 -303483 -251385 -56770 240965 384849 248994 4617 -135560 -190275 -294245 -423685
32790 -423685 -434139 -335325 -312877 -435165 -530399 -444253 -261985 -166867 -213399 -355747 -565189
32779 -565189 -772940 -813182 -599545 -290058 -120508 -135570 -226601 -341493 -464508 -461690
32769 -461690 -186777 255735 559756 559589 363952 153518 21938 11642 106750 172526 95736
$$ packed form
32841C89594q3465k38282k01735l0204K7906m4407R001K48336L66476J62888j14623
32830D91485j44865J966O3823M7577J41850K85253K01969j26691l65950k90349
32820C06068p4115K268p6197j21908k8241J41157K41381J33564j97220n18823
32810a92066m88770n9991L59510L34462o4817l48686k23139Q5847J99871R4296
32800c03483N2098J94615K97735J43884j35855k44377j40177n4715j03970j29440
32790d23685j0454R8814K2448j22288r5234Q6146J82268R5118m6532j42348k09442
32779e65189k07751m0242K13637L09487J69550j5062r1031j14892j23015K818
32769d61690K74913M42512L04021j67j95637k10434j31580j0296R5108O5776p6790
$$ plain form
32758 95736 -2308 96983 348096 467801 370950 305082 443187 608592 569675 384859 264607
32747 264607 265112 302902 329256 322044 233033 89676 17632 34502 -20025 -209287 -334050
32736 -334050 -217286 7069 81333 -34669 -187907 -267048 -245077 -121254 21702 43746
32726 43746 -36674 -35788 65271 45703 -131445 -153089 119697 315750 123923 -128676 44816
32715 44816 497085 693624 567739 507912 592266 511004 267479 261080 525385 546074 88484
32704 88484 -395007 -494089 -414267 -451018 -429057 -146438 71262 -170884 -622296 -691665 -285307
32693 -285307 170817 414825 548050 610908 459719 127048 -93225 -25561 203765 417856
32683 417856 565223 601907 452993 173858 -38088 -64557 20195 66484 -22544 -230908
$$ packed form
32758I5736r8044R9291K51113J19705r6851o5868J38105J65405l8917j84816j20252
32747B64607N05L7790K6354p212q9011j43357p2044J6870n4527j89262j24763
32736c34050J16764K24355P4264j16002j53238p9141K1971J23823J42956K2044
32726D3746q0420Q86J01059j9568j77148k1644K72786J96053j91827k52599J73492
32715D4816M52269J96539j25885n9827Q4354q1262k43525o399K64305K0689m57590
32704H8484m83491r9082P9822l6751K1961K82619K17700k42146m51412o9369M06358
32693b85307M56124K44008J33225O2858j51189l32671k20273O7664K29326K14091
32683D17856J47367L6684j48914k79135k11946k6469Q4752M6289q9028k08364
$$ plain form
32673 -230908 -384930 -266793 82382 309999 197550 -5455 34146 177680 26782 -389215
32663 -389215 -592860 -381646 -130966 -205310 -449766 -516907 -390123 -275991 -197712 -31151
32653 -31151 175977 243423 176335 161102 236433 222549 30082 -180612 -232119 -130373 72647
32642 72647 419212 856601 1049366 670473 -99072 -622277 -500637 -44054 145505 -51636
32632 -51636 -172594 149564 674347 867257 554499 64730 -212208 -203813 -77375 30578
32622 30578 92297 86861 -26659 -201263 -268246 -117615 103866 99110 -209640 -519567 -482936
32611 -482936 -149902 85978 -11781 -247178 -278625 -27353 313766 561852 677254 663117
32601 663117 501760 246069 77789 168755 462744 656841 490120 66515 -211815 -106315
$$ packed form
32673b30908j54022J18137L49175K27617j12449k03005L9601J43534j50898m15997
32663c89215k03645K11214K50680p4344k44456o7141J26784J14132P8279J66561
32653c1151K07128O7446o7088j5233P5331j3884j92467k10694n1507J01746K03020
32642G2647L46565M37389J92765l78893p69545n23205J21640M56583J89559j97141
32632e1636j20958L22158N24783J92910l12758m89769k76938Q395J26438J07953
32622C0578O1719n436j13520j74604o6983J50631K21481m756l08750l09927L6631
32611d82936L33034K35880r7759k35397l1447K51272L41119K48086J15402j4137
32601F63117j61357k55691j68280R0966K93989J94097j66721m23605k78330J05500
$$ plain form
32591 -106315 164693 223462 31007 -115375 -48923 55005 1181 -124598 -129878 -35688 -43168
32580 -43168 -248621 -535724 -730503 -770211 -723012 -685802 -665728 -587980 -455717 -417426 -553129
32569 -553129 -677637 -557117 -277569 -152668 -270614 -415174 -469583 -562419 -696992 -595901
32559 -595901 -147025 295987 350511 113625 -64621 -112020 -196606 -307136 -249032 -13069
32549 -13069 185494 239646 245320 259588 221918 132249 73033 38395 -37765 -78621 68664
32538 68664 326186 387767 122124 -212343 -266621 1709 310810 357006 93674 -235794
32528 -235794 -341344 -200233 -68847 -130769 -261389 -260889 -169116 -147147 -166546 -76189 79484
32517 79484 86007 -88309 -218656 -157646 -29297 -9534 -81991 -110241 -53073 -27152 -173443
$$ packed form
32591a06315K71008N8769j92455j46382O6452J03928n3824j25779n280R4190p480
32580d3168k05453k87103j94779l9708M7199L7210K0074P7748J32263L8291j35703
32569e53129j24508J20520K79548J24901j17946j44560n4409r2836j34573J01091
32559e95901M48876M43012N4524k36886j78246m7399q4586j10530N8104K35963
32549a3069J98563N4152N674J4268l7670q9669n9216l4638p6160m0856J47285
32538F8664K57522O1581k65643l34467n4278K68330L09101M6196k63332l29468
32528b35794j05550J41111J31386o1922j30620N00R1773K1969j9399R0357J55673
32517G9484O523j74316j30347O1010J28349J9763p2457k8250N7168K5921j46291
$$ plain form
32506 -173443 -457215 -616852 -434563 -86335 -10081 -309949 -550410 -360723 25177 162333
32496 162333 93391 213352 566319 758967 560823 152465 -237903 -518271 -539398 -192038
32486 -192038 228742 248563 -58326 -64603 474287 973680 821259 196891 -277511 -351962
32476 -351962 -217057 -54604 55641 -12290 -265272 -414176 -209954 171166 387400 414518
32466 414518 432124 392730 109380 -311076 -526534 -444339 -300789 -251358 -205107 -87964
32456 -87964 35545 143796 284599 384539 302723 116783 81653 238723 332163 204020
32446 204020 20621 -10666 78552 159225 225571 311596 342732 244761 103443 63075 125946
32435 125946 178396 176892 194297 282422 371809 346995 199813 55993 789 -78560 -341560
$$ packed form
32506a73443k83772j59637J82289L48228P6254k99868k40461J89687L85900J37156
32496A62333o8942J19961L52967J92648j98144m08358l90368k80368k1127L47360
32486a92038M20780J9821l06889o277N38890M99393j52421o24368m74402p4451
32476c51962J34905J62453J10245o7931k52982j48904K04222L81120K16234K7118
32466D14518J7606l9394k83350m20456k15458Q2195J43550M9431M6251J17143
32456h7964J23509J08251J40803R9940q1816j85940l5130J57070R3440j28143
32446B04020j83399l1287Q9218Q0673O6346Q6025L1136r7971j41318m0368O2871
32435A25946N2450j504J7405Q8125Q9387k4814j47182j43820n5204p9349k63000
$$ plain form
32424 -341560 -670657 -703714 -319076 115227 205232 76033 138810 419358 516649 244646
32414 244646 -101000 -246568 -316250 -471025 -515708 -208134 259649 453887 264678 -40074
32404 -40074 -249190 -378458 -443055 -387077 -274356 -261500 -320421 -253426 -54488 26668 -100573
32393 -100573 -174248 4829 212498 121291 -189067 -339546 -189786 19476 50471 -63838
32383 -63838 -175149 -225276 -226915 -205406 -222178 -318402 -397699 -314059 -111888 -8282 -79320
32372 -79320 -143570 -42840 141260 262622 318954 332545 200733 -114882 -367837 -252552
32362 -252552 170992 495608 433736 97517 -214288 -348475 -352060 -317799 -280341 -242768 -244014
32351 -244014 -352369 -555754 -697534 -629606 -426540 -296063 -251221 -85605 228230 373609
$$ packed form
32424c41560l29097l3057L84638M34303R0005j29199O2777K80548R7291k72003
32414B44646l45646j45568o9682j54775m4683L07574M67783J94238j89209l04752
32404d0074k09116j29268o4597N5978J12721J2856n8921O6995J98938Q1156j27241
32393a00573p3675J79077K07669r1207l10358j50479J49760K09262L0995j14309
32383f3838j11311n0127j639K1509j6772r6224p9297Q3640K02171J03606p1038
32372g9320o4250J00730J84100J21362N6332J3591j31812l15615k52955J15285
32362b52552M23544L24616o1872l36219l11805j34187l585L4261L7458L7573j246
32351b44014j08355k03385j41780O7928K03066J30477M4842J65616L13835J45379
$$ plain form
32341 373609 140180 -180744 -159230 156726 336281 208069 32543 15234 19149 -124085
32331 -124085 -325143 -418184 -397632 -325184 -200558 -66531 -57734 -192056 -267860 -123128 120564
32320 120564 209635 65807 -163106 -283747 -214826 -35955 82081 68486 58343 193105
32310 193105 369527 380685 269888 287505 480409 603893 504240 309573 151594 -15484
32300 -15484 -198561 -255209 -150487 -58069 -61415 -39127 5123 -159020 -545180 -762166 -562528
32289 -562528 -243225 -148783 -105078 201674 551646 448647 -71575 -439723 -359632 -120404
32279 -120404 -33649 -20103 85028 195553 167978 86898 153305 415628 719395 831652
32269 831652 604668 145354 -202837 -201414 5237 115274 73153 24199 -15123 -127123
$$ packed form
32341C73609k33429l20924K1514L15956J79555j28212j75526j7309L915j43234
32331a24085k01058r3041K0552P2448J24626J34027Q797j34322p5804J44732K43692
32320A20564Q9071j43828k28913j20641O8921J78871J18036j3595j0143J34762
32310A93105J76422J1158j10797J7617J92904J23484r9653j94667j57979j67078
32300a5484j83077n6648J04722R2418l346K2288M4250j64143l86160k16986J99638
32289e62528L19303R4442M3705L06752L49972j02999n20222l68148Q0091K39228
32279a20404Q6755J3546J05131J10525k7575q1080O6407K62323L03767J12257
32269H31652k26984m59314l48191J423K06651J10037m2121m8954l9322j12000
$$ plain form
32259 -127123 -202307 -42418 242207 301609 70218 -120764 -42206 145450 206641 119731
32249 119731 -62361 -325277 -528800 -442002 -112378 93568 1676 -110200 24605 230608
32239 230608 195600 -33347 -167788 -127332 -72878 -93451 -123451 -114722 -88261 -68560 -108924
32228 -108924 -282028 -515147 -580850 -403361 -203837 -163614 -139183 58347 299017 346249
32218 346249 274609 330669 473468 422136 135664 -119203 -214802 -330173 -576151 -761742
32208 -761742 -681508 -395951 -84709 167210 302728 235719 41645 11656 292801 613918
32198 613918 617793 381444 327850 615178 891152 774301 367517 87733 94366 141389 18130
32187 18130 -117834 -21929 183432 112321 -323346 -716342 -655647 -233598 113581 149241
$$ packed form
32259a27123p5184J59889K84625N9402k31391j90982P8558J87656O1191q6910
32249A19731j82092k62916k03523Q6798L29624K05946r1892j11876J34805K06003
32239B30608l5008k28947j34441M0456N4454k0573l0000Q729K6461J9701m0364
32228a08924j73104k33119o5703J77489J99524M0223K4431J97530K40670M7232
32218C46249p1640N6060J42799n1332k86472k54867r5599j15371k45978j85591
32208g61742Q0234K85557L11242K51919J35518o7009j94074k9989K81145L21117
32198F13918L875k36349n3594K87328K75974j16851m06784k79784O633M7023j23259
32187A8130j35964R5905K05361p1111m35667l92996O0695M22049L47179L5660
$$ plain form
32177 149241 7803 -119949 -226077 -347471 -380999 -189429 163720 405842 318126 -15056
32167 -15056 -253668 -146155 167755 277443 -24492 -478544 -664208 -477327 -146965 152531
32157 152531 463027 774923 855031 536872 51560 -167220 -9925 170251 28999 -295556
32147 -295556 -342909 60583 534532 597474 269216 16602 111005 296159 227211 4921
32137 4921 -7803 217343 317951 115431 -103007 -46776 116765 35066 -270210 -436633
32127 -436633 -303102 -109157 -97133 -175934 -121936 58200 142306 -2619 -277757 -492555
32117 -492555 -530705 -374805 -81166 207781 297326 99048 -222047 -345950 -121348 252128
32107 252128 456355 429213 364197 350270 239162 -26971 -195348 -46985 201876 158564
$$ packed form
32177A49241j41438j27752j06128j21394l3528J91570L53149K42122q7716l33182
32167a5056k38612J07513L13910J09688l01935m54052j85664J86881L30362K99496
32157A52531L10496L11896Q0108l18159m85312k18780J57295J80176j41252l24555
32147b95556m7353M03492M73949O2942l28258k52614R4403J85154o8948k22290
32137D921j2724K25146J00608k02520k18438N6231J63541q1699l05276j66423
32127d36633J33531J93945J2024p8801N3998J80136Q4106j44925k75138k14798
32117d92555l8150J55900K93639K88947Q9545j98278l21095j23903K24602L73476
32107B52128K04227k7142o5016j3927j11108k66133j68377J48363K48861m3312
$$ plain form
32097 158564 -149835 -287489 -51091 249289 275271 100424 -33315 -103301 -173832 -122270
32087 -122270 147922 375511 222564 -154348 -209221 252278 783776 885969 591015 268758
32077 268758 86584 -71785 -259744 -313433 -89349 293349 532571 432467 76319 -280491
32067 -280491 -449302 -407187 -216092 24054 138022 -14435 -292364 -331101 -5124 358012
32057 358012 430544 332935 337706 351673 121532 -195869 -200417 44742 48219 -284124 -451873
32046 -451873 -184723 130369 159780 180040 473227 682816 359971 -224015 -448391 -276360
32036 -276360 -180132 -297135 -316293 -152406 -97989 -249885 -347434 -277367 -235424 -282334 -223819
32025 -223819 -54497 -47768 -254442 -370953 -280928 -272501 -496570 -644019 -440437 -93549
$$ packed form
32097A58564l08399j37654K36398L00380K5982j74847j33739o9986p0531N1562
32087a22270K70192K27589j52947l76912n4873M61499N31498J02193k94954l22257
32077B68758j82174j58369j87959n3689K24084L82698K39222j00104l56148l56810
32067b80491j68811M2115J91095K40146J13968j52457k77929l8737L25977L63136
32057C58012P2532r7609M771J3967k30141l17401m548K45159L477l32343j67749
32046d51873K67150L15092K9411K0260K93187K09589l22845n83986k24376J72031
32036b76360R6228j17003j9158J63887N4417j51896r7549P0067M1943m6910N8515
32025b23819J69322O729k06674j16511R0025Q427k24069j47449K03582L46888
$$ plain form
32015 -93549 41256 -63237 -215436 -293502 -197848 164515 604987 695818 362196 98309
32005 98309 281020 601080 550659 177945 -75400 -60733 7774 20959 73178 171085 224910
31994 224910 267588 352046 332122 92992 -122909 -23763 192069 59386 -416175 -718947
31984 -718947 -577010 -287331 -153188 -48141 213393 439110 327356 -35439 -260103 -158420
31974 -158420 68025 126096 -25712 -151089 -16184 301104 443688 207981 -148690 -219392
31964 -219392 2662 147369 32814 -102298 -17190 180087 270458 264224 281446 274223 120297
31953 120297 -103027 -175690 -42000 121935 153603 79725 25311 39723 43658 -78951 -327456
31942 -327456 -528077 -503517 -316032 -234357 -398598 -624028 -634004 -405693 -170184 -118928
$$ packed form
32015i3549J34805j04493j52199p8066R5654L62363M40472R0831l33622k63887
32005I8309J82711L20060n0421l72714k53345J4667O8507J3185N2219R7907N3825
31994B24910M2678Q4458j9924k39130k15901R9146K15832j32683m75561l02772
31984g18947J41937K89679J34143J05047K61534K25717j11754l62795k24664J01683
31974a58420K26445N8071j51808j25377J34905L17288J42584k35707l56671p0702
31964b19392K22054J44707j14555j35112Q5108J97277R0371o234J7222p223j53926
31953A20297k23324p2663J33690J63935L1668p3878n4414J4412L935j22609k48505
31942c27456k00621K4560J87485Q1675j64241k25430r976K28311K35509N1256
$$ plain form
31932 -118928 -224211 -332353 -334773 -237191 -125499 -79349 -95336 -107186 -89591 -92149 -147576
31921 -147576 -217402 -273404 -346275 -415945 -353466 -117574 55186 -131085 -588905 -839948
31911 -839948 -588848 -135701 3767 -207447 -306173 -25251 311726 275645 -46374 -217074
31901 -217074 -93236 57729 64181 92881 269170 383810 199236 -171561 -420358 -424071
31891 -424071 -267755 -39088 174855 213169 13184 -222900 -267395 -200515 -260705 -424904
31881 -424904 -418165 -139122 188623 325407 248467 50501 -158565 -205985 41376 439747
31871 439747 642335 507915 260250 165361 233655 317689 308039 137975 -203478 -538218
31861 -538218 -567694 -227792 173996 319026 238457 178422 248046 363932 430766 409751 287147
$$ packed form
31932a18928j05283j08142k420R7582J11692M6150j5987j1850J7595k558n5427
31921a47576o9826n6002p2871o9670O2479K35892J72760j86271m57820k51043
31911h39948K51100M53147J39468k11214r8726K80922L36977l6081l22019j70700
31901b17074J23838J50965O452K8700J76289J14640j84574l70797k48797l713
31891d24071J56316K28667K13943L8314j99985k36084m4495O6880o0190j64199
31881d24904O739K79043L27745J36784p6940j97966k09066m7420K47361L98371
31871D39747K02588j34420k47665r4889O8294Q4034r650j70064l41453l34740
31861e38218k9476L39902M01788J45030q0569o0035O9624J15886O6834k1015j22604
$$ plain form
31850 287147 120277 43306 95457 115034 -63681 -365029 -541265 -440506 -119446 236976
31840 236976 416750 294397 -31261 -270427 -220704 30357 243755 280188 135177 -153418
31830 -153418 -492567 -703823 -649962 -375300 -50158 175115 227944 143894 100675 270021
31820 270021 539608 557658 198499 -198767 -258811 -73941 -20770 -191282 -314785 -215434
31810 -215434 -42438 4681 -77563 -214768 -407445 -644161 -810478 -809085 -685413 -541858
31800 -541858 -388761 -162397 131103 350443 332674 89872 -139342 -110749 157911 432150
31790 432150 547454 494825 251984 -196711 -615394 -632209 -276423 -59908 -264011 -504118
31780 -504118 -374171 -155958 -343802 -744720 -743107 -342411 -177103 -426939 -505526 -80615
$$ packed form
31850B87147j66870p6971N2151J9577j78715l01348j76236J00759L21060L56422
31840B36976J79774j22353l25658k39166M9723K51061K13398L6433j45011k88595
31830a53418l39149k11256N3861K74662L25142K25273N2829q4050m3219J69346
31820B70021K69587J8050l59159l97266o0044J84870N3171j70512j23503R9351
31810b15434J72996M7119q2244j37205j92677k36716j66317J393J23672J43555
31800e41858J53097K26364K93500K19340j7769k42802k29214K8593K68660K74239
31790D32150J15304n2629k42841m48695m18683j6815L55786K16515k04103k40107
31780e04118J29947K18213j87844m00918J613M00696J65308k49836p8587M24911
$$ plain form
31770 -80615 336360 241803 -52220 -4386 258788 248728 -23996 -119687 97217 355949
31760 355949 473825 444011 160327 -418364 -907051 -828550 -304714 64485 16310 -150278
31750 -150278 -174394 -150167 -162037 -95629 37641 21567 -158643 -231307 -105282 -8249 -7039
31739 -7039 145698 461475 496415 22087 -502616 -536757 -196095 39257 59033 87862 138861
31728 138861 23199 -193238 -230606 -80649 -29741 -177193 -309339 -290542 -223339 -160120
31718 -160120 412 223577 248488 -62221 -492164 -711105 -599138 -289724 -51824 -129783
31708 -129783 -498179 -777221 -620094 -183160 50521 -76193 -230609 -137324 55457 105982
31698 105982 60616 84973 154539 152737 107041 112860 155403 185282 240197 336077 382179 351458
$$ packed form
31770h0615M16975r4557k94023M7834K63174j0060k72724r5691K16904K58732
31760C55949J17876k9814k83684n78691m88687P8501N23836L69199m8175j66588
31750a50278k4116K4227j1870O6408J33270j6074j80210p2664J26025R7033J210
31739g039J52737L15777L4940m74328n24703l4141L40662K35352J9776K8829N0999
31728A38861j15662k16437l7368J49957N0908j47452j32146J8797O7203O3219
31718a60120J60532K23165K4911l10709m29943k18941J11967L09414K37900p7959
31708a29783l68396k79042J57127M36934K33681j26714j54416R3285J92781N0525
31698A05982m5366K4357O9566j802m5696N819M2543K9879N4915R5880M6102l0721
$$ plain form
31686 351458 364358 443845 392076 122649 -92692 12616 261056 284090 102931 93748 395847
31675 395847 702331 695096 401114 43182 -211191 -268504 -104490 160283 354174 471730
31665 471730 604413 645445 354879 -190558 -532835 -413446 -139661 -111127 -228225 -121016
31655 -121016 197382 327075 103588 -188656 -309834 -392716 -594008 -743323 -619271 -350764
31645 -350764 -225910 -241197 -175101 -31982 -39855 -189664 -164197 141980 383816 270271
31635 270271 13793 -12473 168560 265451 225925 218603 201478 -50553 -469788 -676772 -541430
31624 -541430 -367406 -361834 -315884 -53903 163806 28478 -289971 -377011 -172307 15315
31614 15315 -16524 -194066 -387600 -493314 -365909 22977 404834 480403 313281 173678
$$ packed form
31686C51458J2900P9487n1769k69427k15341J05308K48440K3034j81159r183L02099
31675C95847L06484p235k93982l57932k54373n7313J64014K64773J93891J17556
31665D71730J32683M1032k90566n45437l42277J19389K73785K8534j17098J07209
31655a21016L18398J29693k23487k92244j21178q2882k01292j49315J24052K68507
31645c50764J24854j5287O6096J43119p873j49809K5467L06177K41836j13545
31635B70271k56478k6266J81033R6891l9526p322j7125k52031m19235k06984J35342
31624e41430J74024N572M5950K61981K17709j35328l18449q7040K04704J87622
31614A5315l1839j77542j93534j05714J27405L88886L81857P5569j67122j39603
$$ plain form
31604 173678 82729 -123995 -341938 -257401 85487 229226 -28019 -309261 -225169 85522
31594 85522 252878 226758 221523 307726 363765 323813 229348 113711 16176 12936 88423 112740
31582 112740 85347 203797 498103 625160 322360 -106963 -125307 287774 578544 350898
31572 350898 -142430 -335436 25606 668972 1070581 915658 414630 137405 392684 837133
31562 837133 894985 486894 63780 -58659 -58686 -213346 -459760 -538329 -357828 -27668 315305
31551 315305 539117 512014 241600 -72951 -260179 -342828 -374328 -275399 -20267 166492
31541 166492 63031 -173489 -167513 136536 376549 286116 44855 -32739 54671 74239 -43890
31530 -43890 -133054 -76736 58234 197197 354630 480892 412787 124189 -128542 -109124
$$ packed form
31604A73678r0949k06724k17943Q4537L42888J43739k57245k81242Q4092L10691
31594H5522J67356k6120n235Q6203N6039l9952r4465j15637r7535l240P5487K4317
31582A12740k7393J18450K94306J27057l02800m29323j8344M13081K90770k27646
31572C50898m93328j93006L61042O43366M01609j54923n01028k77225K55279M44449
31562H37133N7852m08091m23114j22439k7j54660k46414p8569J80501L30160L42973
31551C15305K23812k7103k70414l14551j87228q2649l1500R8929K55132J86759
31541A66492j03461k36520N976L04049K40013r0433k41261p7594Q7410J9568j18129
31530d3890q9164N6318J34970J38963J57433J26262o8105k88598k52731J9418
$$ plain form
31520 -109124 52231 51727 -97006 -55130 305827 661915 694120 520256 411771 299341
31510 299341 -66324 -558763 -715559 -400927 -34210 15428 -87930 -34322 61347 -136920
31500 -136920 -566982 -775022 -539855 -128897 135805 241671 295313 274161 173692 169022
31490 169022 375402 593170 546242 287903 118692 145292 184908 130645 150933 404704
31480 404704 739564 837489 585721 179199 -115464 -214044 -242739 -359833 -554051 -632780
31470 -632780 -444938 -85075 196133 257095 147583 -30247 -185707 -176554 98454 465619
31460 465619 550084 241025 -89256 -37004 285577 397215 84558 -362185 -565795 -479260
31450 -479260 -309554 -216597 -212186 -237134 -209970 -55781 212419 456266 514458 347549 75664
$$ packed form
31520a09124J61355n04j48733M1876L60957L56088L2205j73864j08485j12430
31510B99341l65665m92439j56796L14632L66717M9638j03358N3608R5669j98267
31500a36920m30062k08040K35167M10958K64702J05866N3642k1152j00469m670
31490A69022K06380K17768m6928k58339j69211K6600L9616n4263K0288K53771
31480D04704L34860R7925k51768m06522k94663r8580k8695j17094j94218p8729
31470f32780J87842L59863K81208O0962j09512j77830j55460R153K75008L67165
31460D65619Q4465l09059l30281N2252L22581J11638l12657m46743k03610Q6535
31450d79260J69706R2957M411k4948K7164J54189K68200K43847N8192j66909k71885
$$ plain form
31439 75664 -113940 -116082 1662 79682 58936 25114 18539 -72993 -301558 -459916 -313933
31428 -313933 15303 151113 -36709 -273121 -285415 -126991 18556 120477 213938 228639
31418 228639 123625 49817 141771 248317 125189 -160077 -294130 -200917 -169782 -386386
31408 -386386 -582060 -367141 214856 700473 746954 455006 128584 -74284 -138856 -35605
31398 -35605 206355 355968 185373 -162724 -287422 -103583 -19097 -346866 -805878 -906659
31388 -906659 -633443 -372043 -287365 -207961 -97478 -160976 -383130 -414859 -115613 192066
31378 192066 250082 261682 448292 564352 268596 -267020 -561335 -489912 -330192 -244443
31368 -244443 -139538 -167 49602 39660 147125 359402 471155 437043 385524 266999
$$ packed form
31439G5664j89604k142J17744P8020k0746l3822o575r1532k28565j58358J45983
31428c13933L29236J35810j87822k36412j2294J58424J45547J01921R3461J4701
31418B28639j05014p3808R1954J06546j23128k85266j34053R3213L1135k16604
31408c86386j95674K14919N81997M85617M6481k91948l26422k02868o4572J03251
31398c5605K41960J49613j70595l48097j24698J83839Q4486l27769m59012j00781
31388i06659K73216K61400Q4678P9404J10483o3498k22154l1729K99246L07679
31378A92066N8016J1600J86610J16060k95756n35616k94315P1423J59720Q5749
31368b44443J04905J39371M9769r942J07465K12277J11753l4112n1519j18525
$$ plain form
31358 266999 -106969 -593200 -725476 -384579 -56183 -146570 -393896 -310130 73663 324621
31348 324621 295321 234663 257734 166537 -96486 -218422 20432 327251 254559 -148892
31338 -148892 -371747 -138838 219298 240344 -40937 -180977 41862 357354 408300 194664
31328 194664 -13512 -40801 81796 266134 445601 532300 443344 193184 -106609 -334547
31318 -334547 -422557 -388104 -324153 -276255 -139938 164140 423722 313522 -80585 -247253
31308 -247253 43916 363997 262511 -48701 -91059 74933 16634 -237749 -193958 235244
31298 235244 499139 256687 -116187 -179733 -106197 -294318 -653425 -714383 -284879 347185
31288 347185 760891 731817 357301 27575 89563 394472 432748 77143 -157303 134660
$$ packed form
31358B66999l73968m86231j32276L40897L28396r0387k47326Q3766L83793K50958
31348C24621k9300o0658K3071r1197k63023j21936K38854L06819p2692m03451
31338a48892k22855K32909L58136K1046k81281j40040K22839L15492N0946k13636
31328A94664k08176k7289J22597J84338J79467Q6699q8956k50160k99793k27938
31318c34547q8010L4453O3951M7898J36317L04078K59582j10200l94107j66668
31308b47253K91169L20081j01486l11212m2358J65992n8299k54383M3791M29202
31298B35244K63895k42452l72874o3546P3536j88121l59107o0958M29504O32064
31288C47185M13706k9074l74516l29726O1988L04909L8276l55605k34446K91963
$$ plain form
31278 134660 599743 635097 262218 4115 63275 148754 78347 38791 157074 245393 150057
31267 150057 37248 122004 309179 297865 -36750 -482499 -697395 -561757 -325078 -329625
31257 -329625 -570672 -688107 -465319 -119378 55614 95537 182525 279937 263330 240315
31247 240315 377729 518033 343329 -120631 -510001 -611017 -521577 -356103 -128717 72930
31237 72930 127536 103518 141234 145696 -64962 -355039 -418535 -305591 -344591 -522804 -461220
31226 -461220 -101405 132165 43813 -13915 180501 256342 -127245 -653980 -813858 -624517
31216 -624517 -405364 -172861 178100 357637 -3587 -625329 -796925 -354370 124966 195253
31206 195253 74065 122673 281750 310286 219468 149744 74758 -61594 -99081 139068 505475
$$ packed form
31278A34660M65083L5354l72879k58103N9160Q5479p0407l9556J18283Q8319r5336
31267A50057j12809Q4756J87175j1314l34615m45749k14896J35638K36679m547
31257c29625k41047j17435K22788L45941J74992L9923Q6988R7412j6607k3015
31247B40315J37414J40304j74704m63960l89370j01016Q9440J65474K27386K01647
31237G2930N4606k4018L7716M462k10658k90077o3496J12944l9000j78213O1584
31226d61220L59815K33570q8352n7728J94416P5841l83587n26735j59878J89341
31216f24517K19153K32503L50961J79537l61224o21742j71596M42555M79336P0287
31206A95253j21188M8608J59077K8536r0818o9724p4986j36352l7487K38149L66407
$$ plain form
31195 505475 668060 545820 360805 263133 142138 -120957 -400319 -460993 -263096 -7420
31185 -7420 98730 18752 -174960 -424928 -669732 -772719 -610428 -263206 -13010 -67321
31175 -67321 -319245 -447352 -251019 151609 465850 537051 491002 530619 635527 581707
31165 581707 288135 -11742 -58578 117103 333870 559310 809727 868642 473341 -207894
31155 -207894 -648730 -601414 -328919 -109622 102919 349343 401521 133598 -174995 -254999
31145 -254999 -282737 -517354 -759240 -630498 -231550 -31824 -167984 -303831 -179956 114756
31135 114756 426089 671970 665627 234177 -385057 -662419 -428902 -68515 61091 38750
31125 38750 59811 79109 2215 -74713 -62848 -68196 -157137 -177500 -44501 31844 -135145
$$ packed form
31195E05475J62585j22240j85015r7672j20995k63095k79362o0674J97897K55676
31185g420J06150p9978j93712k49968k44804j02987J62291L47222K50196n4311
31175f7321k51924j28107J96333M02628L14241P1201m6049L9617J04908n3820
31165E81707k93572k99877m6836J75681K16767K25440K50417N8915l95301o81235
31155b07894m40836M7316K72495K19297K12541K46424N2178k67923l08593q0004
31145b54999k7738k34617k41886J28742L98948J99726j36160j35847J23875K94712
31135A14756L11333K45881o343m31450o19234k77362K33517L60387J29606k2341
31125C8750K1061J9298p6894p6928J1865n348q8941k0363J32999P6345j66989
$$ plain form
31114 -135145 -369445 -389793 -240237 -175438 -240255 -260443 -190138 -185752 -318545 -424768 -293799
31103 -293799 103709 583186 875598 827608 533646 229470 46714 -35826 -23938 122052
31093 122052 328268 435521 441329 489545 571104 513634 340079 294600 380322 265470 -131305
31082 -131305 -383544 -209521 34441 -48755 -193696 57305 468580 386211 -215032 -662192
31072 -662192 -592440 -361606 -313285 -292254 -145246 -111677 -331314 -440901 -116552 327494
31062 327494 352741 -22912 -314850 -296716 -186718 -159161 -101466 66236 176897 89538
31052 89538 -38428 59913 387813 650958 592998 268382 -61769 -240989 -318411 -345612
31042 -345612 -246274 -7567 151166 22758 -243453 -287948 -28396 235153 233684 27818
$$ packed form
31114a35145k34300k0348J49556O4799o4817k0188P0305M386j32793j06223J30969
31103b93799L97508M79477K92412m7990k93962l04176j82756q2540J1888J45990
31093A22052K06216J07253N808M8216Q1559n7470j73555m5479Q5722j14852l96775
31082a31305k52239J74023K43962q3196j44941K51001M11275q2369o01243m47160
31072f62192O9752K30834M8321K1031J47008L3569k19637j09587L24349M44046
31062C27494K5247l75653k91938J8134J09998K7557N7695J67702J10661q7359
31052H9538j27966R8341L27900K63145n7960l24616l30151j79220p7422k7201
31042c45612R9338K38707J58733j28408k66211m4495K59552K63549j469k05866
$$ plain form
31032 27818 -152816 -162613 11754 254837 342774 166590 -65003 -92904 -44083 -247704 -608345
31021 -608345 -629911 -208575 93423 -144805 -573462 -648898 -454751 -447845 -656617 -690769
31011 -690769 -426948 -157558 -74714 -61825 -20607 -5226 1110 80421 130639 -23133 -260709
31000 -260709 -288918 -147903 -177275 -419825 -514213 -312267 -135174 -196190 -223656 24757
30990 24757 286100 247901 145582 388319 787069 736472 161764 -266659 -43246 482955
30980 482955 629235 304979 41952 198154 503948 499687 161359 -133783 -161747 -112653
30970 -112653 -238529 -449915 -448567 -174910 91991 107489 -40057 -92126 36086 191247
30960 191247 207811 89699 -32318 -49929 40331 165833 255012 286556 285087 287895 307359
$$ packed form
31032B7818j80634r797J74367K43083Q7937j76184k31593k7901M8821k03621l60641
31021f08345k1566M21336L01998k38228m28657p5436J94147O906k08772l4152
31011f90769K63821K69390Q2844J2889M1218J5381O336P9311N0218j53772k37576
31000b60709k8209J41015k9372k42550r4388K01946J77093o1016k7466K48413
30990B4757K61343l8199j02319K42737L98750n0597n74708m28423K23413N26201
30980D82955J46280l24256k63027J56202L05794m261l38328k95142k7964M9094
30970a12653j25876k11386J348K73657K66901J5498j47546n2069J28212J55161
30960A91247J6564j18112j22017j7611R0260J25502Q9179L1544j469K808J9464
$$ plain form
30949 307359 310048 255993 182333 187324 259259 207539 -74583 -338293 -222086 207385 450756
30938 450756 235351 -110818 -139066 152632 497527 812904 1093913 1093389 604020 -38711
30928 -38711 -239978 68821 396557 458177 459623 537739 483533 242732 155029 363474 457093
30917 457093 111050 -320505 -328347 -42494 33602 -135843 -125815 175218 362757 163439
30907 163439 -179462 -320503 -261073 -209779 -245981 -288407 -242503 -72131 166311 325860
30897 325860 315410 230805 214639 241535 207496 154389 180779 188575 -5274 -305582 -373554
30886 -373554 -87340 281934 442769 414534 385351 426358 462928 401713 208628 -38784
30876 -38784 -161150 -65755 92167 95157 -36654 -142974 -247083 -460568 -587026 -252905
$$ packed form
30949C07359K689n4055p3660M991P1935n1720k82122k63710J16207M29471K43371
30938D50756k15405l46169k8248K91698L44895L15377K81009n24m89369o42731
30928c8711k01267L08799L27736O1620J446P8116n4206k40801q7703K08445R3619
30917D57093l46043m31555p842K85853P6096j69445J0028L01033J87539j99318
30907A63439l42901j41041N9430N1294l6202m2426M5904J70372K38442J59549
30897C25860j0450q4605j6166K6896l4039n3107K6390P796j93849l00308o7972
30886c73554K86214L69274J60835k8235k9183M1007L6570o1215j93085k47412
30876c8784j22366R5395J57922K990j31811j06320j04109k13485j26458L34121
$$ plain form
30866 -252905 433907 788775 393966 -304245 -585691 -371169 -150282 -198605 -334874 -385348
30856 -385348 -410951 -407488 -208877 140023 261329 -62728 -516427 -629952 -370969 -97289
30846 -97289 -25585 -31140 43378 162424 259640 386927 542159 520644 167424 -292321 -427872
30835 -427872 -147933 154872 122401 -103385 -137189 64102 162786 -20905 -231258 -162455
30825 -162455 109342 276571 237373 157602 161003 177360 104969 -53915 -245392 -394571 -357976
30814 -357976 -26311 443861 666007 425606 -64193 -440530 -614168 -739056 -842375 -733487
30804 -733487 -320753 185748 487505 481009 254848 -46129 -247102 -183910 117033 390196
30794 390196 419178 296124 237104 237173 130663 -60908 -109094 66303 271144 339187 335297
$$ packed form
30866b52905O86812L54868l94809o98211k81446K14522K20887m8323j36269n0474
30856c85348k5603L463J98611L48900J21306l24057m53699j13525K58983K73680
30846i7289P1704n555P4518J19046R7216J27287J55232k1515l53220m59745j35551
30835d27872K79939L02805l2471k25786l3804K01291R8684j83691k10353O8803
30825a62455K71797J67229l9198p9771L401J6357p2391j58884j91477j49179L6595
30814c57976L31665M70172K22146k40401m89799l76337j73638j24888j03319J08888
30804g33487M12734N06501L01757o496k26161l00977k00973O3192L00943K73163
30794C90196K8982j23054n9020O9j06510j91571m8186J75397K04841O8043l890
$$ plain form
30783 335297 357722 351812 256720 156903 140729 161608 173727 242434 373979 412128 283197
30772 283197 171249 236591 323107 201235 -31763 -85888 75122 226514 272843 324660
30762 324660 384231 284236 14248 -181470 -147791 -26111 -4953 -72033 -128389 -157968 -166327
30751 -166327 -121245 -61415 -96242 -195351 -159798 71508 261918 175910 -105743 -320278 -342010
30740 -342010 -213293 17718 304057 516682 528561 363465 152469 -18474 -130006 -164552
30730 -164552 -128454 -98787 -160407 -321434 -528916 -705587 -749770 -612352 -420766 -391658
30720 -391658 -546348 -654518 -554155 -374310 -312675 -342248 -306821 -186254 -74245 28426
30710 28426 204084 435500 596322 613229 524408 410593 359109 425131 528714 487423 270277
$$ packed form
30783C35297K2425n910r5092r9817j6174K0879J2119O8707J31545L8149j28931
30772B83197j11948O5342Q6516j21872k32998n4125J61010J51392M6329N1817
30762C24660N9571r9995k69988j95718L3679J21680K1158o7080n6356k9579q359
30751a66327M5082N9830l4827r9109L5553K31306J90410q6008k81653k14535k1732
30740c42010J28717K31011K86339K12625J1879j65096k10996j70943j11532l4546
30730a64552L6098K9667o1620j61027k07482j76671m4183J37418J91586K9108
30720c91658j54690j08170J00363J79845O1635k9573L5427J20567J12009J02671
30710B8426J75658K31416J60822J6907q8821j13815n1484O6022J03583m1291k17146
$$ plain form
30699 270277 101807 165020 330648 369477 300529 285139 285562 131126 -121184 -214221 -101968
30688 -101968 -28122 -126953 -235301 -206838 -140437 -152364 -166104 -99525 -46851 -87595 -103676
30677 -103676 14810 154753 184907 210945 373854 528521 419610 108853 -77915 -22049
30667 -22049 63576 19113 -40905 11548 88916 61992 -34869 -113220 -169065 -176881 -37294 198510
30655 198510 248492 -24909 -329449 -322803 -149359 -238546 -608757 -779190 -469179 -12064
30645 -12064 124057 -71882 -283582 -340574 -272305 -74735 245470 485755 428112 184023
30635 184023 77614 182147 246566 121273 -9588 83696 363271 600063 609647 352594
30625 352594 -36779 -271250 -140555 214352 428282 359508 204692 113420 -37677 -336173
$$ packed form
30699B70277j68470O3213J65628L8829o8948j5390M23j54436k52310r3037J12253
30688a01968P3846r8831j08348K8463O6401j1927j3740O6579N2674m0744j6081
30677a03676J18486J39943L0154K6038J62909J54667j08911l10757j86768N5866
30667b2049Q5625m4463o0018N2453P7368k6924r6861p8351n5845p816J39587K35804
30655A98510M9982k73401l04540O646J73444q9187l70211j70433L10011M57115
30645a2064J36121j95939k11700n6992O8269J97570L20205K40285n7643k44089
30635A84023j06409J04533O4419j25293j30861R3284K79575K36792R584k57053
30625C52594l89373k34471J30695L54907K13930o8774j54816r1272j51097k98496
$$ plain form
30615 -336173 -561957 -472912 -198126 -89162 -265110 -519420 -608915 -441048 -49925 391976
30605 391976 569477 255889 -405417 -985462 -1163700 -960798 -622857 -391308 -352372 -393110
30595 -393110 -327263 -149624 -90865 -302261 -589348 -644747 -471232 -339478 -346368 -282143 -3939
30584 -3939 306908 411010 351966 333754 362157 237915 -87305 -354290 -305625 -30029 157870
30573 157870 133666 67519 75887 -5981 -322685 -635234 -554648 -110790 215975 106489 -218256
30562 -218256 -349508 -177895 131757 426016 614650 617942 487064 438837 564388 647853
30552 647853 491702 261463 238493 364314 338990 88993 -177989 -338799 -460757 -556048
30542 -556048 -539999 -453450 -438544 -467102 -374040 -184036 -105752 -163186 -156774 -65331 -141131
$$ packed form
30615c36173k25784Q9045K74786J08964j75948k54310q9495J67867L91123M41901
30605C91976J77501l13588o61306n80045j78238K02902L37941K31549L8936m0738
30595c93110O5847J77639N8759k11396k87087n5399J73515J31754o890O4225K78204
30584c939L10847J04102n9044j8212K8403j24242l25220k66985M8665K75596J87899
30573A57870k4204o6147Q368q1868l16704l12549Q0586M43858L26765j09486l24745
30562b18256j31252J71613L09652K94259J88634L292j30878m8227J25551Q3465
30552F47853j56151k30239k2970J25821k5324k49997k66982j60810j21958r5291
30542e56048J6049Q6549J4906k8558R3062J90004P8284n7434O412R1443p5800
$$ plain form
30531 -141131 -460082 -697187 -556818 -183232 54745 -9765 -282443 -555103 -565128 -163986
30521 -163986 383964 532837 120675 -349569 -373256 -134596 -167814 -527502 -752917 -589882
30511 -589882 -279718 -75438 92534 308428 408899 284954 168004 306942 532134 470769
30501 470769 129327 -70067 115926 408118 402255 102125 -152289 -167371 -64104 4451
30491 4451 50514 101338 79438 -18480 6000 297649 658826 731459 439355 54162 -177285
30480 -177285 -272238 -338126 -354720 -245319 -50923 86556 79858 -24788 -104273 -79026 1525
30469 1525 16601 -54299 -87099 -3024 100709 121478 129775 204618 215597 19773 -210703
30458 -210703 -172984 71686 135050 -103660 -288446 -112988 255334 465291 425921 257059
$$ packed form
30531a41131l18951k37105J40369L73586K37977o4510k72678k72660j0025M01142
30521a63986N47950J48873m12162m70244k3687K38660l3218l59688k25415J63035
30511e89882L10164K04280J67972K15894J00471j23945j16950J38938K25192o1365
30501D70769l41442j99394J85993K92192n863l00130k54414j5082J03267O8555
30491D451M6063N0824k1900r7918K4480K91649L61177P2633k92104l85193k31447
30480a77285r4953o5888j6594J09401J94396J37479o698j04646p9485K5247Q0551
30469A525J5076p0900l2800Q4075J03733K0769Q297P4843J0979j95824k30476
30458b10703L7719K44670O3364k38710j84786J75458L68322K09957l9370j68862
$$ plain form
30448 257059 47049 -112366 -82756 75490 31653 -354733 -702022 -576891 -149675 5892
30438 5892 -293547 -635820 -622571 -320948 -18492 145594 149745 -40985 -363735 -581965
30428 -581965 -524310 -312857 -198589 -238641 -281965 -228199 -144817 -114559 -96607 -8626 118157
30417 118157 145407 -15354 -295128 -512468 -495433 -197424 217827 425365 230899 -128897
30407 -128897 -161817 260992 644212 462465 -136092 -547558 -539024 -429013 -417283 -237958
30397 -237958 283587 755763 689134 187906 -203396 -183285 121043 511103 877714 1052415
30387 1052415 862533 393302 -41079 -216434 -127826 126208 377802 407808 195914 63808
30377 63808 264471 517957 343853 -170374 -390482 -23277 470247 569603 395925 383322
$$ packed form
30448B57059k10010j59415K9610J58246m3837l86386l47289J25131M27216J55567
30438E892k99439l42273J3249L01623L02456J64086M151j90730l22750k18230
30428e81965N7655K11453J14268m0052m3324N3766Q3382L0258J7952Q7981J26783
30417A18157K7250j60761k79774k17340J7035K98009M15251K07538j94466l59796
30407a28897l2920M22809L83220j81747n98557m11466Q534J10011J1730J79325
30397b37958N21545M72176o6629n01228l91302K0111L04328L90060L66611J74701
30387A052415j89882m69231m34381j75355Q8608K54034K51594L0006k11894j32106
30377F3808K00663K53486j74104n14227k20108L67205M93524R9356j73678j2603
$$ plain form
30367 383322 559738 586114 365376 172680 164745 133735 -116812 -419169 -466888 -254324
30357 -254324 -85878 -177469 -414936 -544453 -480454 -346196 -286519 -339968 -456428 -538206
30347 -538206 -487750 -327108 -247815 -397867 -625967 -623453 -354198 -129187 -169961 -331054
30337 -331054 -402933 -453923 -640838 -866079 -900674 -733812 -534967 -360951 -167863 -30931
30327 -30931 -57078 -124250 -13939 199792 196389 -113922 -432939 -467051 -252534 -28222 18534
30316 18534 -158239 -435526 -567058 -440299 -256437 -238306 -240218 35596 488363 692326
30306 692326 557965 476851 662152 774200 455546 -110311 -471813 -479284 -301601 -96625
30296 -96625 56196 73748 -21740 -57881 17892 1977 -227163 -444651 -395248 -168824 5235
$$ packed form
30367C83322J76416K6376k20738j92696p935l1010k50547l02357m7719K12564
30357b54324J68446r1591k37467j29517O3999J34258N9677n3449j16460q1778
30347e38206N0456J60642P9293j50052k28100K514K69255K25011m0774j61093
30337c31054p1879n0990j86915k25241l4595J66862J98845J74016J93088J36932
30327c0931k6147o7172J10311K13731l403l10311l19017l4112K14517K24312M6756
30316A8534j76773k77287j31532J26759J83862J8131j912K75814M52767K03963
30306F92326j34361q1114J85301J12048l18654n65857l61502p471J77683K04976
30296i6625J52821J7552r5488l6141P5773j5915k29140k17488M9403K26424J74059
$$ plain form
30285 5235 131267 307472 407242 266715 55829 70579 227038 161459 -172853 -403651
30275 -403651 -302838 -95643 -74992 -198425 -243352 -156745 -68451 -68375 -104779 -58712 123391
30264 123391 319195 279365 -102925 -598839 -855679 -781240 -574722 -412206 -294348 -211292
30254 -211292 -246880 -439425 -685343 -859440 -931092 -916308 -811571 -618255 -367404 -112555
30244 -112555 53005 27699 -157570 -301298 -255718 -110521 -15902 60192 196663 266333
30234 266333 109072 -115791 -101253 82455 22966 -376431 -660068 -443501 53044 358531
30224 358531 379672 377727 504939 674267 780625 774313 591243 259333 6776 28508 210327
30213 210327 312910 338067 434921 523689 370772 52605 -29030 280707 620118 597196
$$ packed form
30285E235J26032J76205R9770j40527k10886J4750J56459o5579l34312k30798
30275d03651J00813K07195K0651j23433m4927Q6607Q8294P6l6404M6067J82103
30264A23391J95804l9830l82290m95914k56840P4439K06518J62516J17858Q3056
30254b11292l5588j92545k45918j74097p1652J4784J04737J93316K50851K54849
30244a12555J65560k5306j85269j43728M5580J45197R4619P6094J36471O9670
30234B66333j57261k24863J4538J83708n9489l99397k83637K16567M96545L05487
30224C58531K1141j945J27212J69328J06358o312j83070l31910k52557K1732J81819
30213B10327J02583K5157R6854Q8768j52917l18167q1635L09737L39411k2922
$$ plain form
30203 597196 288162 34336 -51750 -123560 -267212 -374235 -305982 -23778 389450 718186
30193 718186 737245 493838 329189 428781 513706 256813 -138940 -170397 197238 446388
30183 446388 294054 106416 275339 576635 534468 158866 -119476 -110270 -19936 4546
30173 4546 51695 118395 11433 -296536 -555823 -638647 -729617 -926831 -965167 -610036 -84246
30162 -84246 208417 213991 168377 145593 25942 -140894 -119447 107121 236987 74984 -190172
30151 -190172 -269140 -132121 48756 139626 84393 -132024 -390064 -436080 -164895 183780
30141 183780 288683 137347 -22123 -44165 20801 154764 416335 698523 712246 369881
30131 369881 -14182 -102427 30038 53544 -129741 -308075 -320746 -228176 -104972 66761
$$ packed form
30203E97196l09034k53826q6086p1810j43652j07023O8253K82204M13228L28736
30193G18186J9059k43407j64649R9592Q4925k56893l95753l1457L67635K49150
30183D46388j52334j87638J68923L01296m2167l75602k78342R206R0334K4482
30173D546M7149O6700j06962l07969k59287q2824r0970j97214l8336L55131N25790
30162h4246K92663N574m5614k2784j19651j66836K1447K26568J29866j62003k65156
30151a90172p8968J37019J80877R0870n5233k16417k58040m6016K71185L48675
30141A83780J04903j51336j59470k2042O4966J33963K61571K82188J3723l42365
30131C69881l84063q8245J32465K3506j83285j78334j2671R2570J23204J71733
$$ plain form
30121 66761 213758 137532 -180149 -441279 -392712 -173051 -100924 -241939 -405563 -478488
30111 -478488 -509954 -498290 -347750 -82195 100057 60615 -123284 -285900 -343132 -307833
30101 -307833 -243405 -224898 -261313 -270656 -220167 -228301 -387740 -557205 -522748 -325046 -210285
30090 -210285 -272277 -370177 -395710 -372418 -276983 -39460 229259 295440 164774 96776 165909
30079 165909 132229 -107634 -284610 -191911 -36872 -82516 -219049 -208084 -106581 -91511
$$ packed form
30121F6761J46997p6226l17681k61130M8567K19661P2127j41015j63624p2925
30111d78488l1466J1664J50540K65555J82252l9442j83899j62616n7232L5299
30101c07833O4428J8507l6415r343N0489q134j59439j69465L4457J97702J14761
30090b10285o1992r7900k5533K3292R5435K37523K68719O6181j30666o7998O9133
30079A65909l3680k39863j76976R2699J55039m5644j36533J0965J01503J5070
$$ [...]
##END NTUPLES=NMR SPECTRUM
##END=
