##TITLE=31Pdec_93-2025
CDCl3, 24 sc
 11.8.2025
##JCAMPDX= 6.0         $$ Bruker NMR JCAMP-DX V2.0
##DATA TYPE= NMR SPECTRUM
##DATA CLASS= NTUPLES
##ORIGIN= UXNMR, Bruker Analytische Messtechnik GmbH
##OWNER= root
$$ XWIN-NMR		Version 3.5
$$ Mon Aug 11 15:25:15 2025 Russian Standard Time (UT+4h)  she@DPX200
##.OBSERVE FREQUENCY= 81.013821
##.OBSERVE NUCLEUS= ^31P
##.ACQUISITION MODE= SIMULTANEOUS
##.ACQUISITION SCHEME= undefined
##.AVERAGES= 24
##.DIGITISER RES= 17
##SPECTROMETER/DATA SYSTEM= spect
##.PULSE SEQUENCE= zgpg30
##.SOLVENT NAME= CDCl3
##.SHIFT REFERENCE= (INTERNAL, CDCl3, 0, 198.062)
##AUDIT TRAIL= $$ (NUMBER, WHEN, WHO, WHERE, WHAT)
$$ ##TITLE= Audit trail, XWIN-NMR		Version 3.5
$$ ##JCAMPDX= 5.01
$$ ##ORIGIN= Bruker BioSpin GmbH
$$ ##OWNER= she
$$ F:/spectra/data/she/nmr/P31/2/pdata/1/auditp.txt
$$ ##AUDIT TRAIL=  $$ (NUMBER, WHEN, WHO, WHERE, WHAT)
(   1,<2025-08-11 14:52:27.76 +0400>,<she>,<DPX200>,
      <created by zg, POWCHK disabled, PULCHK disabled
       configuration hash MD5:
       00 E9 B6 7A A2 85 ED C7 34 08 36 98 17 FE 4E 26
       data hash MD5: 32K
       2B 85 3D 50 04 7A A1 4F 81 DF CE B6 43 8D 9D E8>)
(   2,<2025-08-11 15:24:19.57 +0400>,<she>,<DPX200>,
      <Start of raw data processing
       efp BC_mod = 2 LB = 1.5 FT_mod = 6 PKNL = 1 PHC0 = 1752.794 PHC1 = 102.8994 SI = 64K 
       data hash MD5: 64K
       A5 22 B7 86 03 17 2B FF D4 AB D9 CA 4F F0 A3 AC>)
(   3,<2025-08-11 15:24:37.04 +0400>,<she>,<DPX200>,
      <pk PHC0 = 1.380084 PHC1 = 0 
       data hash MD5: 64K
       54 CF F8 DE 81 60 9E 6C 4E C6 04 28 9B 69 83 5A>)
(   4,<2025-08-11 15:24:42.53 +0400>,<she>,<DPX200>,
      <abs ABSG = 5 
       data hash MD5: 64K
       68 19 9A 57 C3 B9 8B 9D 75 9E BF 96 87 B0 E2 FE>)
$$ ##END=
$$ 
$$ hash MD5
$$ 2E 95 3A AE B9 46 56 DE B8 C6 99 84 84 91 C6 55
##$RELAX= 
##$RELAX= 
##$RELAX= 
##$RELAX= 
##$RELAX= 
##$RELAX= 
##$RELAX= 
##$RELAX= 
$$ Bruker specific parameters
$$ --------------------------
##$DU= <F:/spectra>
##$EXPNO= 2
##$NAME= <P31>
##$PROCNO= 1
##$TYPE= <nmr>
##$USER= <she>
##$AMP= (0..31)
100 100 100 100 100 100 100 100 100 100 100 100 100 100 100 100 100 100 
100 100 100 100 100 100 100 100 100 100 100 100 100 100 
##$AQSEQ= 0
##$AQ_mod= 1
##$AUNM= <au_zg>
##$AUTOPOS= <>
##$BF1= 81.014009
##$BF2= 200.13
##$BF3= 200.13
##$BF4= 200.13
##$BF5= 200.13
##$BF6= 200.13
##$BF7= 200.13
##$BF8= 200.13
##$BYTORDA= 1
##$CFDGTYP= 0
##$CFRGTYP= 5
##$CHEMSTR= <none>
##$CNST= (0..31)
1 1 145 1 1 1 1 1 1 1 1 1 1 1 1 1 1 1 1 1 1 1 1 1 1 1 1 1 1 1 1 1 
##$CPDPRG= <waltz16>
##$CPDPRG1= <>
##$CPDPRG2= <waltz16>
##$CPDPRG3= <>
##$CPDPRG4= <mlev>
##$CPDPRG5= <mlev>
##$CPDPRG6= <mlev>
##$CPDPRG7= <mlev>
##$CPDPRG8= <mlev>
##$CPDPRGB= <>
##$CPDPRGT= <>
##$D= (0..31)
0 1 0 0 0 0 0 0 0 0.06 0 0.03 2e-05 3e-06 0 0 0.0002 0 0 0 0 0 0 0 0 0 
0 0 0 0 0 0 
##$DATE= 1754909547
##$DBL= (0..7)
120 120 120 11 120 120 24 19 
##$DBP= (0..7)
150 150 150 150 150 150 150 150 
##$DBP07= 0
##$DBPNAM0= <>
##$DBPNAM1= <>
##$DBPNAM2= <>
$$ [...]
##$SUBNAM3= <"">
##$SUBNAM4= <"">
##$SUBNAM5= <"">
##$SUBNAM6= <"">
##$SUBNAM7= <"">
##$SUBNAM8= <"">
##$SUBNAM9= <"">
##$SW= 400.765351723535
##$SWIBOX= (0..15)
0 1 3 0 0 0 0 0 0 0 0 0 0 0 0 0 
##$SW_h= 32467.5324675325
##$TD= 32768
##$TD0= 1
##$TE= 0
##$TE2= 300
##$TE3= 300
##$TEG= 300
##$TL= (0..7)
0 120 53 12 22 120 120 120 
##$TP= (0..7)
150 150 150 150 150 150 150 150 
##$TP07= 0
##$TPNAME0= <>
##$TPNAME1= <>
##$TPNAME2= <>
##$TPNAME3= <>
##$TPNAME4= <>
##$TPNAME5= <>
##$TPNAME6= <>
##$TPNAME7= <>
##$TPOAL= (0..7)
0.5 0.5 0.5 0.5 0.5 0.5 0.5 0.5 
##$TPOFFS= (0..7)
0 0 0 0 0 0 0 0 
##$TUNHIN= 0
##$TUNHOUT= 0
##$TUNXOUT= 0
##$USERA1= <user>
##$USERA2= <user>
##$USERA3= <user>
##$USERA4= <user>
##$USERA5= <user>
##$V9= 5
##$VALIST= <valist>
##$VCLIST= <CCCCCCCCCCCCCCC>
##$VD= 0
##$VDLIST= <DDDDDDDDDDDDDDD>
##$VPLIST= <PPPPPPPPPPPPPPP>
##$VTLIST= <TTTTTTTTTTTTTTT>
##$WBST= 1024
##$WBSW= 4
##$XGAIN= (0..3)
0 0 0 0 
##$XL= 0
##$YL= 0
##$YMAX_a= 11100
##$YMIN_a= -3580
##$ZGOPTNS= <>
##$ZL1= 120
##$ZL2= 120
##$ZL3= 120
##$ZL4= 120
##$ABSF1= 198.0616
##$ABSF2= -202.7028
##$ABSG= 5
##$ABSL= 3
##$ALPHA= 0
##$AQORDER= 0
##$ASSFAC= 0
##$ASSFACI= 0
##$ASSFACX= 0
##$ASSWID= 0
##$AUNMP= <proc_1d>
##$AZFE= 0.1
##$AZFW= 0.5
##$BCFW= 0
##$BC_mod= 2
##$BYTORDP= 0
##$COROFFS= 0
##$CY= -3
##$DATMOD= 1
##$DC= 0
##$DFILT= <>
##$DTYPP= 0
##$F1P= 0
##$F2P= 0
##$FCOR= 1
##$FTSIZE= 65536
##$FT_mod= 6
##$GAMMA= 0
##$GB= 0
##$INTBC= 1
##$INTSCL= 9.790993e-09
##$ISEN= 30
##$LB= 1.5
##$LEV0= 0
##$LPBIN= 0
##$MAXI= 10000
##$MC2= 0
##$MEAN= 0
##$ME_mod= 0
##$MI= 50
##$NCOEF= 0
##$NC_proc= -8
##$NLEV= 6
##$NOISF1= 182.463
##$NOISF2= 159.3651
##$NSP= 0
##$NTH_PI= 0
##$NZP= 0
##$OFFSET= 198.0616
##$PC= 4
##$PHC0= 1754.174
##$PHC1= 102.8994
##$PH_mod= 1
##$PKNL= yes
##$PPARMOD= 0
##$PSCAL= 0
##$PSIGN= 0
##$REVERSE= no
##$SF= 81.0140089999434
##$SI= 65536
##$SIGF1= 159.3651
##$SIGF2= -187.1042
##$SINO= 113.3802
##$SIOLD= 16384
##$SREGLST= <1H.CDCl3>
##$SSB= 0
##$STSI= 65536
##$STSR= 0
##$SW_p= 32467.5324675325
##$SYMM= 0
##$S_DEV= 0
##$TDeff= 32768
##$TDoff= 0
##$TI= <>
##$TILT= no
##$TM1= 0
##$TM2= 0
##$TOPLEV= 0
##$USERP1= <user>
##$USERP2= <user>
##$USERP3= <user>
##$USERP4= <user>
##$USERP5= <user>
##$WDW= 1
##$XDIM= 65536
##$YMAX_p= 476245986
##$YMIN_p= -56911895
$$ End of Bruker specific parameters
$$ ---------------------------------
##NTUPLES= NMR SPECTRUM
##VAR_NAME=  FREQUENCY,     SPECTRUM/REAL,   SPECTRUM/IMAG
##SYMBOL=    X,             R,               I
##VAR_TYPE=  INDEPENDENT,   DEPENDENT,       DEPENDENT
##VAR_FORM=  AFFN,          ASDF,            ASDF
##VAR_DIM=   65536,         65536,           65536
##UNITS=     HZ,            ARBITRARY UNITS, ARBITRARY UNITS
##FACTOR=    0.49542278885378, 1,            1
##FIRST=     16045.7642231865, 0,            0
##LAST=      -16421.768244346, 0,            0
##MIN=       -16421.768244346, -56911895,    0
##MAX=       16045.7642231865, 476245986,    0
$$ Real data points
##PAGE= N=1
##DATA TABLE= (X++(R..R)), XYDATA
$$ [...]
38263 1773201 2832517 3770384 3619182 2643841 1961210 2020018 2250918 2118481 1714601
38254 1714601 1297292 1019594 1209131 2146909 3367804 3895465 3447841 2773393 2528274
38245 2528274 2512750 2407456 2566521 3440253 4639896 5240155 4871259 4058929 3554919
38236 3554919 3620185 3913678 3965969 3829563 4096587 4910933 5229017 3879016 1402316
38227 1402316 -118439 565477 2536222 4189070 5046063 5375309 5043241 3948969 2948037
38218 2948037 2990276 3584596 3336905 1910584 317987 -650902 -1061525 -883213 172967
38209 172967 1478594 1539727 16194 -1393256 -1005979 768028 2369006 3283386 4042306
38200 4042306 4567299 4025032 2364856 698667 -146509 -347554 -29246 1242364 3143094
38191 3143094 3930756 2390741 -234228 -1699793 -1809221 -2374893 -4060152 -5149141 -4338919
38182 -4338919 -3097312 -3669240 -5789042 -7246284 -7245202 -7197975 -8050939 -8749696 -8055706
38173 -8055706 -6304278 -4393299 -2336850 15474 1888867 2561594 2696672 3338254 4134567
38164 4134567 4028292 3391031 3809576 5545573 6710095 5615297 2884630 490642 -524771
38155 -524771 -571784 -283092 301245 1270684 2151299 2053240 565678 -1591041 -3075804
38146 -3075804 -3267013 -2818017 -2572986 -2320815 -1292042 298353 1141439 574838 -326143
38137 -326143 -43943 1365978 2288580 1609793 110087 -639422 -391250 -452624 -1700010
38128 -1700010 -3268340 -3890501 -3733559 -3673099 -3282929 -1395334 1204927 1817623 -406072
38119 -406072 -2701873 -2381872 -609086 -207327 -982762 -220295 2512966 4308042 3395408
38110 3395408 1817066 2124356 3675711 4167035 3228509 2323136 1979563 1262309 -228581
38101 -228581 -1570632 -1889960 -1322929 -489406 67103 -124246 -1195784 -2584754 -3535353
38092 -3535353 -3889610 -3861134 -3304854 -1954086 -240446 896572 1068589 730109 421655
38083 421655 287666 381754 902155 1911920 3071367 3731257 3240727 1411251 -1063860
38074 -1063860 -2849177 -2921267 -1244428 1464759 4251919 6151355 6530984 5625110 4375388
38065 4375388 3483090 2951833 2584943 2276884 1710837 634538 -328283 -188671 657733
38056 657733 390234 -1798454 -4408381 -5688160 -5728771 -5347908 -4304521 -2373603 -992352
38047 -992352 -1529770 -2566281 -1426736 1667722 3534035 2493361 386433 -711794
38039 -711794 -1289669 -2385849 -2907388 -1160984 2103961 4282860 4034956 2188935 46185
38030 46185 -1560923 -1831183 -385148 1688150 2554439 1751065 522280 -160311 -742165
38021 -742165 -1837038 -2987345 -3478502 -3620235 -4281539 -5498694 -6372048 -6271924 -5496115
38012 -5496115 -4669914 -4017147 -3391724 -2636870 -1695780 -664307 55611 2347 -584521
38003 -584521 -600972 672297 2296534 2521136 1112281 -111406 327536 1530253 1585531
37994 1585531 253777 -1134061 -2093922 -3463656 -5129616 -5215151 -2765013 179198 885442
37985 885442 -479660 -1414483 -918210 -681753 -1982943 -3375159 -2846883 -1003523 -253809
37976 -253809 -1237394 -1944627 -787239 1073132 1526144 551590 -33532 533625 931547
37967 931547 -59219 -1674894 -2268085 -1403182 34976 1192955 1756579 1552398 672503
37958 672503 -189339 -447032 -531164 -1214569 -2252766 -2766655 -2818733 -3268191 -3965269 -3662657
37948 -3662657 -2299450 -1820605 -3593385 -6155466 -6909523 -5384738 -3496890 -2954233 -3621540
37939 -3621540 -4290271 -4027484 -2809859 -1593243 -1532125 -2424538 -2456720 -496706 1955642
37930 1955642 2527674 1276225 424497 782095 553681 -1459145 -3397765 -2661379 485681
37921 485681 3290782 3891561 2797677 1346117 236155 -282158 -79624 535165 998203
37912 998203 1311698 2025281 3225598 4258378 4673105 4749106 4826556 4780637 4430558 3810475
37902 3810475 2788777 1193873 -364962 -762605 -43526 143729 -1280342 -3115877 -3592716
37893 -3592716 -3055745 -3290019 -4477861 -4776173 -3300589 -1699071 -1802448 -3148481 -4072189
37884 -4072189 -4178879 -4343582 -4964115 -5621418 -6071985 -6290737 -5839187 -4495481 -3315899
37875 -3315899 -3695082 -5345453 -6499911 -6192075 -5003143 -3473904 -1453023 467616
37867 467616 668282 -1164170 -2810528 -2162821 -197355 339387 -1232856 -2665707 -1813643
37858 -1813643 879354 3293588 3939165 2827298 871806 -887731 -1852084 -2206092 -2615717
37849 -2615717 -3364941 -3956038 -3748041 -2824979 -1977814 -1818795 -2123498 -2259202 -2191524 -2618721
37839 -2618721 -3816367 -4819613 -4450039 -2926129 -1584598 -1062494 -819947 -626956 -1210211
37830 -1210211 -2757574 -3978559 -3684381 -2395345 -1281361 -370200 857242 1841974 1634872
37821 1634872 938208 1668293 4191005 6464176 6468080 4386086 1865282 53578 -1080034
37812 -1080034 -2156254 -3560387 -4809924 -4782623 -3184382 -1503512 -1492974 -2900983 -3934326
37803 -3934326 -3802393 -3234189 -2483301 -871364 1079511 1225734 -1144147 -3609095 -3659550
37794 -3659550 -2023749 -1071596 -1131082 -722474 237093 82984 -1610488 -3058369 -3007117
37785 -3007117 -2561078 -3272833 -4869495 -5996109 -6126244 -5594244 -4567900 -3224141 -2482094
37776 -2482094 -3342171 -5466537 -7219760 -7250626 -5608941 -3413822 -1917150 -1780248 -2662598
37767 -2662598 -3408767 -3109431 -2145616 -1786711 -2551289 -3415967 -3131833 -2069013 -2017018
37758 -2017018 -3934195 -6519918 -7586092 -6497150 -4559105 -3152023 -2334825 -1464898
37750 -1464898 -350511 701344 1371283 1342377 375189 -1061496 -1778965 -1211472 -328357
37741 -328357 -385255 -1150616 -1406864 -1047360 -1433554 -3315721 -5426184 -5860076 -4300434
37732 -4300434 -2158094 -733859 78230 1091932 2283927 2546766 1246019 -444940
37724 -444940 -620817 889204 2160434 1804406 901078 1278989 2763184 3618449 3230031
37715 3230031 2627797 2441206 2171018 1838716 2525722 4429097 5907384 5508668 3704364
37706 3704364 1608302 -678901 -3139854 -4543912 -3844327 -2051987 -886573 -119390
37698 -119390 1740268 4306384 5057787 2748558 -710658 -2628668 -2445101 -1434904 -733656
37689 -733656 -697676 -1297604 -1988613 -1708021 5565 2202809 3600458 4122470 4601957
37680 4601957 5258888 5349644 4304751 2525134 962378 344203 763030 1608922 1991963
37671 1991963 1609970 1031799 741464 265473 -1056893 -2678385 -3157986 -1964170 -51642
37662 -51642 1645649 3291935 5018918 5611580 3618724 -379651 -3841863 -4960223 -4369474
37653 -4369474 -3649996 -3043625 -1701066 276293 1454450 1076293 336119 788240 2091045
37644 2091045 2360697 651351 -1863403 -3417441 -3598948 -3287022 -3147586 -2880331 -1949378
37635 -1949378 -580247 273662 -29877 -946975 -1184920 -209625 980456 1094158 382698
37626 382698 395812 1701987 2840506 2319080 904468 710125 2251814 3773394 3790182
37617 3790182 2999940 2821879 3021218 2123170 -86700 -1815221 -1409380 600950 2157065
37608 2157065 1865970 37389 -2084990 -3513933 -4045275 -4116858 -4232645 -4260521 -3375403
37599 -3375403 -1086042 1700515 3171988 2467627 729672 -55336 860824 2322052 2562940
37590 2562940 920617 -1602216 -3141499 -2417206 171294 2749819 3613361 2878204 2226709
37581 2226709 2809208 3786864 3447930 1558933 -115486 129772 1904485 3193222 2552275
37572 2552275 344110 -2018766 -3417562 -3542069 -2693434 -1455831 -268707 905028
37564 905028 2196166 3078642 2715193 1451605 1090916 2693668 4690776 4512813 1884096
37555 1884096 -1012845 -2733033 -4074364 -5662833 -6019281 -3779762 -505664 974796
37547 974796 487444 469828 1981991 3115943 2126348 49125 -1139229 -1379287 -1893671
37538 -1893671 -2782064 -3101527 -2886033 -3307289 -4688818 -5740589 -5197824 -3316973 -1356066
37529 -1356066 -217918 54498 -98280 -301437 -580251 -1219891 -2253685 -3322161 -4134726
37520 -4134726 -4617059 -4428940 -3096513 -1128812 -145918 -992754 -2399020 -2563468 -1463009
37511 -1463009 -369801 306652 1059993 1491960 441778 -1811925 -3359071 -3381212 -3389072
37502 -3389072 -4695376 -6072632 -5313033 -2256995 1013082 2498042 1841479 83533
37494 83533 -1262550 -1324002 -740276 -900641 -1850917 -1939400 -304725 1492975 1604564 603255
37484 603255 388336 1108158 1158831 46268 -783579 -334177 474097 413002 -387508 -1221384
37474 -1221384 -2131898 -3473112 -4866027 -5539739 -5418693 -5221619 -5570742 -6300698 -6583843
37465 -6583843 -5775029 -4317599 -3487941 -3782999 -4036837 -2932879 -900660 641884 1538231
37456 1538231 2830680 4500681 5088374 4063694 2862417 2698312 2874913 2362354 1652035
37447 1652035 1676365 2019414 1726476 1058670 912852 1143761 992523 640833 716019 647008
37437 647008 -693390 -2763124 -3551154 -2293407 -418917 593307 735727 301941 -1112789
37428 -1112789 -3306769 -4489029 -3164531 -446695 874400 -550383 -3442878 -5731718
37420 -5731718 -6587595 -6476467 -6073197 -5686140 -5398482 -5235231 -5106184 -4811446 -4282162
37411 -4282162 -3780685 -3653303 -3793350 -3602505 -2736143 -1657036 -1064196 -951435 -752336
37402 -752336 -353010 -330979 -1032488 -1972696 -2446020 -2324017 -1969180 -1701548 -1603028 -1529742
37392 -1529742 -1103258 -62636 1114376 1364836 248129 -1263208 -1640554 -325394 1909041
37383 1909041 3899651 4949605 4865452 3745207 2033356 519705 -107257 154497 549120
37374 549120 188724 -1178194 -2992632 -4397578 -4817052 -4149619 -2772335 -1469835 -896922
37365 -896922 -737352 193899 2434882 4772245 5418565 4176467 2553456 1650478 969566
37356 969566 -211551 -1267377 -1015009 365687 1246242 483926 -1254169 -2366883 -2103299
37347 -2103299 -1129875 -437445 -44011 879162 2581817 3978468 3882878 2687360 1913245
37338 1913245 2031082 1774669 130866 -1966702 -2899840 -2706654 -2921231 -4119792 -4786663
37329 -4786663 -3149491 480259 3803973 4808964 3555724 1707348 633361 313603
37321 313603 55675 -307448 -469789 -511569 -799831 -1022610 -313516 1325696 2664073
37312 2664073 2825082 2329721 1906446 1254883 -7920 -1059633 -879798 -21061 2906
37303 2906 -1215662 -2866944 -4542727 -6326976 -7320452 -5982952 -2572228 326373 620201
37294 620201 -1067561 -2744723 -3441969 -3342234 -2659172 -1653758 -1073731 -1348035 -1703759
37285 -1703759 -1065473 468133 1859744 2472758 2371309 1688122 591388 -385114 -815768
37276 -815768 -1001911 -1451569 -2060750 -2455104 -2623469 -2399644 -1007358 1625510 3602420
37267 3602420 2735393 -472520 -3040693 -3034532 -1496171 -393352 -91824 192420 559702
37258 559702 350118 -535486 -1292751 -1161466 -149569 1111807 1945877 2279019 2815178
37249 2815178 4089276 5274844 4748834 2206817 -653877 -2144786 -2400351 -2383615 -2014908
37240 -2014908 -603534 1356515 2326575 1716893 494290 -409997 -1098765 -1676480 -1397045
37231 -1397045 244368 2285864 3212033 2845668 2379480 2446678 2063335 107797 -2580097
37222 -2580097 -3516520 -1388867 2011221 3509402 2185556 369674 570850 2330214
37214 2330214 3151403 2028112 646944 983238 3060756 5695671 8264742 10600054
37206 10600054 11828929 10776883 7671976 4408907 2635275 2139668 1576363 398367
37198 398367 -474901 95734 1907983 3340790 2927145 997268 -442039 280806 2642158
37189 2642158 4367071 3855588 1944834 1039434 2588087 5634164 7843432 7759198 5990284
37180 5990284 4372974 4136602 4821832 4837924 3088938 170053 -2066684 -2272508 -892295
37171 -892295 492364 1030876 1394704 2546940 4231906 5299703 5443339 5959082 8382505
37162 8382505 12540012 16280189 17287557 15194539 11870788 9556636 8786668 8362060
37154 8362060 7234943 5796056 4975915 4663579 3776751 1761815 -657035 -2302317 -2634762
37145 -2634762 -1967812 -996797 -131953 1001556 3194825 6337300 8800412 8899302 6813046
37136 6813046 4261323 2494103 1642500 1863629 3575151 6125262 7686258 7313942 6040335
37127 6040335 5205384 4868437 4632085 4575595 4148339 1636643 -3409983 -8259617 -9596941
37118 -9596941 -7465957 -4618025 -2512067 -392237 1832620 2650444 1681011 879315 1655983
37109 1655983 2684484 2066276 201484 -1026946 -827168 133174 1021403 1281447 644089
37100 644089 -231688 -101965 863812 725278 -1246018 -2689397 -1214980 1851936 3240569
37091 3240569 2595157 2814393 5433752 8337096 8890977 7158209 4845548 2880495 1481028
37082 1481028 1288580 2769054 5070817 6752189 7371455 7507734 7546264 7242445 6334408
37073 6334408 5028055 3919453 3567043 3816888 3582254 1977952 -232359 -1204160 -320437
37064 -320437 1007042 1301017 799718 581515 797555 688138 -215614 -1688069 -3093932
37055 -3093932 -3451360 -1929847 889794 2928546 2750759 1273786 436953 790975 1501260
37046 1501260 2111754 2833896 3316770 2654060 824267 -1056809 -2140984 -2525850 -2508750
37037 -2508750 -2292134 -2459707 -3410867 -4126938 -3022009 -537690 709688 -677958 -2808411
37028 -2808411 -3165810 -2133275 -2094985 -3722280 -5102424 -4527105 -2416642 -129624 1625513
37019 1625513 2543426 2178076 671922 -702159 -737569 221697 681798 -248487 -1953681
37010 -1953681 -3002942 -2436361 -592490 1116231 1610398 1540538 2679683 5456660 7793064
37001 7793064 7302251 4240556 1193641 -46442 -92460 -240051 -412061 332130 1986813
36992 1986813 3293029 3071385 1271932 -1141607 -2941238 -3525323 -3434708 -3649123 -4064394
36983 -4064394 -3310521 -721476 2186799 3234877 2172160 578455 -587178 -1882378
36975 -1882378 -3614569 -4713028 -4233631 -2954376 -2452902 -3183154 -4301589 -4898637 -4611351
36966 -4611351 -3489265 -2116873 -1515538 -2023122 -2486655 -1491623 628449 1865280 800291
36957 800291 -1813981 -3905859 -4064195 -2586794 -987798 -598375 -1431142 -2425204 -2813613
36948 -2813613 -2770409 -2475265 -1391494 643105 2229174 1606986 -1016576 -3474183 -4078046
36939 -4078046 -3054718 -1497586 -107175 658373 338312 -942157 -2388861 -3483735
36931 -3483735 -4230123 -4226272 -2748067 -397866 692234 -516321 -2214129 -2061969 -474717
36922 -474717 117621 -1067115 -2074859 -1044733 1407982 3232150 3259769 1904754 452352
36913 452352 229247 1692109 3697930 4269261 2684487 379552 -671473 -9466 1264060
36904 1264060 1897326 1349277 -268500 -2326227 -3881944 -4370532 -4145274 -4028295 -4400793
36895 -4400793 -4962727 -5179563 -4681757 -3447604 -1896317 -579975 482626 1827520 3516151
36886 3516151 4463032 3439018 678667 -2042608 -3006267 -1952873 -23872 1351347
36878 1351347 1679637 1899476 3440900 6366356 8798271 8905448 7232034 6144175 6946099
36869 6946099 8499275 8916691 7635789 5368226 2999531 1318752 1000995 1767175 2003524
36860 2003524 325064 -2616956 -4841424 -5441819 -5253811 -5118751 -4762964 -3945878 -3599313
36851 -3599313 -4754687 -6826818 -8006035 -7335414 -5652232 -4360662 -3867928 -3499055 -2594955
36842 -2594955 -1363006 -669067 -1080195 -2148201 -2753195 -2207253 -841429 564358 1587720
36833 1587720 2151989 2125111 1491343 720490 305488 -39696 -990095 -2267152 -2522687
36824 -2522687 -1089386 844472 1627012 1286281 1275751 2164410 2722878 1780989 122904
36815 122904 -289870 1385253 4052219 5944486 6075981 4592838 2453380 901157 634743
36806 634743 1207670 1609691 1542550 1650698 2387256 3300893 3794529 3993219 4333382 4750832
36796 4750832 4868500 4629578 4111046 3011122 1060993 -1177773 -2619548 -2729127 -1725280
36787 -1725280 94927 2427741 4395771 4859060 3633628 1775011 418021 -88300
36779 -88300 179707 1103331 2239184 2944751 3193483 3574828 4167556 4262657 3609958 2913166
36769 2913166 2431066 1201463 -1317137 -3843309 -4888014 -5024826 -5912374 -7436951 -7652411
36760 -7652411 -5731403 -3303814 -2288430 -2746366 -3596086 -4247802 -4523669 -3811855 -1537562
36751 -1537562 1674642 4154176 4679983 3574055 2339970 2285394 3343706 4286544 4268377
36742 4268377 3818564 3809976 3913905 3072776 1320893 -85980 -496774 -559915 -712186 -287631
36732 -287631 1124870 2586425 3053305 2838084 2810419 2866138 2266345 980728 -301183
36723 -301183 -1086113 -1192440 -541691 267832 -82922 -1909481 -3407184 -2693449 -466048
36714 -466048 1050528 1499442 2656072 5006246 6245296 4349501 530438 -2353685
36706 -2353685 -3221737 -2993431 -2146902 -6785 3420434 6623131 8462525 9866441 12530974
36697 12530974 16223025 18412197 16949312 12558659 8119334 5667513 4717906 3614850
36689 3614850 1812191 248692 -111214 669337 1881812 2964675 3747010 4320907 4810767
36680 4810767 5031864 4525618 3374006 2731022 3726672 5820476 7218153 7276978 7479042
36671 7479042 9224692 11488161 11893475 9828035 7187598 5829236 5494156 4922006 4020577
36662 4020577 3693298 3851530 3026616 488555 -2215686 -2792665 -947186 1244626 1669697
36653 1669697 161962 -1928844 -3390921 -3968901 -4015211 -3814990 -3174022 -1616221 757171
36644 757171 2766686 3190492 2347596 1782422 2116774 2274508 1462475 771351 1589538
36635 1589538 3195582 3477036 1858753 40838 -432020 -122430 -688052 -2709388 -5058690
36626 -5058690 -6023783 -4788314 -2079800 594994 2514754 4185998 5911649 6727687
36618 6727687 5745069 3926241 3149046 3726063 4220170 3606026 2139571 118514 -2452656
36609 -2452656 -4611746 -4684543 -2590565 -359007 547984 943852 1945348 2848891 2398582
36600 2398582 906315 -518752 -1897044 -3809761 -5555928 -5664093 -4045281 -2147377
36592 -2147377 -1047320 -657852 -693764 -1128852 -1653060 -1772543 -1476809 -905674 390896
36583 390896 2733709 5105293 6032996 5681765 5654117 6526601 7141355 6965367 7661599
36574 7661599 11026198 16099599 19655385 19539276 16646549 13413525 11049797 8838956
36566 8838956 5956874 3154047 2024608 2947511 4611533 5653527 5931936 5948080 5934317
36557 5934317 6009204 6419741 7101000 7781971 8907267 11310833 14440444 16466482 17195965
36548 17195965 19087132 23519057 27569641 27045943 21936323 16208119 12519488 9922886
36540 9922886 7050461 4751522 4488178 6182247 8734822 11034596 11656229 9384579
36532 9384579 5147364 1911182 1549913 3029426 4433533 5261648 5800483 5830121 5222650
36523 5222650 4585994 4206300 3531198 2620119 2681567 4111366 5530295 6005637 6589057
36514 6589057 8094443 8981158 7468744 4506663 2439710 1587210 397528 -1490057
36506 -1490057 -2550539 -1703065 468468 2888625 4930163 6231560 6863297 7516540 8397438
36497 8397438 8379926 6517888 3828713 2140760 1760515 1838163 2340554 3718424 5097443
36488 5097443 4983600 3696541 3047590 3539118 3882815 3416918 2948380 2943798 2955474 3190257
36478 3190257 4463317 6023780 5704673 3223293 1271005 2074879 4583623 6255093
36470 6255093 6025971 4341190 1924547 -57959 -143764 1509377 2594565 1597880 95342
36461 95342 467595 2416847 3658189 3330980 2724663 2891794 3383037 3482367 3239748 2980232
36451 2980232 2822954 2910878 3364669 3916124 4124645 3847430 3091370 1812118 386179
36442 386179 -240454 461776 1891647 3077063 3552453 3089406 1561879 -233730 -805695
36433 -805695 -49286 79628 -1720083 -3910970 -4325613 -3416004 -3118312 -3297466 -1999057
36424 -1999057 884849 3001393 3182214 3118716 4248636 5241092 4236941 1858247 114767
36415 114767 -425692 -420654 342046 2561059 5182599 5776229 3726649 1401333 1257910
36406 1257910 2953969 4290995 4118805 3111076 2166644 1404408 806459 614357 576495
36397 576495 -196163 -1814404 -2822538 -1919070 -7508 773013 -28068 -652923 116324
36388 116324 1132465 688310 -967027 -2104927 -1865366 -979259 -500250 -836641 -1845638
36379 -1845638 -2996812 -3530439 -3121973 -2218049 -1233886 65310 1718456 2811464 2596490
36370 2596490 1802101 1644907 2023298 2051102 1971176 2855746 4453597 5135236 4385835 3715505
36360 3715505 4388044 5632214 5945087 4993340 3330288 1287294 -816626 -2181440 -2334323
36351 -2334323 -1940715 -1921829 -2182198 -2005079 -1310290 -679810 -337816 142164 1083802 2103422
36341 2103422 2332131 1215507 -652981 -1569295 -203183 2799239 5316538 6026727 5467044
36332 5467044 4650578 3655503 2232068 960739 845778 2071674 3818300 5086161 5326510
36323 5326510 4659490 3861686 3709429 3994972 3695483 2416645 1019807 430448 533581
36314 533581 720005 784240 736540 510380 516206 1710606 4357170 7437088 10033881 12452475
36304 12452475 15025940 16728394 16318984 14292633 12274588 10771813 8915928 6342017
36296 6342017 3931928 2471270 1704363 1029442 204491 -917273 -2489706 -4130937 -4935830
36287 -4935830 -4404639 -2949515 -1318191 69151 1107230 1727698 1776185 1031640 -509370
36278 -509370 -2261202 -3401040 -3860518 -4393765 -5276981 -5683019 -4939669 -3592392 -2448990
36269 -2448990 -1488643 -721588 -1060091 -2823203 -4254331 -3449252 -1299456 -466093 -1567371
36260 -1567371 -2550253 -2058711 -1172734 -1112104 -1333656 -1028068 -705973 -929541 -906812 191091
36250 191091 1603737 2060841 1623395 1201749 1056753 993169 1221094 1736119 1661017 709206
36240 709206 625078 3321154 7683019 9989281 7983601 3324597 -490331 -1683861 -1184053
36231 -1184053 -850222 -1450045 -2224754 -2065874 -960086 -43345 -134297 -701754 -750215 -324907
36221 -324907 -447161 -1687637 -3413221 -4454764 -4106567 -2531310 -526359 1205142 2743234
36212 2743234 4593600 6472443 7149778 6088344 4565481 4282210 5401261 7090962
36204 7090962 9598453 14151522 20408616 25427688 26259450 23013778 18505690 15183260
36196 15183260 13230196 11623462 10105935 9463642 10173225 11555569 12547254 12781163 12369221
36187 12369221 11018712 8299531 4874883 2511163 2310967 3507316 4501921 4563839 3978714
36178 3978714 3108468 2103545 1271508 991194 1290852 1933646 2767658 3687005 4561026
36169 4561026 5483639 6619364 7536729 7480459 6819955 7224433 9396258 11483021 11097556
36160 11097556 8404292 5778259 4737450 4763388 5022617 5463529 5803404 5073401 3053622
36151 3053622 1050201 389128 921290 1689174 2323321 3074288 4016187 4819232 4967971
36142 4967971 4003386 2123821 597731 645144 1691977 1858259 610107 -344166 432359
36133 432359 1955427 2326980 1356076 266945 -472240 -1419844 -2553175 -2962123 -2277003
36124 -2277003 -1124989 71621 1618284 3555327 5226379 6347386 7558341 9179570
36116 9179570 10105535 8860363 5577313 2215509 694699 1175503 2251210 2529659 1821749
36107 1821749 917039 555423 879045 1714523 2894636 4131012 4970407 5179539 4914758
36098 4914758 4328156 3444532 2728398 3151646 5002889 7052556 7770833 7177885 6583981
36089 6583981 6599710 6488650 5679074 4771351 4459361 4388703 3888870 3148531 2784403 2769800
36079 2769800 2747031 3007166 4051492 5314423 5478715 4222798 2619734 1543034 759889
36070 759889 56368 69147 1083242 1956376 1460572 108056 -644090 -631490 -1008518 -2155379
36060 -2155379 -3104161 -3308188 -3437218 -3788608 -3386467 -1702700 -68787 -56833 -1274936
36051 -1274936 -2081355 -1803096 -827265 917732 3816587 7023377 8805274 8717179 7927476
36042 7927476 7042115 5273179 2542727 807342 1902655 5025625 7740297 8892678
36034 8892678 9196713 9315869 8868506 7555585 6085753 5372166 5432520 5623017 5641020
36025 5641020 5819857 6459296 7181371 7183643 6163631 4777317 3927531 3729563 3554168
36016 3554168 2995944 2254516 1550622 896080 695754 1750449 3996286 5822482 5538802
36007 5538802 3369299 1245975 626961 1182046 1749731 1898258 2037166 2332616 2229978
35998 2229978 1300098 85955 -504163 -534304 -966681 -1974307 -2250511 -813594 1247532
35989 1247532 2063805 1624551 1668807 2962940 4240197 4220504 3202469 2013630 773681
35980 773681 -462648 -1140025 -1259972 -1728863 -2527200 -1931317 813454 3220190 2107869
35971 2107869 -2038955 -5336979 -5160327 -2701247 -628714 53563 127632 511895 1465269
35962 1465269 2782229 4102005 5243549 6319291 7226163 7375845 6578352 5740160 5740064
35953 5740064 6038768 5584500 4724283 4732406 5556807 5680912 4465830 3051324 2453834
35944 2453834 2222803 1607558 744507 4104 -620476 -768778 433947 2960840 5409890
35935 5409890 6781456 7696046 8975477 10035846 9703881 7814290 5084027 2213647
35927 2213647 -706 -565841 599316 2107345 2610619 2231921 1700535 986010 -128792
35918 -128792 -960875 -656631 624086 2323470 4438826 6604703 7213690 5205338 2115262
35909 2115262 522358 874870 1673112 2261655 3083909 3330236 1229208 -2495339 -4169126
35900 -4169126 -1805025 1895101 3112526 1784444 631520 648071 428790 -414170 -219005
35891 -219005 1590292 2901082 1996902 428887 831831 2940279 3979199 2766289 1276260
35882 1276260 1614144 3256472 4385644 4594908 4757314 4988890 4460679 3155159 2295375
35873 2295375 2657744 3580903 4062571 3850448 3005891 1427283 -488458 -1585540 -1221186
35864 -1221186 -198562 350751 435979 738640 1272038 1550818 1722748 2405460 3492737
35855 3492737 4153300 4072729 3781067 3642491 3421576 3068737 3052120 3491031 3670661 2940244
35845 2940244 1595447 356728 -654595 -1847583 -3211577 -3979896 -3423562 -1729593
35837 -1729593 161494 1550833 2518138 3305762 3553124 2738864 1273299 337695 361842
35828 361842 404337 -474330 -1893474 -2842014 -3100377 -3167584 -3141473 -2502379 -898240 1398954
35818 1398954 3573840 4399990 2931001 -149285 -2448084 -2194907 -325588 785314
35810 785314 341590 -298226 174553 1611228 3272539 4726872 5497417 5010352 3512864
35801 3512864 2221762 2044372 2744867 3597953 4126465 3984018 2956833 1467185 441820
35792 441820 414582 1241448 2594387 4000658 4661280 4331740 4183695 5400248 6984835
35783 6984835 6700629 4480687 3004590 4146518 6676543 8501684 9334212 9700951 9077153
35774 9077153 7048087 5133713 5233257 6839489 7791810 7377073 6680722 6091225 4659571
35765 4659571 2311073 732946 1178174 2710129 3484790 2866525 1632457 883414 1327291
35756 1327291 2915333 4573377 4814758 3180345 795191 -797038 -1065908 -625173 -317829
35747 -317829 -366201 -195994 949033 3048593 5131421 6316641 6698522 6775563 6441110
35738 6441110 5256024 3457902 1919980 1204741 1286242 1972007 2855809 3098400 2134194
35729 2134194 490920 -852556 -1637922 -1954055 -1170678 1302451 4256376 5305070 3714248
35720 3714248 1263048 -212972 -748798 -1026070 -734621 523682 1704654 1266442 -668392
35711 -668392 -2350730 -2559565 -1735586 -900982 -290672 641186 2304202 4327776 5731409
35702 5731409 5756907 4598289 3180692 2259727 2060147 2699772 4282359 6322257 7705194
35693 7705194 7662368 6406430 4568470 2541553 660926 -644789 -1399700 -2228598 -3402366
35684 -3402366 -4214718 -3896898 -2738344 -1694082 -1227389 -1140541 -1241945 -1530403 -1859141
35675 -1859141 -1938036 -1609186 -857645 181636 984149 867633 -124504 -985676 -802206
35666 -802206 348281 1813245 2999252 3208921 1826903 -465404 -1516170 38566
35658 38566 2824537 4216584 3388747 1635534 11864 -1747637 -3809503 -5290386 -5386055
35649 -5386055 -4430426 -3230462 -2139290 -1270334 -852748 -821707 -672460 -223381 -20166
35640 -20166 -575184 -1653970 -2607372 -2950429 -2444036 -1197775 127034 895225 1480888
35631 1480888 2898401 5196434 7131377 7868158 8029495 8402707 8586663 7900407 6867028
35622 6867028 6581596 6980128 6919378 5929806 4909029 4957514 6257401 8185161 9882581
35613 9882581 10619534 10189693 9150061 8308910 7896723 7486003 6602037 5084156 3050899
35604 3050899 967027 -392729 -534849 207786 1023715 1392157 1280951 899101 570497
35595 570497 462427 128372 -1048085 -2469008 -2283276 274460 3273277 4164340 2957795
35586 2957795 1781869 1636345 1514183 853170 709119 1702461 2719157 2845707 2915025
35577 2915025 3631352 3671443 1638540 -1085309 -1654591 432680 2915803 4143058 4827672
35568 4827672 6035032 7335202 7881518 7875675 7843519 7449296 6105076 4061935 1935516
35559 1935516 -262576 -2610669 -4189684 -3623471 -837904 2398227 3932103 3020923
35551 3020923 775833 -908954 -967867 86971 1070614 1628873 2330201 3293157 3652748
35542 3652748 2919917 2067897 2370405 3607392 4362448 3883905 2738194 1692754 885619
35533 885619 241781 -134636 -295364 -518325 -749112 -586655 -144859 -273372 -1393097
35524 -1393097 -2599842 -2559754 -1064934 814552 1934841 1947251 1179321 301067 121148
35515 121148 1048032 2467216 3150836 2699649 2205744 2898783 4290226 4423893 2272963
35506 2272963 -716206 -2105928 -1205371 459046 1442255 2220528 4122595 7041084 9202320
35497 9202320 9218844 7542595 5570830 3964003 2424736 797719 -339033 -331864 730625
35488 730625 2162883 3483674 4746916 6004100 6722404 6109816 4095829 1710826 255294
35479 255294 205244 1106909 2332645 3545261 4463561 4670902 3941820 2529706 889819
35470 889819 -713660 -2086210 -2784951 -2383513 -1187207 -311449 -628404 -1656488 -1872707
35461 -1872707 -329714 2252704 4216444 4566587 3585125 2195593 1343609 1858705 3989569
35452 3989569 6693511 8153911 7628012 6229724 5271963 4524662 3078223 1325558 651284
35443 651284 1268259 1911826 1980665 2345815 3202554 2719028 -548897 -4808591 -6533580
35434 -6533580 -4742226 -2094731 -1364663 -2306291 -2812781 -1980997 -770367 -159467 32772
35425 32772 338530 597233 244537 -754395 -1755020 -2177399 -2093848 -1988210 -2147296 -2511939
35415 -2511939 -2996886 -3513232 -3520960 -2116597 765342 3428447 3569484 713659 -3064205
35406 -3064205 -5253418 -5254847 -4185041 -3011008 -1855839 -880347 -591121 -884682 -793571
35397 -793571 106113 771048 50842 -1574300 -2710073 -3213947 -4282329 -6144125 -7080290
35388 -7080290 -5668491 -3055168 -1738409 -2469500 -3590948 -3451198 -2297653 -1354250 -966608
35379 -966608 -460006 560640 1528670 1606369 697675 -394142 -825806 -715991 -1044882
35370 -1044882 -2251019 -3207186 -2323325 245593 2351963 2359977 1231350 1239218 2927791
35361 2927791 4445331 4121623 2683950 2077372 2606506 2428735 146150 -3082111 -4838102
35352 -4838102 -4324528 -2879605 -1778754 -875841 112050 336626 -980251 -2922299 -3848569
35343 -3848569 -3547470 -3061838 -2747702 -2135323 -1561339 -1977279 -2812553 -2112586 352485
35334 352485 2149906 1634307 368112 316946 497090 -1057163 -3312253 -3332181 -953242
35325 -953242 807401 435031 42739 1696098 4167404 5032210 4104917 2948970 2314213
35316 2314213 1864740 1532275 1494761 1434664 1145303 1173471 1619207 1222144 -792057 -2786479
35306 -2786479 -2551899 -636328 185319 -1268702 -3305313 -4230352 -4545986 -5429931 -6615102
35297 -6615102 -6991167 -6347193 -5415563 -4757559 -4447306 -4428958 -4512472 -4323208 -3704422 -2884320
35287 -2884320 -2072784 -1382109 -1205771 -1891182 -2859435 -3015479 -2397155 -2344236 -3431231
35278 -3431231 -4356806 -3816098 -2491487 -1987699 -2490789 -2778556 -2164704 -1247661 -962300
35269 -962300 -1865558 -3979623 -6299062 -6966137 -5273311 -3099627 -2812117 -3987570 -4022366
35260 -4022366 -2011859 89097 740216 1078563 2617012 4411520 4253764 1674525 -1772634
35251 -1772634 -4459027 -5596422 -5091830 -3987599 -4262176 -6542534 -8674431 -8344976 -6471997
35242 -6471997 -5794417 -6484157 -5885562 -3004591 -404221 -310014 -1289491 -828664 603454
35233 603454 525658 -1495460 -3219510 -2951869 -1308454 359613 1515586 2086536 2120671
35224 2120671 2261981 3232533 4359386 3912621 1532870 -900637 -1608673 -995365 -458263
35215 -458263 -209447 396769 1129831 1085047 405124 231382 707464 480829 -1138065 -2710057
35205 -2710057 -2425427 -622680 642873 294601 -670101 -897600 -382675 83401 302534
35196 302534 619903 921167 695875 165938 504407 2499595 5429421 7665112 8231317
35187 8231317 7585398 7034293 7461359 8347878 7983581 5097980 569259 -2903375 -3332253
35178 -3332253 -1495546 -30807 -552212 -2130212 -2741983 -1806044 -841715 -1595363 -3892118
35169 -3892118 -5788177 -5857955 -4747469 -4015371 -3926726 -3267321 -1243396 1421391 3530915
35160 3530915 4635822 4764108 3864201 2295165 1164724 1219809 1798327 1758539 1104482
35151 1104482 753707 956180 1031304 691905 576685 1177854 2086728 2698835 2996668 3173750
35141 3173750 2974895 1933129 81122 -1928404 -3417134 -4287897 -4978713 -5700364 -5831470
35132 -5831470 -4550903 -2175845 -175883 546426 646522 1011945 1322396 921913 304419
35123 304419 321034 454784 -432272 -1841138 -1990823 -642837 326363 -173227 -753140
35114 -753140 182014 1966077 2818607 2352179 1508611 792053 54673 -389508 123207
35105 123207 1392671 2340236 2318619 1664441 905897 113591 -805978 -1617600 -1747804 -733850
35095 -733850 1163429 2855239 3388526 3015176 2695167 2606095 2128776 1422023 1660571
35086 1660571 3082935 4110465 3421918 1829414 921016 761582 261588 -918050 -2254394
35077 -2254394 -3567237 -4790105 -4880087 -2615140 1365485 4619736 5301008 3632470 1015229
35068 1015229 -1323344 -2714812 -3056573 -2733473 -2068655 -1003693 215508 641057 -176325
35059 -176325 -1136667 -884730 249567 790226 176727 -1034604 -2584082 -4480680 -5752596
35050 -5752596 -5036273 -2618926 -284934 1084353 2088261 2728229 1719780 -1281062
35042 -1281062 -4430414 -5789507 -5507725 -5075888 -5545501 -7198042 -9633499 -11262646 -10063559
35033 -10063559 -6050864 -1920790 -71560 13200 259466 1041821 1312861 887200 767486
35024 767486 1345059 1821979 1658204 1488884 2209639 3719801 4826430 4308246 2301054
35015 2301054 574410 680293 1720533 1136284 -1780252 -4552627 -4684744 -2814221 -1292421
35006 -1292421 -811232 -327105 423308 525922 -81140 -200582 620175 1323707 1134612
34997 1134612 780926 1302341 2650115 3959096 4350464 3201213 638885 -1896136 -2667593
34988 -2667593 -1725705 -996357 -1770636 -3109902 -3411743 -2561021 -1587815 -967534 -375034
34979 -375034 314128 893803 1546620 2651010 3761573 3731164 2274165 704224 451662
34970 451662 1214922 1394086 374847 -544137 -117422 669738 -364209 -3378547 -5682076
34961 -5682076 -4849226 -1660880 1083123 1903481 1482454 715499 -310792 -1213856 -906365
34952 -906365 816878 2424777 2400329 1084499 -192274 -1138045 -2451312 -4076038 -4834755
34943 -4834755 -4012016 -2250506 -456533 1272282 2967429 3816520 2972249 1155537 354074
34934 354074 1566610 3595502 4549423 3938272 2719487 1858119 1639423 1953695 2248360
34925 2248360 1467936 -728448 -2697898 -2192439 586128 2775704 2526040 1465412 2171332
34916 2171332 4345294 5359470 4072097 2094385 1147276 1003484 690158 217199 75055
34907 75055 9433 -539020 -1197305 -828784 1091366 3837050 6173980 7381216 7511865
34898 7511865 6902518 5656046 3795119 1875118 929740 1389998 2426954 2937601 2887475
34889 2887475 2980735 3246400 2877387 1541439 19756 -686400 -264328 997206 2549424
34880 2549424 3762123 4443829 5198381 6472645 7330948 6365676 4063149 2865080 4096902
34871 4096902 6033784 6138035 4292810 2453208 1710169 1335841 677965 342868 874263
34862 874263 1460250 910083 -715521 -2314502 -3184888 -3416398 -3132582 -2385057 -1855942
34853 -1855942 -2500915 -3925460 -4142718 -1968551 1056824 2446752 2053530 1978421 3195854
34844 3195854 4109837 3132306 1009663 -500535 -808273 -77956 1857031 4404780 5336420
34835 5336420 3279165 339192 -195205 1586740 2528278 1295511 137619 1015619 2649879
34826 2649879 2870329 1775663 815009 343849 -77004 -110746 836721 2229484 2982238
34817 2982238 2863968 2215595 1041981 -465525 -1344232 -1086077 -701935 -1243795 -1993674
34808 -1993674 -1609231 -516673 -513066 -2102345 -3664788 -3455635 -1433605 1008292 2419964
34799 2419964 2443294 2076045 2530687 3584852 3840069 2976011 2463642 3189631 3826802
34790 3826802 2958041 1476123 1054758 1343758 831926 -286251 -474235 322047 647481
34781 647481 263460 421888 1116195 520443 -2040567 -4679123 -5483836 -4703711 -3480189
34772 -3480189 -2116738 -667501 300535 674493 1195458 1860879 1316932 -945405 -3056136
34763 -3056136 -2830062 -458717 2107741 3647237 4320202 4570679 4628679 4669536 4511009
34754 4511009 3605848 2034277 768688 219907 -468238 -1635130 -1686770 1029165 5572178
34745 5572178 9141280 10078993 8780866 6089209 2544138 -721704 -2108460 -1303253
34737 -1303253 158198 761174 735042 1364435 3113572 4969839 5458862 4084321 1901407
34728 1901407 660435 1174384 2613068 3567735 3503496 2868831 2247394 1993556 2319312
34719 2319312 2946947 2851819 1204812 -1362488 -3174778 -3368898 -2682611 -2142609 -1621450
34710 -1621450 -271749 1888685 3491187 3187803 1259810 -551778 -905950 -135006 655836
34701 655836 1240876 2214484 3524631 4206982 3854566 3318083 3414939 3830057 3908646 3677529
34691 3677529 3366724 2791156 2068730 2057825 2971195 3363131 1884226 -508037 -1621328
34682 -1621328 -1036624 -460856 -1063409 -2039599 -2159684 -1309338 81130 1881875 3742310
34673 3742310 4653334 3877685 1802236 -638784 -2811305 -4258804 -4495777 -3595708 -2502161
34664 -2502161 -2141362 -2496541 -2912000 -2938945 -2573987 -2091568 -1951526 -2436393 -3097905 -3037127
34654 -3037127 -2001181 -661798 470299 1716732 3333656 4605122 4572537 3334092
34646 3334092 1984143 1441471 1759022 2298033 2136553 616136 -2008449 -4648752 -6434847
34637 -6434847 -7334634 -7400961 -6065572 -3008101 644574 3009579 3434916 3052331 3200825
34628 3200825 3953412 4424877 3928931 2453275 427586 -1497522 -2595687 -2405682 -1085742
34619 -1085742 600462 1734065 1902990 1594161 1716674 2418439 2589593 1100718 -1454753
34610 -1454753 -2904864 -1737137 1217440 3708446 4329133 3435295 2175827 1339313 1160035
34601 1160035 1531989 2038934 2182476 1941054 1816495 2036552 2088105 1490937 686253 496878
34591 496878 885864 1067767 934089 1480419 3358332 5681479 6908232 6488964 5045188
34582 5045188 3325828 1745905 725697 589700 990649 1140155 897416 1103536 2469557
34573 2469557 4451482 5579472 4797314 2322670 -657667 -2949289 -4074548 -4273725
34565 -4273725 -4032883 -3731678 -3542260 -3309420 -2644299 -1665918 -1550168 -3415133 -6378628
34556 -6378628 -7824495 -6384758 -3702816 -2190558 -1983187 -1601144 -837754 -906680 -1869076
34547 -1869076 -2193696 -1446502 -1317009 -2868030 -4536878 -4336825 -2704616 -1581566 -1685378
34538 -1685378 -2292084 -2881084 -3291345 -2888045 -1419142 -349244 -1433934 -4001715 -5525884
34529 -5525884 -5082227 -4298114 -4365916 -4180366 -2598507 -760970 -401423 -965339 -397581
34520 -397581 1617271 3121889 2786046 1664572 1325975 1467503 540797 -1811756 -4107745
34511 -4107745 -4835399 -4045905 -2862820 -2098429 -1880500 -2138746 -2629886 -2609602 -1455512
34502 -1455512 40450 -85173 -2586151 -5390406 -5457621 -2245101 1637769 3427166 2885736
34493 2885736 1529002 257367 -1005501 -1730402 -450320 3247048 7291501 8824394
34485 8824394 7206407 4433714 2458239 1125598 -602900 -2336355 -2524747 -861787
34477 -861787 1001291 1605495 1437206 1819262 2976857 4170311 5062713 5767892 5842873
34468 5842873 4430753 1500573 -1926022 -4847786 -6826679 -7539146 -6762457 -4979226
34460 -4979226 -3122095 -1487078 293230 2038915 2818101 2412571 2018450 2734549 4016190
34451 4016190 4389766 3239930 1219297 -682527 -1758168 -1600887 -312809 1291034
34443 1291034 2215457 2116056 1403683 669858 208042 -124490 -776466 -1988701 -3281660
34434 -3281660 -3813552 -3353581 -2404415 -1242059 461749 2761649 4967224 6553264 7802230
34425 7802230 8930011 9324579 8436821 6752991 5003854 3062713 668219 -1347915
34417 -1347915 -1822360 -933687 126548 945699 2048643 3311593 3583022 2176101 -306149
34408 -306149 -2813049 -4534390 -4769365 -3372289 -1512679 -741049 -1099895 -1500572 -2074160
34399 -2074160 -4246571 -7788984 -9814864 -8161373 -4273461 -1147220 302391 1055281
34391 1055281 1361421 573978 -918460 -1854060 -2188245 -3007373 -4160361 -3965600 -1849617
34382 -1849617 480998 1319407 966754 632912 666367 836179 1203953 1649310 1486152
34373 1486152 590827 22349 451922 898347 346032 -169232 1238765 4316866 6580056
34364 6580056 6428790 4945256 4106375 4384427 4831033 4682883 4000623 3081636 1986928
34355 1986928 697698 -577883 -1360473 -1249359 -465658 150315 65346 -163927 473139
34346 473139 2105612 3835869 4846405 4936616 3955063 1675313 -1319962 -3461037 -3637616
34337 -3637616 -2412855 -1279781 -1194892 -2361713 -4719432 -7594341 -9295779 -8439582 -5866083
34328 -5866083 -4041718 -4061037 -4344379 -3132014 -1233409 -843850 -2078545 -2532920 -811233
34319 -811233 1136724 545085 -2277260 -4357295 -4133882 -3183594 -3272579 -3521462 -2081159
34310 -2081159 456046 1408319 -255729 -2346359 -2231870 156320 2901444 4559260
34302 4559260 4925926 4101277 2174502 -157353 -1669621 -1680927 -688819 129765 -146937
34293 -146937 -1527609 -3047924 -3584607 -3014030 -2233975 -1811663 -1300603 -466947 -351773
34284 -351773 -1957128 -4336228 -5377862 -4488332 -3214162 -3014738 -3680893 -4342319 -4759004
34275 -4759004 -4906906 -4371550 -3061662 -1738941 -1001105 -453715 304077 688455 165112
34266 165112 -446127 16609 1181112 1625998 1032983 459560 417170 102014 -1038385
34257 -1038385 -2200769 -2371865 -1706664 -1108946 -1134902 -1917876 -3503169 -5480976 -6683918
34248 -6683918 -6002739 -3478390 -312048 1975068 2318407 748748 -1250886 -1622903 313022
34239 313022 3086075 4795316 5174278 5223541 5218462 4221596 1748555 -1036119 -2411121
34230 -2411121 -2051530 -1444157 -2372558 -5087925 -7928026 -8803090 -7179931 -4492876 -2540134
34221 -2540134 -1861406 -1962328 -2507339 -3408589 -3976073 -3131611 -863949 1335097 2030287
34212 2030287 1276134 -9199 -1466219 -3237929 -4809308 -4966582 -3243825 -782840
34204 -782840 704840 569790 -470487 -1399174 -1883777 -2255381 -2867511 -3631795 -4067558
34195 -4067558 -3732061 -2708210 -1743396 -1754306 -2953361 -4433448 -4835827 -3613688 -1582565
34186 -1582565 -102149 218578 -141248 -461622 -623550 -941537 -1418349 -1560707 -999256
34177 -999256 -8086 772894 945256 480181 -509266 -1668599 -2172879 -1309008 370296
34168 370296 1102790 -165899 -2241333 -2865122 -1348347 810220 1947209 1854580 1065751
34159 1065751 -325654 -2244550 -3820881 -4155294 -3624885 -3458128 -4152247 -5181397 -6099262
34150 -6099262 -6882684 -7135311 -6098081 -3928189 -2103699 -1869313 -2692106 -2769029 -897298
34141 -897298 2325500 4914868 5153420 3274791 1400052 1218581 1957113 1574388 -201875
34132 -201875 -1425136 -797165 576065 1119328 1008427 1127222 967977 -687516 -3548835
34123 -3548835 -5932757 -6837968 -6397332 -4557132 -1173723 2354190 3437060 1177391
34115 1177391 -2321681 -4317325 -4100283 -2728967 -1330197 -592124 -860668 -1544565 -1165748
34106 -1165748 833664 2925123 3262949 2016385 630618 -657588 -2761748 -5217429
34098 -5217429 -5723240 -3131505 498934 2070172 869963 -1284174 -2674769 -3114336
34090 -3114336 -2962575 -2171565 -812138 417866 966249 1235962 1934440 2809380 2669936
34081 2669936 786849 -2087609 -4266781 -4574810 -3250684 -1617172 -937776 -1465468 -2445623
34072 -2445623 -2932117 -2542060 -1557304 -615017 -386283 -1190668 -2619778 -3778487 -4230189
34063 -4230189 -4483573 -5171680 -6030803 -6264552 -5741980 -5131744 -4862264 -4654329 -4101338
34054 -4101338 -2908960 -535377 3269800 7163825 8674574 6881578 3767980 1959503
34046 1959503 1934603 2500830 3026315 3575364 3500497 1978991 -7699 -255687 1503474
34037 1503474 2762577 1468482 -1349053 -3262323 -3537146 -3265805 -3361862 -3871940 -4755833
34028 -4755833 -5947065 -6795816 -6613790 -5755282 -5203978 -5130889 -4838011 -4242593 -4454523
34019 -4454523 -6390465 -9285198 -10997344 -9763652 -5742973 -1048522 1888497 2283171
34011 2283171 1336626 699358 1025959 2014939 2992831 3060499 1622514 -470849 -1195957
34002 -1195957 237204 2066474 2245687 1156903 447139 -55006 -1938892 -4804760 -5905046
33993 -5905046 -4135722 -2088094 -2487080 -4323571 -4573787 -2632153 -730678 -334158 -358299
33984 -358299 695105 2640442 4334228 5134367 4836263 3237498 716343 -1482915 -2494832
33975 -2494832 -2932219 -3898152 -5230867 -5677438 -4790675 -3729963 -3777399 -4626415 -4718319
33966 -4718319 -3177579 -1020867 -276541 -1928873 -4793308 -6541100 -5921814 -3871838
33958 -3871838 -2336899 -2254174 -3027719 -3740165 -4148957 -4284065 -3797516 -2402742 -682074
33949 -682074 210386 -338868 -1981483 -3940837 -5465000 -5939851 -5298072 -4371362 -4091375
33940 -4091375 -4153002 -3243958 -950864 1347793 2061729 1198506 -93824 -1184797 -2230275
33931 -2230275 -3135174 -3332564 -2722916 -2037034 -1988251 -2550122 -3246136 -3767944 -4188104 -4831926
33921 -4831926 -5899975 -6933454 -6867136 -5142271 -2717198 -1444391 -2341574 -4764534 -7151455
33912 -7151455 -8174476 -7370261 -5288690 -3080772 -1462869 -63728 1807317 3859833
33904 3859833 4814167 3700155 815693 -2433422 -4308665 -3827343 -1757744 -133643
33896 -133643 -24753 -302494 411573 1281823 342483 -2320499 -4466224 -4937264 -4868087
33887 -4868087 -5019081 -4190617 -1710963 486649 329906 -1206588 -1654916 -930536 -1160742
33878 -1160742 -2850119 -3739858 -2088259 947824 3183328 4096519 4504612 4724448 4404320
33869 4404320 3619771 2965213 2696867 2547384 2259477 1714719 728121 -637462 -1613033
33860 -1613033 -1237262 456292 2171036 2546883 1474022 70875 -474008 142675 1369344
33851 1369344 2423456 2803247 2479916 1831438 1275264 831403 235457 -424998 -647188
33842 -647188 -459517 -878205 -2621424 -4694920 -5281670 -3987348 -2129603 -757141 283749
33833 283749 961459 322327 -1847313 -3928342 -4447274 -4246363 -5114920 -6834950 -7319918
33824 -7319918 -5616875 -3188975 -1935136 -2186466 -2986329 -3267718 -2428085 -758646 332613
33815 332613 -484832 -2562439 -3424130 -1396968 2501607 5687103 6401505 4694364 1823399
33806 1823399 -719961 -2106557 -2676749 -3334640 -4241216 -4537838 -3547805 -1727168 -181841
33797 -181841 292381 -414826 -1678014 -2325792 -1645599 -443606 -284597 -1365809 -2101907
33788 -2101907 -1341926 16795 437677 -149735 -719481 -903311 -1093202 -1215225 -817779
33779 -817779 -352916 -977231 -2692002 -3847473 -3169601 -1442390 -401005 -532452 -825960
33770 -825960 -386609 616942 1620994 2418333 2889158 2638637 1520067 208527 -394114
33761 -394114 -274464 -279091 -963918 -2042942 -3043188 -3801944 -4066451 -3410481 -2115439
33752 -2115439 -1406033 -1978354 -2820375 -2440404 -882673 516692 1080701 1269357 1300169
33743 1300169 694443 -497939 -1341832 -1472620 -1779003 -2924342 -4211620 -4766787 -4925317
33734 -4925317 -5405394 -5833779 -5306391 -4048932 -3359570 -3923193 -5032385 -5492465 -4677020
33725 -4677020 -2827579 -955689 -277634 -1031823 -1949740 -1604715 -246291 417770 -665112
33716 -665112 -2640517 -3761322 -3137543 -1314692 466364 1399533 1753045 2434467 3756987
33707 3756987 4831089 4533960 2901100 1103077 156494 127918 517463 882981 1036390
33698 1036390 1078258 1326055 1889193 2367950 2348157 2061643 2012689 1994832 1166474 -658226
33688 -658226 -2360064 -2601484 -1347912 -1524 -64642 -1723177 -3643719 -4253323 -3456549
33679 -3456549 -2928398 -4237837 -6728025 -7940393 -6446943 -3642902 -2102643 -2528864
33671 -2528864 -3196839 -2464157 -873524 -111122 -500999 -637538 456878 1902531 2260203
33662 2260203 1422047 343310 -473682 -1043477 -796885 1036638 3646261 4710016 3118528
33653 3118528 599914 -370515 496324 1528862 1604643 1121551 715167 359148 -22486
33644 -22486 -87064 329144 786935 785388 285609 -546101 -1705472 -3155633 -4434411 -4646834
33634 -4646834 -2982745 429083 4073454 5991159 5599597 4140886 2921821 1823492
33626 1823492 314286 -881846 -535486 969510 1827139 1341228 876411 1783426 3592564
33617 3592564 4942768 5221015 4445275 2514456 -274748 -2574167 -3072906 -2077702 -1061831
33608 -1061831 -764019 -678857 -445748 -693323 -1987184 -3563318 -3793681 -1880480 1194617
33599 1194617 3436188 3523741 1857995 -9984 -1005883 -1442641 -2134386 -2869332 -2398563
33590 -2398563 -183591 2390867 3219223 1848190 73942 -19689 1837419 4219373 5678311
33581 5678311 5708374 4449401 2432852 800484 879164 2894771 5514942 7235560 8002834
33572 8002834 8970707 10798715 12753237 13675909 13541853 13701147 15407218 18292683 20857154
33563 20857154 22675568 25323812 30262862 36471214 41627209 45408706 49736876 55304062
33555 55304062 59876001 61270224 60326838 59212169 58092361 55564099 51526088 47316796
33547 47316796 43307803 38643468 33499958 29428844 26959507 24828928 22297290 20356381
33539 20356381 19638620 18824832 16501482 13400588 11435569 11337779 12366983 13538449 14002831
33530 14002831 13010768 10807944 9026557 8917522 9590350 9272921 7981776 7417394 8097002
33521 8097002 8171212 5919128 2372773 275941 780762 2323842 2974075 2849643 3384324
33512 3384324 4823597 5749601 5179026 3815016 2599727 1277095 -467450 -1495423
33504 -1495423 -564096 1244231 1305890 -1110996 -3758825 -4242509 -2680005 -999409 -654264
33495 -654264 -1602056 -2705873 -2705796 -1462726 -351698 -643212 -1697631 -1942694 -1355710 -1239036
33485 -1239036 -1503550 -339233 2683566 5185497 4824172 2035242 -1107350 -3207299
33477 -3207299 -3622974 -1936376 1114312 3501178 4248283 4803945 6687644 8963617 9621400
33468 9621400 8450588 6959620 6264371 6490339 7461027 8620542 9006374 8410947 7731685
33459 7731685 7400343 6844248 6357048 7624747 11152633 15220443 18873866 23764008 31544255
33450 31544255 42172080 56425264 76556332 102712717 134468183 179585436 252263020
33443 252263020 350894584 441124277 476245986 440194729 362176349 285130263 228681257
33436 228681257 187522662 153790656 127350038 108058069 91483079 75256877 62091833
33429 62091833 53989318 48767789 44002117 39756455 36000083 31625809 27427491 25943758
33421 25943758 26785407 25969608 21579928 16391672 13055353 10474088 7360424 5697564
33413 5697564 7336839 9992373 10366695 9366655 10408805 13602881 15361211 13639166
33405 13639166 10277900 7676102 5912400 4138904 2707720 2609348 3969568 6023047
33397 6023047 7822115 8506685 7687571 5977973 4445299 3296574 1885735 205569
33389 205569 -647580 -28907 1101569 1346472 629168 -29545 -161532 -361099 -1043905
33380 -1043905 -1458894 -464196 1960002 4466646 5686620 5491363 4731301 4053361 3471123
33371 3471123 3013854 3086188 3785536 4387615 4203797 3747454 4250505 5897509 7348123
33362 7348123 7521748 7207334 7990595 9791071 10575338 8961137 6264513 5107695 6383469
33353 6383469 8518231 9608365 9207145 7730625 5275525 2035594 -696691 -1204579
33345 -1204579 749945 3395973 4612011 3773045 1919377 553084 397218 957111 1123784
33336 1123784 399877 -518407 -639305 79030 917612 1610100 2477554 3270040 2974889
33327 2974889 1402302 63480 486452 2177785 3331539 3295216 3118267 3549190 3775208
33318 3775208 2864653 1578112 1687118 3705254 6132032 7064039 6055549 4276497 3232273
33309 3232273 3516928 4594543 5573641 6097040 6349448 6271131 5287510 3204947 913587
33300 913587 -564532 -1555596 -3282822 -5690544 -6741347 -4708516 -599706 2687485
33292 2687485 3513212 3000262 3382139 5582878 8567876 10414774 9802875 7099428 4325322
33283 4325322 3472925 4448032 5193108 4211346 2228373 711302 -344250 -1826826 -3245723
33274 -3245723 -2925586 -784459 931992 761833 314920 1738802 3931359 3529600 -431027
33265 -431027 -4983015 -6845251 -5737226 -3398888 -1263843 -376372 -1804910 -5151843
33257 -5151843 -7763281 -7491256 -5570936 -4776686 -5366692 -5187144 -3500473 -2065231 -2083324
33248 -2083324 -2634075 -2880804 -3370210 -4086323 -3674452 -2090046 -1670853 -3612707 -5446031
33239 -5446031 -4356076 -1324220 584667 665762 528194 687274 285687 -268894 511814
33230 511814 2281043 2924866 1872649 731927 191391 -1031605 -3323029 -4758030 -3803120
33221 -3803120 -1489771 247061 714244 6339 -1847262 -4207570 -5794987 -6260558 -6437645
33212 -6437645 -6512679 -5731308 -4526071 -4752009 -6711091 -8060812 -7109196 -5281807 -4723443
33203 -4723443 -5179880 -4985632 -3691905 -2063509 -758416 -440806 -1765223 -3808076 -4097549
33194 -4097549 -1785025 823631 1530041 1230515 1745672 2619673 2567246 2478296 4090926
33185 4090926 6672895 7834304 7124382 6388309 6930092 8358410 9704318 9884849 7976568
33176 7976568 4934742 3890457 6621208 10894519 13395439 13852282 14179702 15586459
33168 15586459 19058308 26142331 36280864 47094592 61823419 91274841 139011291
33161 139011291 186374107 203839313 181218129 138542748 103003218 82987505 70040994
33154 70040994 57497432 46796093 39265453 32466914 25667491 21544474 20691312 19781345
33146 19781345 16798816 13729012 12519045 12116249 11119385 10190856 10133826 10076730 9163747
33137 9163747 8182803 8260125 9331581 10602197 11228921 10377868 8137307 6306396 6466997
33128 6466997 7430043 6715529 4434284 3183701 3934817 4831421 4696246 4792087 5861770
33119 5861770 6205999 4567978 2662667 2690491 4072576 4832140 4793819 5102248 5612164
33110 5612164 5188190 4051737 3477261 3321634 2167328 179054 -465840 1117419 2732890
33101 2732890 2062055 35059 -562757 839481 1931868 1067369 -413710 -376287 955324
33092 955324 1570585 803470 233526 1341113 3649811 5680121 6643842 6574491 5732318
33083 5732318 4672752 4230279 4702957 5552736 6367529 7349710 8317038 8243344 6701926
33074 6701926 4839258 3806129 3068798 1605744 71229 165052 2133571 4379891 5471757
33065 5471757 5246787 4092351 2513469 1332211 895981 139639 -2012742 -4305420 -4118112
33056 -4118112 -1292487 950724 74263 -2365643 -2959758 -1069149 669145 215050 -1303985
33047 -1303985 -1505133 15581 1548271 1970373 2208290 3404034 4655292 4005848 1487440
33038 1487440 -483553 -312623 688185 500397 -637927 -1005995 -192235 648899 756658
33029 756658 202723 -1187174 -3372794 -4743525 -3423141 -268192 1500300 345514
33021 345514 -1714091 -2061606 -548379 1403983 3093719 4529363 5339422 5164424 4463938
33012 4463938 3848619 3217646 2374017 1723444 1539808 1362582 961430 981096 1649823 1790888
33002 1790888 376725 -1609261 -2184217 -878311 896062 1712046 1346992 362035 -568724
32993 -568724 -971474 -890040 -730932 -402267 755892 2569650 3503845 2699456 1754486
32984 1754486 2863220 5501733 6735026 5024435 2054924 159057 -533011 -1251538
32976 -1251538 -2070442 -1854185 -380479 1049036 1489710 1668272 2639961 3906133 3971297
32967 3971297 2557111 1089948 653158 449998 -948409 -3471727 -5584575 -6167709 -5529017
32958 -5529017 -4662178 -4264977 -4470557 -4884590 -4879016 -4339353 -3899881 -3896136 -3601678 -2445322
32948 -2445322 -1474485 -2209491 -4168858 -5049121 -3606261 -982980 1137522 2258636 2480802
32939 2480802 1710223 305397 -730974 -1110809 -1756109 -3145081 -4320898 -4478733 -4361544
32930 -4361544 -4891404 -5401687 -4567726 -2417512 -172597 1397404 2350619 2772959 2641756
32921 2641756 2122159 1194478 -479875 -2549739 -3572344 -2614936 -646313 614699 607291
32912 607291 -167502 -1242968 -2069132 -1759409 -393739 214403 -1342146 -3777346 -4672212
32903 -4672212 -3812781 -3056461 -3143768 -2819327 -1411942 -191442 -287970 -877297 -534990
32894 -534990 718751 1809035 2304456 2698551 3300783 3641954 3075764 1687903 455979
32885 455979 300189 895594 864493 -552047 -2550215 -3890667 -4243587 -3801955 -2472468
32876 -2472468 -483699 989130 1080660 536841 515607 786749 627885 771275 2450939
32867 2450939 4847475 5683007 4460686 2957681 2178597 1109609 -740871 -1843617
32859 -1843617 -1050459 306464 303959 -879352 -1655371 -1370218 -541119 352407 914693
32850 914693 423629 -1219292 -2679134 -2627870 -1526031 -749100 -466119 208632 1320701
32841 1320701 1925887 1850280 2043674 2783685 2932180 1754896 380316 347035 1322580
32832 1322580 1519410 319822 -695752 188546 2633055 4952640 6418806 7634327
32824 7634327 8717931 8593693 6735792 4402638 3060587 2481137 1699701 1137270 2067725
32815 2067725 4185131 5516651 5149247 4518603 5308086 7288353 9044579 9893322 10245112
32806 10245112 10782264 12065847 14440349 17628889 20720852 22966706 24244733 24549296
32798 24549296 23603485 21342417 18361957 15642502 14067012 13924312 14190567 12712893
32790 12712893 8400486 3231902 656317 1693566 4004995 5169888 5210189 5168049 5048443
32781 5048443 4580826 4555930 5648203 6841622 6756348 5916288 6006244 7267058 8329977
32772 8329977 8568423 9029187 10764090 13442506 15854833 16787277 15340857 11590351 7261473
32763 7261473 4662344 4385335 4832362 4414905 3357096 2746211 2698023 2503972 2124597
32754 2124597 2260493 2810310 2502293 844227 -470561 538338 3089825 4105621 2235356
32745 2235356 -89039 220930 2908519 5113112 5353811 4784771 4600892 4239729 2746832
32736 2746832 373076 -1906690 -3306122 -3186518 -1346346 1141079 2596943 2709840
32728 2709840 2602491 2659179 1969399 470691 -346127 71268 98417 -1308332 -2398694
32719 -2398694 -1114486 1556007 2812560 1749599 -132431 -1388219 -1620131 -566421
32711 -566421 1713029 3872582 4399497 3858992 4436098 6920326 9390837 9305755 6156250
32702 6156250 1907112 -740757 -710269 533169 909592 567737 1554489 4410696 6995537
32693 6995537 7588262 7095347 6819398 6268150 5114701 5133598 7712247 11365420 14311476
32684 14311476 17388872 21424709 24266962 24595793 26525534 35538543 51904151 74118849
32676 74118849 106495913 153550092 204917831 235935234 230293163 197018700 159256616
32669 159256616 131131992 112176913 99327236 93507533 93585180 92812293 85704649 74068331
32661 74068331 63045441 54466486 46906989 39681059 33742441 29854910 27997534 27827580
32653 27827580 28501350 29139134 30616457 35591789 45161167 56166628 63189092 62966574
32645 62966574 56226484 46146609 36356859 29835739 27781093 28637944 28979326 26305255
32637 26305255 21170570 16383130 14161238 14284255 14920659 14721277 13733062 12686897 12093213
32628 12093213 11948524 11666341 10337732 7788450 5343844 4650477 5668952 6839228
32620 6839228 7349851 7990409 9397040 10832020 11362540 10939050 9569956 6888548 3541110
32611 3541110 1478232 1527359 2114889 1926646 2268630 4717608 7831503 8878819 8016001
32602 8016001 7778438 8633237 8178390 5353103 2519167 2046147 3158182 3775259 3666241
32593 3666241 4025885 5261949 6967635 9172303 11915366 14114928 14431681 13095857
32585 13095857 11631756 10828558 10058189 8640877 6879208 5428975 4372812 3393077
32577 3393077 2505933 2135104 2447094 2985967 3292631 3697432 4832229 6139672 5736800
32568 5736800 2667494 -1186536 -2650574 -784621 2148593 3476397 2915954 2142050
32560 2142050 2425272 3485561 4339042 4574709 4650650 5120948 5762005 5756346 4826506 3696454
32550 3696454 3112244 3045951 3420002 4739138 6882592 8006549 6323068 2825993 544283
32541 544283 833908 2028646 2258648 1926886 2366433 3362338 3405575 1851393 -229204
32532 -229204 -1131415 64380 2742520 5065954 5576758 4721194 4117760 4286456 4261242
32523 4261242 3718381 3959173 5883695 8296659 9435885 9198596 8604571 7927688 6810362
32514 6810362 5671961 5498255 6332988 7083912 6731377 4947262 1991076 -982357 -2032909
32505 -2032909 -221368 2860938 4626747 4552137 4456235 5591166 6747981 5829372 2464161
32496 2464161 -1491534 -3557635 -2485381 874299 4165011 5351494 4288246 2486121
32488 2486121 1567711 2208920 4099590 6173416 7049085 6070485 4061913 2584556 2462857
32479 2462857 3375579 4521509 5064709 4337101 2514612 908400 690691 1452384 1878677
32470 1878677 1613760 1373192 1380081 1060234 473720 649740 1932411 3152305 3169853 2361387
32460 2361387 1900378 2331436 3463062 4888485 5938506 5847996 4722368 3775101 3958130
32451 3958130 4901601 5727523 6153541 6129152 5287334 3798607 3049317 4173528 6235363
32442 6235363 7091920 5963367 4093074 2972768 3028504 4036018 5562264 6653555 6216479
32433 6216479 4342828 2511308 1922721 2229897 2363852 1973090 1470913 1187085 1134490
32424 1134490 1302204 1597045 1695248 1418918 1045058 788740 223267 -1196798 -3088382
32415 -3088382 -4196389 -3700494 -2143846 -841295 -505588 -652945 -385283 427264 1088086
32406 1088086 1324743 2080121 4359653 7502270 9593596 9806641 9271969 9069944 8512439
32397 8512439 6567534 4139929 3304571 4431733 5606601 5171665 3584868 2390202
32389 2390202 2494996 3871556 5789643 6820416 5827465 3667612 2710176 3802049 4950881
32380 4950881 4132241 2131511 1086202 1311401 1469338 1131265 1009887 952849 -48534
32371 -48534 -1683002 -2241872 -1164778 206969 885715 1337437 1780808 1497133 742106
32362 742106 1217171 3357640 5163819 5264877 5175267 6664052 8861492 10374245 12581118
32353 12581118 17878162 25583090 32371160 36156849 37222778 37044295 39478002 51335086
32345 51335086 75676942 103356535 117193773 108628030 87027335 68972358 61169559
32338 61169559 57821716 51926434 43089995 34297530 26816168 20847393 17635882 17810725
32330 17810725 19222731 18826862 16044449 12767171 10751304 10383384 11466859 13751946
32322 13751946 16538583 18608991 18938250 17476984 15416154 14509153 15446285 16812045
32314 16812045 16407571 13759003 10482942 8091227 6686017 6203904 7259082 9466051
32306 9466051 10307849 7693008 3137454 400217 918754 2509601 2984640 2984035 4032880
32297 4032880 5544368 5736185 4661249 4167590 4902864 5379287 4582657 3740787 4354803
32288 4354803 5750361 6063901 4979671 3989291 4132658 4795011 4825838 3811554 2179574
32279 2179574 996182 1591395 4213261 7014502 7722035 6533514 5854970 6754696 7486798
32270 7486798 6462349 4772882 4123141 3882150 2435432 443242 200907 2039678 3750000
32261 3750000 3725658 2547756 1208151 -62335 -718306 140403 1933515 2790414 2497672
32252 2497672 3120676 5499835 7404525 6906678 5419933 5063388 4859580 2489721 -1336589
32243 -1336589 -3491785 -3047074 -2185510 -2318281 -2252442 -952411 596085 1493360 2584551
32234 2584551 4496055 5877046 5267412 3314957 1555729 212139 -1180715 -2056256
32226 -2056256 -1579378 -453642 -110634 -351119 496831 2973750 5504523 6395203 5753837
32217 5753837 4962941 4904482 5110943 4456736 2663104 1113949 1593972 3909118 5626961
32208 5626961 4895663 2631600 921378 259667 -123927 -105569 948837 1886673 421528
32199 421528 -3195889 -5448549 -3893333 -444542 1444750 1500900 2298296 4860999 7054527
32190 7054527 6763584 4694228 2992030 2373106 1870659 742508 -630733 -1646413 -2276317
32181 -2276317 -2690366 -2707809 -2037320 -823878 336174 870562 659242 177079 296169
32172 296169 1642023 3862166 5741802 6370134 5968860 5142514 3674916 999491 -2141155
32163 -2141155 -3751007 -2964141 -1349283 -802236 -970164 -195055 1510728 2302041 1477761
32154 1477761 723588 1521738 2896271 3056877 2111504 1488917 1346658 435139 -1469968
32145 -1469968 -2768971 -2264745 -869244 -240839 -634676 -1040702 -850725 -381586 17769
32136 17769 469880 1151035 2065469 3295807 4793147 5755842 4999125 2497421 40741
32127 40741 -389673 1255857 3214341 4014513 3710943 3020335 2244845 1588583 1713044
32118 1713044 3062287 5012801 6523312 7361320 7853542 7725490 6368335 4382215 3704374
32109 3704374 5666806 9625844 13811939 16720821 17392874 15476559 11854306 8415476
32101 8415476 6339008 5170043 4223305 3953820 4858586 5863164 5305258 3183946 1037470
32092 1037470 -194821 -756059 -692793 380335 1882889 2369191 1677070 1405570 2392799
32083 2392799 3297359 2947231 2610176 4055495 6302046 6533439 4097102 1438072 574272
32074 574272 569826 -408702 -2003727 -2218029 -393636 1900709 2950344 2664369 1988904
32065 1988904 1548950 1508595 2171583 3832488 5979754 7239322 6499980 4016376 1223417
32056 1223417 -524611 -952133 -708706 -487904 -465719 -475060 -388688 -115097 618786 2092618
32046 2092618 4028978 5451452 5456317 4143125 2515086 1384060 637693 -269472 -1414709
32037 -1414709 -2355622 -2827237 -3044128 -3247215 -3346466 -3211829 -2982309 -2748326 -2169881 -941928
32027 -941928 330066 341527 -1319370 -3088703 -2667701 467671 4344758 6588865 6665791
32018 6665791 5486445 3464657 279604 -3375668 -5286535 -3960469 -640410 1986112
32010 1986112 2740964 2645225 2931158 3598932 4166048 4675173 5189693 4956101 3006077
32001 3006077 -432336 -3670162 -4879341 -3614671 -1155515 548850 472179 -713201
31993 -713201 -1449886 -894781 380221 1178453 871322 -233914 -1424899 -2319931 -3150459
31984 -3150459 -4291465 -5475227 -5777828 -4689851 -2875076 -1366808 -309819 810550
31976 810550 1927750 2317829 1769739 843894 -197778 -1621402 -2982720 -2849620 -615593
31967 -615593 2266729 3779817 3420808 2019508 388089 -658457 254243 3811637 8209703
31958 8209703 10209323 8552473 5314556 3384783 3451035 3959952 3316840 1515918 -16974
31949 -16974 189619 2156444 4237322 4784413 3984796 3449270 4045187 4995176 5258162
31940 5258162 4825873 4226604 3629406 3054354 2775326 2869122 2907630 2644535 2437474 2452737
31930 2452737 2111483 1006035 -231699 -696406 -267539 788976 2482175 4346377 4843010
31921 4843010 3023424 417620 -369585 1044052 2520314 2617249 2385128 3307915 5156354
31912 5156354 7086213 9450266 12763382 15594351 15433084 11844882 7367418 4783905
31904 4783905 4401490 4473163 3565420 1865245 485446 134764 690897 1865207 3800088
31895 3800088 6547814 9169263 10223247 9472620 8293198 7840610 7667742 6984057 6319932
31886 6319932 6515120 6692481 5141864 2254708 612194 1460496 2812817 2235056 228795
31877 228795 -620019 894808 3439551 5130261 5423691 5022206 4833220 5162226 5433265
31868 5433265 4810533 3427117 2527194 2889626 3744355 3960061 3574540 3151922 2368528
31859 2368528 689701 -911433 -549459 2077383 5095496 6608535 6298445 4738384
31851 4738384 2479482 350723 -458495 669755 3332372 6675205 9542801 10256833
31843 10256833 7852452 3924003 1597814 1900537 2671946 1980038 890101 1367357 2943732
31834 2943732 3512838 2602959 1777403 2055461 2775017 3047421 2802788 2284750 1830375
31825 1830375 2185401 3732749 5381002 5563225 4393838 3380560 2854589 1417028 -1407445
31816 -1407445 -3590974 -2895490 227240 3223197 4394475 4269519 4304260 5095436 5986735
31807 5986735 6053944 5322869 4830133 5200800 5520479 4402745 2052101 259042 195051
31798 195051 1264345 2489953 3904888 5831159 7657478 8286101 7412675 5736714 4228639
31789 4228639 3543902 3637370 3616457 2638905 1323400 1411403 3438188 5625287 5921793
31780 5921793 4400912 2699068 1752690 1204500 605354 21601 -434575 -742102 -719884
31771 -719884 -365796 -177261 -348138 -29725 1602054 3821476 5033665 4879778 4493786
31762 4493786 4621153 4719789 4216846 3453622 2810496 1904826 441660 -830370 -845549
31753 -845549 423594 1976051 2986891 3534343 4159609 4984058 5392637 4756874 3548417
31744 3548417 3251003 4599885 6281711 6257420 4267610 2089836 1280692 1691794 2435480
31735 2435480 3208579 4115543 5072700 5999923 6899075 7286480 6396998 4512576 3182473
31726 3182473 3402326 4422959 5108975 5485509 5948053 6002412 5219528 4612208 5298419
31717 5298419 6213306 5056165 1570562 -1906701 -3498328 -3681286 -3556257 -2922548 -1155187
31708 -1155187 1248989 3212138 4348600 4680588 3852660 1754580 -568759 -1682051
31700 -1682051 -1224208 32721 1133746 1329149 212053 -1604385 -2504326 -1567469 207887
31691 207887 1367634 2107544 3596073 5556853 6108527 4190057 844234 -2196404 -4045936
31682 -4045936 -4497527 -3516472 -1456744 1068122 3883078 6952337 9217405 9026986 6384373
31673 6384373 3675755 3292031 5261594 7865017 9665979 10110283 9055840 6936116
31665 6936116 4987155 4283808 4654518 5098252 4912483 3943002 2324693 606515 -437484
31656 -437484 -714227 -891301 -1091940 -517925 876293 1576394 633234 -513857 37389
31647 37389 1760016 2598054 2177715 2034385 2807423 3351569 2924610 2303740 2169334 2104670
31637 2104670 1913558 2442854 4304462 6922337 9340120 10794388 10286167 7280252 3402286
31628 3402286 1632363 2799732 4402817 3930670 1823581 2434 -895239 -1262275 -926707
31619 -926707 345104 1692302 2220192 2460664 3231724 3927405 3682035 3381241 4423629
31610 4423629 5976466 5726016 3384392 1344445 1456366 2977927 4267162 4824324 4850480
31601 4850480 4196010 2821915 1459153 876986 909994 753599 -81867 -1332046 -2135483
31592 -2135483 -1630967 130191 1983934 2923871 3342613 4297226 5806895 6776232 6480641
31583 6480641 5276161 3975897 3307156 3637913 4280786 3524433 598001 -2772704 -4168660
31574 -4168660 -3484510 -2532564 -2018720 -1012142 527201 1065629 10144 -1273139 -1900394
31565 -1900394 -2817452 -4467123 -5216475 -3887785 -2120597 -2100259 -3180711 -2970197 -946320
31556 -946320 1192073 2264527 2561263 2316853 1409572 729511 1758961 4157122 5451193
31547 5451193 3983708 911426 -1512578 -2509916 -2717814 -2535780 -1786169 -703373 -153387
31538 -153387 -612805 -1475449 -1697703 -970332 -9196 351040 124979 -14733 289071 832470
31528 832470 1591315 2950176 4799316 6100489 6029793 5096753 4441885 4415906 4594061
31519 4594061 4810716 5217416 5459535 4862090 3694164 3393664 4997019 7769906 9874060
31510 9874060 10270890 9684314 9685028 11005018 12940642 14416828 15210475 15661976 15558988
31501 15558988 14262507 11995311 9962265 8818231 8001002 7065071 6562380 6833762 7057763
31492 7057763 6582582 6173715 6593440 6854247 5563544 3402145 2385307 2880591 3296736
31483 3296736 2864226 2743014 3734827 4645215 3993537 2163797 799308 862036 2147715
31474 2147715 4002374 5623596 6114186 5069417 3051037 1158706 268276 636913 1771898
31465 1771898 2716640 3017336 3234960 3792445 3744709 1973244 -602590 -1706904 -870494
31456 -870494 -95233 -647338 -1061967 358187 2711670 4028466 4545900 6313179 9840875
31447 9840875 13077147 13951156 12489239 10096837 7986436 6782806 6648962 7075086 7031599
31438 7031599 5892329 4095615 2715351 2451810 2995965 3327546 2893531 2547625 3749658
31429 3749658 6522403 8905919 9067323 7325891 5276166 3521929 1479020 -821087
31421 -821087 -2131263 -1614856 -136757 680801 239591 -637947 -827467 -54133 1043671
31412 1043671 1798744 2228947 2669850 2960846 2671962 2196335 2730732 4709076 7035082
31403 7035082 8466851 8985618 9071990 8513091 7012419 5278266 4222674 3568007 2618775
31394 2618775 2056219 3368998 6433257 9127737 9721275 8545183 7087665 6540050 7432966
31385 7432966 9512699 11591224 12523510 12635242 13240668 14649134 15832321 16216696 16405428
31376 16405428 16750179 16669247 15982309 15509997 15607906 15475388 14781131 14634015 15923743
31367 15923743 17905746 19426476 20295534 20418654 19060596 16382672 14291902 14019976
31359 14019976 14074743 12526086 10218736 9466231 10397648 11140814 11181490 11779049 12968071
31350 12968071 12976768 11346146 10050073 10335417 10697841 9536969 7952535 8023666 9580945
31341 9580945 10607840 10145354 9083672 8395987 8049302 7645088 7056936 6352384 5766311
31332 5766311 5677997 6120554 6567998 6645380 6623983 6704245 6327527 4899621 2842253 1237979
31322 1237979 632866 716932 968030 1134744 1240162 1439040 1760339 1994711 2210554 3172331
31312 3172331 5379992 7720992 8271967 6774021 5090086 4690330 4981465 4823637 4265774
31303 4265774 3750017 3028743 2211880 2503214 4188626 5108711 3230346 -55584 -1408986
31294 -1408986 140318 2543179 4115827 5154891 5953637 5570960 3400406 250695
31286 250695 -2790616 -5059507 -5539473 -3270357 749967 3824640 4588660 4229139 3972344
31277 3972344 3227761 1367395 -451115 -813281 -81618 573842 982563 1336348 934913
31268 934913 -702836 -2327078 -2255657 -569839 1523322 3851008 7047721 10523689 12417366
31259 12417366 11716810 9234111 6480226 4524734 3691199 3360393 2382612 601760 -580661
31250 -580661 -156895 807410 794933 233629 479392 1153234 735864 -490629 -572213 798863
31240 798863 1528987 421095 -1010083 -1154508 -806951 -1601564 -3401821 -4721023 -4663874
31231 -4663874 -3164228 -340943 3012175 5187756 5263065 4407197 4182997 4210883 3035371
31222 3035371 850855 -401742 231055 1456262 1754164 1484998 2191800 4439451 7027029
31213 7027029 8076932 6556973 3082820 -367732 -1790025 -735032 1315054 2344500
31205 2344500 1606941 -97802 -1773743 -3268353 -4652332 -5200116 -3994957 -1525873
31197 -1525873 436447 1024114 1315768 2443065 3686009 3707284 2943230 3150300 4802024
31188 4802024 6526330 7165318 6816198 5649865 3490137 1215152 813637 2810788 4892567
31179 4892567 4467778 1792428 -694171 -1464942 -1038224 -469123 -101086 97209 -20186
31170 -20186 -586733 -1320559 -1454044 -183363 2329907 4413873 4238862 2070993 234547
31161 234547 299745 1357029 1842249 1863117 2413111 3238918 3244571 2676770 3135406 5123812
31151 5123812 6972992 6822973 4850323 2984825 2879335 4495950 6369203 6978858 5918205
31142 5918205 3827361 1529585 -227733 -465195 1337282 3823798 4357688 2059486
31134 2059486 -715944 -1108479 844515 2825151 3530708 3773524 4637053 6134081 7724765
31125 7724765 8809273 8585690 6633504 3859817 1918392 1581948 2404270 3645920 4510733
31116 4510733 3945548 1669594 -781469 -1560014 -1020290 -1183722 -2677593 -3933614 -3693955
31107 -3693955 -2522985 -1293612 78544 1616356 2637358 3086005 4024905 5751933
31099 5751933 6863773 6434248 5803786 6705510 8618883 9556818 8767772 7104359 5215843
31090 5215843 3004214 793777 -407751 -146495 868299 1629597 1721677 1282290 591100
31081 591100 -158747 -790923 -747941 952291 4519902 8187913 9570544 8771134 8623544
31072 8623544 10705638 12589438 10928278 6345067 2950559 3139045 5111805 6054820
31064 6054820 5671409 5345635 5357157 4712044 3213497 2081999 2247398 3052147 3207699
31055 3207699 2512918 1985678 2412025 3404200 4149807 4539163 4931373 5138519 4561816
31046 4561816 3405279 2825330 3517130 4955940 6442708 7985328 9501089 10094743 9152321
31037 9152321 7498263 6366152 5699376 4621311 3197248 2369157 2200962 1574921 -14636
31028 -14636 -1478106 -1485900 -62316 1636831 2585705 2584478 2161340 2038770 2348355 2355457
31018 2355457 1431911 193658 -57827 939831 2052252 2274220 1762522 1058474 222778
31009 222778 -636502 -758578 430468 2211726 3149517 2739725 1846569 1410563 1253429
31000 1253429 474092 -1193455 -2768307 -2915235 -1371616 733022 2095477 2588810 3169669
30991 3169669 4562533 6318608 7170670 6155627 3506980 664848 -739939 -217988
30983 -217988 1292909 2608848 3509430 4497616 5713488 6646259 6822798 6297597 5471858
30974 5471858 4744271 4199921 3371351 1670818 -519402 -1725990 -1102867 220198 551832
30965 551832 63574 460459 2248984 3886131 4135156 3746490 3774060 3458599 1310493
30956 1310493 -2248394 -4870300 -5018688 -3596897 -2514664 -2447354 -2502068 -1630032 161890
30947 161890 1930136 2806057 2765695 2453542 2418074 2668016 2800428 2200795 243750 -3048078
30937 -3048078 -6350030 -7754702 -6744354 -5034842 -4791336 -6219457 -7595080 -7579952 -6713752
30928 -6713752 -6354859 -6778298 -6867153 -5452223 -2481756 1086106 4099020 5765500 5809806
30919 5809806 4565118 2899035 1617500 742681 -343495 -1845196 -2947470 -2572132
30911 -2572132 -518705 2411577 5085176 6440103 5729586 3240519 664978 -164079
30903 -164079 863291 2201923 2694826 2718808 3050205 3613064 4034730 4588072 5570284
30894 5570284 6224919 5381741 3106712 833900 -209626 16610 999237 2435615 3987122
30885 3987122 4878212 4348220 2460290 274248 -773533 153512 2524551 4635836 5008350
30876 5008350 3728989 2087034 911273 -151249 -1561598 -2853372 -3234492 -2697197
30868 -2697197 -1807014 -736660 612462 1657875 1378968 -127998 -1227870 -565438 1227795
30859 1227795 2350063 1997705 982981 373957 273475 15148 -955362 -2437091 -3370031
30850 -3370031 -2638830 -516325 1107490 813328 -406154 -539014 318146 -41406 -2427501
30841 -2427501 -4652092 -4552654 -2957951 -1983677 -1650525 -315811 2177906 4062807 4399836
30832 4399836 4247628 4625302 5036258 4730574 4019241 3496556 3075963 2635585 2696744 3595670
30822 3595670 4645717 4890107 4255029 3458593 3201396 3730471 4664014 5067540 4360832
30813 4360832 3235533 2828125 2949782 2318272 785417 -92666 654121 1944545 2454437
30804 2454437 2688258 4012718 6497588 8974727 10624925 11329983 10931782 9295262 6894210
30795 6894210 4511764 2610545 1503211 1507753 2300902 2887481 2918018 3127501 3706384
30786 3706384 3492455 2010187 1050357 2485441 5411748 7335155 7509429 7093672 6556508
30777 6556508 5292724 3788592 3766074 5602735 7570082 8305214 8324753 8451657 8456253
30768 8456253 8052158 7624041 7034280 5204838 1981080 -853831 -1571385 -525497 769946
30759 769946 1633083 2373245 3374548 4872268 6763355 7957030 7029894 4314429 2069829
30750 2069829 1607254 1618545 570786 -748144 -785470 -144 82960 -266072 554006 2499534
30740 2499534 3743668 3591537 3264669 3397246 3019871 1879338 1653858 3469265 5792623
30731 5792623 6364443 5105884 3562335 2352401 902259 -705850 -1362220 -588215 697654
30722 697654 1375954 1180190 397821 -556311 -1054643 -706067 -268616 -1156610 -3412131
30713 -3412131 -5039868 -4313700 -2173754 -1187595 -2326864 -3970782 -4280028 -3370572 -2491103
30704 -2491103 -1978978 -1084767 514962 2010408 2353928 1274025 -651554 -2469969 -3429373
30695 -3429373 -3579594 -3811821 -4837774 -6143101 -6456344 -5248389 -3202421 -1185190 534885
30686 534885 1835176 2248508 1467391 -27876 -1285022 -1672399 -1228115 -532306 -308534
30677 -308534 -718391 -979426 -234535 1128422 1793928 1385346 1051698 1604964 2044356
30668 2044356 992282 -1016974 -1973330 -1019993 487897 773963 -389863 -1853248 -2523253
30659 -2523253 -2104614 -793146 1151477 3370778 5179473 5774139 5023238 3919595 3674191
30650 3674191 4218394 4207262 2788224 692796 -870835 -1659803 -2042076 -1939318 -1134269
30641 -1134269 -164112 161380 -156703 -696552 -1673400 -3321925 -4507639 -3598112 -947554
30632 -947554 1058209 982345 -75555 -581131 -744353 -1389185 -1872433 -810920 1587440
30623 1587440 3420844 3309553 1657641 -227376 -1268251 -878733 862401 2970902
30615 2970902 4163290 3988188 2976523 1736708 494585 -501329 -850488 -505554 71943
30606 71943 397116 243368 -439734 -1305749 -1418598 -80812 2021741 3238068 2685445
30597 2685445 892975 -1255802 -3140812 -3765417 -1990332 1607941 4290491 3989966
30589 3989966 1921132 940138 1836791 2944571 3175875 3349851 4004020 3924295 2155666
30580 2155666 45184 -321616 1103397 2633024 3344643 3700730 3955030 3592221 2540907
30571 2540907 1564149 1104765 891269 924794 1568645 2282717 1725676 -98599 -1127526
30562 -1127526 211115 2754822 4107382 3547623 2202664 1134237 755962 1537678 3483523
30553 3483523 5062943 4491329 2352097 1288358 2568649 4483001 4861760 3736731
30545 3736731 2513563 1793743 1330510 1241472 1821833 2564754 2559978 1642855 281327 -1230841
30535 -1230841 -2511518 -2586598 -935723 1244132 2140451 1583988 910138 656201 -60570
30526 -60570 -1645973 -3149296 -3909207 -4559657 -5468293 -5575647 -4071685 -2104500 -1292878
30517 -1292878 -1320459 -656555 818037 1685799 1387126 952162 1057189 1044840 505438 270917
30507 270917 861588 1282805 665927 111851 1344679 4002919 5797134 5328060 3446400
30498 3446400 1675218 546525 -20025 248162 1701881 3967759 6062896 7190727
30490 7190727 7207141 6615184 6306863 6901996 8018441 8518390 7796871 6551773 5984437
30481 5984437 6518880 7627770 8635282 9270462 9582248 9711995 9716007 9346056 8115090
30472 8115090 5897246 3391348 1626872 937667 675832 40397 -990539 -1690202 -1480379
30463 -1480379 -652095 -56731 -71387 -128996 442546 1324400 1526566 893197 627253 1840777
30453 1840777 4028502 5628285 5903700 5585179 5607516 5887555 5702250 4855003 3967779
30444 3967779 3655282 3745899 3502368 2580178 1615112 1641821 2828604 3986348 3619691
30435 3619691 1466713 -1219757 -2936485 -3240481 -2739155 -2100381 -1440866 -668041 -13221
30426 -13221 125961 -211347 -452100 -90868 869053 2157312 3547164 4692183 5071000
30417 5071000 4543540 3648322 2841859 1814792 289775 -872964 -499841 968869 1645351
30408 1645351 688364 -557024 -552478 463422 1431368 2321009 3711070 5246691 5985402
30399 5985402 5942953 5910511 5899636 5134193 3587737 2200408 1427146 820520 210553 -32647
30389 -32647 -178193 -1139578 -2813299 -3873795 -3955548 -4556686 -6663321 -8772300 -8692520
30380 -8692520 -6357951 -3378197 -628307 1959880 3698554 3259835 754137 -1888411
30372 -1888411 -3068314 -2793330 -1475682 1073271 4632642 7744587 9007203 8531656
30364 8531656 7230069 5353909 2832157 551690 -88213 988747 2262766 2563245
30356 2563245 2417416 2908437 3873980 4056017 2824988 1033650 52052 408695 1528983
30347 1528983 2462362 2646182 2162662 1481659 937776 444430 -175824 -696062 -716801 -481181
30337 -481181 -930718 -2492719 -4152875 -4399009 -3069680 -1637234 -1438378 -2118132 -2201176
30328 -2201176 -927628 876807 1729547 1099297 86215 464687 2837874 5731551 6845726
30319 6845726 5355921 2707496 1020737 1108795 2312764 3747011 4983044 5642856 5183595
30310 5183595 3557089 1680067 675119 636541 533077 -526307 -2187689 -3198124 -2661036
30301 -2661036 -723270 1769686 3899849 5075687 5368641 5544703 6189596 6630334 5448319
30292 5448319 2463896 -630110 -2384990 -3531948 -5561108 -7891658 -8143061 -5389264
30284 -5389264 -1542401 1135636 2511685 3639079 4568113 4512687 3590796 2955997 3204789
30275 3204789 3679730 3482979 2457859 1068003 -117559 -708541 -664256 -249950 337034
30266 337034 1105072 1914712 2461892 2865759 3608048 4439871 4184374 2434915 652008
30257 652008 426371 1278269 1605178 1403574 2241653 4343167 5565966 4235542 1679978
30248 1679978 693798 2157399 4298809 4984807 3773979 1740720 59115 -937311 -1598860
30239 -1598860 -2179029 -2422335 -2053858 -1413601 -1177543 -1586941 -2429599 -3564087 -4746883
30230 -4746883 -5116110 -3873945 -1623096 33833 564754 1087088 2358807 3408329 3163060
30221 3163060 2477057 3202105 5673942 8310132 9501312 8901119 7056856 4810514 3015016
30212 3015016 1927970 946702 -253593 -675065 707704 2840644 3370992 1773364 55336
30203 55336 -251314 -61774 -576262 -866296 440304 2182973 1833906 -582997 -2212804
30194 -2212804 -1542599 -564636 -1583254 -3842454 -5143465 -5344309 -5936802 -6932515 -6802472
30185 -6802472 -5578778 -5383872 -6938276 -7804444 -5683049 -1743607 1230816 2704028
30177 2704028 4095401 5421089 4981257 2648740 906905 1480791 2833686 2477282 417565
30168 417565 -1303673 -1605748 -1246994 -1135587 -1297366 -1456522 -1357097 -448355 1600489
30159 1600489 3913142 4963683 4329716 2948508 1468685 -540855 -3330089 -6015754
30151 -6015754 -7581159 -7954843 -7394281 -5750903 -3378409 -1925670 -2707945 -4538877 -4733904
30142 -4733904 -2539990 -204299 -14585 -1448839 -2261736 -1602382 -777862 -1125148 -2309620
30133 -2309620 -3033212 -2613610 -1350587 232840 1940180 3696851 5129739 5629694 4998193
30124 4998193 3958658 3651816 4394699 5222204 4964303 3543857 1913017 1016390 1174834
30115 1174834 2059579 2721030 2107492 316389 -1131526 -1238992 -1233713 -2893922 -5488832
30106 -5488832 -6327460 -4628495 -2728743 -2581431 -3198315 -3038114 -2841784 -3819518 -4623040
30097 -4623040 -3025865 143901 1770393 1060823 427531 1321518 2128712 1344832 226936
30088 226936 622848 2211370 3658164 4743861 5440014 4465681 1066005 -2753779 -4027489
30079 -4027489 -2391834 -15878 1469228 2083772 2097614 1694750 1889423 3596785 5584600
30070 5584600 5442808 3124327 1586224 3045142 6184852 8045624 7356544 5013523
30062 5013523 2469545 851392 852315 2289322 4034204 5042393 5160675 4697536 3910495
30053 3910495 3217294 3031006 3010134 2467927 1884962 2626185 4396492 4585908 1642691
30044 1642691 -2136941 -3123802 -997996 1162961 1254383 497889 971616 2619422 3723983
30035 3723983 3194715 1392723 -612150 -1866297 -2189343 -2511202 -3858250 -5542563 -5331574
30026 -5331574 -2280716 1450859 2786418 1217329 -1104570 -2331886 -2456710 -1956481
30018 -1956481 -772426 602341 642715 -1156825 -2765969 -1870018 824555 2372453 1712386
30009 1712386 1041766 2347332 4413326 4807622 3580860 2978376 3919961 4817234 4179992
30000 4179992 2627635 1511735 887203 -52325 -1358871 -2260255 -2304666 -1709273 -827447
29991 -827447 32314 475928 313696 -196260 -817604 -1690220 -2734154 -3190847 -2487351
29982 -2487351 -1218502 -486732 -470976 -374267 425775 1921431 3898678 5916203 7049947
29973 7049947 6692330 5604437 5169720 5580509 5859960 5716641 5963691 6705862 6667031
29964 6667031 5241453 3839201 3851744 4306913 3163612 366127 -2077352 -2904141 -2851753
29955 -2851753 -2907962 -2856446 -2218374 -1466056 -1402543 -1979412 -2455236 -2336473 -1681891 -857617
29945 -857617 -366404 -531791 -1052470 -1282347 -1139558 -1141534 -1313864 -918887 168760 682699
29935 682699 -459220 -2317423 -2775672 -1074956 1465801 3202060 3626081 2978535 1551486
29926 1551486 -16358 -599217 348200 1892224 2546068 2008443 1337057 1360056 1600632
29917 1600632 1155922 155664 -330633 206318 973715 940665 114973 -805788 -1673086
29908 -1673086 -2891183 -4188408 -4418269 -3124671 -1537505 -1207162 -2075775 -2703542 -2136178
29899 -2136178 -722543 761263 1877107 2344658 2011853 1349646 1255399 1899929 2285819
29890 2285819 1420755 -434187 -2098796 -2757989 -2534073 -2051905 -1882045 -2308103 -3237811
29881 -3237811 -4240039 -4807639 -4640535 -3736612 -2394532 -1175118 -629564 -857589 -1339490
29872 -1339490 -1273998 -181873 1615692 3046587 3098976 1810992 240855 -681121 -852904
29863 -852904 -367504 1025301 3094395 4464115 3971636 2431668 1820282 2733760 3928755
29854 3928755 4504212 5051456 6022361 6310616 4592327 1401234 -1094773 -1123672 1296108
29845 1296108 4464486 6160398 5371483 3243688 1665794 839478 -608797 -2924238
29837 -2924238 -4353892 -3840577 -2852586 -3079415 -3824644 -3606884 -3141166 -4312982 -6719514
29828 -6719514 -7739593 -6192677 -3712865 -2019754 -870301 461632 1477362 1428521
29820 1428521 738978 247375 -105301 -736109 -1208342 -678316 646036 1362084 367710
29811 367710 -1802401 -3261153 -2507517 -6285 2257533 3061511 3230302 4083592 5368090
29802 5368090 5850017 5393569 4940261 4595152 3368617 1052578 -1143502 -2237169 -2415006
29793 -2415006 -1969956 -755663 769775 1466849 1262356 1561308 2976625 4002174 3129695
29784 3129695 1151820 35452 352350 1143416 1719522 2322282 3291961 4515503 5450197
29775 5450197 5181020 3128252 286808 -1182518 -463535 743947 551112 -619196 -1101920
29766 -1101920 -608385 -191881 -215893 -55044 408992 561927 330389 330284 670330 778128
29756 778128 447078 -36114 -737680 -1859444 -2699611 -2133743 -336237 1169176 1457610
29747 1457610 1095733 824382 598449 523408 1592966 4450183 7931616 9783643 8825862
29738 8825862 5948278 2975551 885760 -655541 -2106822 -2922269 -2247518 -549976
29730 -549976 528966 313746 -32041 508442 1104097 504799 -856331 -1692053 -1997572
29721 -1997572 -2581313 -2976226 -1873433 367246 1669856 1155450 384804 1110511 3266010
29712 3266010 5695597 7376047 7380625 5293787 2472149 1277228 2038665 2350184 601496
29703 601496 -1419337 -1159134 839591 1929758 1467184 1464924 3047707 4542508 4026650
29694 4026650 2142122 1025341 1288028 1467106 375347 -1161986 -1457011 -263859 885080
29685 885080 705540 -235753 -499755 173657 703751 369866 -433961 -1351171 -2796869
29676 -2796869 -4838846 -6252996 -5705353 -3439574 -907219 970501 2295592 3170439
29668 3170439 3222056 2354902 1163126 171529 -782531 -1924569 -2717086 -2378025 -1222702
29659 -1222702 -746838 -1875727 -3574560 -3963439 -2708598 -1439073 -1635374 -3073574 -4762673
29650 -4762673 -6249691 -7088293 -6178240 -3196596 -39085 906683 -303938 -1631436 -2232245
29641 -2232245 -3151219 -4664002 -5245767 -4101277 -2643845 -2093507 -1396312 743185 3196445
29632 3196445 3799995 2508712 1152552 568805 -47848 -1103192 -1819109 -1751693 -1521432
29623 -1521432 -1580252 -1522974 -1160809 -1238913 -2401293 -4048129 -4795014 -3863879 -1849340
29614 -1849340 -257089 -160551 -1117582 -1734179 -1479486 -1255639 -1748840 -2200491 -1737467
29605 -1737467 -981747 -978365 -1212822 -341614 1449037 2579930 2548245 2467451 2890075 2934169
29595 2934169 2205501 1809048 2392488 2694212 1408681 -620814 -1563085 -1185561 -756206
29586 -756206 -843273 -847950 -707757 -1463353 -3530633 -5511414 -5595226 -3685288 -1486233 -678415
29576 -678415 -1430409 -2564221 -2789948 -1762109 -155597 1225719 2401369 4062946 6312166
29567 6312166 7892606 7282345 4619288 1934405 1098363 1974621 3040779 3325223 2978689
29558 2978689 2328121 1496715 1026293 1722930 3401128 4664886 4509957 3451087 2584519
29549 2584519 2287131 2329099 2387866 1856865 200504 -1666927 -1576198 1016239 3457794
29540 3457794 3002440 729433 240484 2715816 5559578 6246523 5210827 4024657 2815154
29531 2815154 1030479 -699768 -1246374 -776169 -400202 -557083 -1051966 -2200804 -4430047
29522 -4430047 -6834868 -7597140 -6216595 -4257097 -3376824 -3455386 -3317293 -2704014 -2640029
29513 -2640029 -3899395 -5850446 -7182238 -7390941 -7041715 -6668236 -6033766 -4757949 -3196068
29504 -3196068 -2185344 -2118456 -2693215 -3393762 -3793675 -3618487 -3057284 -2822839 -3247702
29495 -3247702 -3433445 -2097302 596986 2803921 2982809 1665255 852140 1832265 3802390
29486 3802390 4620749 3006474 25254 -1967904 -2002347 -1442847 -1847807 -2810440 -2945028
29477 -2945028 -2238159 -1912524 -2258075 -2205300 -1156273 213621 1197297 1696320 1370589
29468 1370589 -323616 -2751534 -4227499 -4175232 -3788692 -3872388 -3491381 -1650813 1082113
29459 1082113 3608589 5554519 6466966 5372684 2636539 779528 1501527 2914778
29451 2914778 1781264 -2145606 -5959837 -7270291 -6074553 -3408570 -364413 1491263
29443 1491263 900709 -1311084 -2905377 -3126069 -3349662 -4459679 -5394700 -5133959 -4463219
29434 -4463219 -4569099 -5139553 -5157472 -4636240 -4196943 -3525671 -1690476 1058389 2966784
29425 2966784 2668724 892498 -111648 1131120 3679170 5120787 4399197 3182596
29417 3182596 3631285 5201172 5051133 1879985 -2058231 -3578149 -2086276 578361
29409 578361 2899976 4795770 6292675 6666605 5403301 3139417 1095910 -13813
29401 -13813 -237311 21836 328556 404633 263128 7039 -553170 -1666804 -2800614 -2616495
29391 -2616495 -539808 1922762 2518610 1164974 367134 1910125 4299715 5133098 5289596
29382 5289596 8238484 14614139 19977980 19789350 14970981 10322971 8431993 7705297
29374 7705297 6114034 4057549 2722159 1868769 664523 -704584 -1573119 -1967726 -2121424
29365 -2121424 -1644076 -232274 1454399 2558809 3074420 3344171 3238265 2711131 2421888
29356 2421888 2751732 2870392 1975335 951797 1471516 3633924 5726222 6333819 5683477
29347 5683477 4907976 4897944 5808291 6774330 6242493 3619813 521681 -741006 85052
29338 85052 1145787 1186966 810159 667644 88771 -1455688 -2805264 -2399746 -413180
29329 -413180 1619685 2801046 3330071 3375718 2793547 1938651 1606627 1920391 2109375
29320 2109375 1607189 647619 -436449 -1809086 -3657465 -5530999 -6440363 -5518515 -2784281
29311 -2784281 419987 2167855 1836339 935208 1154066 1912448 1169082 -1354979 -3408320
29302 -3408320 -3256480 -1969637 -1610279 -2380821 -2949912 -2767274 -2543694 -2814147 -3336945
29293 -3336945 -3757547 -3876238 -3553465 -3215174 -3851527 -5466854 -6349813 -5289636 -3632046
29284 -3632046 -3351110 -4101845 -4679784 -6397204 -11143591 -15856935 -13593875 -2541417
29276 -2541417 9680500 14164513 10698854 6033935 4370118 4222470 3855705 4501020
29268 4501020 6811901 8319221 6885694 4055624 2623845 2735077 2580752 1598314 861124
29259 861124 1084540 1976404 3015555 3543105 2753149 893623 -194268 922632 3270931
29250 3270931 4715604 4596413 3778679 2729351 1296261 185379 755688 2885091 4525252
29241 4525252 4106588 2342629 941727 402428 -37819 -781677 -1154076 -359688 1386618
29232 1386618 2940229 3321720 2582048 1514301 639114 -196421 -1150100 -1796949 -1627105
29223 -1627105 -886557 -476153 -1050584 -2422614 -3675671 -3713470 -2134801 34790 913383
29214 913383 -311663 -2282076 -2955534 -2022251 -1067212 -1321194 -2135749 -2111082 -1088824
29205 -1088824 -311922 -743142 -1826712 -2181640 -1292492 -136648 25417 -749903 -1099808
29196 -1099808 -21705 1864350 2998081 2601223 1398292 675007 874503 1244251 878246
29187 878246 11773 -53359 1432479 3482520 4394170 3774830 2800341 2467917 2499653 2243502
29177 2243502 1726303 1228441 537390 -678159 -2218446 -3608513 -4515008 -4484087 -2981370
29168 -2981370 -350551 1927982 2695857 2264613 1425036 118132 -1888290 -3739351 -4259409
29159 -4259409 -3599611 -2829836 -2183900 -1080080 290566 905624 548601 95664 -44939
29150 -44939 -399719 -1072613 -1400832 -1410645 -2061227 -3333531 -3681580 -2492303 -1609241 -2846065
29140 -2846065 -5058422 -5517418 -3666477 -1703736 -1501475 -2575883 -3348210 -2989725 -1573110
29131 -1573110 327071 1493448 569198 -2385509 -5465627 -6861207 -6761844 -6567867 -6680305
29122 -6680305 -6125752 -4295808 -1978004 -290249 598969 1148514 1483816 1486317 1448681
29113 1448681 1799976 2284764 2220694 1623974 1267690 1427226 1440471 947825 687595 1285692
29103 1285692 1949051 1417648 -92973 -962554 -178361 1627217 3245311 4112460 4180889
29094 4180889 3374500 1774629 22909 -928213 -536840 769086 1633105 748142 -1702829
29085 -1702829 -3882684 -4233861 -3291559 -2725808 -2867159 -2428912 -775061 934139 1438236
29076 1438236 1027375 690379 632905 650793 1134269 2415867 3523305 2871950 275015
29067 275015 -2641834 -4170164 -4025925 -3123089 -2508261 -2638402 -3173383 -3276362 -2387835
29058 -2387835 -748001 962279 2219029 2629106 1789837 -171689 -2161293 -2944532 -2411803
29049 -2411803 -1485405 -856225 -412263 146975 842644 1674297 2681489 3502554 3417064
29040 3417064 2160199 373310 -932712 -1060678 219407 2611231 5125112 6489777
29032 6489777 6197171 4952159 3873093 3527410 3900943 4786174 5714592 5888985 4884212
29023 4884212 3376993 2564998 2706363 2731443 1577733 -484669 -2256854 -3096980 -3515011
29014 -3515011 -4311335 -5596597 -6827572 -7418820 -7031441 -5583840 -3425818 -1379753 -176963
29005 -176963 149070 -3210 -531631 -1557512 -2643550 -2814925 -1728960 -292641 354958
28996 354958 87413 -432058 -774314 -891099 -581837 283354 997848 386298 -1684760
28987 -1684760 -3829050 -4675117 -4399264 -4157397 -4344315 -4150841 -2824583 -720555 1092574
28978 1092574 1808847 1302993 122929 -565907 408876 2905158 4952055 4451697 1635287
28969 1635287 -885715 -924334 1006617 2695794 2888954 2179975 1702935 1962958 2893960
28960 2893960 4050459 4517684 3537681 1611386 182477 -226327 -727747 -2254644 -3862884
28951 -3862884 -3962890 -2825680 -2516836 -4103483 -6038538 -6029057 -3906245 -1798612 -1559680
28942 -1559680 -2772101 -3623661 -3250241 -2488951 -2290196 -2205125 -1127170 872475 2389648
28933 2389648 2444072 1570782 886519 844360 1366879 2460446 3946936 5046580 4997519
28924 4997519 3865878 2192060 240219 -1686477 -2629088 -1751002 289741 1736830
28916 1736830 1699650 884564 161129 -636438 -1910542 -3071349 -2967052 -1292271 1072449
28907 1072449 3009935 3941700 3759314 2600223 936185 -455928 -971107 -658853 -129408
28898 -129408 47852 -160261 -315067 15611 852296 1747903 2026760 1225172 -420583
28889 -420583 -1910606 -2200187 -1136644 460486 1673268 2216205 2329904 2361483 2583934
28880 2583934 3027076 3285645 2893036 2109335 1880805 2693102 3903808 4570001 4461167
28871 4461167 3834180 2771097 1375753 174775 -389638 -527988 -529670 -116123 771317
28862 771317 1015385 -648240 -3728663 -6196984 -6658267 -5367347 -3219143 -1006442 243036
28853 243036 -244048 -1509458 -1220026 1520859 4708683 5786632 4599649 2899653 1696498
28844 1696498 566034 -726729 -1489469 -1335774 -1042626 -1593229 -2971755 -4334757 -4943985
28835 -4943985 -4606718 -3581736 -2416108 -1657132 -1417625 -1290723 -831420 -31438 769478
28826 769478 1321137 1671323 1959673 2123009 1928178 1339552 700053 319028 -55109 -986302
28816 -986302 -2446073 -3520239 -3354452 -2199665 -1126190 -736405 -575575 768 719176
28807 719176 629874 -500374 -1543879 -1240100 153344 1120789 900594 487439 1188666
28798 1188666 2850712 4222479 4571361 4086941 3077193 1784459 755146 226746 -764545
28789 -764545 -3312948 -6511348 -7898476 -6602241 -4535770 -3520129 -2703701 -368710
28781 -368710 2803728 4269082 3073619 885973 -565097 -1378861 -2298386 -3160080 -3488834
28772 -3488834 -3601126 -3966561 -3978132 -2458167 602407 3555474 4603111 3526536 1817603
28763 1817603 1221848 2159382 3491727 3776822 2625343 750359 -1035008 -2467881 -3599486
28754 -3599486 -4445985 -5055939 -5567328 -5973202 -6054594 -5705635 -5121060 -4524654 -3907371 -3158665
28744 -3158665 -2250953 -1144122 293004 2046712 3733874 4806410 5004794 4569302 4037158
28735 4037158 3817439 3842822 3609042 2708247 1415117 592585 810787 1599463 1838524
28726 1838524 1032179 -27172 -192190 532334 924304 184318 -903194 -994037 -11198
28717 -11198 806387 574271 -354566 -1296986 -2139121 -2894216 -3111343 -2384867 -1016958 374782
28707 374782 1530707 2385006 2740260 2659570 2615151 2531557 1313863 -1576404 -4459377
28698 -4459377 -4737405 -2027786 1215833 2663273 2635967 2970712 4215891 5036579 4167516
28689 4167516 1991564 -64146 -1126451 -1459647 -1671242 -1815084 -1529474 -862660 -520379
28680 -520379 -1136245 -2566306 -4069797 -4958206 -5010507 -4663639 -4881470 -6166136 -7401730
28671 -7401730 -6567782 -3322631 -26328 912409 28254 -292631 543893 642646 -1220441
28662 -1220441 -3584849 -4315664 -3230715 -1649061 -380584 634904 1399143 1778537 2013207
28653 2013207 2337458 2331820 1444501 -65916 -1372605 -2003007 -1968514 -1400886 -691291 -479455
$$ [...]
##END NTUPLES=NMR SPECTRUM
##END=
