##TITLE=31Pdec_99-2024
 CDCl3, 24 sc
 3.12.2024
##JCAMPDX= 6.0         $$ Bruker NMR JCAMP-DX V2.0
##DATA TYPE= NMR SPECTRUM
##DATA CLASS= NTUPLES
##ORIGIN= UXNMR, Bruker Analytische Messtechnik GmbH
##OWNER= root
$$ XWIN-NMR		Version 3.5
$$ Tue Dec  3 14:36:03 2024 Russian Standard Time (UT+4h)  she@DPX200
##.OBSERVE FREQUENCY= 81.013821
##.OBSERVE NUCLEUS= ^31P
##.ACQUISITION MODE= SIMULTANEOUS
##.ACQUISITION SCHEME= undefined
##.AVERAGES= 24
##.DIGITISER RES= 17
##SPECTROMETER/DATA SYSTEM= spect
##.PULSE SEQUENCE= zgpg30
##.SOLVENT NAME= CDCl3
##.SHIFT REFERENCE= (INTERNAL, CDCl3, 0, 198.062)
##AUDIT TRAIL= $$ (NUMBER, WHEN, WHO, WHERE, WHAT)
$$ ##TITLE= Audit trail, XWIN-NMR		Version 3.5
$$ ##JCAMPDX= 5.01
$$ ##ORIGIN= Bruker BioSpin GmbH
$$ ##OWNER= she
$$ F:/spectra/data/she/nmr/P31/2/pdata/1/auditp.txt
$$ ##AUDIT TRAIL=  $$ (NUMBER, WHEN, WHO, WHERE, WHAT)
(   1,<2024-12-03 14:35:06.76 +0400>,<she>,<DPX200>,
      <created by zg, POWCHK disabled, PULCHK disabled
       configuration hash MD5:
       00 E9 B6 7A A2 85 ED C7 34 08 36 98 17 FE 4E 26
       data hash MD5: 32K
       63 C6 2C 84 C3 2F 03 85 11 5E CD E8 67 7F 7E 76>)
(   2,<2024-12-03 14:35:09.06 +0400>,<she>,<DPX200>,
      <Start of raw data processing
       efp BC_mod = 2 LB = 1.5 FT_mod = 6 PKNL = 1 PHC0 = 2220.307 PHC1 = 260.2883 SI = 64K 
       data hash MD5: 64K
       70 1B 19 2C 66 BE B7 3D FE B6 D6 B6 E2 13 93 8B>)
(   3,<2024-12-03 14:35:26.67 +0400>,<she>,<DPX200>,
      <pk PHC0 = -8.705004 PHC1 = -15.6 
       data hash MD5: 64K
       32 1E 5F 0A 8A 3E 26 13 3B 97 00 D3 95 0E 19 FB>)
(   4,<2024-12-03 14:35:30.64 +0400>,<she>,<DPX200>,
      <abs ABSG = 5 
       data hash MD5: 64K
       EB C1 7B D6 A1 8D EE 82 F9 67 AA BF D5 5A 45 13>)
$$ ##END=
$$ 
$$ hash MD5
$$ 2E 04 4E 45 5B E1 EE 32 CE 5F B9 B2 05 40 A7 7A
##$RELAX= 
##$RELAX= 
##$RELAX= 
##$RELAX= 
##$RELAX= 
##$RELAX= 
##$RELAX= 
##$RELAX= 
$$ Bruker specific parameters
$$ --------------------------
##$DU= <F:/spectra>
##$EXPNO= 2
##$NAME= <P31>
##$PROCNO= 1
##$TYPE= <nmr>
##$USER= <she>
##$AMP= (0..31)
100 100 100 100 100 100 100 100 100 100 100 100 100 100 100 100 100 100 
100 100 100 100 100 100 100 100 100 100 100 100 100 100 
##$AQSEQ= 0
##$AQ_mod= 1
##$AUNM= <au_zg>
##$AUTOPOS= <>
##$BF1= 81.014009
##$BF2= 200.13
##$BF3= 200.13
##$BF4= 200.13
##$BF5= 200.13
##$BF6= 200.13
##$BF7= 200.13
##$BF8= 200.13
##$BYTORDA= 1
##$CFDGTYP= 0
##$CFRGTYP= 5
##$CHEMSTR= <none>
##$CNST= (0..31)
1 1 145 1 1 1 1 1 1 1 1 1 1 1 1 1 1 1 1 1 1 1 1 1 1 1 1 1 1 1 1 1 
##$CPDPRG= <waltz16>
##$CPDPRG1= <>
##$CPDPRG2= <waltz16>
##$CPDPRG3= <>
##$CPDPRG4= <mlev>
##$CPDPRG5= <mlev>
##$CPDPRG6= <mlev>
##$CPDPRG7= <mlev>
##$CPDPRG8= <mlev>
##$CPDPRGB= <>
##$CPDPRGT= <>
##$D= (0..31)
0 1 0 0 0 0 0 0 0 0.06 0 0.03 2e-05 3e-06 0 0 0.0002 0 0 0 0 0 0 0 0 0 
0 0 0 0 0 0 
##$DATE= 1733222106
##$DBL= (0..7)
120 120 120 11 120 120 24 19 
##$DBP= (0..7)
150 150 150 150 150 150 150 150 
##$DBP07= 0
##$DBPNAM0= <>
##$DBPNAM1= <>
$$ [...]
##$SUBNAM3= <"">
##$SUBNAM4= <"">
##$SUBNAM5= <"">
##$SUBNAM6= <"">
##$SUBNAM7= <"">
##$SUBNAM8= <"">
##$SUBNAM9= <"">
##$SW= 400.765351723535
##$SWIBOX= (0..15)
0 1 3 0 0 0 0 0 0 0 0 0 0 0 0 0 
##$SW_h= 32467.5324675325
##$TD= 32768
##$TD0= 1
##$TE= 0
##$TE2= 300
##$TE3= 300
##$TEG= 300
##$TL= (0..7)
0 120 53 12 22 120 120 120 
##$TP= (0..7)
150 150 150 150 150 150 150 150 
##$TP07= 0
##$TPNAME0= <>
##$TPNAME1= <>
##$TPNAME2= <>
##$TPNAME3= <>
##$TPNAME4= <>
##$TPNAME5= <>
##$TPNAME6= <>
##$TPNAME7= <>
##$TPOAL= (0..7)
0.5 0.5 0.5 0.5 0.5 0.5 0.5 0.5 
##$TPOFFS= (0..7)
0 0 0 0 0 0 0 0 
##$TUNHIN= 0
##$TUNHOUT= 0
##$TUNXOUT= 0
##$USERA1= <user>
##$USERA2= <user>
##$USERA3= <user>
##$USERA4= <user>
##$USERA5= <user>
##$V9= 5
##$VALIST= <valist>
##$VCLIST= <CCCCCCCCCCCCCCC>
##$VD= 0
##$VDLIST= <DDDDDDDDDDDDDDD>
##$VPLIST= <PPPPPPPPPPPPPPP>
##$VTLIST= <TTTTTTTTTTTTTTT>
##$WBST= 1024
##$WBSW= 4
##$XGAIN= (0..3)
0 0 0 0 
##$XL= 0
##$YL= 0
##$YMAX_a= 3464
##$YMIN_a= -5063
##$ZGOPTNS= <>
##$ZL1= 120
##$ZL2= 120
##$ZL3= 120
##$ZL4= 120
##$ABSF1= 198.0616
##$ABSF2= -202.7028
##$ABSG= 5
##$ABSL= 3
##$ALPHA= 0
##$AQORDER= 0
##$ASSFAC= 0
##$ASSFACI= 0
##$ASSFACX= 0
##$ASSWID= 0
##$AUNMP= <proc_1d>
##$AZFE= 0.1
##$AZFW= 0.5
##$BCFW= 0
##$BC_mod= 2
##$BYTORDP= 0
##$COROFFS= 0
##$CY= -3
##$DATMOD= 1
##$DC= 0
##$DFILT= <>
##$DTYPP= 0
##$F1P= 0
##$F2P= 0
##$FCOR= 1
##$FTSIZE= 65536
##$FT_mod= 6
##$GAMMA= 0
##$GB= 0
##$INTBC= 1
##$INTSCL= 9.790993e-09
##$ISEN= 30
##$LB= 1.5
##$LEV0= 0
##$LPBIN= 0
##$MAXI= 10000
##$MC2= 0
##$MEAN= 0
##$ME_mod= 0
##$MI= 50
##$NCOEF= 0
##$NC_proc= -8
##$NLEV= 6
##$NOISF1= 182.463
##$NOISF2= 159.3651
##$NSP= 0
##$NTH_PI= 0
##$NZP= 0
##$OFFSET= 198.0616
##$PC= 4
##$PHC0= 2211.602
##$PHC1= 244.6883
##$PH_mod= 1
##$PKNL= yes
##$PPARMOD= 0
##$PSCAL= 0
##$PSIGN= 0
##$REVERSE= no
##$SF= 81.0140089999434
##$SI= 65536
##$SIGF1= 159.3651
##$SIGF2= -187.1042
##$SINO= 113.3802
##$SIOLD= 16384
##$SREGLST= <1H.CDCl3>
##$SSB= 0
##$STSI= 65536
##$STSR= 0
##$SW_p= 32467.5324675325
##$SYMM= 0
##$S_DEV= 0
##$TDeff= 32768
##$TDoff= 0
##$TI= <>
##$TILT= no
##$TM1= 0
##$TM2= 0
##$TOPLEV= 0
##$USERP1= <user>
##$USERP2= <user>
##$USERP3= <user>
##$USERP4= <user>
##$USERP5= <user>
##$WDW= 1
##$XDIM= 65536
##$YMAX_p= 443732842
##$YMIN_p= -166262252
$$ End of Bruker specific parameters
$$ ---------------------------------
##NTUPLES= NMR SPECTRUM
##VAR_NAME=  FREQUENCY,     SPECTRUM/REAL,   SPECTRUM/IMAG
##SYMBOL=    X,             R,               I
##VAR_TYPE=  INDEPENDENT,   DEPENDENT,       DEPENDENT
##VAR_FORM=  AFFN,          ASDF,            ASDF
##VAR_DIM=   65536,         65536,           65536
##UNITS=     HZ,            ARBITRARY UNITS, ARBITRARY UNITS
##FACTOR=    0.49542278885378, 1,            1
##FIRST=     16045.7642231865, 0,            0
##LAST=      -16421.768244346, 0,            0
##MIN=       -16421.768244346, -166262252,   0
##MAX=       16045.7642231865, 443732842,    0
$$ Real data points
##PAGE= N=1
##DATA TABLE= (X++(R..R)), XYDATA
$$ [...]
42537b308373m71612L61236j64823m09384P67228K099668J800054J37828j117491
$$ -2308373 -2779985 -2418749 -2583572 -2992956 -2225728 -126060 1673994 1811822 694331
42528F94331j154254q05833j046618j775324k063263j051813J162011L103740
$$ 694331 -459923 -1265756 -2312374 -4087698 -6150961 -7202774 -6040763 -2937023
42520b937023K954172O93902j395222j294572K44122R05733O5515o67387j28869
$$ -2937023 17149 711051 -684171 -1978743 -1734621 -828888 -763373 -1430760 -1559629
42511a559629Q03815Q44807J70699k57863k65869k42284M5149J122899K375700
$$ -1559629 -755814 88993 259692 1829 -264040 -506324 -461175 661724 3037424
42502C037424K234917L76044j255780p32919J007416J140732r57656k393169q03622
$$ 3037424 5272341 5648385 4392605 3659686 4667102 5807834 4850178 2457009 1653387
42493A653387J821467J664061j341649l298653j890387Q44525K245549K547266
$$ 1653387 3474854 5138915 3797266 498613 -1391774 -547249 1698300 4245566
42485D245566K878226K518607P29001r02166q89603q03714k541973m264483k910656
$$ 4245566 7123792 9642399 10371400 9469234 8579631 7775917 5233944 969461 -1941195
42476a941195K95438J227618n39410j166560Q10350K046330K59699j911667j544113
$$ -1941195 -1645757 -418139 -957549 -2124109 -1313759 732571 992270 -919397 -2463510
42467b463510j38401m52336j633694j141223O58198J532875J544829K458385L806913
$$ -2463510 -2601911 -3054247 -4687941 -5829164 -5170966 -3638091 -2093262 365123 4172036
42458D172036L166631L05807k100644k309770j428016r27935o20390k8919J26565
$$ 4172036 7338667 7644474 5543830 3234060 1806044 878109 257719 228800 355365
42449C55365r01537k311468k471447q78343J192704J999180J210256K85785N62861
$$ 355365 -546172 -2857640 -5329087 -6207430 -5014726 -3015546 -1805290 -1519505 -956644
42440i56644J317458Q76984n06822p72864N22282J150705k31211j764936j454337
$$ -956644 360814 1237798 730976 -41888 480394 1631099 1399888 -365048 -1819385
42431a819385l74411l91511o24124P30650K444686J740126q25124j625903N85136
$$ -1819385 -2193796 -2585307 -3209431 -2478781 -34095 1706031 880907 -744996 -159860
42422a59860K837397K376670M5443j873081k628298k429294j049698J305526L116733
$$ -159860 2677537 5054207 5099650 3226569 598271 -1831023 -2880721 -1575195 1541538
42413A541538K989167J219473q28434k100777k242291j607326j123129j171473
$$ 1541538 4530705 5750178 4921744 2820967 578676 -1028650 -2151779 -3323252
42405c323252p64553Q88659K449976J983914J33647n90785K47319M70283p89853
$$ -3323252 -4087805 -3199146 -749170 1234744 1368391 777606 1024925 1495208 705355
42396G05355j530262m64352N52413m75156k415865k790009j218487P60159J957285
$$ 705355 -824907 -1289259 -736846 -1212002 -3627867 -6417876 -7636363 -6876204 -4918919
42387d918919J951351N98732j196481j511435J35483J603067J034027m15791n70904
$$ -4918919 -2967568 -2368836 -3565317 -5076752 -4941269 -3338202 -2304175 -2719966 -3290870
42378c290870L97896P19102K3466o59758j080250j646843j722385l44239J660745
$$ -3290870 -2892974 -2173872 -2150406 -2810164 -3890414 -5537257 -7259642 -7603881 -5943136
42369e943136K442754J817568J152898Q24033l583j122694j172083o7489P12517
$$ -5943136 -3500382 -1682814 -529916 294117 290534 -832160 -2004243 -2071732 -1359215
42360a359215P64846J415632K911579L200551R09439k222176l511972k700995
$$ -1359215 -594369 821263 3732842 6933393 7842832 5620656 2108684 -592311
42352e92311j573987j161323r58990m06132M12437J377785K331728K466702R75758
$$ -592311 -2166298 -3327621 -4286611 -4692743 -4280306 -2902521 -570793 1895909 2871667
42343B871667j409561k635651j674990J26991P69025O6744n22066k06413K49953
$$ 2871667 1462106 -1173545 -2848535 -2721544 -1952519 -1885775 -2407841 -2614254 -2364301
42334b364301J52691M2712L87800K98952r54950j919384m79380K600138L845215
$$ -2364301 -2211610 -2168898 -1781098 -1482146 -2437096 -4356480 -4835860 -2235722 1609493
42325A609493J576442j658845k460414q45465N28742L30070k19585K56972J382681
$$ 1609493 3185935 1527090 -933324 -1778789 -1250047 -919977 -1139562 -882590 500091
42316E00091J766592O78443j156201k000183p36105J539434K358288Q86948j015199
$$ 500091 2266683 2945126 1788925 -211258 -947363 592071 2950359 3837307 2822108
42307B822108j518051j123971r90606o45468O18932J535316O64679n84715K56857
$$ 2822108 1304057 180086 -810520 -1455988 -837056 698260 1362939 778224 1035081
42298A035081K378811K420965k50129k363507j780338n13212j061612k467078
$$ 1035081 3413892 5834857 5584728 3221221 1440883 927671 -133941 -2601019
42290b601019k242106k72808J509999K071277J834241J252827O34969O41278J374170
$$ -2601019 -4843125 -5115933 -3605934 -1534657 299584 1552411 2187380 2828658 4202828
42281D202828J644283N32519j058013j719136j518488j249435p11908M78715J188014
$$ 4202828 5847111 6379630 5321617 3602481 2083993 834558 122650 601365 1789379
42272A789379j3797k234512k958269j490611J61007K28959o59302q71719P7580
$$ 1789379 1775582 -458930 -3417199 -4907810 -4746803 -4517844 -5177146 -6048865 -5971285
42263e971285J492886K498878K372870Q64837j042143j554676j51183J426263
$$ -5971285 -4478399 -1979521 393349 1258186 216043 -1338633 -1489816 -63553
42255f3553J260699j68198p69800p7257r5810k126815m127714l043031O56518
$$ -63553 1197146 1028948 259148 181891 86081 -2040734 -6168448 -9211479 -8554961
42246h554961K978139J623523q97387r78950J008352J884395Q75699M28075J662304
$$ -8554961 -5576822 -3953299 -4850686 -5829636 -4821284 -2936889 -2061190 -1633115 29189
42237B9189K371560Q82780r59151p76616N50648N68577q02636j642425j400221
$$ 29189 2400749 3283529 2324378 1547762 2098410 2666987 1864351 221926 -1178295
42228a178295j219095j297228n08753J193432K222795J669326M09707m99085r74319
$$ -1178295 -2397390 -3694618 -4203371 -3009939 -787144 882182 1291889 792804 -181515
42219a81515j098565o86163j42610l99028j452664k121265j700029p80984j0206
$$ -181515 -1280080 -1966243 -2108853 -2507881 -3960545 -6081810 -7781839 -8562823 -8573029
42210h573029Q91138K305261L716736M040433K572964l22977k984636l397025
$$ -8573029 -7681891 -5376630 -1659894 2380539 4953503 4630526 1645890 -1751135
42202a751135j337570R07031J132733l0164l83710N02951J207304J267408J629330
$$ -1751135 -3088705 -2181674 -1048941 -1079105 -1462815 -959864 247440 1514848 3144178
42193C144178K169981J383120p62013k102074j473171l66494j72472m5107Q78949
$$ 3144178 5314159 6697279 5935266 3833192 2360021 1993527 1821055 1775948 2654897
42184B654897J285778j88136k286534k823600j830995q79453l14524N72824J375174
$$ 2654897 3940675 3752539 1466005 -1357595 -3188590 -4068043 -4382567 -3809743 -2434569
42175b434569R31147l89543q79147n9028O55807K2214j621557l007324k906102
$$ -2434569 -1503422 -1892965 -2772112 -2831140 -2175333 -2153119 -3774676 -6782000 -9688102
42166i688102p87866K265596L772117K393435j04179q62550M96200J820145J509870
$$ -9688102 -10475968 -8210372 -4438255 -2044820 -2148999 -3011549 -2515349 -695204 814666
42157H14666n7057j835164k950161k382292J58290K869301L306464J543250Q0542
$$ 814666 757609 -1077555 -4027716 -6410008 -6251718 -3382417 -75953 1467297 1547839
42148A547839K77665Q20155K93824p42119j218853j311305j519275j423637o11202
$$ 1547839 1825504 2645659 2939483 2197364 978511 -332794 -1852069 -3275706 -3886908
42139c886908K58799M40059K55637L49019O32156P34578O15621J49693q06797
$$ -3886908 -3628109 -3188050 -2932413 -2583394 -1951238 -1216660 -601039 -451346 -1258143
42130a258143j390776j93470K414919L912949K731616L55274r65506j191360j565050
$$ -1258143 -2648919 -2842389 -427470 3485479 6217095 6572369 5606863 4415503 2850453
42121B850453j988194j393158k0142P26769M20462j70571p77208j746628k502505
$$ 2850453 862259 -530899 -551041 175728 596190 425619 -351589 -2098217 -4600722
42112d600722j746268L85165J895190J320621n01298j611338j109566K38614J026293
$$ -4600722 -6346990 -5961825 -4066635 -2746014 -3247312 -4858650 -5968216 -5729602 -4703309
42103d703309O27920j03119J75514J274265J305324n60498k248969j366221J141351
$$ -4703309 -4075389 -4178508 -4002994 -2728729 -1423405 -1983903 -4232872 -5599093 -4457742
42094d457742K128493Q27325k58862M88407J365460L76896j512229k060480j118820
$$ -4457742 -2329249 -1501924 -1760786 -1272379 93081 469977 -1042252 -3102732 -4221552
42085d221552k13404J93697Q10336J400593Q12317p63062j510284n24285Q89322
$$ -4221552 -4434956 -4241259 -3430923 -2030330 -1218013 -1981075 -3491359 -4015644 -3126322
42076c126322J149216M34815l056L53879J010132J330232R27828l19623j915844
$$ -3126322 -1977106 -1542291 -1545347 -1191468 -181336 1148896 2076724 1757101 -158743
42067a58743k780219k309975j095668J1368J053068K313103K995800J975253m3385
$$ -158743 -2938962 -5248937 -6344605 -6333237 -5280169 -2967066 28734 2003987 1960602
42058A960602p14604P55374J968589L55358l004502m466653k616755k928N53276
$$ 1960602 1245998 2001372 3969961 4325319 1320817 -3145836 -5762591 -5765519 -5212243
42049e212243m33860n76832N74526J135024L0234j314578j072299L63743Q74753
$$ -5212243 -5646103 -6222935 -5648409 -4513385 -4483151 -5797729 -6870028 -6506285 -5631532
42040e631532n71965k441457k339526L3358K294934K244307P72134P02033K726832
$$ -5631532 -6203497 -8644954 -10984480 -10951122 -8656188 -6411881 -5639747 -4937714 -2210882
42031b210882M180075K757937j24236j392360o26761r0614q60031j395802m24445
$$ -2210882 1969193 4727130 4602894 3210534 2583773 2493159 1633128 237326 -187119
42022a87119R64865J153228K56823o29499j148271j438914j287461p52592o89742
$$ -187119 777746 1930974 2187797 1558298 410027 -1028887 -2316348 -3068940 -3758682
42013c758682j379907j515635M674J966900K147268L81411j278476j380924m48088
$$ -3758682 -5138589 -6654224 -6649550 -4682650 -2535382 -2153971 -3432447 -4813371 -5261459
42004e261459O00817J664557K427375J725687o69859k579128j453930K102922
$$ -5261459 -4660642 -2996085 -568710 1156977 487118 -2092010 -3545940 -1443018
41996a443018M349021K617876j452606l894406l001075o27360Q99516J370351
$$ -1443018 2906003 5523879 4071273 176867 -2824208 -3451568 -2552052 -1181701
41988a181701J504182J024349l00672r42871O08310K784427K386936n56173k231750
$$ -1181701 322481 1346830 1046158 103287 711597 3496024 5882960 5326787 3095037
41979C095037n23860J669296O62304k682606m536875l527849j578224j14540J381968
$$ 3095037 2571177 4240473 4902777 2220171 -2316704 -5844553 -7422777 -7537317 -6155349
41970f155349K954355L238296J774085K6222p89185j073717j315982j050616k66916
$$ -6155349 -3200994 37302 1811387 1837609 1048424 -25293 -1341275 -2391891 -2658807
41961b658807r7261r18942j250052J38187K134020K606324J042298j164623k391175
$$ -2658807 -2756068 -3675010 -4925062 -4786875 -2652855 -46531 995767 -168856 -2560031
41952b560031j949542k96620J220333J499277R70742Q58291J027673J31538j656461
$$ -2560031 -4509573 -4806193 -3585860 -2086583 -1115841 -257550 770123 901661 -754800
41943g54800k095107k16200J784656J680507M15847P3006K98637n47641j846916
$$ -754800 -2849907 -3066107 -1281451 399056 814903 887909 1186546 638905 -1208011
41934a208011j460619L77884J060744k37132j324985o20755O93533J157972J137731
$$ -1208011 -2668630 -2290746 -1230002 -1467134 -2792119 -3412874 -2719341 -1561369 -423638
41925d23638J100505J90636j702085k533940r09177J339514J669422O25922O05740
$$ -423638 676867 867503 -834582 -3368522 -4277699 -2938185 -1268763 -642841 -37101
41916c7101J743096J844374J81972j457120j896932k116701k747894k430290k18887
$$ -37101 1705995 3550369 3732341 2275221 378289 -1738412 -4486306 -6916596 -7135483
41907g135483K212941K669275J497286O16862L70251m65669j831164j903960j9662
$$ -7135483 -4922542 -2253267 -755981 -139119 231132 -234537 -2065701 -3969661 -3989323
41898c989323J902815J949233P49951R4033J50279k37215j123767j291252n56009
$$ -3989323 -2086508 -137275 612676 706709 856988 619773 -503994 -1795246 -2351255
41889b351255l41234j238073j659643k19056J779815J995147O02745J59395J678020
$$ -2351255 -2692489 -3930562 -5590205 -5809261 -4029446 -2034299 -1431554 -1272159 405861
41880D05861K838982J299774j615173k362213R3791K856205K881647O86900q93653
$$ 405861 3244843 4544617 2929444 567231 661022 3517227 6398874 7085774 6192121
41871F192121p51058o00716j913195l365663k561356M11107K639967J898308n80123
$$ 6192121 5441063 4840347 2927152 -438511 -2999867 -2588760 51207 1949515 1369392
41862A369392j600924J86948K800900L283133J001601j761046k433727j004467
$$ 1369392 -231532 -44584 2756316 6039449 7041050 5280004 2846277 1841810
41854A841810K17262k80533j168218k46322K055082K750208K92509l026443l824921
$$ 1841810 2059072 1778539 610321 363999 2419081 5169289 5461798 2435355 -1389566
41845a389566j741708O34309J297347O46195m1917k56556m196O88392J389563
$$ -1389566 -3131274 -2496965 -1199618 -553423 -595340 -851896 -856092 -167700 1221863
41836A221863J410045Q98191Q42626J429131J424161J5728j627071j735660l84081
$$ 1221863 2631908 3530099 4372725 5801856 7226017 7241745 5614674 3879014 3494933
41827C494933N80348k5708j272464j349748K55004K112850K317325N07116j733204
$$ 3494933 4075281 4049573 2777109 1427361 1682365 3795215 6112540 6619656 4886452
41818D886452k632607k035074r81451j3124J040864J805267J368078p6817r83640
$$ 4886452 2253845 218771 -762680 -775804 265060 2070327 3438405 3361588 2377948
41809B377948n40519K34401K69744L0449K98116O10725K31122l95034n57467o32169
$$ 2377948 1837429 2071830 2341574 2372023 2670139 3280864 3511986 3116952 2559485 1927316
41799A927316r77833n97764J147770K474682J244678j443129k399305r92698J66377
$$ 1927316 949483 351719 1499489 3974171 5218849 3775720 1376415 383717 550094
41790E50094m30469j124460m11647N09649K32389k30784N11205J426815P14733
$$ 550094 119625 -1004835 -1416482 -906833 -674444 -905228 -394023 1032792 1747525
41781A747525j039552j768675j128447n12867m70894l42653r8012l44630o75080
$$ 1747525 707973 -1060702 -2189149 -2702016 -3172910 -3515563 -3613575 -3958205 -4633285
41772d633285j48476O51501K97638o24879J38050K655756L861899J821170j257259
$$ -4633285 -4781761 -4130260 -3832622 -4457501 -4319451 -1663695 2198204 4019374 2762115
41763B762115k151274j029098m10848q89336o39623R46510J826044M28765j753711
$$ 2762115 610841 -418257 -829105 -1718441 -2358064 -1411554 414490 843255 -910456
41754i10456k154319n31783J164468J709560J732096J921001J684454L06763j625130
$$ -910456 -3064775 -3596558 -2432090 -722530 1009566 2930567 4615021 4921784 3296654
41745C296654k890852l076110k457428j102564P50249J924759J451624L47962
$$ 3296654 405802 -2670308 -5127736 -6230300 -5480051 -3555292 -2103668 -1755706
41737a755706N12429J629898J238408j263401k893942j181413J808414K092846
$$ -1755706 -1243277 386621 1625029 361628 -2532314 -3713727 -1905313 187533
41729A87533n56131k420775j190493J304662K333103J730819R33818N43264L86702
$$ 187533 -368598 -2789373 -3979866 -2675204 -342101 1388718 2322536 2865800 3252502
41720C252502O17554J234305J411615N63009o58340j384721j700883j859273j373753
$$ 3252502 3870056 5104361 6515976 7078985 6420645 5035924 3335041 1475768 102015
41711A02015q1740Q61402M51454m69732m60773K27822K25707n58453r05132n31560
$$ 102015 20275 881677 1333131 863399 402626 630448 856155 297702 -607430 -1138990
41701a138990n12754j129281j015028P69984L106510M160914L448722J718134
$$ -1138990 -1651744 -2781025 -3796053 -3026069 80441 4241355 7690077 9408211
41693I408211m10045k610142m054010l613981j217011J533588K562994J206763
$$ 9408211 8998166 6388024 2334014 -1279967 -2496978 -963390 1599604 2806367
41685B806367j213067k714861k435912j024937L69967R83638N45224n73169j166658
$$ 2806367 1593300 -1121561 -3557473 -4582410 -4212443 -3228805 -2683581 -3256750 -4423408
41676d423408j75933J685132K326500J006527m59554k43121R00645J082913L51205
$$ -4423408 -4599341 -2914209 -587709 418818 -40736 -283857 616788 1699701 2050906
41667B050906K95419J056449R98928m47719j760152j751240j137111q28744m12182
$$ 2050906 2346325 3402774 4401702 3953983 2193831 442591 -694520 -1523264 -1935446
41658a935446N30701J105354M88230n29441p82845n90643r33820j492175j014318
$$ -1935446 -1404745 -299391 188839 -340602 -1123447 -1714090 -2647910 -4140085 -5154403
41649e154403O91561K455568L270316L023660J898396J50534j494960k136017
$$ -5154403 -4462842 -2007274 1263042 4286702 6185098 6335632 4840672 2704655
41641B704655j532289j91803J151911J714903R33315o37484j303888j85646J288038
$$ 2704655 1172366 980563 2132474 3847377 4780692 4143208 2839320 2653674 3941712
41632C941712J074994o19629j625018r08909J50331j8997j112707j861528j921990
$$ 3941712 5016706 4397077 2772059 1863150 2013481 1994484 881777 -979751 -2901741
41623b901741j868435j909441j556314m24511J188230K470138K633342J513271
$$ -2901741 -4770176 -6679617 -8235931 -8660442 -7472212 -5002074 -2368732 -855461
41615h55461j88957j454263j750277j089066L70105K093216K812882J543925p77830
$$ -855461 -1044418 -2498681 -4248958 -5338024 -4967919 -2874703 -61821 1482104 704274
41606G04274j779664m26290J545735J753703L1712j756969k236263j708222r93927
$$ 704274 -1075390 -1501680 44055 1797758 1829470 72501 -2163762 -3871984 -4865911
41597d865911k96365L95966O48505M4127r89226j403518o48193P09690J572524
$$ -4865911 -5162276 -4766310 -4117805 -4073678 -5062904 -6466422 -7114615 -6404925 -4832401
41588d832401J380219M96808l60630q53867j106381j261248j197362o63794M22621
$$ -4832401 -3452182 -2955374 -3316004 -4169871 -5276252 -6537500 -7734862 -8398656 -7976035
41579g976035J731851K515341K140869Q77460j80610l51946j61830l67765o69479
$$ -7976035 -6244184 -3728843 -1587974 -710514 -891124 -1243070 -1404900 -1772665 -2442144
41570b442144l15496L40755K31609l89303J14920K061869L172701J394175j947792
$$ -2442144 -2757640 -2416885 -2185276 -2574579 -2459659 -397790 2774911 4169086 2221294
41561B221294l504276k098991M9594M46974p77374j643659r32443P45705J941682
$$ 2221294 -1282982 -3381973 -3332379 -2885405 -3662779 -5306438 -6238881 -5493176 -3551494
41552c551494J814534P89357J3308J6762J09273m41559j037255n52709O51050
$$ -3551494 -1736960 -947603 -934295 -917533 -808260 -1249819 -2287074 -2839783 -2188733
41543b188733Q89363l41272j434608j014058J13076M74897K43197M59743P74866
$$ -2188733 -1299370 -1640642 -3075250 -4089308 -3976232 -3501335 -3258138 -2798395 -2023529
41534b023529r4121j835376k458975j165828M11835O10227q4202k86670Q8032
$$ -2023529 -2117650 -3953026 -6412001 -7577829 -7165994 -6555767 -6639969 -6926639 -6838607
41525f838607K37899K47317Q82149J899455K058695J028105R3038M69928J696050
$$ -6838607 -6600708 -6353391 -5471242 -3571787 -1513092 -484987 -391949 77979 1774029
41516A774029K223900J172509q75134k486186k553151j185496L64125R26865O50076
$$ 1774029 3997929 5170438 4295304 1809118 -744033 -1929529 -1565404 -638539 11537
41507A1537O42563J333982J755527Q12536j149241k569867k349250r13424L66865
$$ 11537 654100 1988082 3743609 4556145 3406904 837037 -1512213 -2425637 -2058772
41498b058772N46417j13395n20072J54116J640591K766736K475717O99804j614132
$$ -2058772 -1512355 -1625750 -2145822 -1991706 -351115 2415621 4891338 5591142 3977010
41489C977010l173251l151194j701072J71457J421277J794809J757733J596100
$$ 3977010 803759 -2347435 -4048507 -3877050 -2455773 -660964 1096769 2692869
41481B692869R33573n32408k023519k056133k09329J872649K005585R4988j566594
$$ 2692869 3626442 3094034 1070515 -985618 -1194947 677702 2683287 2778275 1211681
41472A211681j126618N43363J388457J215666J435045J987230R81763j678086
$$ 1211681 85063 628426 2016883 3232549 4667594 6654824 7636587 5958501
41464E958501k820031l40425K829230K167408j842315m032729j770544J589203
$$ 5958501 3138470 2798045 5627275 7794683 5952368 1919639 149095 1738298
41456A738298J838674n10973k058424j653925q56028m75536L88950K013392L111798
$$ 1738298 3576972 3065999 1007575 -646350 -1502378 -1977914 -1588964 424428 3536226
41447C536226K621055Q76593j157039k573513k579835j245903p7173m20689j432042
$$ 3536226 6157281 7033874 5876835 3303322 723487 -522416 -599589 -1020278 -2452320
41438b452320j172296L64852J128640J40510j125606j111930k01967N09344R26728
$$ -2452320 -3624616 -3259764 -2131124 -1990614 -3116220 -4228150 -4430117 -3920773 -2994045
41429b994045J319808J281965O08493J98418P25482J178297J63053j779402k591368
$$ -2994045 -1674237 -392272 216221 414639 1140121 2318418 2481471 702069 -1889299
41420a889299j397553M00105R38168n4987j281085j342250M3781J882735K781854
$$ -1889299 -3286852 -2886747 -1948579 -2003566 -3284651 -4626901 -4583120 -2700385 81469
41411H1469K243535J126892O09491P72688N63672p78670k576751l284499k232880
$$ 81469 2325004 3451896 4061387 4834075 5397747 4619077 2042326 -1242173 -3475053
41402c475053n58089k2026q86578j503620m10841J664250K617842J554732k63883
$$ -3475053 -4033142 -4055168 -4941746 -6445366 -6856207 -5191957 -2574115 -1019383 -1283266
41393a283266j100095o39394n65l37311j588833k371743j298134J266724L220407
$$ -1283266 -2383361 -3022755 -3023320 -3360631 -4949464 -7321207 -8619341 -7352617 -4132210
41384d132210L061818J593515M76220n8883p02166j105180m34658M94227p715
$$ -4132210 -1070392 523123 999343 940460 238294 -866886 -1301544 -807317 -815032
41375h15032j476729j559025J48153J216750M47573k0863J454517K723837J125080
$$ -815032 -2291761 -3850786 -3702633 -2485883 -2038310 -2059173 -604656 2119181 3244261
41366C244261j873034k517084k16178K005515K081678R70016J31548k95072l91475
$$ 3244261 1371227 -1145857 -1362035 643480 2725158 3695174 3826722 3531650 3140175
41357C140175M5301L31962o30321k139743k057877j20824J177572M0680k100483
$$ 3140175 3185476 3517438 2887117 747374 -1310503 -1431327 -253755 -213075 -2313558
41348b313558k714985j349066N41574J702624J807589J036784P0511j43845N66612
$$ -2313558 -5028543 -6377609 -5836035 -4133411 -2325822 -1289038 -1218527 -1362372 -795760
41339g95760J359470J604216J525475J315689P42079Q0139J58578Q60028Q81676
$$ -795760 563710 2167926 3693401 5009090 5751169 5831308 5989886 6849914 7731590
41330G731590k99924j571391k049300k287704k648015k145912l47328J150031
$$ 7731590 7431666 5860275 3810975 1523271 -1124744 -3270656 -3617984 -2467953
41322b467953R22824Q8510M15171J176302L43440j686279k251422m66059J385129
$$ -2467953 -1545129 -1456619 -1041448 134854 478294 -1207985 -3459407 -3925466 -2540337
41313b540337J216334j61065p68719k53112L51436N38793O48391P84233N29991
$$ -2540337 -1324003 -1485068 -2253787 -2506899 -2155463 -1616670 -968279 -184046 345945
41304C45945l19797j333480j728122r48194P24518K074236J975456O54206o08893
$$ 345945 26148 -1307332 -3035454 -3983648 -3259130 -1184894 790562 1444768 835875
41295H35875j119546j369927j747943j575757k08789J491463J843756N44899p03314
$$ 835875 -283671 -1653598 -3401541 -4977298 -5186087 -3694624 -1850868 -1305969 -2009283
41286b009283k88203J074274J063721j106772l167573k356339Q79844L123174
$$ -2009283 -2297486 -1223212 -159491 -1266263 -4433836 -6790175 -5910331 -2787157
41278b787157K230393r4713r09807Q2599Q50717M07466j97981k25914n00881j586637
$$ -2787157 -556764 -651477 -1561284 -1478685 -627968 -220502 -418483 -644397 -1145278 -2731915
41268b731915k363224j609699M3462R55194O45618L3730j26318M67J17707N00663
$$ -2731915 -5095139 -6704838 -6661376 -5706182 -5060564 -5026834 -5153152 -5152685 -5034978 -4534315
41258d534315J556851K929069L327810J620908j600642l961594l624900j495130
$$ -4534315 -2977464 -48395 3279415 4900323 3299681 -661913 -4286813 -5781943
41250e781943l5005O0094M80618K167622L394737K315275k4137j093658m40705
$$ -5781943 -5816948 -5756854 -5276236 -3108614 286123 2601398 2577261 1483603 1042898
41241A042898K12158R357j30565K08350J7967r75204j208095L45313K198008K305546
$$ 1042898 1255056 1264413 1133848 1342198 1360165 384961 -823134 -477821 1720187 4025733
41231D025733R31686j09471l40233q86971k083543k670203j736598N8246J751248
$$ 4025733 4957419 4847948 4507715 3620744 1537201 -1133002 -2869600 -2811354 -1060106
41222a060106L177374M044201L271372N72962k177249k740410j393146n22557
$$ -1060106 2117268 6161469 9432841 10005803 7828554 5088144 3694998 3172441
41214C172441j280850k168626j509713O0527P06964Q9977m49623p2549N67471
$$ 3172441 1891591 -277035 -1786748 -1726221 -1019257 -929280 -1378903 -1451452 -883981
41205h83981O50748L22723N3681j88158n06557n30582M917O27795P59760O02142
$$ -883981 -233233 89490 143171 -44987 -551544 -1082126 -1077209 -449414 310346 912488
41195I12488P11524R87408Q10186N3174p05195r46176o73253k09458J6835k69816
$$ 912488 1624012 2611420 3421606 3474780 2769585 1823409 1150156 940698 957533 687717
41185F87717o43108j32011J298605J960875L81890k242634l103581j462119L85665
$$ 687717 44609 -87402 1211203 3172078 3553968 1311334 -1792247 -3254366 -2868701
41176b868701M31057m22005j60707J312067K438191K343987J423419K61376n98879
$$ -2868701 -2437644 -2859649 -3020356 -1708289 729902 3073889 4497308 4758684 4159805
41167D159805m29102O58695J030058n13322k597761k913048j573436p16012q98635
$$ 4159805 3730703 4389398 5419456 4906134 2308373 -604675 -2178111 -2894123 -3792758
41158c792758m08264J400926K669840K013645O21386k5559l60994r37150n67881
$$ -3792758 -4201022 -2800096 -130256 1883389 2504775 2479216 2118222 1181072 613191
41149F13191J390646K682943R79423k058269k711656p68883J77574j640547l532062
$$ 613191 2003837 4686780 5666203 3607934 896278 127395 304969 -1335578 -4867640
41140d867640k676476l47606K90395j149943k103690p80571J840618L571933L232806
$$ -4867640 -7544116 -7891722 -7601327 -8751270 -10854960 -11635531 -9794913 -6222980 -2990174
41131b990174J337283m99011q73414N4311O96930k1528j277085j465398k47837
$$ -2990174 -1652891 -2151902 -3025316 -2971005 -2274075 -2295603 -3572688 -5038086 -5285923
41122e285923J247571J936750J711090J013257K38684l27647m52933l0282Q39857
$$ -5285923 -4038352 -2101602 -390512 622745 861429 533782 80849 50567 890424
41113H90424J708231J783453O24812j000230j640971r46201j71276k89775m81373
$$ 890424 2598655 4382108 5006920 4006690 2365719 1419518 1248242 958467 477094
41104D77094L74356J395862O21226j722088k751161p08405K238278K607958K79084
$$ 477094 851450 2247312 2868538 1146450 -1604711 -2313116 -74838 2533120 2812204
41095B812204j442620n29008J097407P25171j026600j331287L68445J500632L18050
$$ 2812204 1369584 840576 1937983 2663154 1636554 305267 673712 2174344 2492394
41086B492394j588660j869236o29184N53612J321947K165549K353653O99870j833927
$$ 2492394 903734 -965502 -1594686 -1041074 280873 2446422 4800075 5499945 3666018
41077C666018k667745j084651Q53857J397281J149302J211507J152095J01188
$$ 3666018 998273 -86378 767479 2164760 3314062 4525569 5677664 5778852
41069E778852j472744k390816k295908j591605o67868Q5126M08912Q84957K333979
$$ 5778852 4306108 1915292 -380616 -1972221 -2640089 -2554963 -2146051 -1261094 1072885
41060A072885L952416L609383R12493j693116k136042j351188j151100j197786
$$ 1072885 5025301 8634684 9547177 7854061 5718019 4366831 3215731 2017945
41052B017945k12404J190576J368835M90362L2785J5792p84805k181240k615020
$$ 2017945 1805541 2996117 4364952 4855314 4888099 4903891 4119086 1937846 -677174
41043f77174j770153p70268J44514J586766K651609J495097j196550k302309q32706
$$ -677174 -2447327 -3217595 -3073081 -1486315 1165294 2660391 1463841 -838468 -1671174
41034a671174N41299n8678p44090N16649K049730J226522q89717j045893J026092
$$ -1671174 -1129875 -1188553 -1932643 -1415994 633736 1860258 970541 -75352 950740
41025I50740K273088R99581j106854j992932j659754q34206M77458J982892K441890
$$ 950740 3223828 4223409 3116555 1123623 -536131 -1370337 -892879 1090013 3531903
41016C531903J296681k87002j107237j534324k311655k794961j811179L03488
$$ 3531903 4828584 4541582 3434345 1900021 -411634 -3206595 -5017774 -4714286
41008d714286J924907K207980J704664R46837k92056j888709k618441j431138
$$ -4714286 -2789379 -581399 1123265 2070102 1778046 -110663 -2729104 -4160242
41000d160242R72246K675543K573196J248875q7752p97841p67977K7903J261903
$$ -4160242 -3187996 -512453 2060743 3309618 3221866 2424025 1656048 1683951 2945854
40991B945854J976959J379237j30713j346404j689357j618405j543010j152753
$$ 2945854 4922813 6302050 6171337 4824933 3135576 1517171 -25839 -1178592
40983a178592k61240M16023J08316p75400j122606p05268l73345n07816k84989
$$ -1178592 -1439832 -1023809 -915493 -1690893 -2813499 -3518767 -3892112 -4399928 -4684917
40974d684917Q55035J806488J042073r49903j821421m20741J487211J551628K8570
$$ -4684917 -3829882 -2023394 -981321 -1931224 -3752645 -4173386 -2686175 -1134547 -1105977
40965a105977q01823n6552O68748L2527r01945l55372J443828K589362J996193
$$ -1105977 -1907800 -1964352 -1295604 -1263077 -2165022 -2520394 -1076566 1512796 3508989
40956C508989L48340j102172j533451o14786J194479K420449J807309o2123j361725
$$ 3508989 3857329 2755157 1221706 606920 1801399 4221848 6029157 5967034 4605309
40947D605309j334415r30199r57946q95735j90209L63793m04297k215604l446542
$$ 4605309 3270894 2340695 1382749 487014 296805 660598 256301 -1959303 -5405845
40938e405845k944030j126410O67176J496060J506880J572047K254799L120779
$$ -5405845 -8349875 -9476285 -8809109 -7313049 -5806169 -4234122 -1979323 1141456
40930A141456L248552K363988J092685N0924q22229j771170k457414k133136n63592
$$ 1141456 4390008 6753996 7846681 7897605 7075376 5304206 2846792 713656 150064
40921A50064J445709K550380J962239J17419j729439k526410k037842p87633K19556
$$ 150064 1595773 4146153 6108392 6225811 4496372 1969962 -67880 -855513 -635957
40912f35957P2860j012679j475775k03513J658065K063196J142024R40378J729840
$$ -635957 -563097 -1575776 -3051551 -3255064 -1596999 466197 1608221 2548599 4278439
40903D278439J183269j423274k950281q51782K384579K595862J54419j088047
$$ 4278439 5461708 4038434 1088153 236371 2620950 5216812 5371231 4283184
40895D283184k30728k83195k421641l724387k095759L47737Q72310J8573l14313
$$ 4283184 4052456 3769261 1347620 -2376767 -4472526 -4124789 -3252479 -3233906 -3548219
40886c548219k5208K76353J215680L056945M009767K487844l96181k490177l129445
$$ -3548219 -3573427 -3297074 -2081394 975551 4985318 7473162 7076981 4586804 1457359
40877A457359k379915k8184K563019K173709j775169m804820l017107Q69936J338148
$$ 1457359 -922556 -950740 1612279 3785988 2010819 -2794001 -5811108 -4941172 -3603024
40868c603024j548160k540329L44181L026837K166115P784J18597J958991K615307
$$ -3603024 -5151184 -7691513 -7347332 -4320495 -2154380 -2146596 -2027999 -69008 2546299
40859B546299J436143N1682o42911r72766r91828o68602p82132j728721k132764
$$ 2546299 3982442 4034124 3391213 2418447 1426619 758017 -24115 -1752836 -3885600
40850c885600n99292J583835J598687q70186k727061j485489J295612K122633
$$ -3885600 -4484892 -2901057 -1302370 -2172556 -4899617 -6385106 -5089494 -2966861
40842b966861M12891p22962J016173L693558L834127J399513l68264Q0598O27277
$$ -2966861 -2553970 -3276932 -2260759 1432799 5266926 6666439 6298175 6378773 7006050
40833G006050n15881j602455l52626J874933J810058q38736l129141l229803k314693
$$ 7006050 6490169 4887714 4535088 6410021 8220079 7381343 4252202 1022399 -1292294
40824a292294j900212j714372q92958N16306J878024K491829J678728k38359j243606
$$ -1292294 -3192506 -4906878 -5799836 -5283530 -3405506 -913677 765051 526692 -716914
40815g16914K37959K603111K616201r4543k389765k061843n71118k09413o54637
$$ -716914 -478955 2124156 4740357 4645814 2256049 194206 -376912 -586325 -1240962
40806a240962j00613J512103K251621Q29851j706908l022824j922540K36117R08575
$$ -1240962 -1341575 170528 2422149 3252000 1545092 -1477732 -3400272 -3164155 -2255580
40797b255580m96725j735071r12007O87512P19279m02799l39451J128312J804887
$$ -2255580 -2752305 -4487376 -5399383 -4711871 -3992592 -4395391 -4734842 -3606530 -1801643
40788a801643Q32831k14793m00734o38993j117874m51549J484885K629900J948661
$$ -1801643 -968812 -1183605 -1584339 -2223332 -3341206 -3792755 -2307870 322030 2270691
40779B270691R95597R56537P82226k35310p54045p2097J03545j327744k543028
$$ 2270691 3266288 4222825 5005051 4769741 4015696 3943599 4047144 2719400 176372
40770A76372j790572l94222k78628o32958K46189J629212J672231N41692m29789
$$ 176372 -1614200 -2008422 -2287050 -2920008 -2673819 -1044607 627624 1169316 739527
40761G39527j238351k237538k205698k16023J926459K006632Q86038P44641J190086
$$ 739527 -498824 -2736362 -4942060 -5158083 -3231624 -1224992 -338954 405687 1595773
40752A595773L85086j128100j328119o06776r99358k038394j341865P31954J140432
$$ 1595773 1980859 852759 -475360 -1082136 -2081494 -4119888 -5461753 -4729799 -3589367
40743c589367o03035j297785O86868K786924K534674J134497P08404Q06196M181
$$ -3589367 -4192402 -5490187 -4803319 -2016395 518279 1652776 2361180 3167376 3171557
40734C171557j170521j246183k55860P21401J210057R93632m89277k790875l785452
$$ 3171557 2001036 754853 498993 1220394 2430451 3424083 2934806 143931 -3641521
40725c641521k119793N83689J618873O34139l33157J37582J185170J057358o53545
$$ -3641521 -5761314 -5177625 -3558752 -2924613 -3257770 -3120188 -1935018 -877660 -1531205
40716a531205k372301k090420K34108K215116J805103M5497m19830O92832R55183
$$ -1531205 -3903506 -5993926 -5759818 -3544702 -1739599 -1694102 -2113932 -1421100 -465917
40707d65917p23282k027795o02472K327103L548949K021240l40557j438805r50514
$$ -465917 -1189199 -3216994 -3819466 -1492363 2056586 4077826 3737269 2298464 1347950
40698A347950K45130J189704J268687M73576n13998r57931p93673m65719k92778
$$ 1347950 1593080 2782784 4051471 4525047 4011049 3053118 2259445 1793726 1500948
40689A500948l03387m28182n43669n11259l36209j29841K4646o5529o67165j490864
$$ 1500948 1197561 769379 225710 -285549 -621758 -751599 -726953 -792482 -1459647 -2950511
40679b950511j558153m66557O75811O32194l2860K47912J469791J832604L49813
$$ -2950511 -4508664 -4975221 -4299410 -3667216 -3700076 -3452164 -1982373 -149769 200044
40670B00044j733616k602139j778958K0728J785754K544042J951335J013098J156150
$$ 200044 -1533572 -4135711 -5914669 -5893941 -4108187 -1564145 387190 1400288 2556438
40661B556438K189160K312503N73569j849743l262288l158468j874669J03644
$$ 2556438 4745598 7058101 7631670 5781927 2519639 -638829 -2513498 -2409854
40653b409854J780890J891527M68865p78103n31077M95525P40007j36205j118362
$$ -2409854 -628964 1262563 1731428 953325 422248 917773 1657780 1521575 403213
40644D03213j202035k92971Q22674J126318M51310j47649J82206O33087j30061
$$ 403213 -798822 -1091793 -269119 857199 1308509 1160860 1343066 1976153 1846092
40635A846092j672358k181794j100581L55668J389358K394469L213142K705727
$$ 1846092 173734 -2008060 -3108641 -2752973 -1363615 1030854 4243996 6949723
40627F949723P80093j026779j726105j821930j551290m17614P55887p2306k644392
$$ 6949723 7729816 6703037 4976932 3155002 1603712 1186098 1941985 1869679 -774713
40618g74713l600254j121095J974909K104723j31703j499690r88249k26366j06140
$$ -774713 -4374967 -5496062 -3521153 -1416430 -1548133 -3047823 -4036072 -4262438 -4368578
40609d368578O9653M36820J20197r89419j879051j835238q85582P27635K243607
$$ -4368578 -4298925 -3862105 -3741908 -4731327 -6610378 -8445616 -9331198 -8603563 -6359956
40600f359956K345464Q41268n17762l11615O17773J030311J492702K628399K826383
$$ -6359956 -4014492 -3173224 -3690986 -4002601 -3384828 -2354517 -861815 1766584 4592967
40591D592967N24125k397397k637606k50129J696221J782006J333712J064519
$$ 4592967 5117092 2719695 82089 -168040 1528181 3310187 4643899 5708418
40583E708418J43537r88300l78482J853935K855442J288212o12934p62217k95644
$$ 5708418 5851955 4863655 4485173 6339108 9194550 10482762 9869828 9107611 8811967
40574H811967j006487k076790j703164l03122K73027k91086p00714l45553R1346
$$ 8811967 7805480 5728690 4025526 3722404 3995431 3704345 3003631 2658078 2749424
40565B749424J9995m27984r87735j499758j736259j618047j295341o64439N80271
$$ 2749424 2769419 2341435 1353700 -146058 -1882317 -3500364 -4795705 -5460144 -4879873
40556d879873K064192K700450K007627P24274k60266p93663j019985j015201j125110
$$ -4879873 -2815681 -115231 1892396 2616670 2356404 1562741 542756 -472445 -1597555
40547a597555j577944j547347Q890K205204K617482O25415j334940j066889M27518
$$ -1597555 -3175499 -4722846 -4713956 -2508752 108730 734145 -600795 -1667684 -1240166
40538a240166Q85492L16933N17355J797158K447503J503410J13735l65917j72440
$$ -1240166 -354674 -37741 479614 2276772 4724275 6227685 6341420 5975503 5803063
40529E803063k59817o78954p77683m64912l29366n78312o56403k22200R0640m63052
$$ 5803063 5543246 4864292 4086609 3621697 3292331 2714019 2057616 1835416 1926056 1463004
40519A463004j406880j499704o31832j74180q69456j501146p41832O28375Q71191
$$ 1463004 56124 -1443580 -2075412 -2249592 -3119048 -4620194 -5362026 -4733651 -3862460
40510c862460M6649j93362N88633R31167o0039j295822j418136n09549O11193
$$ -3862460 -3815811 -4009173 -3420540 -2489373 -2549412 -3845234 -5263370 -5772919 -5161726
40501e161726J533360J976448J545254N24618r5442j7173k416k96104L5857J402032
$$ -5161726 -3628366 -1651918 -106664 417954 322512 305339 302923 6819 42676 1444708
40491A444708K576003K295913R07707n71121j921147l089415l150608j429969
$$ 1444708 4020711 6316624 7224331 6653210 4732063 1642648 -1507960 -2937929
40483b937929R04382J850082J030520m95J07921J005715J406995O94631m95661
$$ -2937929 -2033547 -183465 847055 846560 954481 1960196 3367191 4061822 3566161
40474C566161j078983p40972j30285K64438P83398J515573J404396k48728k073304
$$ 3566161 2487178 1746206 1615921 1880359 2663757 4179330 5583726 5334998 3261694
40465C261694k243962j340819j306720j783241m90349K249857K865499L9660k474352
$$ 3261694 1017732 -323087 -1629807 -3413048 -3903397 -1653540 1211959 1251619 -1222733
40456a222733j157068J951246K516628L60833j141159p53622l88985q51477n91286
$$ -1222733 -2379801 -428555 2088073 2448906 1307747 554125 165140 -686337 -1277623
40447a277623P99555J371873J36584j287291j463582j047407p76715j640J396807
$$ -1277623 -478068 893805 1030389 -256902 -1720484 -2767891 -3544606 -3546246 -2149439
40438b149439J837211M46505j143871j080616R8933P27951N52851L59625J85862
$$ -2149439 -312228 134277 -1009594 -2090210 -1991277 -1263326 -710475 -350850 -164988
40429a64988l53644p51040k57079P06942J220498J378045J701419J631212K88933
$$ -164988 -518632 -1269672 -1526751 -819809 400689 1778734 3480153 5111365 5400298
40420E400298j543978k000357q17710K15744m0834n02007J61117J273207J222529
$$ 5400298 3856320 1855963 1038253 1253997 1213163 711156 872273 2145480 3368009
40411C368009N6178n04861L63435J317209O99029j183838k418163j752482J82578
$$ 3368009 3424187 2919326 3282761 4599970 5298999 4115161 1696998 -55484 127094
40402A27094J752800J809027M21472j204410j572737l77039Q24842K41570j729071
$$ 127094 1879894 3688921 4110393 2905983 1333246 956207 1781049 2022619 293548
40393B93548k751523j587820L45128J213051J255596J699941K244938J528906
$$ 293548 -2457975 -4045795 -3700667 -2487616 -1232020 467921 2712859 4241765
40385D241765k97257j464594j227390p78039j003660j064561j59986P58345L74902
$$ 4241765 3944508 2479914 1252524 474485 -529175 -1593736 -1753722 -995377 -620475
40376f20475q56395j399807r43865o42413j172595j768609j417695j36105J275157
$$ -620475 -1476870 -2876677 -3820542 -4462955 -5635550 -7404159 -8821854 -8957959 -7682802
40367g682802K119549K131905J444930O52212N53122J326590K074867J702040
$$ -7682802 -5563253 -3431348 -1986418 -1334206 -781084 545506 2620373 4322413
40359D322413L42703n98118j86179P31711O73952k63922m30825Q58477J999638
$$ 4322413 4665116 4066998 3880819 4612530 5286482 5022560 4591735 5450212 7449850
40350G449850J232683p55692j733986j090054n40555j406551k616134k297347
$$ 7449850 8682533 7926841 6192855 5102801 4562246 3155695 539561 -1757786
40342a757786m47360J080119R26670l55866j270291j087737l59744o3161n01059
$$ -1757786 -2205146 -1125027 -198357 -554223 -1824514 -2912251 -3271995 -3335156 -3836215
40333c836215j011907o84876O39909K073183K406201J261984l56890q38695L24302
$$ -3836215 -4848122 -5532998 -4893089 -2819906 -413705 848279 491389 -347306 -23004
40324b3004J619709R51212j685707l634642k431673J134950L718270L140303N66671
$$ -23004 1596705 2547917 862210 -2772432 -5204105 -4069155 -350885 2789418 3356089
40315C356089j267156j186703l23958j86780q41942j264583r60837n46077o18226
$$ 3356089 2088933 902230 578272 391492 -450450 -1715033 -2675870 -3221947 -3840173
40306c840173p54421k37204O82770J154658J117612J174875J104111k3068j800829
$$ -3840173 -4594594 -4831798 -4149028 -2994370 -1876758 -701883 402228 379160 -1421669
40297a421669k210946m08408J681318J951351J003083O84733Q48254j46389k169074
$$ -1421669 -3632615 -4041023 -2359705 -408354 594729 1279462 2127716 1981327 -187747
40288a87747l003278j554297O54491J699614J317310L16860m84181l10979J024783
$$ -187747 -3191025 -4745322 -4090831 -2391217 -1073907 -757047 -1241228 -1552207 -527424
40279e27424K202401J590371k37179r39406J41446R85555J82607r50191q88914
$$ -527424 1674977 3265348 3028169 2088763 2230209 3215764 3398371 2448180 1559266
40270A559266m94634j198459k210775j727858J10667J571102J943375J872959
$$ 1559266 1064632 -133827 -2344602 -4072460 -3961793 -2390691 -447316 1425643
40262A425643J617196Q72234K5278j65103P4522K9830l5159M60917P78841j80223
$$ 1425643 3042839 3915073 3940351 3775248 3849770 3879600 3844441 4305358 5084199 4903976
40252D903976j607919j682613o86181q04189k395830k956664q12162K364078M041966
$$ 4903976 3296057 1613444 927263 123074 -2272756 -5229420 -6041582 -3677504 364462
40243C64462L878821K772041Q21491j725707l080822j954207n3370K22j297988
$$ 364462 4243283 7015324 7836815 6111108 3030286 1076079 1022709 1022931 -275057
40234b75057j122535R34806J954310L89382j243782k54901J918176J904852m21258
$$ -275057 -1397592 -462786 1491524 1880906 637124 382223 2300399 4205251 3783993
40225C783993j884271q46017P08036N77008n14093n40595O57641J469886R36583
$$ 3783993 1899722 1053705 1761741 2338749 1824656 1284061 1941702 3411588 4348171
40216D348171l75188j502103j878780j256593N4428R37067M62071p87694j227870
$$ 4348171 3972983 2470880 592100 -664493 -610065 327002 789073 1379 -1226491
40207a226491k57578R67981R39598n78928k472115l366201k706634j128805J79770
$$ -1226491 -1484069 -516088 423510 -155418 -2627533 -5993734 -8700368 -9829173 -9649403
40198i649403O85969Q70189J173412J192731N64267J7986M86652J503047J687722
$$ -9649403 -8963434 -8093245 -6919833 -5727102 -5162835 -5144849 -4658197 -3155150 -1467428
40189a467428P34100l18677q15564j149910j467187j136791j02959N48125K20737
$$ -1467428 -733328 -1052005 -1867569 -3017479 -4484666 -5621457 -5724416 -5176291 -4955554
40180d955554q2930P21342K051391K507228J839812R96789O17324N05216L83924
$$ -4955554 -5038484 -4317142 -2265751 241477 2081289 3078078 3695402 4200618 4584542
40171D584542K61496R7623j61641k19473L06181J192956J600555Q34876r87317
$$ 4584542 4846038 4943661 4782020 4562547 4868728 6061684 7662239 8497115 7509798
40162G509798k893569l644222k739581r73079L85961R70499J330584J636246J310201
$$ 7509798 4616229 972007 -1767574 -2740653 -2354692 -1384193 -53609 1582637 2892838
40153B892838K39161o46878o17536j71186j53900n20948o42657k60123M56069
$$ 2892838 3131999 2485121 1867585 1696399 1542499 1021551 378894 118771 574840
40144E74840J205164J414997N66052p69423j118811r8357P49262Q1721j241309
$$ 574840 1780004 3195001 3761053 2991630 1872819 1774462 2523724 2605445 1364136
40135A364136j546745r01026o86019j101190q63160N16106J746837J615086P11982
$$ 1364136 -182609 -1083635 -1769654 -2870844 -3734004 -3217898 -1471061 144025 856007
40126H56007N86266J700739K785328K166899l33606k892830l456611k071613p33826
$$ 856007 1442273 3143012 5928340 8095239 7761633 4868803 1412192 -659421 -1393247
40117a393247p03158j055607n15515N52474J128528J351181J769183J664695L1291
$$ -1393247 -2096405 -3152012 -3667527 -3115053 -1986525 -635344 1133839 2798534 2829825
40108B829825k193558k830804j401334L73406J122773J180617J145651Q18597
$$ 2829825 636267 -2194537 -3595871 -3222465 -2099692 -919075 226576 1045173
40100A045173J42505k75307k54181m26905r31856q63477L38438J908513K661665
$$ 1045173 1187678 912371 658190 231285 -700571 -1564048 -1225610 682903 3344568
40091C344568K039895J20925k226355l076802j003726K485464L746287J301729
$$ 3344568 5384463 5505388 3279033 202231 -801495 1683969 5430256 6731985
40083F731985k057828k753243p89383Q69798M24204j004681j487220o12423N85816
$$ 6731985 4674157 1920914 1131531 2001329 2425533 1420852 -66368 -678791 -92975
40074i2975J063274P16066K50691K35706L13662k46748j216829j467178o89476
$$ -92975 970299 1686365 1937056 2172762 2486424 2239676 1022847 -444331 -1133807
40065a133807n2212m22140q97663k17253J073419J256373N0428p78925K34332
$$ -1133807 -1186019 -1608159 -2505822 -2723075 -1649656 -393283 -342855 -1121780 -887448
40056h87448K252742L056360J518163j321420l484535l926071l014867j503063
$$ -887448 1365294 4421654 5939817 4618397 1133862 -2792209 -5807076 -7310139
40048g310139K53335J797377K232580J422187R19515K171548L965401L538596
$$ -7310139 -7056804 -5259427 -3026847 -1604660 -685145 1486403 5451804 8990400
40040H990400O04501j805379j536482k62034m93941j518291r21454R68755J337954
$$ 8990400 9594901 7789522 6253040 5991006 5497065 3978774 3057320 4026075 5364029
40031E364029m73471j719271n48534J187740J079216q9569J8702J316096J576654
$$ 5364029 4890558 3171287 2622753 3810493 4889709 4800140 4818842 6134938 7711592
40022G711592K66954m86597O85646K060763J146743j848016m231971m040677j895825
$$ 7711592 7978546 7491949 8177595 10238358 11385101 9537085 5305114 1264437 -631388
40013f31388K11760R92214N06433m33373r38504m61094Q71496K237334K698167
$$ -631388 -419628 572586 1079019 645646 -292858 -753952 117544 2354878 5053045
40004E053045J964219N80377o37799j300291j581209j749051j701829j124687
$$ 5053045 7017264 7597641 6959842 5659551 4078342 2329291 627462 -497225
39996d97225j20356N64741K22462r46377j908444j808036p19450O04159J442821
$$ -497225 -617581 -52840 169622 -776755 -2685199 -4493235 -5212685 -4608526 -3165705
39987c165705J496719R38916L78478N18147J421422K156610J605905j63130j644414
$$ -3165705 -1668986 -730070 -351592 166555 1587977 3744587 5350492 5187362 3542948
39978C542948j436165K1142Q16068k3000j095105m17366J715571K945552K080538
$$ 3542948 2106783 2127925 2943993 2920993 1825888 1408522 3124093 6069645 8150183
39969H150183N84627P1508q0085j066958j967069r92784J179195J884537L87773
$$ 8150183 8734810 8806318 8726233 7659275 5692206 4699422 5878617 7763154 8150927
39960H150927j109114r03948P0515L70825P2731l96041j286211k098754j284403
$$ 8150927 7041813 6137865 6208380 6579205 6651936 6255895 4969684 2870930 1586527
39951A586527J061344K317493J005698p14653l91357Q51569M08229j466116k313560
$$ 1586527 2647871 4965364 5971062 5256409 4865052 5716621 6124850 4658734 2345174
39942B345174j378000m1509Q28930J352599J219196K97909j59328P12247J552668
$$ 2345174 967174 925665 1754595 3107194 4326390 4624299 4464971 5177218 6729886
39933F729886J153230J008527K457113L230916Q71379k079034j129909K935043
$$ 6729886 7883116 8891643 11348756 14579672 15451051 13372017 12242108 15177151
39925A5177151N141016M191372L695451N381524O846966O868993P326148Q840586
$$ 15177151 20318167 24509539 28204990 33586514 40433480 47302473 54628621 63469207
39917F3469207J0102890J2185841J7258344K2839553K5541501L1038857M8624690
$$ 63469207 73572097 85757938 103016282 125855835 151397336 182436193 231060883
39910B31060883P1618864P6446550N1060355J3546190j0359664j9765474l2886002
$$ 231060883 302679747 379126297 430186652 443732842 433373178 413607704 380721702
39903C80721702n4262359o7024155n9545143m2082291k9988743k4289668j8102656
$$ 380721702 326459343 259435188 199890045 157807754 127819011 103529343 85426687
39896H5426687j1571212r425433j0327343r132740o184415n596085o750813n420306
$$ 85426687 73855475 64430042 54102699 44969959 38785544 33189459 26438646 21018340
39888B1018340j852402m96757k220487l225302j835314o80951j441666k285066
$$ 21018340 19165938 18669181 16448694 13223392 11388078 10707127 9265461 6980395
39880F980395j610738l79580L62819R99663J460510P02395j047047j961785j266968
$$ 6980395 5369657 4990077 5352896 6352559 7813069 8515464 7468417 5506632 4239664
39871D239664j61519L30199M47747L56346l00943j182388j363324q94738n95988
$$ 4239664 4078145 4408344 4856091 5212437 4911494 3729106 2365782 1471044 875056
39862H75056l28456O60764J685164J050623j039392k030140l20380K472076L431235
$$ 875056 546600 1207364 2892528 3943151 2903759 873619 553239 3025315 6456550
39853F456550J560131j468937l015142j728133J102974K502749R78815j544532
$$ 6456550 8016681 6547744 3532602 1804469 2907443 5410192 6389007 4844475
39845D844475k081211m54891Q03770L19118l95522K54110J253467O13972j295305
$$ 4844475 2763264 2308373 3112143 3431261 3035739 3289849 4543316 5157288 3861983
39836C861983j860272K50969L153326M283001M041205N240431Q642493J0953433
$$ 3861983 2001711 2252680 5406006 9689007 13730212 18970643 27613136 38566569
39828C8566569Q893391L891870J40362j442195l927694q457817j1306860r088101
$$ 38566569 47459960 51351830 51492192 50049997 46122303 37664486 26357626 17269525
39820A7269525l994120p89027n29066n91639L14054P46795j84102j398788k032112
$$ 17269525 13275405 12486378 11957312 11365673 11679727 12426522 12242420 10843632 8811520
39811H811520k414814k505849j653871k60944M32269M41598Q24166J294862M22847
$$ 8811520 6396706 3890857 2236986 1976042 2408311 2849909 3674075 4968937 5391784
39802E391784j513219k352639j313926k8785L93495Q85740K022123K493698J320412
$$ 5391784 3878565 1525926 212000 183215 576710 1462450 3484573 5978271 7298683
39793G298683m56241j595459k242443k494599j561419J36306L09913j720644k985923
$$ 7298683 6842442 5246983 3004540 509941 -1051478 -915172 -605259 -2325903 -5311826
39784e311826q68615K489477K782556l38644k828114j855976R41315K385905J626304
$$ -5311826 -6180441 -3690964 -908408 -1247052 -4075166 -5931142 -4989827 -2603922 -977618
39775i77618Q1385q25630p20098J45N85362N30840J58535J63507M90174L34436
$$ -977618 -896233 -1721863 -2441961 -2441816 -1856454 -1325614 -1167079 -1003572 -513398 -178962
39765a78962n60199j322634j053470m6802M88508j93007j435354j671985l5101
$$ -178962 -739161 -2061795 -3115265 -3162067 -2673559 -2866566 -4301920 -5973905 -6009006
39756f009006K508417L999456L541704J992086N42016m77942j004124o29730M35238
$$ -6009006 -3500589 498867 4040571 6032657 6574673 6096731 5092607 4462877 4898115
39747D898115P69139n24032k081582j795117K29382J770246J484787J83813j040445
$$ 4898115 5667254 5143222 3061640 1266523 1495905 3266151 4750938 4934751 3894306
39738C894306k123685k805250j971297L63362J823569L55231k519749l171431
$$ 3894306 1770621 -1034629 -3005926 -2642564 -818995 -463764 -2983513 -6154944
39730f154944o19290K115748K077576R8899q52763R6940R83715K75530r05454
$$ -6154944 -6774234 -4658486 -2580910 -2482011 -3334774 -3237834 -2254119 -1978589 -2884043
39721b884043n65389J257208K451032J413527j091883k737669j997469K78826
$$ -2884043 -3449432 -2192224 258808 1672335 580452 -2157217 -4154686 -3875860
39713c875860J638057O49206j327060j674899O4434J395992J85050k299324k989999
$$ -3875860 -2237803 -1588597 -2915657 -4590556 -4526122 -3130130 -2945080 -5244404 -8234403
39704h234403j062040J263818J883506J104577L50785R6468p906l5839J44311
$$ -8234403 -9296443 -8032625 -6149119 -5044542 -4693757 -4597289 -4605195 -4641034 -4496723
39695d496723L24417L04021K77719K71816j31897q37430q18303L74584J429621
$$ -4496723 -4172306 -3868285 -3590566 -3318750 -3450647 -4288077 -5106380 -4731796 -3302175
39686c302175Q72767o19462r87781K11533J157963N42740m86483j67973J117928
$$ -3302175 -2429408 -3048870 -4036651 -3825118 -2667155 -2124415 -2610898 -2778871 -1660943
39677a660943J366251n9018j380544q32940Q91528J609135O53982k86695L15749
$$ -1660943 -294692 -353710 -1734254 -2567194 -1675666 -66531 587451 300756 616505
39668F16505J533697J208219j001155l045198l084185j490493K54588J574099
$$ 616505 2150202 3358421 2357266 -687932 -3772117 -5262610 -5008022 -3433923
39660c433923K701212L286140K472695M10853j395619j688832p89992L4674P8732
$$ -3433923 -732711 2553429 5026124 5436977 4041358 2352526 1562534 1597208 1675940
39651A675940l21164m93706k03992K09427J97328n00981j557576k224646j902772
$$ 1675940 1354776 861070 657078 866505 1063833 562852 -994724 -3219370 -5122142
39642e122142o37515Q84034J808879J663296N90406p74135j618302j390802k99098
$$ -5122142 -5759657 -4875623 -3066744 -1403448 -813042 -1587177 -3205479 -4596281 -4895379
39633d895379O22571M11523o23341j066548j54387J145943J464884R49717Q51576
$$ -4895379 -4272808 -3861285 -4484626 -5551174 -5705561 -4559618 -3094734 -2145017 -1293441
39624a293441J436573J592409P35026j78630j91819J57205k00229j134179j553201
$$ -1293441 143132 1735541 2470567 2291937 2100118 2257323 2057094 922915 -630286
39615f30286r86712p5120L22360r5651r22341j194530j52929J591268K226897
$$ -630286 -1616998 -1692118 -1369758 -1465409 -2387750 -3582280 -3735209 -2143941 82956
39606H2956Q48302j124584j542431j49740J367387J669943J049532N29612O90862
$$ 82956 931258 -193326 -1735757 -1885497 -518110 1151833 2201365 2730977 3421839
39597C421839J419896J970251J318408o61478k472177k452889r52990M2737m59233
$$ 3421839 4841735 6811986 8130394 7468916 4996739 2543850 1590860 1633597 1174364
39588A174364j409868j551045j012237m92069j9047N80097Q08289O8637j307268
$$ 1174364 -235504 -1786549 -2798786 -3290855 -3309902 -2729805 -1921516 -1852879 -3160147
39579c160147k297952k170720q81453R53722K148702J758674L13607n00298N5654
$$ -3160147 -5458099 -7628819 -8510272 -7556550 -5407848 -3649174 -3335567 -3835865 -3780211
39570c780211Q28322O09381q1589j09274K73072k1829q50807r03618K20226J415392
$$ -3780211 -2951889 -2342508 -2424097 -2533371 -2260299 -2282128 -3132935 -4036553 -3816327 -2400935
39560b400935J722558J324069O56317k11280q92037o08676N03568J046380J64322
$$ -2400935 -678377 645692 1302009 1090729 198692 -409984 93584 1139964 1304286
39551A304286j084624j097326P7096Q64701K37267j176625k002358j529044k04373
$$ 1304286 219662 -877664 -800568 64133 301400 -875225 -2877583 -4406627 -4611000
39542d611000Q54078Q52215O8343n10501l89485q666J63923L22994O70359P64735
$$ -4611000 -3756922 -2904707 -2836364 -3346865 -3736350 -3745016 -3581093 -3258099 -2587740 -1823005
39532a823005K61544k42022J9714P46638J027997P10802L18956r5208q08562j260615
$$ -1823005 -1561461 -1803483 -1783769 -1037131 -9134 701668 1020624 925416 116854 -1143761
39522a143761m35406J359325K446801J962300Q24498N0351m75289q22222k29424
$$ -1143761 -1579167 -219842 2226959 4189259 5013757 5064108 4588819 3766597 3537173
39513C537173J214765J580927l89368k834412k966567j086485j9761o79967q38936
$$ 3537173 4751938 6332865 5943497 3109085 142518 -943967 -963728 -1643695 -2482631
39504b482631J013323L103144L120938J560502M32712N8405o91164j735092j641315
$$ -2482631 -1469308 1633836 4754774 6315276 6747988 6806393 6115229 4380137 2738822
39495B738822j26082J228582J147817N9868j112301k152014k887608k593296j053299
$$ 2738822 2612740 3841322 4989139 5049007 3936706 1784692 -1102916 -3696212 -4749511
39486d749511N69394R26082J23156n98444m60188K68743R23814R54049R3064j158579
$$ -4749511 -4180117 -3254035 -3130879 -3729323 -4189511 -3920768 -2996954 -2042905 -1949841 -3108420
39476c108420j440787J01603K318626K937457J322432n36589m38923J306318K429802
$$ -3108420 -4549207 -4447604 -2128978 808479 2130911 1594322 1155399 2461717 4891519
39467D891519J582152l11562j558188j627661j231449j144887j501082j957051
$$ 4891519 6473671 6162109 4603921 2976260 1744811 599924 -901158 -2858209
39459b858209k089606j678877q34788J89595J319814K544902L438632L228486
$$ -2858209 -4947815 -6626692 -7461480 -7271885 -5952071 -3407169 31463 3259949
39451C259949J655126m85760j953298k079491j079175L14217J287264J359488
$$ 3259949 4915075 4429315 2476017 396526 -682649 -368432 918832 2278320
39443B278320P02493r5424o66085r48864p17348K34799J269610J245432J65662
$$ 2278320 2980813 2885389 2219304 1270440 553092 787891 2057501 3302933 3468595
39434C468595n82126l69197m29205j586729k243246o35514J857995K253224M66487
$$ 3468595 2886469 2517272 2088067 501338 -1741908 -2377422 -519427 1733797 2200284
39425B200284o33447N633K3615j926760l370518j974791L16510K52147j455208
$$ 2200284 1566837 1572470 1596085 -330675 -3701193 -5675984 -5359474 -5107327 -6562535
39416f562535j446901O55605J832246Q65352P3246R05626J439805J08948j185893
$$ -6562535 -8009436 -7353831 -5521585 -4656233 -4582987 -3677361 -2237556 -2128608 -3314501
39407c314501k62298J414876J035066q61939j265999M02016J547704P34406k84553
$$ -3314501 -3576799 -2161923 -1126857 -1988796 -3254795 -2852779 -1305075 -570669 -855222
39398h55222J92670J085512N39116j184911k477983k743046k368750j343780M12514
$$ -855222 -662552 422960 962076 -222835 -2700818 -5443864 -7812614 -9156394 -8743880
39389h743880J953325K181769J522003J237335J334957P46380m42741p22932L92829
$$ -8743880 -6790555 -4608786 -3086783 -1849448 -514491 231889 -210852 -933784 -540955
39380e40955J248186K91467j689971k588868j504674N61538J941289J594403j86999
$$ -540955 707231 998698 -691273 -3280141 -4784815 -4223277 -2281988 -687585 -874584
39371h74584j793366j682782j90336R19671J037167J396620K442048K400894J60132
$$ -874584 -2667950 -4350732 -4541068 -3621397 -2584230 -1187610 1254438 3655332 3815464
39362C815464k139565j854321o4849j07529k293630l312530j335505J424141K426844
$$ 3815464 1675899 -178422 -243271 -350800 -2644430 -5956960 -7292465 -5868324 -3441480
39353c441480K247550K499176K674734J415970n78619j292625l06952Q92800J001670
$$ -3441480 -1193930 1305246 3979980 5395950 4817331 3524706 3217754 4110554 5112224
39344E112224j39260j967570l263406k657595m86254Q37962j09570j403229m22736
$$ 5112224 4972964 3005394 -258012 -2915607 -3401861 -2563899 -2673469 -4076698 -4499434
39335d499434K102644L136695J900863O58076P61598O60923j126704l248760l304461
$$ -4499434 -2396790 739905 2640768 3298844 4060442 4721365 3594661 345901 -2958560
39326b958560j162890R53868J187049j12950j052369k48087J693205K814504K123206
$$ -2958560 -4121450 -3167582 -1980533 -2093483 -3145852 -3393939 -1700734 1113770 3236976
39317C236976O96457r0029m86838j294568j798906p33354J091471J359215l38619
$$ 3236976 3933433 3843404 3356566 2061998 263092 -470262 621209 1980424 1641805
39308A641805j784807j381059r4711O36437R70088J455478J512556O24240k60853
$$ 1641805 -143002 -1524061 -1618772 -982335 -12247 1443231 2955787 3580027 3319174
39299C319174q9276M74066R9512r85999j284348k23132J131446J466412N00950
$$ 3319174 3229898 3703964 3803476 2817477 1533129 1309997 2441443 3907855 4408805
39290D408805r95702j868083j447622j73017R02357J330627J432346J227093K25708
$$ 4408805 3413103 1545020 97398 -75619 826738 2157365 3589711 4816804 5042512
39281E042512j350548k239459j700842n45107L1820j69658o76252j123999j114885
$$ 5042512 3691964 1452505 -248337 -793444 -761624 -931282 -1607534 -2731533 -3846418
39272c846418k49431J040333J637156J319050J100808J359668R67828p48893k544528
$$ -3846418 -4095849 -3055516 -1418360 -99310 1001498 2361166 3328994 2580101 35573
39263C5573k976932k349037j549585k39731K018774L846812L394281J186196l56594
$$ 35573 -2941359 -5290396 -6839981 -7079712 -5060938 -1214126 2180155 3366351 3009757
39254C009757j46227O03631O83464M06900M13699M11189j91115j236969j913979
$$ 3009757 2863530 3467161 4150625 4557525 4971224 5382413 5191298 3954329 2040350
39245B040350j483406N0258J557231J485647l22678k012718j842259m18806L00641
$$ 2040350 556944 607202 2164433 3650080 3327402 1314684 -527575 -946381 -645740
39236f45740k43228q21065m94572L57019J063414J362071R96583p7677r21166
$$ -645740 -888968 -1710033 -2204605 -1847586 -784172 577899 1574482 1496805 575639
39227E75639l15371J454032K646310K231337R85727J03785k82640p41360j483945
$$ 575639 260268 1714300 4360610 6591947 7577674 7681459 7398819 6657459 5173514
39218E173514k131352k091514j088688K29045M87412q16129k194754j703529N14650
$$ 5173514 3042162 950648 -138040 91005 578417 -237712 -2432466 -4135995 -3621345
39209c621345K311368K182357P60948m21882o07842n5796M54202J85192p50529
$$ -3621345 -1309977 872380 1633328 1211446 603604 547808 1002010 1187202 436673
39200D36673j226020m96588O05185Q60503M87564M06721L07299o49446j565348
$$ 436673 -789347 -1285935 -680750 179753 667317 1074038 1381337 731891 -833457
39191h33457o18998J644861K330505K85966k124583k449738j158727J65372J441394
$$ -833457 -1452455 192406 2522911 2808877 684294 -1765444 -2924171 -2758799 -1317405
39182a317405K947724L419906J740393o16247j282130m88568m96660j840392k524546
$$ -1317405 1630319 5050225 6790618 6174371 4892241 4403673 3907013 2066621 -457925
39173d57925j238817P20672J439235P14848l72032j000443r37654k51722N53509
$$ -457925 -1696742 -976070 463165 1178013 805981 -194462 -1132116 -1383838 -830329
39164h30329P59885L65724K17120P16061J033795K99624q94085j069119R2869
$$ -830329 -70444 295280 512400 1228461 2262256 2561880 1667795 598676 691545
39155F91545J125776O22231q38298j343696j52792J288430J246227p5740r95309
$$ 691545 1817321 2439552 1601254 257558 104766 1393196 2639423 2563683 1568374
39146A568374o15992L79678J088659J392687J337781O25161o08101j325349p76958
$$ 1568374 952382 1332060 2420719 3813406 5151187 5776348 5168247 3842898 3065940
39137C065940K75777L23744j013380k428796k305290m56859J499172J644505q6980
$$ 3065940 3341717 3665461 2652081 223285 -2082005 -2538864 -1039692 604813 517833
39128E17833j556061q55240J189019J969823M92870j457570j824015o08283Q68705
$$ 517833 -1038228 -1893468 -704449 1265374 1758244 300674 -1523341 -2131624 -1262919
39119a262919J678382J375567k93532k476967l044912r04952K073295K962013
$$ -1262919 415463 1791030 1497498 -979469 -4024381 -4929333 -2856038 105975
39111A05975J322595n65145q87381k30968q3414p24846j312089j287674r47540
$$ 105975 1428570 863425 -23956 -254924 -338338 -1063184 -2375273 -3662947 -4610487
39102d610487q17732r46649r52926o87217n36597p03449m87112Q48393K525479
$$ -4610487 -5428219 -6374868 -7327794 -8015011 -8551608 -9255057 -9742169 -8893776 -6368297
39093f368297K795076J413503K04456L55727O42319l11832j417415p89874Q75199
$$ -6368297 -3573221 -2159718 -1955262 -1599535 -957216 -1269048 -2686463 -3476337 -2601138
39084b601138J052107o67218j882949j132724N4599o25k90768J018111L143741
$$ -2601138 -1549031 -2216249 -4099198 -5231922 -5177323 -5177948 -5468716 -4450605 -1306864
39075a306864L306955O46213k294332k605301m82959J217794N53536j274946j665999
$$ -1306864 2000091 2646304 351972 -2253329 -2736288 -1518494 -964958 -2239904 -3905903
39066c905903p7480J273359M79549j344509j559138L42775K148739K147320J295262
$$ -3905903 -3983383 -2710024 -2230475 -3574984 -5134122 -4791347 -2642608 -495288 799974
39057G99974J266665J655563P01256j672172l223324k217406K72731J671404Q76737
$$ 799974 2066639 3722202 4423458 2751286 -472038 -2689444 -2416713 -745309 131428
39048A31428q95677j908036j577223l14845J263489K381337K160093N97183r25171
$$ 131428 -764249 -2672285 -4249508 -4564353 -3300864 -919527 1240566 1837749 912578
39039I12578j127643n65564o92263j371099r75361O58715J285146n09441k698514
$$ 912578 -215065 -780629 -1472892 -2843991 -3819352 -3160637 -1875491 -2384932 -5083446
39030e083446k346032J77317J668506N44841j318636j575908l13553R11216J406707
$$ -5083446 -7429478 -7252161 -5583655 -5038814 -6357450 -7933358 -8246911 -7335695 -5928988
39021e928988J484059J254990O53690K31311P10675J745137K040835R44533p11870
$$ -5928988 -4444929 -3189939 -2536249 -2304938 -1594263 150874 2191709 3136242 2424372
39012B424372j638525j481542p72344J53305J409351K583083K392357K35100k283913
$$ 2424372 785847 -695695 -1468039 -1314734 94617 2677700 5070057 5305157 3021244
39003C021244k609977l09189K168953K366370N51744j133226j397081o85381Q937
$$ 3021244 411267 102078 2271031 4637401 5189145 4055919 2658838 1973457 1982394
38994A982394J02486m60421j047002n85050J084432K433162J863038j44295j567324
$$ 1982394 2084880 1624459 577457 -7593 1076839 3510001 5373039 5228744 3661420
38985C661420j368683l75225K93012N18515P40455J142057J484890J145289m95634
$$ 3661420 2292737 1917512 2210524 2729039 3469494 4611551 6096441 7241730 6746096
38976F746096k936868m241630k985879l12568J200057O54929m16662l86540P29765
$$ 6746096 3809228 -432402 -3418281 -3730849 -2530792 -1875863 -2292525 -2679065 -1949300
38967a949300J971953K535485J931283K98674j150257j131727O4599J014045J193314
$$ -1949300 22653 2558138 4489421 4788095 3637838 2506111 2570710 3584755 4778069
38958D778069J233555J232843N32506o41385j129984q09925p66679j084677n54855
$$ 4778069 6011624 7244467 7776973 7135588 6005604 5195679 4429000 3344323 2789468
38949B789468P50384R36137n69857j673261r51021m5824p17598j617014n48942
$$ 2789468 3539852 4475989 3906132 2232871 1281850 1236026 518428 -1098586 -1647528
38940a647528J685481K547309J726573R28602M70082p96980k430815k501543j129214
$$ -1647528 37953 2585262 4311835 5240437 5710519 4913539 2482724 -18819 -1148033
38931a148033q15118k255597k715055k51763K810216K913429K85221j526791n76144
$$ -1148033 -1963151 -4218748 -6933803 -7185566 -4375350 -1461921 -1176700 -2703491 -3279635
38922c279635J280057J354146m45659k002907j797235k83199J209947J949135
$$ -3279635 -1999578 -645432 -1091091 -3093998 -4891233 -5174432 -3964485 -2015350
38914b015350J876020J004167m22687j460431j179694J0806P39061O25702O65150
$$ -2015350 -139330 864837 442150 -1018281 -2197975 -2187169 -1448108 -822406 -157256
38905a57256J124473O09338j498536l090378j837506J154558K527689J294712
$$ -157256 967217 1576555 78019 -3012359 -4849865 -3695307 -1167618 127094
38897A27094j76122j39154J59067p49181j752019j124813K82996K21682j309644
$$ 127094 -49028 -188182 -29115 -778296 -2530315 -3655128 -3372132 -3150450 -4460094
38888d460094j978512p22059P28629N79677n45499r51709l72857K75553P96227
$$ -4460094 -6438606 -7160665 -6432036 -5852359 -6397858 -7349567 -7722424 -7446871 -6650644
38879f650644J721515K685490K467350J003500j26888J7042K50957p98287k274271
$$ -6650644 -4929129 -2243639 223711 1227211 1100323 1117365 1368322 570035 -1704236
38870a704236k135761j25718J889896K452254J891802J108908M74201K21435M74604
$$ -1704236 -3839997 -3965715 -2075819 376435 2268237 3377145 3851346 4072781 4547385
38861D547385M88709o78361k321403k562698j237535l99772j045172j475593l89175
$$ 4547385 5036094 4357733 2036330 -526368 -1763903 -2163675 -3208847 -4684440 -5073615
38852e073615O15355j95622j373879n72936J285397J447315J48733L13835K335551
$$ -5073615 -4458260 -4653882 -6027761 -6600697 -5315300 -3867985 -3719252 -3405417 -1069866
38843a069866K918985K78835k776865k797392k21056K032822K477272J485129
$$ -1069866 1849119 2127954 -648911 -3446303 -3667359 -1634537 842735 2327864
38835B327864m58848k558152k956839p07069K041968K141791l34063k046876q46444
$$ 2327864 1869016 -689136 -3645975 -4353044 -2311076 -169285 -503348 -2550224 -3396668
38826c396668J648005K656278J833759J007037J215415J496598O51019q97151
$$ -3396668 -1748663 907615 2741374 3748411 4963826 6460424 7111443 6214292
38818F214292j645845r76336J61384N39605j0228p94901j172596q09598L75190
$$ 6214292 4568447 3592111 3753495 4293100 4282872 3487971 2315375 1505777 1880967
38809A880967J813555K299291J246590l57843j076355p66699l44049k63253l79218
$$ 1880967 3694522 5993813 7240403 6882560 5806205 5039506 4695457 4432204 4052986
38800D052986q84109j916640k457518j306588P46155J480910L28595q75141p62345
$$ 4052986 3168877 1252237 -1205281 -2511869 -1765714 -284804 43791 -831350 -1593695
38791a593695j96958k72524l96646K49545Q56980K71219q74127r59529K51825
$$ -1593695 -1790653 -2063177 -2459823 -2210278 -1353298 -1082079 -1956206 -2915735 -2663910
38782b663910J452099J654464J094966N06111L16708L58684n2572j261351k344887
$$ -2663910 -1211811 442653 1537619 2043730 2360438 2719122 2666550 1405199 -939688
38773i39688k013296o24241J05751k14432q3754R77655J108799p74492k567567
$$ -939688 -2952984 -3577225 -3471474 -3685906 -3769660 -2792005 -1683206 -2457698 -5025265
38764e025265j811206O23093K000731J625488Q50645K67579m57078o81285M94599
$$ -5025265 -6836471 -6213378 -4212647 -2587159 -1736514 -1468935 -1926013 -2607298 -2112699
38755b112699J979322J860232O14362M11638J269708Q67442j390135l037903k207188
$$ -2112699 -133377 1726855 2341217 2752855 4022563 4890005 3499870 461967 -1745221
38746a745221j31795J043005Q37855o6901r05161o54730J156894K890842K303662
$$ -1745221 -1877016 -834011 3844 -63057 -968218 -1622948 -466054 2424788 4728450
38737D728450R8308p51067J64290q3235k409005l438724j000209J739291J063806
$$ 4728450 4826758 4075691 4239981 4156746 1747741 -1690983 -2691192 -951901 111905
38728A11905j343974j346598R78161K151837J381358J030860J515439N65056j975528
$$ 111905 -1232069 -2578667 -1600506 551331 1932689 2963549 4478988 5044044 3068516
38719C068516l148619j819779n09019p50322n29861J512678K915245J278495j501951
$$ 3068516 -80103 -1899882 -2408901 -3159223 -3689084 -2176406 738839 2017334 515383
38710E15383k058081n55618L11917j42832k96754L88935P27971L20235Q6258K88622
$$ 515383 -1542698 -2098316 -1786399 -1929231 -2225985 -1837050 -1109079 -788844 -702586 -413964
38700d13964K47888M1157M28508J084105Q95191L8832k24513J90184K80522L15714
$$ -413964 -166076 -124919 303589 1387694 2282885 2321717 2097204 2287388 2567910 2883624
38690B883624J589309L395341L027945o1960k691942k207839r7133O54385j62647
$$ 2883624 4472933 7868274 10896219 10834259 8142317 5934478 5837345 6491730 6329083
38681F329083p91052j007353j888879k912462k320854l22447Q62162N26054M25929
$$ 6329083 5538031 4530678 2641799 -270663 -2591517 -2913964 -2051802 -1525748 -1099819
38672a099819J423988J706888k07134k702402l137429j360809O11009J495067
$$ -1099819 324169 2031057 1823923 -878479 -4015908 -5376717 -4765708 -3270641
38664c270641J591940J360448Q79646N36191P48238R79958K72010j198214k207975
$$ -3270641 -1678701 -318253 561393 1097584 1845822 2825780 3097790 1899576 -308399
38655c08399k163073j544284o61476O84037J974127J867448J66949j266805p53491
$$ -308399 -2471472 -4015756 -4677232 -3993195 -2019068 -151620 15329 -1251476 -2004967
38646b004967Q00797J078893l83040j534560o44245J457262K654029K161854Q95350
$$ -2004967 -1204170 -125277 -508317 -2042877 -2687122 -1229860 1424169 3586023 4481373
38637D481373k46014j225011j985333j987617j250170q95753j663728k446455
$$ 4481373 4235359 3010348 1025015 -962602 -2212772 -3108525 -4772253 -7218708
38629g218708j483362J179720L595487M270550L367735J455782j280158l838124
$$ -7218708 -8702070 -7522350 -3926863 343687 3711422 5167204 3887046 48922
38621D8922m132003j531405J415161J671466m15782j814377j066589K94335P78967
$$ 48922 -4083081 -5614486 -4199325 -2527859 -2943641 -4758018 -5824607 -5530272 -4751305
38612d751305J057691K031681K791922K129262P15413j3217k41807j158429k444788
$$ -4751305 -3693614 -1661933 1129989 3259251 3974664 3961447 3719640 2561211 116423
38603A16423k399997o97792P82508M93147p79545j237555l99658P17310J044199
$$ 116423 -2283574 -2981366 -2198858 -1705711 -2485256 -3722811 -4122469 -3405159 -2360960
38594b360960L12934j036193k106175k073412j080876l02514n72889j256202j053408
$$ -2360960 -2048026 -3084219 -5190394 -7263806 -8344682 -8647196 -9220085 -10476287 -11529695
38585a1529695L18226J860612K547020K235739J410086N95864P8595k56867q05028
$$ -11529695 -11211469 -9350857 -6803837 -4568098 -3158012 -2562148 -2483553 -2740420 -3545448
38576c545448j565534j762082p40007Q69261J677229J320069Q41444R97118J116379
$$ -3545448 -5110982 -6873064 -7613071 -6743810 -5066581 -3746512 -2905068 -1907950 -791571
38567g91571L21139q77395j154476j93947R59605J267753O86322j73570p22753
$$ -791571 -470432 -1347827 -2502303 -2696250 -1736645 -468892 217430 43860 -678893
38558f78893o91328k27425L12703R32585J942200K896337K371436j12351k558870
$$ -678893 -1370221 -1597646 -1284943 -352358 1589842 4486179 6857615 6745264 4186394
38549D186394k477057k53996J227742N92574l92913l096O88783j12087j670770
$$ 4186394 1709337 1455341 2683083 3275657 2882744 2879648 3568431 3456344 1785574
38540A785574j771025k28472R15943N63990j66168j08236L69563N47949N57088
$$ 1785574 14549 -213923 702020 1266010 1099842 991606 1361169 1909118 2466206
38531B466206O14924L51278k63525m08465K69526P66330J33455r72043j195505
$$ 2466206 3081130 3432408 3168883 2760418 3029944 3796274 3929729 2957686 1762181
38522A762181m12419K94996K62848j76565o42568j265397k091212k625002k337849
$$ 1762181 1349762 1644758 1907606 1731041 1088473 -176924 -2268136 -4893138 -7230987
38513g230987j315241j51647O49145R99592J009925O66984R960l93077K86477
$$ -7230987 -8546228 -8697875 -8048730 -7049138 -6039213 -5372229 -5362269 -5755346 -5468869
38504e468869J941379L105200K513343P54466o06561j256220k118684l149751
$$ -5468869 -3527490 -422290 2091053 2845519 2238958 982738 -1135946 -4285697
38496d285697k942161j174905L32934K43215k04802N99729J686798J010848q77694
$$ -4285697 -7227858 -8402763 -8069829 -7826614 -8031416 -7431687 -5744889 -4734041 -5611735
38487e611735j296893M06292J749790R06014o98914q42268L22805J183294J334064
$$ -5611735 -6908628 -6502336 -4752546 -3846532 -4545446 -5387714 -5064909 -3881615 -2547551
38478b547551J461509J451307N29995j045660k083876k110987j551053n12921
$$ -2547551 -1086042 365265 895260 -150400 -2234276 -4345263 -5896316 -6409237
38470f409237J064490K237859J837148N66634M04779J427112J336878p92789k456672
$$ -6409237 -5344747 -3106888 -1269740 -703106 -298327 1128785 2465663 1672874 -783798
38461g83798j233354J366044K013632M49101n81056O8528M54700p10967j704806
$$ -783798 -2017152 -651108 1362524 1811625 1230569 1299097 1753797 1042830 -661976
38452f61976p32711R62093R89680n48429j391052l88932J347867K203336J510818
$$ -661976 -1394687 -432594 557086 8657 -1382395 -1771327 -423460 1779876 3290694
38443C290694l60178k060108j906376J08996J484310L933l051432m329268k811788
$$ 3290694 2930516 870408 -1035968 -926972 557338 561271 -2490161 -6819429 -9631217
38434i631217p21571Q7308L53075J295881K406140K617129K102555J549043Q64291
$$ -9631217 -10352788 -10265480 -9912405 -8616524 -6210384 -3593255 -1490700 58343 922634
38425I22634q8528n38492O8392Q47720O68751j49249n39171l79742k47366j57096
$$ 922634 834106 295614 364006 1211726 1880477 1731228 1192057 812315 564949 407853
38415D07853P7726k12072j705692l417115l372789j094214J769608L408458L401763
$$ 407853 485579 273507 -1432185 -4849300 -8222089 -9316303 -7546695 -4138237 -736474
38406g36474K229150L99325j475595k554272k335097j154878M7970M16933j00597
$$ -736474 1492676 1892001 416406 -2137866 -4472963 -5627841 -5579871 -5162938 -5263535
38397e263535n00002L32785K061893K939437J968214K88837l93963k5242K00609
$$ -5263535 -5763537 -5430752 -3368859 -429422 1538792 1827629 1433666 1408424 1609033
38388A609033k10817p70704j206739j578749j457815l69357J030552J523476J040455
$$ 1609033 1398216 627512 -579227 -2157976 -3615791 -3985148 -2954596 -1431120 -390665
38379c90665N43747K64027n24955j832572k471599j657196J3020J434506J842225
$$ -390665 153082 417109 -107846 -1940418 -4412017 -6069213 -6056193 -4621687 -2779462
38370b779462Q03602j313651k787657j969852M17677J896710J506827Q38499J245318
$$ -2779462 -1975860 -3289511 -6077168 -8047020 -7629343 -5732633 -4225806 -3387307 -2141989
38361b141989J819914J183903k58863j170694j229206r71945o20330j90008N1092
$$ -2141989 -322075 861828 602965 -567729 -1796935 -2768880 -3389210 -3579218 -3528126
38352c528126J89742P93906J537699R37582j295023k895788j740252J004063K293937
$$ -3528126 -3338384 -2544478 -1006779 -69197 -1364220 -4260008 -6000260 -4996197 -2702260
38343b702260J259434p3449M0728J021494J363462N35004r93967k382521k549601
$$ -2702260 -1442826 -1516275 -1475547 -454053 909409 1444413 450446 -1932075 -4481676
38334d481676p42772K275951M251095L430048M97148j877186j658144L55615J352763
$$ -4481676 -5224448 -2948497 1302598 4732646 5229794 3352608 1694464 2050079 3402842
38325C402842k4015j667003p63183J812957K134807j083510m009204k815829Q70194
$$ 3402842 3378827 1711824 948641 2761598 4896405 3812895 -196309 -3012138 -2141944
38316b141944K459013R14023o12135j66845O22068J64279m42940J09908Q51133
$$ -2141944 317069 1231092 618957 452112 1074180 1238459 795519 905427 1756560
38307A756560M29668l85021p6957J032668J371510M29971r32508j740550j370190
$$ 1756560 2186228 1801207 1724250 2756918 4128428 4558399 3625891 1885341 515151
38298E15151K86581K068368K081353J61239j430691j074245j09558l89867j063717
$$ 515151 801732 2870100 4951453 5112692 3682001 2607756 2498198 2108331 1044614
38289A044614k12689J465984J599769K85664L5655J290883J349435j007284k912056
$$ 1044614 831925 2297909 3897678 4183342 4218997 5509880 6859315 5852031 2939975
38280B939975j566971J366382K192412M81588q89702k71420R76703J220750N47278
$$ 2939975 1373004 2739386 4931798 5413386 4523684 4252264 5228967 6449717 6996995
38271F996995m78653j829624k893025k263679L0645J590432N16933j765930k258352
$$ 6996995 6518342 4688718 1795693 -467986 -437341 1153091 1670024 -95906 -2354258
38262b354258m38229J172995N38227j371733k146488r18531J012325J934111J374715
$$ -2354258 -2792487 -1619492 -1081265 -2452998 -4599486 -5518017 -4505692 -2571581 -1196866
38253a196866K26550k72361L03539J234990J513509R52602J92183k64177n06188
$$ -1196866 -970316 -1242677 -939138 295852 1809361 2761963 2954146 2689969 2183781
38244B183781p04868p62463o78193o87330p28824l10622O98860J609477J668020
$$ 2183781 1478913 716450 38257 -649073 -1377897 -1688519 -989659 619818 2287838
38235B287838Q88238k30709j304802j933332j583759l47432O30789L21039q44589
$$ 2287838 3176076 2945367 1640565 -292767 -1876526 -2223958 -1593169 -1272130 -2116719
38226b116719j564615j315182n25904N59728J972595K986501K419909M73110r66715
$$ -2116719 -3681334 -4996516 -5522420 -4962692 -2990097 -3596 2416313 2889423 1922708
38217A922708o74241K44442M5066j071898j381521l23430O27213P5184j375232
$$ 1922708 1248467 1492909 1537975 466077 -915444 -1238874 -611661 -536477 -1911709
38208a911709j973942j023527M80901J247957J115277Q58490R04575P47049j19285
$$ -1911709 -3885651 -4909178 -4428277 -3180320 -2065043 -1206553 -301978 445071 325786
38199C25786j041080o82732J148904K812211K577030P20151q58952r98773m05439
$$ 325786 -715294 -1398026 -249122 2563089 5140119 5860270 5001318 4002545 3597106
38190C597106k39056m63746k68162M30360P99817L17700n89506j256932j484072
$$ 3597106 3358050 2894304 2626142 3056502 3856319 4174019 3584513 2327581 843509
38181H43509j301262o75642J03624K58678o21569j801538k087489j216846l5185
$$ 843509 -457753 -1133395 -1029771 -771093 -1392662 -3194200 -5281689 -6498535 -6533720
38172f533720O57023Q92247J150821J699525K386386K686321K024791N74563m44848
$$ -6533720 -5876697 -4984450 -3833629 -2134104 252282 2938603 4963394 5537957 5093109
38163E093109o1471R27062P81175o60072j544995o70122O92786O33927p87529
$$ 5093109 5031638 5958700 6739875 6079803 4534808 3864686 4557472 5191399 4403870
38154D403870k045064k421423k293473j712847m03697R65843J175135L11031k19832
$$ 4403870 2358806 -62617 -2356090 -4068937 -4472634 -3506791 -2331656 -2020625 -2240457
38145b240457J96487O84821O38485O36148R87619Q96425K7333m61407L07816J225213
$$ -2240457 -2043970 -1359149 -720664 -84516 903103 1799528 1826861 1365454 1673270 2898483
38135B898483O80586j020357k189216k171158j719171j255763l96598O52813P99888
$$ 2898483 3579069 2558712 369496 -1801662 -3520833 -4776596 -5173194 -4520381 -3720493
38126c720493j72970p38958M76492K557242L137757J360193q96841j243755K44278
$$ -3720493 -3893463 -4632421 -4155929 -1598687 1539070 2899263 2002422 758667 1002945
38117A002945J176293J29165j302002p97345J079903J439357o01133k276195j090744
$$ 1002945 2179238 2308403 1006401 209056 1288959 2728316 2127183 -149012 -1239756
38108a239756J452052K060908L57202j178922j402474j660900k353851j454431
$$ -1239756 212296 2273204 2630406 1451484 49010 -1611890 -3965741 -5420172
38100e420172J862067M614043L605590J53840j601406m73183O48119l60339j875594
$$ -5420172 -3558105 1055938 4661528 4815368 3213962 2740779 3388898 3028559 1152965
38091A152965j638868l04009K31378K63368J355051K811199K093636r15129k850974
$$ 1152965 -485903 -789912 -558534 -295166 1059885 3871084 5964720 5049591 2198617
38082B198617j382661J384246J921918J51970j055704m28575L61498L6349k39678
$$ 2198617 815956 2200202 4122120 4274090 3218386 2789811 3151309 3187658 2947980
38073B947980P16402J711884J012250o91237j167863P100R46490L87582o20952
$$ 2947980 3664382 5376266 6388516 5697279 4529416 4536516 5483006 5870588 5249636
38064E249636n94965K07076M80732j37368q92192j259642j382894j295500p44074
$$ 5249636 4654671 4861747 5342479 5205111 4312919 3053277 1670383 374883 -369191
38055c69191N7356M09069K05435K01932P06387Q59706L1515q51812n75341L08255
$$ -369191 -311835 97234 302669 504601 1210988 2070694 2102209 1250397 675056 983311
38045I83311K43806o79824p26815M57216Q64392p06639k372490j811643K66228
$$ 983311 1227117 547293 -179522 277694 1142086 435447 -1937043 -3748686 -3482458
38036c482458J444214J324742J422567J930180J445905L1622l98388M33378R3389
$$ -3482458 -2038244 -713502 709065 2639245 4085150 4116772 3718384 4151762 4245151
38027D245151k605513m970776l920654m52895J749026J242795O3007L59527J859775
$$ 4245151 1639638 -3331138 -7251792 -7704687 -5955661 -4712866 -4649859 -4290332 -2430557
38018b430557K919322K585379J155003l85739j123781r61859p24641j182528k053104
$$ -2430557 488765 3074144 4229147 3843408 2719627 1757768 1033127 -149401 -2202505
38009b202505k251875j024800J207250K893035K536527M57942j096171o24366
$$ -2202505 -4454380 -5479180 -4271930 -1378895 1157632 1615574 519403 -104963
38001a04963M72307j5983j542573j714750m03089J98838j31790R13765L279134
$$ -104963 367344 351361 -1191212 -2905962 -3309051 -3110213 -3242003 -2328238 950896
37992I50896L296067k79599l088469j521952J427711J091560j267392j151057
$$ 950896 4246963 3967364 878895 -643057 784654 1876214 608822 -542235
37984e42235J159044J445557o27914r85763J322251K281193q3112k555192k534607
$$ -542235 616809 2062366 1434452 448689 1770940 4052133 3969021 1413829 -1120778
37975a120778j778091j977020j478622P52125K348620J813683J447977K741212
$$ -1120778 -2898869 -4875889 -6354511 -5602386 -3253766 -1440083 7894 2749106
37967B749106K907707j95138l482801l288953j276122j023936j643153n9537K527205
$$ 2749106 5656813 5461675 1978874 -1310079 -2586201 -3610137 -5253290 -5312827 -2785622
37958b785622K208501o79699j797893J13372J611978N87981q46515o43265J89695
$$ -2785622 -577121 -1256820 -3054713 -2941341 -1329363 -741382 -1587897 -2231162 -2041467
37949b041467L86682O39833J347916J191627k99429j278053l56560J221261J675822
$$ -2041467 -1654785 -1014952 332964 1524591 1225162 -52891 -409451 811810 2487632
37940B487632J160729P74619O43630K54566m40961j146652j514991r81289N46745
$$ 2487632 3648361 4422980 5066610 5321176 4880215 3733563 2218572 1237283 1784028
37931A784028J758095J148372p36297j796072j178312J0757P30752R39406N48639
$$ 1784028 3542123 4690495 3954198 2158126 979814 990571 1721323 2660729 3209368
37922C209368n51546j341068n95890Q88601J085357j51661j010888q57708r00751
$$ 3209368 2657822 1316754 720864 1609465 2694822 2543161 1532273 674565 -226186
37913b26186j421848j117115J37969O81912J65868M20636J969225K488000M34784
$$ -226186 -1648034 -2765149 -2627180 -1945268 -1779400 -1358764 610461 3098461 3533245
37904C533245k293217l183491k381230j330607l21564O66853P62546o0930K2568
$$ 3533245 1240028 -1943463 -4324693 -5655300 -5976864 -5310011 -4547465 -4608395 -4585827
37895d585827J784617K923753J361899j181643j601194Q816J012072M48306l22653
$$ -4585827 -2801210 122543 1484442 302799 -1298395 -1289579 -277507 170799 -151854
37886a51854o03527j077810j598144r23159Q73601J852459P53427j364746k539459
$$ -151854 -755381 -1833191 -3431335 -4354494 -3480893 -1628434 -875007 -2239753 -4779212
37877d779212j923151j92267J187112J100953r6286q35110k57630P18735R08717
$$ -4779212 -6702363 -6894630 -5707518 -4606565 -4702851 -5537961 -5795591 -5076856 -4168139
37868d168139N03788K71631J16915l10013m00070O34298K271816L117582K435837
$$ -4168139 -3664351 -3392720 -3275805 -3585818 -3985888 -3351590 -1079774 2037808 4473645
37859D473645N69645j420440k056446o64562J099843P00142j425502j710741J312481
$$ 4473645 5043290 3622850 1566404 901842 2001685 2701827 1276325 -434416 878065
37850H78065M131717L017582n24856k151301q90339M93043L37693l10996o14827
$$ 878065 5009782 8027364 7502508 5351207 4460868 4953911 5291604 4980608 4365781
37841D365781j041651j356247n25730R60322J290198K23613n52363j37878P57538
$$ 4365781 3324130 1967883 1442153 2402475 3692673 3916286 3363923 3226045 3983583
37832C983583J601416K203722J378560j656643m607562m054697m56364K012511
$$ 3983583 5584999 7788721 9167281 7510638 2903076 -1151621 -1607985 404526
37824D04526J238651m67197o24959J84327O05507P20854L79118j485657l974927
$$ 404526 1643177 1175980 551021 735348 1340855 2061709 2440827 955170 -3019757
37815c019757l820357j91057L026390K488499K82499L65350K327855K442127l26311
$$ -3019757 -6840114 -7031171 -4004781 -1516282 -1233783 -868433 1459422 3901549 3575238
37806C575238l088474l500621k241147q22243L40476J085086Q97506k2855n53753
$$ 3575238 486764 -3013857 -5255004 -6077247 -5736771 -4651685 -3754179 -3777034 -4330787
37797d330787j92131K17915j82545r47910q57795M65059J770091J363262o29246
$$ -4330787 -4522918 -4305003 -4487548 -5435458 -6293253 -5828194 -4058103 -2694841 -3324087
37788c324087j834764n29092J645292J652105m84038j582656p7010J783097J664438
$$ -3324087 -5158851 -5687943 -4042651 -2390546 -2874584 -4457240 -4534250 -2751153 -1086715
37779a086715N31796M79289J302257J402811N85161j38713m18544n32537n40612
$$ -1086715 -554919 -75630 1226627 2629438 3214599 3075886 2657342 2124805 1584193
37770A584193p41360j591522k174008q14690J606267J781593p67059j947931N06403
$$ 1584193 842833 -748689 -2922697 -3737387 -2131120 -349527 -1116586 -3064517 -2558114
37761b558114K506780j96449m358585l511098J832385M668743K087428j082762
$$ -2558114 -51334 -247783 -4606368 -8117466 -6285081 -1616338 471090 -611672
37753f11672n89649J267687P40050j249094j741105r21507q16334j188792l44822
$$ -611672 -1201321 66366 806416 -442678 -2183783 -3105290 -3921624 -5110416 -5455238
37744e455238J393950K098636J289601J88336m48920q53644j162286j264947j198441
$$ -5455238 -4061288 -1962652 -673051 -484715 -933635 -1787279 -2949565 -4214512 -5412953
37735e412953q11704P5705O87193p540j035390K2794L205175N271977M140064
$$ -5412953 -6224657 -6148952 -5461759 -5469299 -6504689 -6481895 -3276720 1995257 6135321
37726F135321J761714O00218k08849k392925m437954l523110l77168J411244N80913
$$ 6135321 7897035 8497253 8288404 5895479 1457525 -2065585 -2442753 -1031509 -450596
37717d50596n73674k10990Q80195J584554K175352K837539K706408J395999j68883
$$ -450596 -1024270 -1235260 -355065 1229489 3404841 6242380 8948788 10344787 10175904
37708A0175904j190273j821863k106669j643995p77630n60553j045991j123078
$$ 10175904 8985631 7163768 5057099 3413104 2635474 2074921 1028930 -94148
37700i4148m68080k4257r2947J90410P73242J12511k098164l495584k054424Q29212
$$ -94148 -562228 -586485 -679432 -489022 284220 396731 -1701433 -5197017 -7251441 -6422229
37690f422229K105902J012851n55293r94203m88996J97786P47433R65261P75038
$$ -6422229 -4316327 -3303476 -3858769 -4852972 -5341968 -5144182 -4396749 -3431488 -2656450
37681b656450P21689J382891K184627J922883O20475l04708n7005N04875M06469
$$ -2656450 -1934761 -551870 1632757 3555640 4176115 3871407 3814402 4319277 4725746
37672D725746K4820J19571K51933n86862k067542k507305j061430R73569J653049
$$ 4725746 4750566 4870137 5122070 4535208 2467666 -39639 -1101069 -127500 1525549
37663A525549P04347l21336r5637R46992J362369N32944p39303j345138j067593
$$ 1525549 2229896 1908560 1812923 2759915 4122284 4655228 3915925 2570787 1503194
37654A503194n34756l37060m42103l44566K98537J055324R14886l95355j422429
$$ 1503194 968438 631378 189275 -155291 143246 1198570 2113456 1718101 295672
37645B95672l43564K303266L476796J323697k015671k990717j385591k20656r19756
$$ 295672 -47892 2255374 5732170 7055867 5040196 2049479 663888 443232 -476524
37636d76524j340730K55726J964766J250841p68896j062982L50488N41813j329272
$$ -476524 -1817254 -1561528 403238 1654079 885183 -177799 172689 714502 -614770
37627f14770k574767j417616K52153K36396m54783K77023J878233K129305P67646
$$ -614770 -3189537 -4607153 -4355000 -4118604 -4573387 -4296364 -2418131 -288826 478820
37618D78820m41133p55293j173964k099717k432439j462006l3627P48848Q13269
$$ 478820 37687 -717606 -1891570 -3991287 -6423726 -7885732 -7919359 -7170511 -6357242
37609f357242P08442Q64428J488695K299865K284655O98565j584582k680607j771597
$$ -6357242 -5648800 -4784372 -3295677 -995812 1288843 1987408 402826 -2277781 -4049378
37600d049378K77792K280637L593982L644555J992753o13812k342780k160540
$$ -4049378 -3771586 -1490949 2103033 5747588 7740341 7126529 4783749 2623209
37592B623209r90492m61726r71090j457148q91312L29623O77852n84009k091321
$$ 2623209 1632717 1170991 199901 -1257247 -2148559 -1818936 -1141084 -1725093 -3816414
37583c816414j937601m72471R1907o57861l22867K177819L899128K032499j143756
$$ -3816414 -5754015 -6226486 -6134579 -6792440 -7115307 -4937488 -1038360 994139 -149617
37574a49617j185669J646673K685561Q1210k632613k298029l70026N27665O81052
$$ -149617 -1335286 311387 2996948 3078158 445545 -1852484 -2222510 -1694845 -1013793
37565a013793J383494J877695J009167k75706p10513j058600k217349k907987
$$ -1013793 369701 2247396 3256563 2980857 2270344 1211744 -1005605 -3913592
37557c913592j835963k92864J12165M42887K098543L254619J284200k384731l646503
$$ -3913592 -5749555 -6042419 -5930254 -5487367 -3388824 -134205 1149995 -1234736 -4881239
37548d881239j533418R02516J423665Q94815N29645J53859j83590K25194R16604
$$ -4881239 -6414657 -5512141 -4088476 -3193661 -2664016 -2510157 -2693747 -2468553 -1551949
37539a551949N86022l36562j50743P52661J08171j977016k388737L6316K198029
$$ -1551949 -965927 -1302489 -1453232 -700571 -592400 -2569416 -4958153 -4921837 -2723808
37530b723808J369479p21876r13058O06747J316554N77873k9083K13787L13164
$$ -2723808 -1354329 -2076205 -2989263 -2382516 -1065962 -488089 -517172 -303385 9779
37521I779l23614q73047m32558P60756J563877R21061r79803k358768j599265
$$ 9779 -313835 -1186882 -1619440 -858684 705193 1626254 646451 -1712317 -3311582
37512c311582M50566J333598M38453l33785M561n7765j232883j280441J235489
$$ -3311582 -2861016 -1527418 -1088965 -1422750 -1418189 -1475954 -2708837 -3989278 -2753789
37503b753789L306618J218017l289500m677589j436718J815391J278268o88634
$$ -2753789 552829 1770846 -1518654 -6196243 -7632961 -5817570 -4539302 -5227936
37495e227936L04396L808659N211863K383733j608268k921975j557914k02988
$$ -5227936 -4923540 -1114881 4096982 6480715 4872447 1950472 392558 189570
37487A89570j44852l19779J21309L68804l65376j253695j063628m1284O55444
$$ 189570 44718 -275061 -153752 215052 -150324 -1404019 -2467647 -2508931 -1853487
37478a853487P82864Q84057P42268l81753j941358k257715r46813L83638N55877
$$ -1853487 -1070623 -186566 555702 173949 -1767409 -4025124 -4971937 -4588299 -4032422
37469d032422M16872J036541J732754J242656j78536j288461j787390k267670
$$ -4032422 -3615550 -2579009 -846255 396401 217865 -1070596 -2857986 -5125656
37461e125656k621721j892789K19171K608574L654444K531699l0443k035883j949413
$$ -5125656 -7747377 -9640166 -9420995 -6812421 -3157977 -626278 -656721 -2692604 -4642017
37452d642017m96402J58663n89607r43954L56653J822966J390266m69660j601068
$$ -4642017 -5138419 -4979756 -5569363 -6513317 -6156664 -4333698 -2943432 -3413092 -5014160
37443e014160j217948k31462P60420J771863K136396J043181o55092j115774j25587
$$ -5014160 -6232108 -6463570 -5703150 -3931287 -1794891 -751710 -1406802 -2522576 -2648163
37434b648163P43196P21730P19359J308062J705261J311650N84202j53271j090347
$$ -2648163 -1904967 -1183237 -463878 844184 2549445 3861095 4445297 4292026 3201679
37425C201679j604326m54413J862820K858287J343784p35141j137420l66084j94052
$$ 3201679 1597353 1142940 3005760 5864047 7207831 6472690 5335270 4969186 4775134
37416D775134o21704m18531K55676O8034r64417j267946j55648J252223J807447
$$ 4775134 4153430 3734899 3990575 4058609 3094192 1826246 1670598 2922821 4730268
37407D730268J547213Q64214j08047r08289q96487m48157o71789j376179p87544
$$ 4730268 6277481 7141695 7033648 6125359 5228872 4780715 4108926 2732747 1945203
37398A945203J703511L831608L003941j89995k637950k625315j492331j139053
$$ 1945203 3648714 7480322 10484263 10294268 7656318 5031003 3538672 2399619
37390B399619j388354p50040J057871K495072K041109n0100k040291k469486j436331
$$ 2399619 1011265 261225 1319096 3814168 5855277 5805177 3764886 1295400 -140931
37381a40931j46989N89553R97144J365796J192363R0216r35150m24519J254125
$$ -140931 -287920 301633 1298777 2664573 3856936 3947152 3012002 2587483 3841608
37372C841608J958132O26351j247210j830180j315949q43490l29129Q21516J701013
$$ 3841608 5799740 6426091 5178881 3348701 2032752 1189262 860133 1681649 3382662
37363C382662P91577j358679k494409j823088p44423j10920R07305K386074K473128
$$ 3382662 4174239 2815560 321151 -1501937 -2246360 -2357280 -1449975 936099 3409227
37354C409227K77678j941714j509484R54310K533640J894896K48495r85908j513013
$$ 3409227 3686905 1745191 235707 1190017 3723657 5618553 5867048 4881140 3368127
37345C368127j321372l16239R25708J324818N57645o10878j237928q73833K76430
$$ 3368127 2046755 1730516 2656224 3981042 4538687 3927809 2689881 1816048 2092478
37336B092478J257922J140402N50333J237556L047574K962330q29548n299675
$$ 2092478 3350400 4490802 5041135 6278691 9326265 12288595 11459047 6159372
37328F159372n811761k293907R07200J217220M84456P82641J095080j0482j307714
$$ 6159372 347611 -1946296 -1039096 178124 662580 1445221 2540301 2529819 1222105
37319A222105j017207J5389j35772j106770j035203Q9838M42183n14642j247858
$$ 1222105 204898 220287 84515 -1022255 -2057458 -1967620 -1525437 -2040079 -3287937
37310c287937p17741K45943O07179N60129O84110R23621J061767J235696J388101
$$ -3287937 -4005678 -3759735 -3152556 -2592427 -1908317 -984696 77071 1312767 2700868
37301B700868J020548N9149p33123p86275n88380r24989j701422k142731j860536
$$ 2700868 3721416 3780565 3047442 2261167 1672787 747798 -953624 -3096355 -4956891
37292d956891j083380j18J389782K627214K664479R40602j603101l078537k358343
$$ -4956891 -6040271 -6040389 -4650607 -2023393 641086 1581688 -21413 -3099950 -5458293
37283e458293q2081J996184K491347J386290o4611m52685M06197J273004J061972
$$ -5458293 -5540374 -3544190 -1052843 333447 268836 -183849 222348 1495352 2557324
37274B557324L46002M66003J280530J103141p00255k430669k348542j108721n93161
$$ 2557324 2903326 3369329 4649859 5753000 5052745 2622076 273534 -835187 -1428348
37265a428348j158851j569256j138283l30963N51929J693679K709218K720860
$$ -1428348 -2587199 -4156455 -5294738 -5625701 -5073772 -3380093 -670875 2049985
37257B049985J717273O51491O6861k41642k52991K50415O69073P6861j125824
$$ 2049985 3767258 4418749 4485610 4243968 3990977 4241392 4910465 4987326 3861502
$$ [...]
##END NTUPLES=NMR SPECTRUM
##END=
