##TITLE=31Pdec_98-2024-Bay
 DMSO-d6, 24 sc
 29.11.2024
##JCAMPDX= 6.0         $$ Bruker NMR JCAMP-DX V2.0
##DATA TYPE= NMR SPECTRUM
##DATA CLASS= NTUPLES
##ORIGIN= UXNMR, Bruker Analytische Messtechnik GmbH
##OWNER= root
$$ XWIN-NMR		Version 3.5
$$ Fri Nov 29 13:47:39 2024 Russian Standard Time (UT+4h)  she@DPX200
##.OBSERVE FREQUENCY= 81.013821
##.OBSERVE NUCLEUS= ^31P
##.ACQUISITION MODE= SIMULTANEOUS
##.ACQUISITION SCHEME= undefined
##.AVERAGES= 64
##.DIGITISER RES= 17
##SPECTROMETER/DATA SYSTEM= spect
##.PULSE SEQUENCE= zgpg30
##.SOLVENT NAME= CDCl3
##.SHIFT REFERENCE= (INTERNAL, CDCl3, 0, 198.062)
##AUDIT TRAIL= $$ (NUMBER, WHEN, WHO, WHERE, WHAT)
$$ ##TITLE= Audit trail, XWIN-NMR		Version 3.5
$$ ##JCAMPDX= 5.01
$$ ##ORIGIN= Bruker BioSpin GmbH
$$ ##OWNER= she
$$ F:/spectra/data/she/nmr/P31/2/pdata/1/auditp.txt
$$ ##AUDIT TRAIL=  $$ (NUMBER, WHEN, WHO, WHERE, WHAT)
(   1,<2024-11-29 13:46:31.62 +0400>,<she>,<DPX200>,
      <created by zg, POWCHK disabled, PULCHK disabled
       configuration hash MD5:
       00 E9 B6 7A A2 85 ED C7 34 08 36 98 17 FE 4E 26
       data hash MD5: 32K
       AF A6 65 03 52 15 4E 23 B7 5F 23 06 70 27 2D 3D>)
(   2,<2024-11-29 13:46:34.39 +0400>,<she>,<DPX200>,
      <Start of raw data processing
       efp BC_mod = 2 LB = 1.5 FT_mod = 6 PKNL = 1 PHC0 = 2217.861 PHC1 = 272.4883 SI = 64K 
       data hash MD5: 64K
       55 34 1F 04 8E E6 78 22 C1 93 C3 55 74 7F DE A7>)
(   3,<2024-11-29 13:47:03.76 +0400>,<she>,<DPX200>,
      <pk PHC0 = -4.093898 PHC1 = -50.00001 
       data hash MD5: 64K
       57 5F B5 0C 61 BF BE 15 BF 5F D5 26 80 3A 99 D4>)
(   4,<2024-11-29 13:47:07.10 +0400>,<she>,<DPX200>,
      <abs ABSG = 5 
       data hash MD5: 64K
       64 37 7C 3E F9 2C B4 2B 0A 2E B2 B8 85 3A 4D F5>)
$$ ##END=
$$ 
$$ hash MD5
$$ AF D5 64 2E 45 44 A3 35 C5 D5 25 18 8B 07 A9 BE
##$RELAX= 
##$RELAX= 
##$RELAX= 
##$RELAX= 
##$RELAX= 
##$RELAX= 
##$RELAX= 
##$RELAX= 
$$ Bruker specific parameters
$$ --------------------------
##$DU= <F:/spectra>
##$EXPNO= 2
##$NAME= <P31>
##$PROCNO= 1
##$TYPE= <nmr>
##$USER= <she>
##$AMP= (0..31)
100 100 100 100 100 100 100 100 100 100 100 100 100 100 100 100 100 100 
100 100 100 100 100 100 100 100 100 100 100 100 100 100 
##$AQSEQ= 0
##$AQ_mod= 1
##$AUNM= <au_zg>
##$AUTOPOS= <>
##$BF1= 81.014009
##$BF2= 200.13
##$BF3= 200.13
##$BF4= 200.13
##$BF5= 200.13
##$BF6= 200.13
##$BF7= 200.13
##$BF8= 200.13
##$BYTORDA= 1
##$CFDGTYP= 0
##$CFRGTYP= 5
##$CHEMSTR= <none>
##$CNST= (0..31)
1 1 145 1 1 1 1 1 1 1 1 1 1 1 1 1 1 1 1 1 1 1 1 1 1 1 1 1 1 1 1 1 
##$CPDPRG= <waltz16>
##$CPDPRG1= <>
##$CPDPRG2= <waltz16>
##$CPDPRG3= <>
##$CPDPRG4= <mlev>
##$CPDPRG5= <mlev>
##$CPDPRG6= <mlev>
##$CPDPRG7= <mlev>
##$CPDPRG8= <mlev>
##$CPDPRGB= <>
##$CPDPRGT= <>
##$D= (0..31)
0 1 0 0 0 0 0 0 0 0.06 0 0.03 2e-05 3e-06 0 0 0.0002 0 0 0 0 0 0 0 0 0 
0 0 0 0 0 0 
##$DATE= 1732873591
##$DBL= (0..7)
120 120 120 11 120 120 24 19 
##$DBP= (0..7)
150 150 150 150 150 150 150 150 
##$DBP07= 0
##$DBPNAM0= <>
$$ [...]
##$SUBNAM3= <"">
##$SUBNAM4= <"">
##$SUBNAM5= <"">
##$SUBNAM6= <"">
##$SUBNAM7= <"">
##$SUBNAM8= <"">
##$SUBNAM9= <"">
##$SW= 400.765351723535
##$SWIBOX= (0..15)
0 1 3 0 0 0 0 0 0 0 0 0 0 0 0 0 
##$SW_h= 32467.5324675325
##$TD= 32768
##$TD0= 1
##$TE= 0
##$TE2= 300
##$TE3= 300
##$TEG= 300
##$TL= (0..7)
0 120 53 12 22 120 120 120 
##$TP= (0..7)
150 150 150 150 150 150 150 150 
##$TP07= 0
##$TPNAME0= <>
##$TPNAME1= <>
##$TPNAME2= <>
##$TPNAME3= <>
##$TPNAME4= <>
##$TPNAME5= <>
##$TPNAME6= <>
##$TPNAME7= <>
##$TPOAL= (0..7)
0.5 0.5 0.5 0.5 0.5 0.5 0.5 0.5 
##$TPOFFS= (0..7)
0 0 0 0 0 0 0 0 
##$TUNHIN= 0
##$TUNHOUT= 0
##$TUNXOUT= 0
##$USERA1= <user>
##$USERA2= <user>
##$USERA3= <user>
##$USERA4= <user>
##$USERA5= <user>
##$V9= 5
##$VALIST= <valist>
##$VCLIST= <CCCCCCCCCCCCCCC>
##$VD= 0
##$VDLIST= <DDDDDDDDDDDDDDD>
##$VPLIST= <PPPPPPPPPPPPPPP>
##$VTLIST= <TTTTTTTTTTTTTTT>
##$WBST= 1024
##$WBSW= 4
##$XGAIN= (0..3)
0 0 0 0 
##$XL= 0
##$YL= 0
##$YMAX_a= 12923
##$YMIN_a= -12620
##$ZGOPTNS= <>
##$ZL1= 120
##$ZL2= 120
##$ZL3= 120
##$ZL4= 120
##$ABSF1= 198.0616
##$ABSF2= -202.7028
##$ABSG= 5
##$ABSL= 3
##$ALPHA= 0
##$AQORDER= 0
##$ASSFAC= 0
##$ASSFACI= 0
##$ASSFACX= 0
##$ASSWID= 0
##$AUNMP= <proc_1d>
##$AZFE= 0.1
##$AZFW= 0.5
##$BCFW= 0
##$BC_mod= 2
##$BYTORDP= 0
##$COROFFS= 0
##$CY= -3
##$DATMOD= 1
##$DC= 0
##$DFILT= <>
##$DTYPP= 0
##$F1P= 0
##$F2P= 0
##$FCOR= 1
##$FTSIZE= 65536
##$FT_mod= 6
##$GAMMA= 0
##$GB= 0
##$INTBC= 1
##$INTSCL= 9.790993e-09
##$ISEN= 30
##$LB= 1.5
##$LEV0= 0
##$LPBIN= 0
##$MAXI= 10000
##$MC2= 0
##$MEAN= 0
##$ME_mod= 0
##$MI= 50
##$NCOEF= 0
##$NC_proc= -5
##$NLEV= 6
##$NOISF1= 182.463
##$NOISF2= 159.3651
##$NSP= 0
##$NTH_PI= 0
##$NZP= 0
##$OFFSET= 198.0616
##$PC= 4
##$PHC0= 2213.767
##$PHC1= 222.4883
##$PH_mod= 1
##$PKNL= yes
##$PPARMOD= 0
##$PSCAL= 0
##$PSIGN= 0
##$REVERSE= no
##$SF= 81.0140089999434
##$SI= 65536
##$SIGF1= 159.3651
##$SIGF2= -187.1042
##$SINO= 113.3802
##$SIOLD= 16384
##$SREGLST= <1H.CDCl3>
##$SSB= 0
##$STSI= 65536
##$STSR= 0
##$SW_p= 32467.5324675325
##$SYMM= 0
##$S_DEV= 0
##$TDeff= 32768
##$TDoff= 0
##$TI= <>
##$TILT= no
##$TM1= 0
##$TM2= 0
##$TOPLEV= 0
##$USERP1= <user>
##$USERP2= <user>
##$USERP3= <user>
##$USERP4= <user>
##$USERP5= <user>
##$WDW= 1
##$XDIM= 65536
##$YMAX_p= 376583244
##$YMIN_p= -20652978
$$ End of Bruker specific parameters
$$ ---------------------------------
##NTUPLES= NMR SPECTRUM
##VAR_NAME=  FREQUENCY,     SPECTRUM/REAL,   SPECTRUM/IMAG
##SYMBOL=    X,             R,               I
##VAR_TYPE=  INDEPENDENT,   DEPENDENT,       DEPENDENT
##VAR_FORM=  AFFN,          ASDF,            ASDF
##VAR_DIM=   65536,         65536,           65536
##UNITS=     HZ,            ARBITRARY UNITS, ARBITRARY UNITS
##FACTOR=    0.49542278885378, 1,            1
##FIRST=     16045.7642231865, 0,            0
##LAST=      -16421.768244346, 0,            0
##MIN=       -16421.768244346, -20652978,    0
##MAX=       16045.7642231865, 376583244,    0
$$ Real data points
##PAGE= N=1
##DATA TABLE= (X++(R..R)), XYDATA
$$ [...]
40726a23199j98794j4680J52774J98605Q2698o0375j00216j35532l02421m46293
$$ -123199 -321993 -336673 -183899 14706 97404 37029 -63187 -198719 -501140 -947433
40716i47433k83713J45839M86794N19080L30077N9531k19821l59877k04660J27621
$$ -947433 -1231146 -1085307 -598513 -79433 250644 310175 90354 -269523 -474183 -346562
40706c46562L14596K59093J80506K07155J73762m9900l03174l75483k82145j35992
$$ -346562 -31966 227127 407633 614788 788550 738650 435476 59993 -222152 -358144
40696c58144N2079K65570L58548K48086J03266J35154K76730K68032K9624k23761
$$ -358144 -306065 -40495 318053 566139 669405 804559 1081289 1349321 1378945 1155184
40686A155184k63788j14812J3059j7963j49176k32067j83488j7638J86232K74684
$$ 1155184 891396 776584 789643 771680 622504 390437 206949 189311 375543 650227
40676F50227Q7442l00244m90383j81579L48388N14856K24275j7211O4242Q2536
$$ 650227 737669 437425 -52958 -234537 113851 628707 852982 835771 900013 982549
40666I82549k60801n10506j14751O02140Q08822L37949j90526l38714k55915j18285
$$ 982549 721748 211242 96491 698631 1507453 1845402 1654876 1316162 1060247 941962
40656I41962J15641K79126L3942m59594n71481j53089J94881J03395p148K32784
$$ 941962 1057603 1336729 1370671 911077 339596 186507 381388 484783 477635 710419
40646G10419M27207J17517l74485m76338k91408k91369m27699k90477O7301J99106
$$ 710419 1137626 1255143 880658 404320 112912 -178457 -606156 -896633 -829332 -630226
40636f30226N0413j2316Q5610M4068j64891k03675j2357M9698j43006k34619o900
$$ -630226 -579813 -592129 -506519 -462451 -627342 -831017 -843374 -793676 -936682 -1171301 -1178201
40625a178201K36241J70599m9828q2140J05928K91920L50679L28386K94586K64127
$$ -1178201 -941960 -771361 -821189 -903329 -797401 -505481 -154802 173584 468170 732297
40615G32297J79628n5068l93741n53834l34613J8300P3964j58415k17220J27390
$$ 732297 911925 856857 463116 -90718 -425331 -407031 -333067 -491482 -708702 -581312
40605e81312N33616N78593K73368r9649l87511n69829n60872k69179K08485O10353
$$ -581312 -47696 530897 804265 704616 317105 -252724 -813596 -1082775 -874290 -263937
40595b63937P02976M19680q6442m87938n04257j42002L35160O39855N94731J77550
$$ -263937 439039 858719 772277 284339 -219918 -361920 -26760 613095 1207826 1385376
40585A385376l70981o15131l69790J4672J00353k4119N0129L33823M15711J67476
$$ 1385376 1014395 399264 29474 44146 144499 120380 170509 504332 920043 1087519
40575A087519n3159k9563m155j50316k05782N1924L53908L17221r989k89573l34370
$$ 1087519 1034360 1004797 1000642 850326 644544 696468 1050376 1367597 1357608 1068035 733665
40564G33665j51162J88471M62432L63869p5769m04657l49664j81730k03921k56692
$$ 733665 582503 770974 1233406 1597275 1521506 1116849 767185 585455 381534 124842
40554A24842j16449l414j84222l74402j26152L81549N51037K70203N406J306j9312
$$ 124842 8393 4979 -179243 -553645 -679797 -298248 252789 522992 528398 529704 510392
40543E10392k67178n31798n73113m31277k00967J03500L28427K35343o3682j19511
$$ 510392 243214 -288584 -861697 -1292974 -1493941 -1390441 -1062014 -826671 -890353 -1009864
40533a009864K10981N04142L76862J7489j47237k6766J65630K83498L05558J95992
$$ -1009864 -798883 -294741 82121 99610 -47627 -74393 91237 374735 680293 876285
40523H76285l3862k30073k50081j17428Q4341L11712M50437L21178m2936l21381
$$ 876285 842423 612350 362269 244841 329182 640894 1091331 1412509 1369573 1048192
40513A048192k84359o9863P3207J12646J17299K9555k00437m09789l96038j88341
$$ 1048192 763833 693970 767177 879823 997122 1026677 826240 416451 20413 -167928
40503a67928M2373K11011K81402J77145o0428k02727j46611r8570j92445j65118
$$ -167928 -125555 85456 366858 544003 483575 280848 134237 35667 -156778 -321896
40493c21896K26704O75144O66061K46158m7517n670J7860k26129m77518m28606
$$ -321896 -95192 579952 1246013 1492171 1444654 1438984 1456844 1230715 753197 324591
40483C24591j72289N4955K19970L13294J48932l19677p12337n98604m6303M71150
$$ 324591 152302 207257 427227 740521 889453 569776 -142561 -741165 -787468 -316318
40473c16318O13873M12696J05398m2068J15101M08246M43704Q6518l18998m37174
$$ -316318 297555 710251 815649 773581 888682 1296928 1740632 1827150 1508152 1070978
40463A070978m12078n28509o51261m65957j13301j9067j29139O8500O45152R76682
$$ 1070978 658900 130391 -520870 -986827 -1100128 -1119195 -1248334 -1179834 -534682 442000
40453D42000O64435J55730M0789J91452J07463k15707l40177j33148Q9088J08077
$$ 442000 1106435 1262165 1302954 1494406 1601869 1386162 1045985 912837 1001925 1110002
40443A110002J0818j31068l28463m05614j31164L01754L77247j8935l92375l38863
$$ 1110002 1120820 989752 661289 255675 124511 426265 803512 784577 392202 53339
40433E3339n4829P8432M2163J2442l4485j96614l49548l06415j01675J60215N14367
$$ 53339 -1490 76942 119105 131547 97062 -99552 -449100 -755515 -857190 -696975 -182608
40422a82608Q75130Q33475J76983n59631o08806q443M13153J68294l07615m01824
$$ -182608 692522 1525997 1702980 1143349 534543 526100 939253 1107547 799932 398108
40412C98108j52777N767n5969j44588j87500k59432k69249k7386L65986N38179
$$ 398108 245331 251098 195129 50541 -136959 -396391 -665640 -693026 -327040 211139
40402B11139L29785J4588o5963R4865K38125J83710q04j17345n7456P5566N9478
$$ 211139 540924 555512 489549 584414 822539 1006249 1005445 888100 830644 906210 965688
40391I65688k00852n42766p03565n71359k38683J14064L12238K67526R9177Q8045
$$ 965688 764836 222070 -481495 -1052854 -1291537 -1177473 -865235 -597709 -498532 -410487
40381d10487L36630N41995L24010k43254o68654o38374l26205m6539J29222K65169
$$ -410487 -73857 468138 792148 548894 -119760 -758134 -1084339 -1130878 -1001656 -736487
40371g36487L23739K57704J58740R2168m8800k82126l21917K7490L95865K20804
$$ -736487 -412748 -155044 3696 95864 47064 -235062 -556979 -529489 -133624 87180
40361H7180l91306o66302k04779M21705M55317j579j89186K04647O36683M81458
$$ 87180 -304126 -970428 -1175207 -753502 -298185 -299764 -488950 -284303 352380 833838
40351H33838j67951o71493o02188j32019K53222K64709L0123j23429m8117J21220
$$ 833838 665887 -5606 -607794 -739813 -486591 -221882 -191759 -315188 -363305 -242085
40341b42085K31012L16427M27373M05730P6788m02807o61198n88400m35083l86566
$$ -242085 -11073 305354 732727 1138457 1215245 812438 151240 -437160 -872243 -1258809
40331a258809l21624j16479Q4500J04836L4113N7771J41943J31244M9792M8029
$$ -1258809 -1580433 -1696912 -1612412 -1507576 -1473463 -1415692 -1273749 -1142505 -1092713 -1044684
40321a044684J09512O6590r7156j91834j01987P1154J92072K39936K15794O7301
$$ -1044684 -935172 -868582 -965738 -1157572 -1259559 -1188405 -996333 -756397 -540603 -473302
40311d73302j87962l70611k89036M0143L75865M59392K48382l2097j02793P6811
$$ -473302 -661264 -1031875 -1320911 -1280768 -904903 -445511 -197129 -229226 -332019 -255208
40301b55208K86799L49525L34013L59354L34140R1445k84552m95386m03740j85759
$$ -255208 31591 381116 715129 1074483 1408623 1500068 1215516 720130 316390 130631
40291A30631q1941j57590l29142m63865m31853k24331l6757n5143j51919k2492
$$ 130631 48690 -108900 -438042 -901907 -1333760 -1558091 -1594848 -1649991 -1801910 -1824402
40281a824402L30189N12949K71379j35431k71396n5144K36490L57752K97436J93302
$$ -1824402 -1494213 -981264 -709885 -845316 -1116712 -1171856 -935366 -577614 -280178 -86876
40271h6876K00953L53817M40752J84205l10875n03218p5028N24736N50312q5343
$$ -86876 114077 467894 908646 1092851 781976 278758 203730 728466 1278778 1193435
40261A193435o86723o46767j08251L60852M58117L07876J26405k0165j53510k47259
$$ 1193435 506712 -140055 -248306 112546 570663 878539 1004944 984779 831269 584010
40251E84010k15333k5299J84716J69367j55756n53706o87675m68026o6183L32428
$$ 584010 368677 343378 528094 697461 541705 -12001 -699676 -1167702 -1233885 -901457
40241i01457N95209N39372O4753n61977q36984n52045J2423M96336P89269Q48792
$$ -901457 -306248 233124 297877 -264100 -1101084 -1653129 -1640706 -1144370 -355101 493691
40231D93691N46590m0623m71494m14221r7607M0399j9674J6032J59413J13843
$$ 493691 1040281 999658 528164 113943 16336 56735 37061 53093 212506 326349
40221C26349j72117l84707l59625k91455k92126j58949J89668M19457K35908j31883
$$ 326349 154232 -230475 -590100 -881555 -1173681 -1332630 -1142962 -723505 -487597 -619480
40211f19480k32718P94K54557L12943K53552K45485L79943O10826O84630K99074
$$ -619480 -852198 -851404 -596847 -283904 -30352 215133 595076 1205902 1890532 2189606
40201B189606m33855q81215n71491J59550N57794L67633k9601k93071m56335n67879
$$ 2189606 1755751 874536 303045 462595 1020389 1388022 1358421 1065350 609015 41136
40191D1136m94084k32582k1909K9874Q2530J98778K18290J41024K10314M08658
$$ 41136 -452948 -685530 -707439 -677565 -595035 -396257 -177967 -36943 173371 582029
40181E82029L36708j00304l63007o8614L26338K03770j99881j56289L51699N66826
$$ 582029 918737 818433 455426 386812 713150 916920 717039 560750 912449 1479275
40171A479275J54381k75556j20592L24511L44726j97137p57959q28738m26961
$$ 1479275 1633656 1358100 1237508 1562019 1906745 1709608 951649 122911 -304050
40162c04050L6893J67771p7200l40173k41906J38418L37404J30189j57196j05488
$$ -304050 -267157 -99386 -176586 -516759 -758665 -620247 -282843 -152654 -309850 -415338
40152d15338K50151N39738N56005L86880J47869j57937m95518p01311o22394l02112
$$ -415338 -165187 374551 930556 1317436 1465305 1307368 811850 110539 -511855 -813967
40142h13967K6473J59161J36908J80971L68359M84233L15420l8429l35703n33825
$$ -813967 -787494 -628333 -491425 -310454 57905 542138 857558 819129 483426 -50399
40132e0399o78818n87111n9008O03254P70909L10174k17793l61568l14227l63507
$$ -50399 -729217 -1316328 -1375336 -772082 -1173 309001 91208 -270360 -584587 -948094
40122i48094l01613J46091O73141P47340M15228J82916J87043O0531l40422o21986
$$ -948094 -1249707 -1103616 -430475 316865 732093 915009 1102052 1162583 822161 200175
40112B00175m42173M832L12930L56018K37629J0393k97800n27527m95482k27234
$$ 200175 -241998 -237166 75764 431782 669411 679804 382004 -145523 -641005 -868239
40102h68239M8630J35555N5566J7190J79784M18437M11024N2431l34274l62195
$$ -868239 -819609 -684054 -628488 -611298 -431514 -13077 397947 450378 116104 -246091
40092b46091n2236K60506L85847L76150K36898j16545n68842p86600o09204k25741
$$ -246091 -298327 -37821 348026 724176 961074 844529 275687 -510913 -1120117 -1345858
40082a345858J24432L80538M91679L09965j38644m91750m20185o0419J49780L0243
$$ -1345858 -1221426 -840888 -349209 -39244 -177888 -669638 -1089823 -1150242 -1000462 -970219
40072i70219j43967l2944L20208N27571L23508q9573k55769k0326K82352K82790
$$ -970219 -1114186 -1147130 -826922 -299351 24157 -65416 -321185 -341511 -59159 223631
40062B23631M7171r4266m4060J6510Q114N4942J81147K17514J02656N153K4622
$$ 223631 270802 176536 132476 148986 157100 212042 393189 610703 713359 718512 743134
40051G43134J5739j41373l02913k60624l2858J77904K01458p380l49922n82157
$$ 743134 758873 617500 314587 53963 21105 199009 400467 393087 43165 -538992
40041e38992m79874p9242L62206O40780O82475M20428j05129n51333n56113k64341
$$ -538992 -1018866 -1098108 -735902 -95122 587353 1007781 902652 351319 -204794 -469135
40031d69135j63883l24562k99580N3584K51720K8987j09794K59294O00445J62934
$$ -469135 -633018 -957580 -1257160 -1203576 -951856 -922869 -1032663 -773369 -172924 -9990
40021i990p16780r45279k43699M82587M99358J60104J11833K71104J49123k30562
$$ -9990 -726770 -1672049 -1915748 -1433161 -933803 -773699 -661866 -390762 -241639 -472201
40011d72201l54097j6454L92258M27581J06281j95186j95747J2511J24938M6971
$$ -472201 -826298 -842752 -450494 -22913 83368 -111818 -307565 -295054 -170116 -123145
40001a23145L5326K68848M36303J08416n20251p39595l16416J12236m3514m49703
$$ -123145 -87819 181029 617332 725748 205497 -534098 -850514 -738278 -781792 -1231495
39991a231495l75201J94723N66340L85860R7712K20803O17844P36901L21210l42606
$$ -1231495 -1606696 -1411973 -845633 -459773 -362061 -141258 476586 1213487 1534697 1192091
39981A192091p46282o05895j06418K47959J73569j3352J95976P07769Q19468J89738
$$ 1192091 445809 -160086 -266504 -18545 155024 141672 337648 1045417 1864885 2054623
39971B054623n65159o10839J4682M97176L32878j52747m18048l81322k77655j90017
$$ 2054623 1489464 878625 893307 1390483 1723361 1570614 1152566 771244 493589 303572
39961C03572l9125J30255J45340n2580l39830n45320n42411k94883O5603L02628
$$ 303572 264447 394702 540042 487462 147632 -397688 -940099 -1234982 -1169379 -866751
39951h66751L32216L01315L02712K06566l3242j30816J47296N02128M19421o9261
$$ -866751 -534535 -233220 69492 276058 242816 112000 259296 761424 1180845 1111584
39941A111584l73693j61842K26516L40712K09760J23806J32557P0095j05292k68695
$$ 1111584 737891 576049 802565 1143277 1353037 1476843 1609400 1679495 1574203 1305508
39931A305508l11302j80200J14871L67798K49990k62595p19966o95639k91742
$$ 1305508 994206 814006 928877 1296675 1546665 1284070 564104 -131535 -423277
39922d23277Q0193K26621K08472O1948j61051k29015k769K24171O4774l35218
$$ -423277 -343084 -116463 92009 153957 -7094 -236109 -238878 -14707 50067 -285151
39912b85151m38572q8062K97992L63811K18133P8776n5221j73627q6130K32434
$$ -285151 -723723 -811785 -513793 -149982 68151 146927 91706 -81921 -168051 64383
39902F4383M19446J51688l96108p75204p80933n17670j14547L52834P40650Q71782
$$ 64383 483829 635517 239409 -535795 -1316728 -1834398 -1948945 -1596111 -855461 16321
39892A6321O85513K52091k73417o31847n71245j44834K39233K44553k3615k28328
$$ 16321 701834 953925 680508 48661 -522584 -667418 -428185 -183632 -207247 -435575
39882d35575k43671j89546j39935m3322R2522J52565R3648L8746J37395L77175
$$ -435575 -679246 -868792 -1008727 -1052049 -959527 -806962 -713314 -674568 -537173 -159998
39872a59998N57396M80986K15751P3286J75572J63254l45153j048880j185110
$$ -159998 397398 878384 1094135 1167421 1342993 1506247 1161094 112214 -1072896
39863a072896n81563K2396J2479k44303o9675M31935O27823M37966L62558M89153
$$ -1072896 -1654459 -1632063 -1619584 -1863887 -1933562 -1501627 -873804 -435838 -73280 415873
39853D15873L25650k02795m21970J7625M52214J84196m00045m18359J48079M83826
$$ 415873 741523 538728 116758 134383 586597 770793 370748 -47611 100468 584294
39843E84294K11595j56227j42940K9457n395j17029j9224J38216j330l79692n72113
$$ 584294 795889 639662 496722 526179 520784 403755 384531 522747 521417 141725 -430388
39832d30388l92786r3679M0103l2p5629j00237m8498O1944J57044K00393K74673
$$ -430388 -823174 -916853 -876750 -876782 -952411 -1052648 -1101146 -1039202 -882158 -681765 -407092
39821d07092M13238M19595J05293l15604l86259l1825K97740K56441M8584L721
$$ -407092 6146 425741 531034 215430 -170829 -202654 95086 351527 400111 403832
39811D03832J2945k23934n68678n28805J0355N39304N55117J57575j65070j57111
$$ 403832 416777 192843 -375835 -904640 -894285 -354981 200136 357711 192641 35530
39801C5530l575M020j54862k21396P181L75827M99736K38194r9954j53133M3348
$$ 35530 31955 35975 -118887 -340283 -333102 42725 542461 780655 680701 527568 570916
39790E70916K16568L18200N00949O90584N75251J12301k96541l07221n6005Q8759
$$ 570916 787484 1105684 1606633 2297217 2872468 2984769 2688228 2381007 2325002 2413761
39780B413761j6120k40572m01438l81852j99877o9441j96575m23092l39261J06719
$$ 2413761 2397641 2157069 1755631 1373779 1173902 1104461 907886 484794 145533 252252
39770B52252M21303K21910k09837l46235j49123j0880j09207k26415j81617q3694
$$ 252252 673555 895465 685628 339393 190270 179390 70183 -156232 -337849 -421543
39760d21543r7076k12336l13073k98181j15078J91934M73001O07750N91678M31713
$$ -421543 -518619 -730955 -1044028 -1342209 -1457287 -1265353 -792352 -184602 407076 838789
39750H38789J20979j84524k14501j26L8368k98562n83258l59323J09093J96805
$$ 838789 959768 775244 560743 560617 598985 300423 -282835 -642158 -533065 -336260
39740c36260j33072l21436j18391J10237P6996m945R4434K17399J75630R5688
$$ -336260 -469332 -790768 -909159 -798922 -721926 -726871 -632437 -415038 -239408 -143720
39730a43720J10635P0878j18212j93078P0963M02401L49795q9571m87728n37769
$$ -143720 -33085 37793 -80419 -273497 -202534 199867 549662 460091 -27637 -565406
39720e65406l01738J7541K76600L81655L06797J54376O6410O6792O4263j7139
$$ -565406 -867144 -849603 -573003 -191348 115449 269825 336235 403027 467290 450151
39710D50151j61020k69318k40531j03992l2610r7710r8274J41495L85161K31543
$$ 450151 289131 19813 -220718 -324710 -357320 -455030 -553304 -411809 -26648 204895
39700B04895k47964n06574k55440J74016L44080K11136o5524m10355o69738n56702
$$ 204895 -43069 -549643 -805083 -631067 -286987 -75851 -141375 -551730 -1221468 -1778170
39690a778170r6018K11263L8835k45182j04135L86745P11643O46672L84488J11589
$$ -1778170 -1874188 -1662925 -1624090 -1869272 -1973407 -1586662 -875019 -228347 156141 267730
39680B67730r0904p5400J84259L41843O1250m37774o42123m45844j41602J50554
$$ 267730 176826 101426 285685 627528 688778 251004 -391119 -836963 -978565 -828011
39670h28011N02345P07447M20841j74452m41978j78170J27639R7329k5714O5889
$$ -828011 -325666 381781 802622 628170 186192 8022 135661 232990 207276 273165
39660B73165J88532L2186l03451m92675m19437j50415K40950N66729N40070J69076
$$ 273165 461697 493883 190432 -302243 -721680 -872095 -631145 -64416 475654 644730
39650F44730j43667j42443n0564j02748j09715J49387M27768L48239J2752j67187
$$ 644730 501063 358620 308056 205308 95593 244980 672748 1020987 1033739 866552
39640H66552q5200L7854J05614J81058J62712j22407n15351o24577l62467l7142
$$ 866552 781352 819206 924820 1105878 1268590 1146183 630832 6255 -356212 -393354
39630c93354J10227J22984O8608q0187k39927k29678q5585n5735j78792j75775
$$ -393354 -283127 -160143 -91535 -171722 -411649 -641327 -726912 -782647 -961439 -1137214
39620a137214R3960L54286K83877n0822l27047l59980j88976P5564K98397L23828
$$ -1137214 -1043254 -688968 -405091 -455913 -782960 -1142940 -1331916 -1256352 -957955 -634127
39610f34127J33256m7589L7115L55738O01080N31152K17780p3974k06690k98241
$$ -634127 -500871 -548460 -511345 -155607 445473 976625 1194405 1120431 913741 615500
39600F15500m83274o19371m15924R1801M33244K76732p4221q2720K26219K93756
$$ 615500 132226 -487145 -903069 -811268 -378024 -101292 -175513 -258233 -32014 261742
39590B61742j03585m68315l05633J33448K14144j72707m80646k66014K76659O24911
$$ 261742 158157 -310158 -615791 -482343 -268199 -440906 -921552 -1187566 -910907 -285996
39580b85996N19243J19410k47579l47941j60262J16263K10378M2848j76095j93694
$$ -285996 233247 352657 105078 -242863 -403125 -286862 -76484 -33636 -209731 -403425
39570d03425k5582R1895M7642q737N1109Q7565q6645l44866l69827j35593K9251
$$ -403425 -429007 -337112 -289470 -298207 -247098 -159533 -246178 -591044 -960871 -1096464 -1067213
39559a067213m1065p4639J75748M63737L83613Q581k09344j27234o7566k11338
$$ -1067213 -1108278 -1182917 -1007169 -543432 -159819 -151238 -360582 -487816 -555382 -766720
39549g66720k56625Q8851N82769P19687L75427q1568k56335j08921R6668Q4957
$$ -766720 -1023345 -934494 -351725 367962 743389 661821 405486 296565 393233 478190
39539D78190j72964m24705m06086j61242K6513M1726P6200K74693M61071L89107
$$ 478190 305226 -119479 -525565 -686807 -660294 -618568 -542368 -267675 193396 582503
39529E82503R6464j81975l16717l10741j63025P2039J95863P8518j00597n5097
$$ 582503 678967 496992 180275 -130466 -293491 -221452 -25589 52929 -47668 -102765
39519a02765K02707L79164L03669J00891m4271q9774p6061m2461n2632j68736
$$ -102765 99942 479106 782775 883666 839395 749621 673560 631099 578467 409731
39509D09731l60194n25900n95061n21860k52104J64618M99670N56666M10004K61279
$$ 409731 49537 -476363 -1071424 -1593284 -1845388 -1680770 -1181100 -624434 -214430 46849
39499D6849J29669r1302l18700l01330L266L11218L49550J33777j39697l04435
$$ 46849 176518 85216 -233484 -534814 -531548 -220330 129220 262997 123300 -181135
39489a81135k82974j01217J08428K41466L39059M27869L37953o2910n19724o09098
$$ -181135 -464109 -565326 -456898 -215432 123627 551496 889449 826539 306815 -302283
39479c02283l12425k1953N7782J14734K43322K14159l9802j38320J88305N83963
$$ -302283 -614708 -636661 -578879 -464145 -220823 -6664 -46466 -184786 3519 587482
39469E87482N20215M5174l35283l85436l33134l78346l92495j82300J96128M77887
$$ 587482 1107697 1152871 817588 432152 99018 -279328 -671823 -854123 -657995 -180108
39459a80108M41740J31074j28156m9993K11587K00809j92524n19254m05823o6607
$$ -180108 261632 392706 264550 214557 426144 626953 434429 -84825 -490648 -557255
39449e57255J26362K32082M47057N26630J01417n70201q01655m34463m553J12192
$$ -557255 -430893 -198811 248246 774876 876293 306092 -495563 -930026 -934579 -822387
39439h22387J28204K66394L39920J87390L7317J06134K23126J76472Q2392Q7963
$$ -822387 -694183 -427789 -87869 99521 136838 242972 466098 642570 724962 812925
39429H12925L9661j99109l96935l03763j06660j36796l11491k83322k7843J26063
$$ 812925 852586 653477 256542 -47221 -153881 -290677 -602168 -885490 -913333 -787270
39419g87270J8888j41255j26857L4796J70807J55890p633j73879j72337l5434
$$ -787270 -768382 -909637 -1036494 -1001698 -830891 -675001 -682634 -856513 -1028850 -1064284
39409a064284L7543M4853K49238O73074Q42894M12403k06685l17804Q8306L54794
$$ -1064284 -1026741 -981888 -732650 -59576 783318 1195721 989036 671232 759538 1114332
39399A114332J27223k34292l05287j53135l7504J8145Q3435Q0965k5597o6150
$$ 1114332 1241555 1007263 701976 548841 511337 529482 612917 693882 668285 602135
39389F02135L5035K9766k72963n85429m56896P6268N01175M88321K29590N1721
$$ 602135 637170 666936 393973 -191456 -648352 -572084 -70909 417412 647002 698723
39379F98723j5692j12836k00977j12283R9058J26762j60257m58779m05013r8794
$$ 698723 683031 570195 369218 256935 355993 482755 322498 -136281 -541294 -640088
39369f40088K2552j67340k84833k3266L68531M64752K88477K00097K87377K71761
$$ -640088 -617536 -784876 -1069709 -1092975 -724444 -259692 28785 228882 516259 788020
39359G88020K1713k19340k09397j1443J81792K72536K24510N2730q5512m8353
$$ 788020 809733 590393 380996 369553 551345 823881 1048391 1101121 1015609 967256
39349I67256K064k06649n21768m50571O1261M15115K26284o6055Q3187M07143
$$ 967256 969320 762671 240903 -209668 -148407 266708 492992 426937 510124 917267
39339I17267K65047k44665l64519J20031M97897J94634l99172n63540k61164k2624
$$ 917267 1182314 937649 573130 693161 1191058 1385692 986520 422980 161816 139192
39329A39192r1823k08426j62941r3417j45545j93687p1588J39359K32240J64086
$$ 139192 47369 -161057 -323998 -417415 -562960 -756647 -828235 -688876 -456636 -292550
39319b92550O3855P426p2508k37837l96148l53828j4244M77485P87922O40756
$$ -292550 -228695 -221269 -293777 -531614 -927762 -1281590 -1295834 -818349 -30427 610329
39309F10329Q2278m88058o31568k87185J53035K50162k5841l26208l69157k02785
$$ 610329 692607 204549 -427019 -714204 -561169 -311007 -336848 -663056 -1032213 -1234998
39299a234998m808J76479L47082M02972K63073P6399M3590O7096j22000m44336
$$ -1234998 -1239806 -1063327 -716245 -313273 -50200 26199 69789 136885 14885 -429451
39289d29451m32767P9857N42764L31026l47003o35669j54640N06976O16366K27783
$$ -429451 -862218 -782361 -239597 91429 -255574 -891243 -1045883 -538907 77459 305242
39279C05242p8205j15961k26358n15440n33771J0795O35658O32188N3337l29941
$$ 305242 227037 111076 -115282 -630722 -1164493 -1153698 -518040 114148 167485 -162456
39269a62456p4875L82676M09447L2500k29644j82288j61294m01715n94163l08357
$$ -162456 -237331 145345 554792 587292 357648 175360 14066 -387649 -981812 -1290169
39259a290169L43495P62746N71350L2199l18227k86250j18994q5491j69920j99885
$$ -1290169 -946674 -183928 387422 419621 101394 -184856 -303850 -389341 -559261 -759146
39249g59146q8521J49225M69459P38551P15058L01036k23967m34835k57186m2004
$$ -759146 -847667 -698442 -228983 509568 1224626 1525662 1301695 866860 609674 567670
39239E67670q8056k84659l40293j89309Q39J10856J62779J77992J17070k9184
$$ 567670 479614 194955 -145338 -334647 -333808 -222952 -60173 117819 234889 205705
39229B05705j98824l01937k32763Q2934N16718O96525L59946k49088n72732m01237
$$ 205705 6881 -295056 -527819 -444885 71833 768358 1128304 879216 306484 -94753
39219i4753j09393q6299j66820P4652N84098P76388L24163l32963n24632j96100
$$ -94753 -204146 -290445 -457265 -382613 201485 977873 1302036 969073 444441 248341
39209B48341J10457M9153j32321q3249J11305J38356k4725j30615r8965q7608
$$ 248341 358798 407951 275630 192381 303686 442042 417317 286702 187737 100129
39199A00129j30053n0468J58541J97846r0202l86146k89979R2225K71796N4432
$$ 100129 -29924 -80392 78149 275995 185793 -200353 -490332 -398107 -126311 -71879
39189g1879k07294j16378K47558M63032K89389j15493m51762n81992n34345l37113
$$ -71879 -279173 -395551 -147993 315039 604428 488935 37173 -544819 -1079164 -1416277
39179a416277L856L79006N75718M83718K14976n1930k42829l10639j51741J81878
$$ -1416277 -1412421 -1033415 -457697 26021 240997 189067 -53762 -364401 -516142 -334264
39169c34264L18729l9179n68877n72040R3847P13164O09693K4878k80183p8083
$$ -334264 -15535 -54714 -623591 -1195631 -1101784 -388620 221073 245951 -34232 -112315
39159a12315J41522j2799l14063l43315p5621J80214K10921N3558j57720l11444
$$ -112315 29207 16408 -297655 -640970 -716591 -536377 -325456 -271898 -429618 -741062
39149g41062l27954j84797N1302K62022L44483K51727K6465j89333k34860n9959
$$ -741062 -1069016 -1253813 -1202511 -940489 -596006 -344279 -317814 -507147 -742007 -801966
39139h01966K28786M47816M67603L02645P9347j13962l00514m63969m30020j09857
$$ -801966 -573180 -125364 342239 644884 724231 610269 309755 -154214 -584234 -694091
39129f94091K12661J77162m9982Q7688O29696Q39465K37370n70196o74550j45700
$$ -694091 -481430 -304268 -354250 -266562 363134 1202599 1439969 869773 195223 49523
39119D9523J77006q441j80240l0874N9196j57315k75717J5111L06771J42192j89820
$$ 49523 226529 218088 37848 6974 66170 -91145 -366862 -351751 -44980 97212 -92608
39108i2608j50016J34005J19468k03780l12336n0842J15934j23867m33570l42279
$$ -92608 -242624 -108619 10849 -192931 -505267 -556109 -440175 -564042 -997612 -1339891
39098a339891J01581M48891M28694K00933R7266K19471L18176J13869k81928m54761
$$ -1339891 -1238310 -789419 -360725 -159792 -62526 156945 475121 588990 307062 -147699
39088a47699k57622j3192K4771O9660L33184M94260J50670m05567m81517j4197
$$ -147699 -405321 -418513 -393742 -324082 9102 503362 654032 248465 -233052 -247249
39078b47249L20176J28783j78194j30916R1176O8649j63231k67553j76947q6165
$$ -247249 72927 201710 23516 -107400 -16224 52425 -110806 -378359 -555306 -641471
39068f41471l9128R4319L09011M34908L72014J47084j70092m25359m08634j44189
$$ -641471 -680599 -586280 -277269 157639 529653 676737 506645 81286 -327348 -471537
39058d71537J4870j57027l78136k58597O6896J12944j93846l65279o4398M04012
$$ -471537 -456667 -613694 -991830 -1250427 -1183531 -1070587 -1264433 -1629712 -1694110 -1290098
39048a290098N13007J77515k05280k43803O3365L48297K25156k72041o09953l07269
$$ -1290098 -777091 -599576 -804856 -1048659 -985294 -636997 -411841 -683882 -1293835 -1601104
39038a601104M14748P87277L99060l04346n90570k84870J76377L55991K01988
$$ -1601104 -1186356 -399079 -19 -304365 -894935 -1179805 -1003428 -647437 -445449
39029d45449q7035k94839k64356M1163M65658P34766O43814J82918m15574p14244
$$ -445449 -532484 -827323 -1091679 -1050516 -584858 149908 793722 976640 561066 -153178
39019a53178l72543L93941Q39980M75712k73883n34955p9475M32205L74680q1025
$$ -153178 -525721 -131780 708200 1183912 910029 375074 295599 727804 1102484 1021459
39009A021459l46133k25010k3365k7287k00043l46996l39598j79253J1438R1928
$$ 1021459 675326 450316 426951 399664 199621 -147375 -486973 -666226 -654788 -562860
38999e62860R1883J92207M12257M87693K47464n6893o5294J56419J94341j35595
$$ -562860 -470977 -278770 133487 621180 868644 811751 746457 902876 1097217 961622
38989I61622n63066p21906m99039l0227M22070N92478M41003K41616K22808J96218
$$ 961622 398556 -323350 -822389 -852616 -430546 161932 602935 844551 1067359 1263577
38979A263577j47389o38357p43809l31015J14658J70653l1971j85823k62891l15918
$$ 1263577 1116188 477831 -265978 -596993 -482335 -311682 -343653 -529476 -792367 -1108285
38969a108285j93048J87551N38471N34104K54308k630j49846k51752k48344q7283
$$ -1108285 -1301333 -1113782 -575311 -41207 213101 210471 60625 -191127 -439471 -526754
38959e26754M2086m3048j87171j48158r227K2922M0355K22650L75544J95572j02210
$$ -526754 -484668 -527716 -714887 -863045 -872272 -849350 -808995 -586345 -210801 -15229 -117439
38948a17439R354N21560Q08535M99987p3085m44858n38392m52041k12273K0102
$$ -117439 -108085 413475 1222010 1721997 1648912 1204054 665662 213621 1348 21450
38938B1450n3003l77223m51328k5907M68536N12014J74207j35255k72368l30814
$$ 21450 -31553 -408776 -860104 -886011 -417475 94539 268746 133491 -138877 -469691
38928d69691k79716m6194K15319L00266K58368K26525J46956m7162j80530r6066
$$ -469691 -749407 -795601 -580282 -280016 -21648 204877 351833 304671 124141 28075
38918B8075N5036J13421K29106M88173N37975J06443l79952l32241M1588M2831
$$ 28075 83111 196532 425638 913811 1451786 1558229 1178277 846036 887624 930455
38908I30455l38687l81179J28757M62299Q8381m93210n43134j25252J84398J86410
$$ 930455 591768 210589 339346 801645 890026 396816 -146318 -271570 -87172 99238
38898I9238R8334L3654k3525L4411K27612K44618j11864m49614k78985J86494
$$ 99238 197572 231226 207701 242112 469724 714342 602478 152864 -126121 60373
38888F0373K89633q2860l47912j03846L54477N13711K15925l52277q67010r67459
$$ 60373 350006 267146 -80766 -184612 169865 683576 899501 547224 -319786 -1287245
38878a287245n10559J68238N55550N53914M38764K75843j03885n07310l94916
$$ -1287245 -1797804 -1629566 -1074016 -520102 -81338 194505 90620 -416690 -811606
38869h11606K58505P16086M77640J679n0359J74978P6605l63722n82926l45104
$$ -811606 -553101 162985 640625 642304 591945 766923 843528 479806 -103120 -448224
38859d48224r650J06068P2882J586j40990k48024n8056L91387O49447L91133j70208
$$ -448224 -457874 -351806 -278924 -277338 -418328 -666352 -724408 -333021 316426 707559 537351
38848E37351n47290m68654n0427L22676K85576j19457l93058j78120K02210J78489
$$ 537351 -9939 -478593 -529020 -206344 79232 -40225 -433283 -611403 -409193 -230704
38838b30704k02696l57789q7366J75240J41787P0063J52047J22864j50207k60873
$$ -230704 -433400 -791189 -878555 -703315 -561528 -491465 -339418 -216554 -366761 -627634
38828f27634O7996L95370K10399k13158k34280J48860L49153J03933k62900m32866
$$ -627634 -559638 -164268 46131 -167027 -401307 -252447 96706 200639 -62261 -495127
38818d95127m09121k64907n8492K5336j02045j29089K60981P64186P68388K68516
$$ -495127 -904248 -1169155 -1227647 -1202311 -1304356 -1433445 -1172464 -408278 360110 628626
38808F28626j12265m8029J60001K74058M62729P13139N65734j50880q49730r19856
$$ 628626 516361 468332 628333 902391 1365120 2078259 2643993 2493113 1643383 723527
38798G23527n16654j53953J03496M81104Q07901O34165j0007n21718m83927j25143
$$ 723527 206873 52920 156416 637520 1445421 2079586 2069579 1547861 1063934 938791
38788I38791Q5934o139k24655l58195l15000r9235K28849N68534P86460P46743
$$ 938791 1024725 1018586 793931 435736 120736 21501 250350 818884 1605344 2352087
38778B352087M14897n1491m14445n85085o29939n50773k62268J38988L14616O9354
$$ 2352087 2766984 2715493 2301048 1715963 1086024 535251 272983 411971 726587 795941
38768G95941l53045n35029l52599m2947J03344K362j85471j94434P3066L69460
$$ 795941 442896 -92133 -444732 -487679 -384335 -381973 -567444 -761878 -688812 -319352
38758c19352L47845K2601k25824j74970k6528j2235j5803J73553M45606M88977
$$ -319352 28493 51094 -174730 -349700 -376228 -388463 -404266 -230713 214893 703870
38748G03870K12387j78294m31344m07189j15131K28265L07827N3414k52141l51393
$$ 703870 916257 737963 306619 -100570 -215701 12564 320391 373805 121664 -229729
38738b29729l11854k74061j37449K26883O27933P29482M76913R6744k19909l89690
$$ -229729 -541583 -815644 -953093 -726210 -98277 631205 1108118 1204862 984953 595263
38728E95263l31624q0345R6285j3462k31461k25291n733J06841k4170j81787j30371
$$ 595263 263639 183294 279579 266117 34656 -190635 -196368 -89527 -113697 -295484 -425855
38717d25855J11514L47820L89012J92954m6097n4248J39637J61591j75290n28568
$$ -425855 -314341 33479 422491 615445 569348 515100 654737 816328 641038 112470
38707A12470m90007j54934J10888K32152L24702K56262j45513n50909l93656K76913
$$ 112470 -377537 -532471 -421583 -189431 135271 391533 246020 -304889 -698545 -421632
38697d21632P54921O07643J57176j13330j55545j37257n3594J43393L15115L07096
$$ -421632 333289 940932 1098108 984778 829233 691976 638382 781775 1096890 1403986
38687A403986J64685P561j32255k35098k50787k16900k32763k81784k82365k84163
$$ 1403986 1568671 1576232 1443977 1208879 958092 741192 508429 226645 -55720 -339883
38677c39883l47499l01965N801K89050J26750l00276l40397J41162M96928K63328
$$ -339883 -687382 -989347 -983546 -694496 -567746 -868022 -1208419 -1067257 -570329 -307001
38667c07001j80285k73070p0978O4767J28917K90141L82472J52140j86080j86454
$$ -307001 -487286 -760356 -831334 -766567 -637650 -347509 34963 187103 1023 -185431
38657a85431J30165L09212J57512m6758o7492l0370j20844k60519k29348M2766
$$ -185431 -55266 253946 411458 364700 297208 266838 145994 -114525 -343873 -301107
38647c01107L84875N11880K63322k02029n04634m11688l6691L48727N44784M38056
$$ -301107 83768 595648 858970 656941 152307 -259381 -296072 52655 597439 1035495
38637A035495L7495l91745m83363k12361N3022P4407K0261M9670j2110k91003
$$ 1035495 1072990 681245 197882 -14479 38543 112950 133211 182881 170771 -120232
38627a20232n04696l72410j03121m2505o4178J94049O27569P22416L04588k26183
$$ -120232 -624928 -997338 -1100459 -1142964 -1207142 -1013093 -385524 336892 641480 415297
38617D15297m60812l86989j67928J11094L45916L55873Q7396k80776n15908n09161
$$ 415297 -45515 -432504 -600432 -489338 -143422 212451 299847 19071 -496837 -1005998
38607a005998k92886j5352J46261J78961K53830M25937M81165K74822K2062j9143
$$ -1005998 -1298884 -1314236 -1167975 -989014 -735184 -309247 171918 446740 468802 449659
38597D49659M2544k8576j35573m1126J23171K4677k47621k49473P7932K50235
$$ 449659 492203 463627 328054 286928 410099 434776 187155 -62318 15614 265849
38587B65849j4623l57679l38116n4319R8784J5334j07679j70959k57139l55387
$$ 265849 251226 -106453 -444569 -498888 -400104 -384770 -492449 -663408 -920547 -1275934
38577a275934k76659O6885M34526M55570Q5831k53181j57692J94277K56387o2679
$$ -1275934 -1552593 -1485708 -1051182 -595612 -509781 -762962 -920654 -726377 -469990 -532669
38567e32669k10728J25491M08880L0489o39961o84134l676N03273K52813k55106
$$ -532669 -743397 -617906 -209026 -178537 -818498 -1502632 -1506308 -1003035 -750222 -1005328
38557a005328k85192J23626M41203M83758M51756M07522K26687l6833j58571j02053
$$ -1005328 -1290520 -1166894 -725691 -241933 209823 617345 844032 807199 648628 546575
38547E46575o4063j61864l07647l87490l71435k51508l8516J65736K19533R8532
$$ 546575 482512 320648 13001 -374489 -745924 -997432 -1035948 -870212 -650679 -552147
38537e52147n1435l2359K19311N13308N13598Q9034m56507o55423l87384L8267
$$ -552147 -603582 -635941 -416630 96678 610276 699310 242803 -412620 -800004 -761737
38527g61737L11702M22212M71473M15966J55188k42606n46528n66192l08661K0792
$$ -761737 -450035 -27823 443650 859616 1014804 772198 225670 -340522 -649183 -628391
38517f28391J84425J44283P8166Q7236J9996k44762m93895m33694j45690L3998
$$ -628391 -443966 -299683 -221517 -134281 -114285 -359047 -852942 -1286636 -1432326 -1398328
38507a398328K9825N5511J42576N9400k08737k99609K0425M95889P15185N71000
$$ -1398328 -1368503 -1312992 -1170416 -1111016 -1319753 -1619362 -1598937 -1103048 -387863 183137
38497A83137K49890j3674o0693R8288K33243J48488r363K6407J52762L2310k66596
$$ 183137 433027 419353 358660 456948 690191 838679 829316 855723 1008485 1040795 774199
38486G74199k58026K00148O18666N57539J48924k68585n66212o35663l04903K20223
$$ 774199 516173 716321 1334987 1892526 2041450 1772865 1206653 570990 266087 486310
38476D86310L35462j31755n45531l67282L6965L3279k80902l51088q2408J98140
$$ 486310 821772 690017 144486 -222796 -185831 -152552 -433454 -784542 -866950 -668810
38466f68810M06444O12620N37161o0136o37918m06601L88342O35392m306n44670
$$ -668810 -262366 350254 887415 827279 189361 -217240 171102 806494 802188 257518
38456B57518j73675N24810N04431j84431n69413k12917K88020K73061j44826m26634
$$ 257518 83843 608653 1113084 928653 359240 146323 434343 707404 562578 135944
38446A35944l63757j78766q1204l9406J9824L2322n9661j24489P922K51978L34856
$$ 135944 -227813 -406579 -487783 -527189 -507365 -475043 -534704 -659193 -651271 -399293 -64437
38435f4437J88202M3479N0160N2486q8265k05050j09990N2480N0273j8410P7574
$$ -64437 123765 167244 217404 269890 181625 -23425 -133415 -80935 -30662 -49072 28502
38424B8502K12956M8335l58267n26608k36506J59326K79507K38610L73275O62151
$$ 28502 241458 289793 -68474 -595082 -831588 -672262 -392755 -154145 219130 881281
38414H81281P13905K90641l59534p45348o42719l11803j75201l12673m01904j96098
$$ 881281 1595186 1885827 1526293 780945 138226 -173577 -348778 -661451 -1063355 -1259453
38404a259453J28554K48272J50709R6767K09632L25022K36738o2222l71430m39558
$$ -1259453 -1130899 -882627 -731918 -635151 -425519 -100497 136241 74019 -297411 -736969
38394g36969k06326P0316Q8822o2599j7207K57431L55965J31265J2574K70287
$$ -736969 -943295 -872979 -784157 -846756 -863963 -606532 -250567 -119302 -106728 163559
38384A63559M54064J06390l84716l37754J17656K74505J9738p6705J75180L06368
$$ 163559 617623 724013 339297 1543 119199 393704 413442 336737 511917 818285
38374H18285J08651j2526J30604J28101j93950l09851J21679N51275L31914k67894
$$ 818285 926936 914410 1045014 1173115 979165 669314 790993 1342268 1674182 1406288
38364A406288m90967j96011R2274L1735k10576l79096l95261k42416L9078K71297
$$ 1406288 915321 719310 811584 843319 632743 253647 -141614 -384030 -344952 -73655
38354g3655L27397L21775L90215M33192L18238J50802O7569m7774l24420n47229
$$ -73655 253742 575517 965732 1398924 1717162 1867964 1935533 1887759 1563339 1016110
38344A016110l98772K9666L05093K05888o4059k06408j51251l5369l527m3250
$$ 1016110 617338 647004 952097 1157985 1093926 887518 736267 700898 697371 654121
38334F54121J3027K38598L95642J95394k13145l44732o9592J69112K1704k61499
$$ 654121 667148 905746 1301388 1496782 1283637 938905 869313 1038425 1060129 798630
38324G98630k68853l0972J49938J88466J80272J15840k5162r9589l5041k6402
$$ 798630 529777 498805 648743 837209 1017481 1133321 1108159 1008570 973529 947127
38314I47127k08716l81764l52135k50959j90735K6902M48603O15342K19850k35020
$$ 947127 738411 356647 4512 -246447 -437182 -410280 38323 653665 873515 638495
38304F38495r7192L81253M01270j18942m45728k07507J29754J25012m0144j04838
$$ 638495 541303 922556 1323826 1204884 759156 551649 681403 806415 766271 661433
38294F61433k12428m67130n38206j54730L68443N18188K59048j9748n7151O3189
$$ 661433 449005 -18125 -556331 -711061 -342618 175570 434618 414870 357719 420908
38284D20908J34100N9176o4848k5904K30454M25737K58808j44811l91007m01695
$$ 420908 555008 614184 549336 523432 753886 1179623 1438431 1293620 902613 500918
38274E00918m62118o50996o67181l67655n2018J3138j7800Q8693K46684K74040
$$ 500918 38800 -612196 -1279377 -1647032 -1699050 -1685912 -1703712 -1615019 -1368335 -1094295
38264a094295K29849K38420K16293O1855q8714p5885p965o1556j46192n3832J61892
$$ -1094295 -864446 -626026 -409733 -347878 -436592 -512477 -520442 -581998 -728190 -782022 -620130
38253f20130K32149O3179j37728j38071M2535J45189n0935m12954m90871n6626
$$ -620130 -387981 -324802 -462530 -600601 -558066 -412877 -463812 -876766 -1367637 -1424263
38243a424263M67918M45736j00296m49716j57068L53518M28131N4537k61843k28716
$$ -1424263 -956345 -510609 -610905 -1060621 -1217689 -864171 -436040 -381503 -643346 -872062
38233h72062J6893K59163L90814L28951P7858j45085j11957R4278J70188j5625
$$ -872062 -855169 -596006 -205192 123759 201617 56532 -55425 38853 209041 193416
38223A93416k98456m55078m01107j73912J38760M41447O55895O87645M23729p9227
$$ 193416 -105040 -560118 -961225 -1135137 -996377 -554930 100965 788610 1212339 1133112
38213A133112m53664l48098O9078K54071K7730j91598n7128J98906J92312m1391
$$ 1133112 679448 331350 400428 654499 682229 490631 433503 632409 824721 783330
38203G83330k33891l25654l58358k19943R8692K50149k7383m21807m40150j03118
$$ 783330 549439 223785 -134573 -354516 -255824 -5675 -33058 -454865 -895015 -998133
38193i98133J97474L36716M43157M09939Q978n39282o74208k43333L11178N63523
$$ -998133 -800659 -463943 -20786 389153 398131 -141151 -815359 -1058692 -747514 -183991
38183a83991M93327K63367L9851L3685K82442M06701M6404m97515n86316j88934
$$ -183991 309336 572703 612554 646239 928681 1335382 1381786 884271 297955 109021
38173A09021Q9418m8988k69383l09359l12284k90458J6346M89419N74313K02005
$$ 109021 198439 149451 -119932 -429291 -741575 -1032033 -1015687 -526268 48045 250050
38163B50050O945K25467K12984l67702p43629k46565M24667K09366n85811p44927
$$ 250050 256995 482462 695446 327744 -415885 -662450 -237783 -28417 -614228 -1359155
38153a359155m1970N42990M64422K59561L53076L35609j21429n48151m35888l0987
$$ -1359155 -1401125 -858135 -393713 -134152 218924 554533 433104 -115047 -550935 -581922
38143e81922J67916J51963J42532Q1563j15773k11283l1831J41832K1345j87779
$$ -581922 -414006 -262043 -119511 -37948 -153721 -365004 -396835 -255003 -233658 -421437
38133d21437j72165o7659j54606k93697j83903M8982N9627q3464j6845K50131
$$ -421437 -593602 -661261 -815867 -1109564 -1293467 -1244485 -1184858 -1268322 -1285167 -1035036
38123a035036L21979P3254j72640j84502j06692r6573o7727N2213J24973M1653
$$ -1035036 -713057 -639803 -812443 -996945 -1103637 -1200210 -1267937 -1215724 -1090751 -1049098
38113a049098o9799l9246J02553K00172J81730J08977R1484J75325K66620K15657
$$ -1049098 -1118897 -1158143 -1055590 -855418 -673688 -564711 -473227 -297902 -31282 184375
38103A84375M3659l1953Q4275J79337M5915j81631k47710j76937j58243j63675
$$ 184375 228034 196081 280356 459693 505608 323977 76267 -100670 -258913 -422588
38093d22588m1636R7310l464k57149k83030p464K02642J42828J03597L61024O59771
$$ -422588 -464224 -366914 -370378 -627527 -910557 -918021 -715379 -572551 -468954 -107930 551841
38082E51841N30997l3248n21121n01936j04772J60840K1117k05915j1765N44272
$$ 551841 1082838 1049590 528469 26533 -78239 82601 103718 -102197 -113962 430310
38072D30310P82818L14294l36468m26596m5894J04558j59458k96510q980K91805
$$ 430310 1213128 1527422 1190954 764358 718464 823022 663564 367054 358074 649879
38062F49879K19525k7868j65304k95477m93690m52784k0163L54832K21819j81304
$$ 649879 869404 841536 676232 380755 -112935 -565719 -585882 -231050 -9231 -190535
38052a90535l36091k05897p7417L8788K72592M08781J50098k78908l66739o3024
$$ -190535 -526626 -732523 -809940 -771152 -498560 -89779 60319 -218589 -585328 -648352
38042f48352K31634L22861L37114K75036K3465k26560j54555Q6285J6645l70760
$$ -648352 -416718 -93857 243257 518293 541758 315198 160643 246928 263573 -107187
38032a07187n48867k97708j3746P066J5789K55798M77468L78547J29499O1423
$$ -107187 -656054 -953762 -967508 -960442 -944653 -688855 -211387 167160 296659 358082
38022C58082J17960J0005k60727l82150j66482K31843M94978M13988N8972k45846
$$ 358082 476042 486047 225320 -156830 -323312 -91469 403509 817497 876469 630623
38012F30623k18663O3822K61220J78120p3622k88037l39545j80621R9588K46068
$$ 630623 411960 475782 737002 915122 841500 553463 213918 33297 132885 378953
38002C78953J15267p4900n4143L7755j24888m42164m75804j58776R5647Q7875
$$ 378953 494220 419320 365177 402932 278044 -164120 -639924 -798700 -703053 -615178
37992f15178J03116L06195L96177J59890r5591l3292J60323J09384j33853j95345
$$ -615178 -512062 -205867 190310 350200 254609 221317 381640 491024 357171 161826
37982A61826N3822L46950L49159l9822n83814q27156n23832J064K10733R9629
$$ 161826 215648 562598 911757 871935 288121 -539035 -1062867 -1061803 -851070 -751441
37972g51441J48737M58327M95465j5924n13279l63342K07646M70431J97484j92480
$$ -751441 -602704 -144377 351088 335164 -178115 -541457 -333811 136620 334104 141624
37962A41624l17654k07259q0981r8330k59606l47342j24882K55975L33442Q453
$$ 141624 -176030 -383289 -464270 -562600 -822206 -1169548 -1294430 -1038455 -705013 -696560
37952f96560k40802q5285J41488K7639k41734k61755r5370o6659j67305j89454
$$ -696560 -937362 -1022647 -881159 -853520 -1095254 -1357009 -1452379 -1519038 -1686343 -1875797
37942a875797j82237k58365k11625J36941M73638M29891K17248K35327L37700
$$ -1875797 -2058034 -2316399 -2528024 -2391083 -1917445 -1487554 -1270306 -1034979 -697279
37933f97279J65272o9057P8482L65330J80175l09513k89804L47738P59970M91079
$$ -697279 -532007 -601064 -522582 -157252 22923 -286590 -576394 -228656 531314 1022393
37923A022393J16084J62701K74740K285l30015k26845O9907o97l72071n19129
$$ 1022393 1138477 1301178 1575918 1578203 1248188 1021343 1091250 1090553 718482 199353
37913A99353l39662k14698k94917l10494r6122J77401L59557N14125O53655O02039
$$ 199353 -140309 -355007 -649924 -960418 -1056540 -879139 -519582 -5457 648198 1250237
37903A250237K86389l9844m9296K59206N50781N46963L29850J90919K49927L76501
$$ 1250237 1536626 1496782 1447486 1706692 2257473 2804436 3134286 3325205 3575132 3951633
37893C951633M80614O43266Q45415Q20114M08551j34282m67738o22261q03429
$$ 3951633 4432247 5075513 5920928 6741042 7149593 7015311 6547573 5925312 5121883
37884E121883r13662o97400k82520j09652k91990m78622m38815l68231m64989
$$ 5121883 4208221 3510821 3228301 3118649 2826659 2348037 1909222 1540991 1076002
37875A076002n68424m32534j01279J80475K58520J56328K2149L8114K19554L10980
$$ 1076002 507578 75044 -26235 154240 412760 569088 591237 629351 848905 1159885
37865A159885Q9521k51954k86626O8709M25990M29201J53253o9380m6514J05562
$$ 1159885 1249406 997452 710826 779535 1205525 1634726 1787979 1718599 1672085 1777647
37855A777647J00558j85554m82951l95119K8693K70054M9415k87869l29277j36575
$$ 1777647 1878205 1692651 1209700 814581 843274 1113328 1162743 874874 545597 409022
37845D09022Q7822M06811P73318P39204J33616m10717k92120J11961R4377j94268
$$ 409022 496844 903655 1676973 2416177 2549793 2139076 1846956 1958917 2053294 1859026
37835A859026j12413K52505K60506p6528j36169J39823J78106j05917j72923Q3623
$$ 1859026 1746613 1999118 2259624 2183096 2046927 2186750 2364856 2258939 2086016 2169639
37825B169639J79548L9217J23484M44599M90773K49414K42423M44275L03222n7000
$$ 2169639 2349187 2388404 2511888 2956487 3447260 3696674 3939097 4383372 4686594 4629594
37815D629594R8477O97451Q47049M69669N29291J282226J765109J476154J125793
$$ 4629594 4728071 5425522 6272571 6742240 7271531 8553757 10318866 11795020 12920813
37806A2920813J253598J565874K063356L224254M650736N299411N457720O469780
$$ 12920813 14174411 15740285 17803641 21027895 25678631 30978042 36435762 42905542
37798D2905542Q109319Q701881Q446519R669560J2902177J6305487K0438140K9031801
$$ 42905542 51014861 59716742 68163261 77832821 90734998 107040485 127478625 156510426
37790A56510426M1881162N1328023N0383349M0697618K7168065Q614601j8007265
$$ 156510426 198391588 249719611 300102960 340800578 367968643 376583244 358575979
37783C58575979m5665804n9336724n2894776l6685154k4546369j9393944j5990707
$$ 358575979 312910175 253573451 200678675 163993521 139447152 120053208 104062501
37776A04062501j2042793r795651r701302r292493p836690p044653p137042o319159
$$ 104062501 92019708 82224057 72522755 63230262 55393572 48348919 41211877 34892718
37768C4892718m363869l147956l248899l123191k115998j453187j672199j653608
$$ 34892718 30528849 27380893 24131994 21008803 18892805 17439618 15767419 14113811
37760A4113811r22086n97363j231424j725154j269613o06518m93799m71074k0861
$$ 14113811 13191725 12594362 11362938 9637784 8368171 7761653 7267854 6796780 6775919
37751F775919L82718K31635j16571k20176k79014n03809o52875o55237q14502
$$ 6775919 7158637 7390272 7273701 7053525 6774511 6270702 5617827 4962590 4148088
37742D148088j021118o85712J71170O89349M23063n0312j45418l5323l7562o6485
$$ 4148088 3126970 2441258 2612428 3301777 3724840 3674528 3529110 3493787 3456225 3389740
37732C389740o6126k15929l98669k34185J21701N5224m04604m95505j3311K99654
$$ 3389740 3323614 3107685 2709016 2474831 2596532 2651756 2247152 1751647 1738336 2037990
37722B037990L5175k26676l4278J60174n1446k41706q679K01680j02614n46936
$$ 2037990 2073165 1846489 1812211 1972385 1920939 1679233 1670554 1872234 1769620 1222684
37712A222684n46546k56619j24127o6965J53730K78103L2060k07258J588L38870
$$ 1222684 676138 419519 295392 228427 382157 660260 692320 485062 486650 825520
37702H25520K55359o8560j00272O0271o1339l25346j59092L76952N93849K81537
$$ 825520 1080879 1012319 912047 972318 910979 585633 426541 803493 1397342 1678879
37692A678879p524Q2955K25649J19850K0223K08117M60088M48625L13127M37387
$$ 1678879 1671355 1754310 1979959 2099809 2120032 2328149 2788237 3236862 3549989 3987376
37682C987376Q67187J261477J287276Q40386L1032q06715j212888r85759m50790
$$ 3987376 4854563 6116040 7403316 8243702 8274734 7468019 6255131 5269372 4818582
37673D818582j31682j63125k53128k28846k93748n76513p49599m64519K5990J56816
$$ 4818582 4686900 4523775 4270647 4041801 3748053 3171540 2421941 1957422 1983412 2140228
37663B140228r2798j76801R9449K48283m4895l49104k29325q011j66883m45029
$$ 2140228 2047430 1870629 1970078 2218361 2173466 1824362 1595037 1587026 1420143 975114
37653I75114k89767J13821J10196k94382m38033j11161K00676K40731K87267L91334
$$ 975114 685347 799168 909364 614982 176949 65788 266464 507195 794462 1185796
37643A185796J78581l33300n58485l13934j52365l42972l61037R7624M18508N2298
$$ 1185796 1364377 1031077 472592 158658 6293 -336679 -697716 -600092 -181584 -129286
37633a29286n13910n23917j01196J60183K43345M85591O90076L70047l11086o75450
$$ -129286 -643196 -1167113 -1268309 -1108126 -864781 -379190 310886 680933 369847 -305603
37623c05603n19992k45619q3760R4032K45295J57428J1283K53572P92168R52502
$$ -305603 -825595 -1071214 -1154974 -1060942 -815647 -658219 -646936 -393364 398804 1351306
37613A351306M27683k65886n02813k72807K7763J48186R3626l8644j28974j11010
$$ 1351306 1778989 1513103 1010290 737483 765246 913432 1007058 968414 839440 728430
37603G28430p1443j26192k05918j60157k7739L3882L2809R2668J75634J38236
$$ 728430 656987 530795 324877 164720 136981 170863 203672 296340 471974 610210
37593F10210J5171l7758l1661q7477j62991j51581j69751l77120n65598l51400
$$ 610210 625381 587623 555962 468485 305494 153913 -15838 -392958 -958556 -1309956
37583a309956J94107N15896K82649k13765m75331l27799N2449L65970L61809L9624
$$ -1309956 -1115849 -599953 -317304 -531069 -1006400 -1334199 -1281750 -915780 -553971 -514347
37573e14347k44432j13386L38625O33525N13697J78177j18402l64121n65154n44683
$$ -514347 -758779 -872165 -533540 99985 613682 791859 673457 309336 -255818 -800501
37563h00501j93953K61608M52511K41533j85809n10147n01413j75331K01184L43832
$$ -800501 -994454 -732846 -280335 -38802 -224611 -734758 -1236171 -1411502 -1210318 -866486
37553h66486K28149P0512M4883J02419O1269j81325m89085n33891j42444L80273
$$ -866486 -638337 -567825 -522942 -420523 -359254 -540579 -1029664 -1563555 -1705999 -1325726
37543a325726N10588J82465r1986N0696L29344L38092J98534K55149M06271K75762
$$ -1325726 -815138 -632673 -724659 -673963 -344619 -6527 192007 447156 853427 1129189
37533A129189j05944l31468k52019q0810P6092K75395L63275J01442l05366l59050
$$ 1129189 1023245 691777 439758 358948 435040 710435 1073710 1175152 869786 510736
37523E10736k9517J61590o4662l77692m11198k14278L3119K82376M24291K96726
$$ 510736 481219 642809 578147 200455 -210743 -425021 -391902 -109526 314765 611491
37513F11491M6694J7312J37761l0254m66525n52709o5856L38439R6869l83137
$$ 611491 658185 675497 813258 783004 316479 -236230 -302086 36353 133222 -249915
37503b49915l86744K7307K40552M1767k50379m09944m47263k77091J77788O16299
$$ -249915 -636659 -609352 -368800 -327033 -577412 -987356 -1434619 -1711710 -1533922 -917623
37493i17623O18001K65025N2439J77525L41214K80374R4385m0654j51825l40943
$$ -917623 -299622 -34597 17842 195367 536581 816955 911340 870686 718861 377918
37483C77918n75844o80317m49826J29350O68521O10768q1412p00842n87807M8485
$$ 377918 -197926 -878243 -1328069 -1198719 -530198 80570 -842 -701684 -1289491 -1241006
37473a241006M81046M51758L26489L59235L51657J28253j25789j90324j34300
$$ -1241006 -759960 -308202 18287 377522 729179 857432 731643 541319 407019
37464D07019j32349k05685k80343k94385j62792J48135M43233M24139Q0282k42538
$$ 407019 274670 68985 -211358 -505743 -668535 -520400 -77167 346972 427254 184716
37454A84716k38610N7582L86587M87827K20865k85876n92777l39069K58689N67923
$$ 184716 -53894 3688 390275 878102 1098967 813091 220314 -118755 139934 707857
37444G07857K86420k31376m82850l66083q4796J98859L86009L34977J1621l44506
$$ 707857 994277 762901 280051 -86032 -170828 28031 414040 749017 760638 416132
37434D16132m20582j71767J53905K77321R9251k53614n02431m25719q1678K47774
$$ 416132 -4450 -176217 -22312 255009 354260 100646 -401785 -827504 -909182 -661408
37424f61408L72576L47996K91906K13674R3611k8776j33257k36644k63590r0293
$$ -661408 -288832 59164 351070 564744 658355 629579 496322 259678 -3912 -94205
37414i4205J85829K46590j2100k63647j95128K2216l711k82711m40786k86529
$$ -94205 91624 338214 326114 62467 -132661 -110445 -114156 -396867 -837653 -1124182
37404a124182m0928N5428O2820J36172K28927J82480j6506k15121k59296r9630
$$ -1124182 -1165110 -1109682 -1046862 -910690 -681763 -499283 -515789 -730910 -990206 -1089836
37394a089836J74442L41497K14978j02963k59730o1160K77497M23922L41883K26126
$$ -1089836 -915394 -573897 -358919 -461882 -721612 -782772 -505275 -81353 260530 486656
37384D86656J40753j5369k18438k81023j56871l1361j7881p693N4225K576k38409
$$ 486656 627409 612040 393602 112579 -44292 -75653 -93534 -101227 -47002 -44426 -282835
37373b82835m12855k78095j6765K2710j15979p5911J98790L31411R6101k27053
$$ -282835 -695690 -973785 -990550 -967840 -1083819 -1159730 -960940 -629529 -533428 -760481
37363g60481k71132p4542P7179R0098Q8911J41215K00730K59675L52638M34269
$$ -760481 -1031613 -1106155 -1028976 -938878 -849967 -708752 -508022 -248347 104291 538560
37353E38560M02422K24113n1220l39554n06109m17565j27713J05807J27270Q8950
$$ 538560 940982 1165095 1113875 774321 268212 -149353 -277066 -171259 -43989 44961
37343D4961J96930L73609L71283J34478j59409l62718m54710m17071k24743L7044
$$ 44961 241891 615500 986783 1121261 961852 599134 144424 -272647 -497390 -460346
37333d60346K15880K48153J45985r3677l89005m86926k40780Q4692R8133j32638
$$ -460346 -244466 3687 149672 55995 -333010 -819936 -1060716 -976024 -877891 -1010529
37323a010529j33736K55055N85961M30382j6245k46172j28249M9455Q7357N9349
$$ -1010529 -1144265 -889210 -303249 127133 110888 -135284 -263533 -214078 -126721 -67372
37313f7372K0363j06330k56007j47545L10581P29373O13788q975n46001m81208
$$ -67372 -47009 -153339 -409346 -556891 -246310 483063 1096851 1087876 541875 60667
37303F0667O5265N07811M57674R5761j36162r8439n6519k18531l78538k21512
$$ 60667 125932 633743 1091417 1187178 1051016 952577 896058 677527 298989 77477
37293G7477J24321J71780k09248n09521k79688J81081K68566K2690M0684M27548
$$ 77477 201798 373578 164330 -345191 -624879 -443798 -175232 -152542 -111858 315690
37283C15690N25032k3918n96557n07654p3185m4946l59866l21605J31541K94994
$$ 315690 840722 816804 220247 -287407 -360592 -405538 -765404 -1087009 -955468 -660474
37273f60474p7220l51375j17116J54288K0096j46076J08325M51933L75280J33717
$$ -660474 -737694 -1089069 -1206185 -1051897 -1031801 -1177877 -1069552 -617619 -242339 -108622
37263a08622K68024N54911L12184m26106q83507o71298k04010N8472J10256N5717
$$ -108622 159402 714313 1026497 600391 -283116 -954414 -1158424 -1099952 -989696 -933979
37253i33979j05820k15625k7038L19723L88022J17623p7941K0673J65710J32706
$$ -933979 -1039799 -1255424 -1282462 -962739 -574717 -457094 -535035 -514362 -348652 -215946
37243b15946n991j79411l85647m08789l5853L86674K71254k29044l13663J77495
$$ -215946 -221937 -401348 -786995 -1195784 -1231637 -844963 -573709 -802753 -1116416 -938921
37233i38921M15769p2184n67244k97710L27536M37063Q6741J3534L38404M56289
$$ -938921 -523152 -595336 -1162580 -1460290 -1132754 -695691 -608950 -595416 -257012 199277
37223A99277J20763k13673k04463p2871r0575j76333j87457j80322k08032j81805
$$ 199277 320040 106367 -98096 -170967 -261542 -437875 -625332 -805654 -1013686 -1195491
37213a195491n9278P6287J83591K96768L83929L61910K20493j4051l26068n86882
$$ -1195491 -1254769 -1178482 -994891 -698123 -314194 47716 268209 254158 -71910 -658792
37203f58792n94998m02175k96281k53985J50818R39567J351213Q55730Q2491k9002
$$ -658792 -1253790 -1655965 -1952246 -2206231 -2055413 -1115846 235367 1091097 1173588 1144586
37193A144586L54771L22518k13394l99442L9456K83548j99692p44865n59282O9791
$$ 1144586 1499357 1821875 1608481 1209039 1248495 1532043 1332351 587486 28204 97995
37183I7995L37526J24470q3030q4472p4432q8178K8907J99356J78865l486p8802
$$ 97995 435521 559991 476961 392489 318057 229879 258786 458142 637007 633521 554719
37172E54719L4625J71356K20091J99978J22993K4463P007L7331j09691m60507
$$ 554719 589344 760700 980791 1180769 1303762 1328225 1335232 1372563 1262872 802365
37162H02365o38304l62899P9664K31837J08782L2589K1954j57200m40389m84054
$$ 802365 164061 -198838 -119174 112663 221445 254034 275988 118788 -321601 -805655
37152h05655k28549L5284J85495L79773N83065M81568L6302l18364k58305J2551
$$ -805655 -1034204 -998920 -813425 -433652 149413 630981 667283 348919 90614 103165
37142A03165J57682J74618J96980J48179p0958k78631k44947p6135l4161q3179
$$ 103165 260847 435465 632445 780624 709666 431035 186088 109953 75792 -7387
37132g387L9880L43565N08672L40666J5589k08623k93219l24692l21381k77114
$$ -7387 32493 376058 884730 1225396 1240985 1032362 739143 414451 93070 -184044
37122a84044k50220k52450j52818J41721M72460N74718M26841K73794K59352K17546
$$ -184044 -434264 -686714 -839532 -697811 -225351 349367 776208 1050002 1309354 1526900
37112A526900l9915l67399m30812j81345M4845j7581k02945j88052k993m603l15689
$$ 1526900 1486985 1119586 688774 507429 552274 534693 331748 143696 140703 136100 -179589
37101a79589n54792l16174K26134M69846J58624k59337k13872K29589M71908J90548
$$ -179589 -734381 -1050555 -824421 -354575 -195951 -455288 -669160 -439571 32337 222885
37091B22885k73150m39581l05194j85843j58082j2691K92016M96357M33236K51988
$$ 222885 -50265 -489846 -795040 -980883 -1138965 -1151656 -859640 -363283 69953 321941
37081C21941J24581P633j26634r0595K17833N05566L99076j5532k77535j61644
$$ 321941 446522 454155 327521 236926 454759 960325 1359401 1343869 1066334 904690
37071I04690Q0352J15593r5099l80783n72120n31389k00125K39867M38148K68133
$$ 904690 985042 1100635 1005536 624753 52633 -478756 -678881 -439014 -866 267267
37061B67267r9p1876j3550o6985k23396k64658j79096k17212m47567n30499j41113
$$ 267267 267168 195292 181742 114757 -108639 -373297 -552393 -769605 -1217172 -1747671 -1888784
37050a888784N23958Q95112O75272J64744j07185M4788L42036M24223K26208m7880
$$ -1888784 -1364826 -469714 205558 370302 263117 307905 649941 1074164 1300372 1252492
37040A252492k16926k74994k77530k21659j16735o9592j63015k86671k33000K8250
$$ 1252492 1035566 760572 483042 261383 144648 75056 -87959 -374630 -607630 -579380
37030e79380L01357M13752L75024K46300K3500k40589l60705k45297r3069j56853
$$ -579380 -278023 135729 510753 757053 780553 539964 179259 -66038 -159107 -315960
37020c15960l63068l83519q9565K70940M01285K92267J58936J62385K57136K44728
$$ -315960 -679028 -1062547 -1152112 -881172 -479887 -187620 -28684 133701 390837 635565
37010F35565j4049l57901l87271M3472M90426L85860j73638m81989j62354L44985
$$ 635565 621516 263615 -123656 -80184 410242 796102 622464 140475 -21879 323106
37000C23106M37846J15057k21996l93000m56366l52353m209L43847L51328J08093
$$ 323106 760952 876009 654013 261013 -195353 -547706 -551915 -208068 143260 251353
36990B51353J1539J21077P0514l01481o43182n72712j61141K25140L28906J36234
$$ 251353 262892 383969 454483 153002 -490180 -1062892 -1224033 -998893 -669987 -533753
36980e33753j70377k97774q4998K73186M32347L26450J54535j7268k99078o05417
$$ -533753 -704130 -1001904 -1086902 -813716 -381369 -54919 99616 82348 -216730 -822147
36970h22147o26640k81986J28956L29014L07767J21624j60511k58810Q9409N75676
$$ -822147 -1448787 -1730773 -1601817 -1272803 -965036 -843412 -1003923 -1262733 -1173324 -597648
36960e97648N28928r7584n02708j30862N48309P74280N02775J73300o5375k98120
$$ -597648 -68720 -166304 -669012 -799874 -251565 522715 1025490 1198790 1133415 835295
36950H35295l84107j92678j2072r8483j01613L72891Q85398O50681k14624p63838
$$ 835295 451188 258510 246438 147955 46342 419233 1304631 1955312 1740688 976850
36940I76850n53328j00466Q6290J30757K31912K44245J31457J74804L84882L21910
$$ 976850 423522 323056 409346 540103 772015 1016260 1147717 1322521 1707403 2029313
36930B029313j30222m14027j51210K20349J54651j70494k82641k26110l22643
$$ 2029313 1899091 1485064 1333854 1554203 1708854 1538360 1255719 1029609 706966
36921G06966m68707l31740k1066Q7775O1707K92449O98186O82260K5397o95230
$$ 706966 238259 -93481 -114547 -26772 34935 327384 1025570 1707830 1733227 1037997
36911A037997q07755l27143J74441K58676J1730j47239L9276L48764L35146n1355
$$ 1037997 230242 -96901 77540 336216 347946 200707 239983 588747 923893 872538
36901H72538l25462j29249K24106J89789k26362n32695m89888l42545l20262l28209
$$ 872538 547076 417827 641933 831722 605360 72665 -417223 -759768 -1080030 -1408239
36891a408239k11357J9836L08910N92973O70460L58574j43096l84867k63519j38108
$$ -1408239 -1619596 -1599760 -1290850 -697877 -27417 331157 188061 -196806 -460325 -598433
36881e98433k18598k29422P0324L82666K58259k09203m54724j57207M04030P09281
$$ -598433 -817031 -1046453 -976129 -593463 -335204 -544407 -999131 -1156338 -752308 -43027
36871d3027N16627K9026l04216j83138K16886L81847O4786l48316k98688J86529
$$ -43027 473600 502626 198410 15272 232158 614005 678791 330475 31787 218316
36861B18316M93385K29048k68351m08070j09875J85194J59787m0143j37874r7613
$$ 218316 711701 940749 672398 264328 154453 339647 499434 459291 321417 223804
36851B23804j5307J22493L33383M45495K91045K3402n3691M4218O419k38890l81708
$$ 223804 208497 330990 664373 1109868 1400913 1424315 1370624 1414842 1421261 1182371 800663
36840H00663k62057j61796k98300l79968o8968L73375M07971O0039j11238R8930
$$ 800663 538606 376810 78510 -301458 -370426 2949 410920 470959 359721 458651
36830D58651K51413L8998j87540k7749K53207J16047l68756n68617k01459K87794
$$ 458651 710064 749062 561522 533773 786980 903027 534271 -34346 -235805 51989
36820E1989L95934J99422O9166N5009p2193l08704l76414k32523k05905m14716
$$ 51989 447923 647345 716511 771520 699327 390623 14209 -218314 -424219 -838935
36810h38935m14462J74426R16851R83667L10622k40192o9737L62124L21212r8675
$$ -838935 -1253397 -1078971 -162120 821547 1132169 891977 822240 1184364 1505576 1406901
36800A406901k54375m3644Q54l31452n79002l86068l8452O3189j8351m4846o0226
$$ 1406901 1152526 1108882 1109736 778284 199282 -186786 -225238 -162049 -180400 -225246 -285472
36789b85472j66224j75480O4290K48570J0417m12397m32819j6514K11711q7984
$$ -285472 -451696 -627176 -562886 -314316 -303899 -716296 -1149115 -1165629 -953918 -1041902
36779a041902m02415p4460P24177J153550P64551J3536l79456k82670j10527r7734
$$ -1041902 -1444317 -1518777 -794600 358950 1123501 1137037 757581 474911 364384 266650
36769B66650o181L48550O38480M31740j05180l38898l3283L20416K04149k46893
$$ 266650 260469 609019 1247499 1679239 1574059 1235161 1201878 1522294 1726443 1479550
36759A479550n38107n11268l80450k40839K6760L65362M61209J95266j23883j80776
$$ 1479550 941443 430175 49725 -191114 -164354 201008 662217 857483 733600 552824
36749E52824r2122j70384l69049k84075K27285O99777N64961j04304o31844n54181
$$ 552824 460702 290318 -78731 -362806 -135521 564256 1129217 1024913 393069 -161112
36739a61112j28221J15667O1294k5504j2431O938N5229K66889N03145M11466J605
$$ -161112 -289333 -173666 -112372 -137876 -150307 -143369 -88140 178749 681894 1093360 1094965
36728A094965k63311j47455J8362m6691p1386K28413N01436K25505m05645o70220
$$ 1094965 831654 684199 702561 655870 584484 812897 1314333 1539838 1134193 463973
36718D63973l24456J42653K73662J30532o0170k40288l33870j70166J91175M08703
$$ 463973 139517 282170 555832 686364 626194 385906 52036 -118130 73045 481748
36708D81748L28580J89518J84666J50737r0923l86189m85290l81971j97555L0780
$$ 481748 810328 999846 1184512 1335249 1244326 858137 372847 -9124 -206679 -175899
36698a75899K27133J92126j05377l65393l37985j66911r6944m6876K11303N92771
$$ -175899 51234 243360 137983 -227410 -565395 -732306 -829250 -876126 -664823 -72052
36688g2052P47388N09810M8526l76576n91700n30550l00261j50237j77952j68749
$$ -72052 675336 1185146 1233672 857096 265396 -265154 -565415 -715652 -893604 -1062353
36678a062353P1235L68141M24258K73276J80765J83086P3761j70747k95350j53910
$$ -1062353 -991118 -622977 -198719 74557 255322 438408 512169 341422 46072 -107838
36668a07838P9866J56017m101l17362n80573n17573m2589N07865O59606L46945
$$ -107838 -27972 128045 123944 -193418 -773991 -1291564 -1334153 -826288 -166682 180263
36658A80263n3131k18944j45801O3615L17772M01911J01498m16033o80469n19328
$$ 180263 127132 -91812 -237613 -173998 143774 545685 647183 231150 -449319 -968647
36648i68647k52759j53992r1650R1637K41067K18518K05147L31186L44605N4406
$$ -968647 -1221406 -1375398 -1467048 -1375411 -1134344 -915826 -710679 -379493 -34888 19518
36638A9518k13202q8544J78609R8693k07508j95580J39004K14304j17681k45777
$$ 19518 -193684 -282228 -103619 -4926 -212434 -408014 -269010 -54706 -172387 -418164
36628d18164J93637O41387M32987k01036n20877l35723q8037p0553j42394j65746
$$ -418164 -224527 416860 849847 648811 127934 -207789 -295826 -366379 -508773 -674519
36618f74519j86229j44909J06123M10534L72147m5323l79308l02760k8336J24990
$$ -674519 -860748 -1005657 -899534 -489000 -116853 -162176 -541484 -844244 -872580 -747590
36608g47590J96760L31148L89630J89088j04586k10153j93737k96894m23920k52865
$$ -747590 -550830 -219682 169948 359036 254450 44297 -149440 -446334 -870254 -1123119
36598a123119J67565L97088K57862P3398J03999J64175M4673o5303Q0907L12477
$$ -1123119 -955554 -558466 -300604 -227206 -123207 40968 85641 20338 101245 413722
36588D13722K98716Q8513j2227K5316k8077j57617q0618K10164L15122J5742l65712
$$ 413722 712438 800951 788724 814040 785963 628346 547728 757892 1073014 1088756 723044
36577G23044m30320k42850j40315k13694k68001j69598K6785K16941L00611J82009
$$ 723044 292724 49874 -90441 -304135 -572136 -741734 -714949 -498008 -197397 -15388
36567a5388q3216k37951j25172P1277J09686O6959J29292J49707j54650o00109
$$ -15388 -98604 -336555 -461727 -390450 -280764 -213805 -84513 65194 -89456 -689565
36557f89565o39875j93224J36522m7387k85401N3083P57712J006830M94603k09233
$$ -689565 -1329440 -1522664 -1386142 -1433529 -1718930 -1665847 -908135 98695 593298 384065
36547C84065m67151k70675J2592J84904K63282K45107J01188j07790k73920l21997
$$ 384065 -83086 -353761 -341169 -156265 107017 352124 453312 345522 71602 -250395
36537b50395j88637J16968L70812K80007j05772l62940k43453j5959l2272j95537
$$ -250395 -439032 -322064 48748 328755 222983 -139957 -383410 -399369 -431641 -627178
36527f27178j84918l2523p5625l86295o33990n52785k19191J84447N62011P80348
$$ -627178 -812096 -844619 -920244 -1306539 -1940529 -2493314 -2712505 -2528058 -1966047 -1185699
36517a185699O78381L38550P3958N696p4834k74642l37301l8602M25703P11967
$$ -1185699 -507318 -168768 -94810 -89114 -163948 -438590 -775891 -814493 -388790 323177
36507C23177P50919O18993K49935l38433p29657n06368Q7224L52679N8008k92770
$$ 323177 1074096 1693089 1943024 1604591 874934 368566 455790 808469 866477 573707
36497E73707k40215J0406P332k39742l16911j4884M28721O61436N77669L37058
$$ 573707 333492 343898 351230 111488 -205423 -220307 208414 869850 1447519 1784577
36487A784577J41399J8294j75756m89047o81606m88706n6410J65527L4863r5555
$$ 1784577 1925976 1944270 1768514 1279467 597861 109155 52745 218272 253135 157580
36477A57580L7873J75665k0261l69331m18987j21247J66122K73131L61053M66433
$$ 157580 195453 371118 350857 -18474 -437461 -558708 -392586 -119455 241598 708031
36467G08031L70689N1684j60341q9691j0256j69771l51823k55518m5053r9605
$$ 708031 1078720 1130404 970063 880372 870116 700345 348522 93004 47951 -51654
36457e1654l70938m46005k16393l7673j41225k91070j97001O8318K87910M50514
$$ -51654 -422592 -868597 -1084990 -1122663 -1263888 -1554958 -1751959 -1683641 -1395731 -945217
36447i45217O10253O29300L88111R7532M5226J15906m9571m21422n27527j58554
$$ -945217 -334964 294336 682447 779979 825205 941111 891540 470118 -57409 -215963
36437b15963K62154K60496l9426j68941j1026J26611M9129p9553o1688N6193J20659
$$ -215963 46191 306687 267261 98320 87294 213905 263034 183481 121793 177986 298645
36426B98645P9914l3272j77656k98206l51577l46769k64391j4577L49311M92109
$$ 298645 378559 345287 167631 -130575 -482152 -828921 -1093312 -1107889 -758578 -266469
36416b66469J72447l07855m17680j70014j11928m16331n31047p1671M45942L20981
$$ -266469 -94022 -401877 -819557 -989571 -1101499 -1517830 -2048877 -2120548 -1674606 -1353625
36406a353625k30638l73509Q4580M55906K85245J130J40627M86464M68776R1922
$$ -1353625 -1584263 -1957772 -1873192 -1417286 -1132041 -1130911 -990284 -503820 -35044 56878
36396E6878q3409K16619O24580O76580L59848j3906k29345k84173k41738j71597
$$ 56878 -26531 190088 814668 1491248 1851096 1837190 1607845 1323672 1081934 910337
36386I10337j82441l19261m07489j93335K52050M49106N9174n79180p73165l54385
$$ 910337 727896 408635 1146 -192189 59861 508967 568141 -11039 -784204 -1138589
36376a138589J06477R3640j98345k65826m3647J31162J03013J9764k3956m5540
$$ -1138589 -1032112 -938472 -1136817 -1402643 -1446290 -1315128 -1212115 -1192351 -1216307 -1261847
36366a261847O0446L76204N98828L01995l75307p70311n51905q5158K09170L69650
$$ -1261847 -1201401 -825197 -226369 75626 -299681 -1069992 -1621897 -1707055 -1497885 -1128235
36356a128235N20769M71233P9144l33588l53158l6422K45136L15980K37423O0231
$$ -1128235 -607466 -136233 -57089 -390677 -743835 -780257 -535121 -219141 18282 78513
36346G8513j31843j27135J39141L87437L61616J96970J42030J60495J24356J17946
$$ 78513 -53330 -180465 -41324 346113 707729 904699 1046729 1207224 1331580 1449526
36336A449526J73151R819m88977q29250n03869J69696M31701J71298k4041J32816
$$ 1449526 1622677 1632496 1143519 314269 -189600 -19904 411797 583095 559054 691870
36326F91870K71923R6915j68921k52305k12913j71661j13821r5190j99421k24348
$$ 691870 963793 1060708 891787 639482 426569 254908 141087 45897 -153524 -377872
36316c77872Q2505M39438L02842j89047k70961K45379O09922L37097k8475J09558
$$ -377872 -295367 144071 446913 257866 -13095 232284 842206 1179303 1150828 1260386
36306A260386L90567J80318l24456m87867l18679l25096n40405n12782j63439
$$ 1260386 1650953 1831271 1506815 1018948 700269 375173 -165232 -678014 -841453
36297h41453Q7419M7798k8316J8837M1074n1942j59751k15236j71445J01709N07189
$$ -841453 -754034 -706236 -734552 -715715 -674641 -726583 -886334 -1101570 -1273015 -1171306 -664117
36286f64117N56316M5365l79395j8853P35869Q74085K70437j95987o9562J10413
$$ -664117 -107801 -62436 -441831 -460684 275185 1149270 1419707 1223720 1154158 1264571
36276A264571r5054l14444j86889m5027k07551l01322O2296N03580M44079K6535
$$ 1264571 1169517 855073 668184 623157 415606 114284 176580 680160 1124239 1150774
36266A150774j91707j28819j33518l02585m22953m08335l02005m5906L09041M17621
$$ 1150774 959067 830248 696730 394145 -28808 -437143 -739148 -785054 -476013 -58392
36256e8392J24089j62050o9133J00763o5229k50456R8863O86182O64512k5608
$$ -58392 65697 -96353 -165486 -64723 -129952 -380408 -281545 404637 1069149 1043541
36246A043541n22052l55542j9810J4718m267J82533K25475j60272n08419k64341
$$ 1043541 521489 165947 146137 160855 156588 339121 564596 404324 -104095 -368436
36236c68436K82459M07864L2104k61658j51059Q6084J29429r413k05690l73299
$$ -368436 -85977 321887 353991 92333 -58726 27358 156787 147374 -58316 -431615
36226d31615l46544j1095L76943L80209j2841l24020k51724m6655l5462j08303
$$ -431615 -778159 -789254 -412311 -32102 -44943 -368963 -620687 -667342 -702804 -811107
36216h11107K5127L06781M07997K37958N2884N5092J45657J40003L1021o3874
$$ -811107 -785980 -479199 -71202 166756 219640 274732 420389 560392 591413 527539
36206E27539r4308j13171j71988k35699j91126K7186K66912K12632k16778n96108
$$ 527539 433231 320060 148072 -87627 -278753 -251567 15345 227977 11199 -584909
36196e84909m09789K16444N45839J78553l79041m33116q4490L0157j84721j36654
$$ -584909 -994698 -778254 -232415 -53862 -432903 -866019 -950509 -920352 -1105073 -1241727
36186a241727M29360R23525P62327J91606j88849k90725l85378m19056j28731
$$ -1241727 -812367 111158 873485 1065091 876242 585517 200139 -218917 -347648
36177c47648L15116M43112K53447K17520M41819M49535K676m40474m16621j25196
$$ -347648 -32532 410580 664027 881547 1323366 1772901 1775577 1335103 918482 793286
36167G93286j7060j05520j14753j5015L6095P2633K05029K80303Q4728k15897
$$ 793286 776226 670706 555953 540938 577033 649666 854695 1134998 1219726 1003829
36157A003829k55970l5677R5397j949j16994j28667j70173k63151j85402J23831
$$ 1003829 747859 712182 807579 805630 688636 559969 389796 126645 -58757 65074
36147F5074L64037K94809Q3576M267L1274j516l8428P7989K31280J18999k65745
$$ 65074 429111 723920 807496 811763 843037 841521 803093 881082 1112362 1231361 965616
36136I65616n30766l65323P8371M05436M25116K30592n0474l75825o60743p23607
$$ 965616 434850 69527 147898 553334 978450 1209042 1158568 782743 122000 -601607
36126f01607m68353l2185L52214N88455P08462O84131M06654j04648n92174p49123
$$ -601607 -1069960 -1102145 -749931 -161476 546986 1231117 1637771 1533123 940949 191826
36116A91826m97717o9089J60910k9779m58569o27718k41830L71680N86148K56977
$$ 191826 -305891 -374980 -214070 -243849 -702418 -1330136 -1571966 -1200286 -614138 -357161
36106c57161j04000n6742J87986J78157p3790j87055n9613K1712r2917j84236
$$ -357161 -461161 -517903 -329917 -151760 -225550 -412605 -472218 -450506 -543423 -727659
36096g27659m7505K04454L28543K06349j35743n13517n85211j84729L13690L47881
$$ -727659 -775164 -570710 -242167 -35818 -171561 -685078 -1270289 -1455018 -1141328 -793447
36086g93447k9268j53631K50587N83976K68791l19927l94402N3601K76841o5852
$$ -793447 -822715 -976346 -725759 -141783 127008 -192919 -587321 -533720 -256879 -322731
36076c22731m46660l34487M8873J77454L1107K9803L32804N98200M58771j2377
$$ -322731 -769391 -1103878 -1055005 -877551 -846444 -816641 -483837 114363 573134 560757
36066E60757l96080l79146m7609K48554K86201J69879J17813J56939J63230J19294
$$ 560757 164677 -214469 -262078 -13524 272677 442556 560369 717308 880538 999832
36056I99832J16690J18949k5845k71634l20306k7506L24677L42410m274l76254
$$ 999832 1116522 1235471 1209626 937992 617686 590180 914857 1257267 1252993 876739
36046H76739m55869k20599R2320J88482l1011l33195l80721j68032n3391k37274
$$ 876739 420870 200271 292591 481073 450062 116867 -263854 -431886 -485277 -722551
36036g22551m41257l31392l8379P9701L4052J37131L90348M26811J59754k122
$$ -722551 -1163808 -1495200 -1533579 -1453878 -1419826 -1282695 -892347 -465536 -305782 -307904
36026c07904J65501K49652j67464p38148p30386o3681N49348N39971J10433k18150
$$ -307904 -142403 107249 -60215 -798363 -1528749 -1592430 -1043082 -503111 -392678 -610828
36016f10828k81019k34546j46853L6484K57884L80308L98599L80975K60566n6562
$$ -610828 -891847 -1126393 -1273246 -1236762 -978878 -598570 -199971 181004 441570 385008
36006C85008m02161m55128j94285L2578Q881m2933J48649M24758L97745K9670
$$ 385008 -17153 -472281 -666566 -633988 -625107 -668040 -519391 -94633 303112 332782
35996C32782l00511l12764j28217J7397J02672K07186K68228J66562m5450k03322
$$ 332782 32271 -280493 -408710 -391313 -288641 -81455 186773 353335 307885 104563
35986A04563k64820k95038k53004j7222L37857N07703L22322j764j16761M5909
$$ 104563 -160257 -455295 -708299 -725521 -387664 120039 442361 440597 323836 369745
35976C69745K64009L47537K98943J73997k3323k40681l19544j63250R3783J93668
$$ 369745 633754 981291 1280234 1454231 1430908 1190227 870683 707433 801216 994884
35966I94884L0365k43750l84648k84822l9723J63463K04520J07275r093m6348
$$ 994884 1025249 781499 396851 112029 72306 235769 440289 547564 538471 492123
35956D92123p982P884j13041l85176o38083n96550j60907L78856N43023J69949
$$ 492123 484141 492025 378984 -6192 -644275 -1240825 -1401732 -1022876 -479853 -309904
35946c09904l61926n34514k56018J02723J98038O7542l5838M602R7092J31628
$$ -309904 -671830 -1206344 -1462362 -1359639 -1161601 -1094059 -1129897 -1125295 -1028203 -896575
35936h96575J18298J41225K33703L09103K30126j1173k19927k08734n5122J2404
$$ -896575 -778277 -637052 -403349 -94246 135880 124707 -95220 -303954 -359076 -346672
35926c46672j3220J05286M12077N72317L40682j7712q6073R1684J35399l2145
$$ -346672 -359892 -254606 157471 729788 1070470 1052758 966685 1058369 1193768 1161623
35916A161623j16836k7401k6409j80405j63813J27267K56991m2055k77234J04783
$$ 1161623 1044787 1017386 990977 810572 646759 774026 1031017 988962 711728 816511
35906H16511P18645O54426j77269q49357p12761k05308m2475j92758j65280R1250
$$ 816511 1535156 2189582 2012313 1162956 450195 244887 202412 9654 -155626 -64376
35896f4376J81388k1502k14171k03726j40908j47173j03307O0806J79717J18642
$$ -64376 117012 95510 -118661 -322387 -463295 -610468 -713775 -652969 -473252 -354610
35886c54610m707k3329K8012J2068r1198j93593k30484j82003m6684J25103K48006
$$ -354610 -359317 -382646 -354634 -342566 -433764 -627357 -857841 -1039844 -1086528 -961425 -713419
35875g13419L08591L67280M12995L41403J52312L7781J50615L70157M26459K15440
$$ -713419 -404828 -37548 375447 716850 869162 906943 1057558 1427715 1854174 2069614
35865B069614j10916l35487l68244k69202j53669p5789R916J32907J70062m2312
$$ 2069614 1958698 1623211 1254967 985765 832096 756307 766223 899130 1069192 1026880
35855A026880m08859n56349k70062J70555L07062R8359n5619P6322K06673j7585
$$ 1026880 618021 61672 -208390 -37835 269227 367586 311967 388289 594962 577377
35845E77377m11864m29201O3121N00755L04251l49334p21664m40820P1402K10965
$$ 577377 165513 -263688 -200567 300188 604439 255105 -466559 -907379 -835977 -625012
35835f25012l6872j92863j951K79781L34995K11682J46338J71573J13291j13276
$$ -625012 -661884 -854747 -856698 -576917 -241922 -30240 116098 287671 400962 287686
35825B87686l93329n72526n86755m40961j78085J12129L29590M26302M02613K76587
$$ 287686 -105643 -678169 -1264924 -1705885 -1883970 -1771841 -1442251 -1015949 -613336 -336749
35815c36749J09499J3539M8484J28805J11982k4114j55680j63246n1771Q3459
$$ -336749 -227250 -213711 -165227 -36422 75560 51446 -104234 -267480 -319251 -235792
35805b35792J64830J88337J84698J38369j6465k73479m68267m20823j68772N4924
$$ -235792 -70962 117375 302073 440442 423977 150498 -317769 -738592 -907364 -852440
35795h52440R7902J4609j06635k59879l76424k64402J22643M92214M99054J55892
$$ -852440 -754538 -739929 -846564 -1106443 -1482867 -1747269 -1624626 -1132412 -633358 -477466
35785d77466k15495l62132k49125N5193L83773M27989J3836n35921o18590o0440
$$ -477466 -692961 -1055093 -1304218 -1249025 -865252 -437263 -423427 -959348 -1577938 -1638378
35775a638378O21323Q12182M64792J0941k11643k16913j42684j5968J91668M09649
$$ -1638378 -1017055 -204873 259919 270860 59217 -157696 -300380 -316348 -124680 284969
35765B84969M77677L11442J7180k03714k68429k65722k65932j90016K5548K37713
$$ 284969 762646 1074088 1091268 887554 619125 353403 87471 -102545 -76997 160716
35755A60716K43131O0734j14896k05364k90188l72748l29855j22232J44494L80435
$$ 160716 403847 464581 349685 144321 -145867 -518615 -848470 -970702 -826208 -445773
35745d45773N23910M19614j8602n02794n85024k76791q3729k59813m29549k20918
$$ -445773 78137 497751 479149 -23645 -608669 -885460 -969189 -1229002 -1658551 -1879469
35735a879469J22497J59257l6861o4539J13749J92125J26636J73227L18081K24298
$$ -1879469 -1756972 -1597715 -1634576 -1699115 -1585366 -1393241 -1266605 -1093378 -775297 -550999
35725e50999j18554k11289K12954O75804N58074l8763m36119k80959P3310J40840
$$ -550999 -669553 -880842 -667888 7916 565990 527227 91108 -189851 -116541 24299
35715B4299m0520l5214L12089N80328K93236l93414p96484n40779j090K59687
$$ 24299 -16221 -51435 260654 840982 1134218 740804 -55680 -596459 -597549 -337862
35705c37862J97903J25342J06223m459o3658K21755O13990M33427m10609j036801
$$ -337862 -139959 -14617 91606 87147 23489 245244 859234 1292661 882052 -154749
35695a54749o67221L26947R46897Q25669M15414J26251p2639k01871p7628K14157
$$ -154749 -821970 -495023 451874 1277543 1692957 1819208 1746569 1544698 1467070 1681227
35685A681227J83867l57522q36454o05024J17924M76369J16948l70540l09424
$$ 1681227 1865094 1507572 671118 66094 184018 660387 777335 406795 97371
35676I7371J57499L55893O1282k47092j39739J60878J58458k03280n22475n14818
$$ 97371 254870 610763 672045 424953 285214 446092 604550 401270 -121205 -636023
35666f36023k87315o3722N7704L7636j16988k10383J2332M49032O18744K54957
$$ -636023 -923338 -987060 -929356 -891720 -1008708 -1219091 -1206759 -757727 -138983 115974
35656A15974l02034n35636l83114j68941o3073P3112L51919O64730Q41779P89674
$$ 115974 -186060 -721696 -1104810 -1273751 -1336824 -1263712 -911793 -247063 594716 1384390
35646A384390M70030m4604m80355n39546k25871J51520L16682K35729J2375k40953
$$ 1384390 1854420 1809816 1329461 789915 564044 715564 1032246 1267975 1280350 1039397
35636A039397m14277m53217m28192m17165l43909j06408J67918K26571O4510n0221
$$ 1039397 625120 171903 -256289 -673454 -1017363 -1123771 -955853 -729282 -664772 -714993
35626g14993K5658J28947Q8912k9618r8284j15793q3652R1719L83340N08605K37797
$$ -714993 -689335 -560388 -471476 -501094 -599378 -715171 -798823 -707104 -323764 184841 422638
35615D22638k58018n60224m47384n2098L42733N26083M57154K78425J73532J31583
$$ 422638 164620 -395604 -842988 -895086 -552353 -26270 430884 709309 882841 1014424
35605A014424l1526l32565m89769l01291K2615J34152J2557j03009j22906j46597
$$ 1014424 982898 650333 160564 -140727 -118112 16040 28597 -74412 -197318 -343915
35595c43915j69282q5128K8023l3646k15930k13020N7188L12182L62213L67261
$$ -343915 -513197 -598325 -570302 -603948 -819878 -1032898 -975710 -663528 -301315 65946
35585F5946M44300L64890l8332m26321l21873J87889N10951L17519q9187k44983
$$ 65946 510246 875136 836804 410483 88610 276499 787450 1104969 1015782 770799
35575G70799q6779R9412J02427j3804o3988K4384J37225J09783p4730k73321l83030
$$ 770799 684020 783432 885859 872055 808067 832451 969676 1079459 1004729 731408 348378
35564C48378m37116m38304k69080O5415K71950J13187j84714j85692J32971L61302
$$ 348378 -88738 -527042 -796122 -730707 -458757 -345570 -530284 -715976 -583005 -221703
35554b21703K83948J39384J39241J30733l2585j45494n295J68502N5690k09842
$$ -221703 62245 201629 340870 471603 439018 293524 288229 456731 512421 302579
35544C02579k18793P1797K77358J56595j15385k77838k70269j37798N4255J46408
$$ 302579 83786 155583 432941 589536 474151 196313 -73956 -211754 -157499 -11091
35534a1091l55k46521k91919j12649J147p9235j20568O1626K96906L58894L06225
$$ -11091 -11446 -257967 -549886 -662535 -661388 -740623 -861191 -799565 -502659 -143765 162460
35523A62460K98562K93859J76664J9862k3009L5652Q1591Q8065N9573p1465k93929
$$ 162460 461022 754881 931545 951407 928398 964050 1045641 1133706 1193279 1121814 827885
35512H27885m04078k58318k0539N5790k0324n6165M032N7284M3941l8101k17611
$$ 827885 423807 165489 144950 200740 180416 124251 128283 185567 229508 191407 -26204
35501b6204m37019m68662j72832K58530N23898N55850M48982K39817J2843r618
$$ -26204 -463223 -931885 -1104717 -846187 -322289 233561 682543 922360 935203 925585
35491I25585J74369J40961l65477q55077o70854n871L12758M1907j83538R2341
$$ 925585 1099954 1240915 875438 20361 -650493 -656364 -343606 -301699 -485237 -392896
35481c92896N06467N84267M44114L91575L53107J71659J2090N123r3195l96026
$$ -392896 113571 697838 1141952 1533527 1886634 2058293 2070383 2075506 1982311 1586285
35471A586285m65700N100M58763J45785o65712r23413k34974O29081Q23389M11150
$$ 1586285 1120585 1125685 1584448 1730233 1064521 141108 -93866 535215 1358604 1769754
35461A769754R327o6402K5012L4643j08943k80436k66888j4624K13443J13068
$$ 1769754 1779081 1712679 1737691 1772334 1663391 1382955 1116067 1101443 1314886 1427954
35451A427954k35355m46097l32082q7103K9543n7639k79804m52182l34578K4811
$$ 1427954 1192599 746502 414420 327317 356860 299221 19417 -432765 -767343 -742532
35441g42532J30310l32140q07501m27775O82592J345567Q48035j13693m34537
$$ -742532 -612222 -944362 -1751863 -2179638 -1497046 -151479 696556 582863 148326
35432A48326j154M49087M35892O8087m51884r81467j195587q07467o7414M36234
$$ 148326 147172 596259 1032151 1100238 648354 -333113 -1528700 -2336167 -2403581 -1967347
35422a967347M96943L88312K82539Q2828j28146l8602L04608L65821j20511o58865
$$ -1967347 -1470404 -1082092 -799553 -716725 -844871 -883473 -578865 -213044 -333555 -992420
35412i92420o11988k2839N33454P00399N81629L76808J53772l5225j12859j00012
$$ -992420 -1604408 -1627247 -1093793 -393394 188235 565043 718815 683590 570731 470719
35402D70719q7314p0965J7312J24148R5836r2232k76831l09230k00267n1372M4056
$$ 470719 383405 312440 329752 453900 549736 457504 180673 -128557 -328824 -380196 -336140
35391c36140K5699q1793j30311L668K07270K15910l0413k60881k04483P1807K79928
$$ -336140 -310441 -392234 -522545 -518877 -311607 -95697 -126110 -386991 -591474 -519667 -239739
35380b39739K71407J31811k3417j69429k84728l00999j87255J7525K63891M60059
$$ -239739 31668 163479 140062 -29367 -314095 -615094 -802349 -784824 -520933 -60874
35370f0874L98678n9848o55023q33367l90653J92996L28661O8837o4751J03253
$$ -60874 337804 277956 -377067 -1210434 -1601087 -1408091 -1079430 -1010593 -1075344 -972091
35360i72091K19988Q0994j9758J51917L18905J78629k4736R7034L59732K76047
$$ -972091 -752103 -671109 -690867 -538950 -220045 -41416 -66152 30882 390614 666661
35350F66661q1940j44543J81580K83688j53762n42292k48411M11301O17910K09609
$$ 666661 584721 440178 621758 905446 751684 209392 -39019 372282 990192 1199801
35340A199801k26711l02916k37905k63258k06740R1196L75693L12764j9602k47622
$$ 1199801 973090 670174 432269 169011 -37729 53467 429160 741924 722322 474700
35330D74700j61910J30747L84024L87595R7051k76833m31193l20571j90850j88312
$$ 474700 312790 443537 827561 1215156 1312207 1035374 604181 283610 92760 -95552
35320i5552j61668J3815J76083J56573Q0255J10964J12941r7504l37040k90399
$$ -95552 -257220 -243405 -67322 89251 169506 280470 393411 295907 -41133 -331532
35310c31532n6286k0967k10895k36479M3645K67358J62969k1326L7266K00994
$$ -331532 -387818 -408785 -619680 -856159 -812514 -545156 -382187 -403513 -366247 -165253
35300a65253J30934j46481k97498j91414l2303k3958j54580k90095k87008n6898
$$ -165253 -34319 -180800 -478298 -669712 -702015 -725973 -880553 -1170648 -1457656 -1514554
35290a514554L04955N14934L97114J16462m4036l4771K3240J24192L33174N32025
$$ -1514554 -1209599 -694665 -297551 -181089 -225125 -259896 -236656 -112464 220710 752735
35280G52735N03805K58707P805j77351l88155n49992m09650L4354L91503L54907
$$ 752735 1256540 1515247 1523052 1345701 957546 407554 -2096 32258 423761 778668
35270G78668R2523l2643M6535J04767k704j93071l41305m27447m70946m25872
$$ 778668 871191 838548 885083 989850 987146 794075 452770 25323 -445623 -871495
35260h71495k06185J72176M85338M33498r909m50727m55049n8992K99090L51372
$$ -871495 -1077680 -905504 -420166 13332 3423 -447304 -902353 -961345 -662255 -310883
35250c10883K56197K28460K02894L2985k03576l21521l04930k54419j56152R1868
$$ -310883 -54686 173774 376668 409653 206077 -115444 -420374 -674793 -830945 -739077
35240g39077M65059P77189Q39301N78181Q0454m00137n94932m84795l06081k16295
$$ -739077 -274018 503171 1342472 1920653 2001107 1600970 1006038 521243 215162 -1133
35230a133j17087Q3234K39896J90074K0766r4832j62495k34796j88832O9390L17174
$$ -1133 -118220 -34986 204910 394984 415750 320918 158423 -76373 -265205 -195815 121359
35219A21359K66647J2635j20753j10291k06459l86849k99244J24073M26812K46842
$$ 121359 388006 400641 279888 169597 -36862 -423711 -722955 -598882 -172070 74772
35209G4772j57370k85343n7178J99597K55250J68225N9654k9464p3898o1874n9786
$$ 74772 -82598 -367941 -425119 -225522 29728 197953 257607 228143 154245 92371 32585
35198C2585j37610k42230k50365j14798J14027L30709L71234J17400k65646l70968
$$ 32585 -105025 -347255 -597620 -712418 -598391 -267682 103552 220952 -44694 -415662
35188d15662l9179L43393L04045p7189l17363k41160j19671p3871J52285N94939
$$ -415662 -454841 -111448 192597 115408 -201955 -443115 -562786 -636657 -484372 110567
35178A10567P32146J92337n20064n70983O0722N69185M62531J15177Q683K4977
$$ 110567 842713 1035050 514986 -55997 4725 573910 1036441 1151618 1160301 1185278
35168A185278j25138k74847j43479M2128j08599l85638k34666K76491M61778R9328
$$ 1185278 1060140 785293 641814 683942 575343 189705 -44961 231530 693308 792636
35158G92636k04691k4947J82337j28404o39922o41350j10450L31873L76126K93294
$$ 792636 587945 562998 745335 616931 -22991 -664341 -774791 -442918 -66792 226502
35148B26502K93511K27267K1261j07359m8628p357j27843k41169j72474k9746
$$ 226502 520013 747280 768541 661182 612554 605197 477354 236185 63711 33965
35138C3965m320q6131j25303l2311J54605K67262R7656l05479m98570j10421N82792
$$ 33965 29645 -56486 -181789 -214100 -59495 207767 305423 -56 -498626 -609047 -26255
35127b6255R14285O66284K39207n8752l73399p67051q57882l92536K06258L33996
$$ -26255 888030 1554314 1793521 1734769 1361370 594319 -263563 -656099 -449841 -115845
35117a15845L0205j26658J56330N50068N81383J73276l18475m66346j88676J48936
$$ -115845 -85640 -212298 -55968 494100 1075483 1248759 930284 463938 275262 424198
35107D24198J59492o4339j37584n0115j89499n67299n91278K1503O27228N04015
$$ 424198 583690 519351 381767 331652 142153 -425146 -1016424 -994921 -367693 136322
35097A36322q1428l14005o1752Q0205j28816k34204O1402L95614L54770N7516
$$ 136322 54894 -259111 -320863 -240658 -369474 -603678 -542276 -146662 208108 265624
35087B65624j50515j75986j01659J9141P2208r2645l54429l56988l2176K44975
$$ 265624 115109 -60877 -162536 -143395 -71187 -163832 -518261 -875249 -907425 -662450
35077f62450K14304R2957J51091K79211K66535J89168J89175J45427p0944k46395
$$ -662450 -448146 -355189 -204098 75113 341648 530816 719991 865418 794474 548079
35067E48079j27828R8095N1466k12700k58652M6058L14478K19543m8956j06439
$$ 548079 420251 518346 569812 357112 98460 144518 458996 678539 629583 523144
35057E23144O1978R8825k16781o44943p48475m18366p074J26091O4129J23982
$$ 523144 585122 683947 467166 -177777 -926252 -1344618 -1351692 -1225601 -1161472 -1037490
35047a037490K84687J72233k96532o22987l46441L03074O99934O10393L47036
$$ -1037490 -752803 -580570 -877102 -1500089 -1846530 -1543456 -843522 -233129 113907
35038A13907K33640K68096L04914K52569N0526k76702m95106l50283M8507K72914
$$ 113907 347547 615643 920557 1173126 1223652 946950 451844 101561 150068 422982
35028D22982R8280k25888l27686j46458R5883J94880J18064j9828m8345Q9533
$$ 422982 521262 295374 -32312 -178770 -82887 111993 230057 210229 161884 251417
35018B51417K22168J35900j14710k77344k98501l76540n37519m93425j29840J90770
$$ 251417 473585 609485 494775 217431 -81070 -457610 -995129 -1488554 -1618394 -1427624
35008a427624J41420k1140J47587N15059N33426J30391j44838o103J18236j51551
$$ -1427624 -1286204 -1307344 -1159757 -644698 -111272 19119 -125719 -131822 -13586 -165137
34998a65137m40647k01030L37374M39786j6995l53349j13719L00285K96585o6501
$$ -165137 -605784 -806814 -469440 -29654 -46649 -399998 -513717 -213432 83153 16652
34988A6652k91080j97018n4303r1797k32825k90721j68841J16914M23083N29175
$$ 16652 -274428 -471446 -525749 -617546 -850371 -1141092 -1309933 -1193019 -769936 -240761
34978b40761L67782J33813J7243m6263j79056k87496k36674j29286r2724M4711
$$ -240761 127021 260834 278077 231814 52758 -234738 -471412 -600698 -693422 -648711
34968f48711M44987P42741L76869n10396j052917p42406o1153K39034O9677j29889
$$ -648711 -203724 539017 915886 405490 -647427 -1389833 -1450986 -1211952 -1142275 -1272164
34958a272164j06287N2828K46375M20777M29858J96786p0381j30359p2699j32107
$$ -1272164 -1378451 -1325623 -1079248 -658471 -228613 -31827 -102208 -232567 -305266 -437373
34948d37373k60601k21891k1026J15030J29945J55169J72819M1204j37725o9950
$$ -437373 -697974 -919865 -940891 -825861 -695916 -540747 -367928 -326724 -464449 -534399
34938e34399K43917M42069L20485O7951j27819l32400n47891n18141j21312L36171
$$ -534399 -290482 151587 472072 540023 412204 79804 -468087 -986228 -1107540 -771369
34928g71369N11195M71939M60556M34436J95030j86132m47998n57557o63772o68601
$$ -771369 -260174 211765 672321 1106757 1301787 1115655 667657 110100 -553672 -1222273
34918a222273k70521M58995R24627O74319j0305m38870l06425N7045J76019l4901
$$ -1222273 -1492794 -1033799 -109172 565147 554842 115972 -190453 -133408 42611 7710
34908G710k62591k07375P0426K24906M7757k41000k44101P5064K98034J07899
$$ 7710 -254881 -462256 -391830 -166924 -119167 -360167 -604268 -529204 -231170 -123271
34898a23271k44079k66418O6195K44968o8949n54080o37247k15040K78017M43673
$$ -123271 -367350 -633768 -567573 -322605 -391554 -945634 -1582881 -1797921 -1519904 -1076231
34888a076231L06905J19741K5525K7602J10602K22205K19726O785k79560l47894
$$ -1076231 -769326 -649585 -624060 -596458 -485856 -263651 -43925 -37140 -316700 -664594
34878f64594o4203L78900O39806N38966J76493k06133m20321m04004j99366O4871
$$ -664594 -728797 -349897 289909 828875 1005368 799235 378914 -25090 -224456 -159585
34868a59585K09888J37129n6944j88587k30182l22085m92417n34179k96812N0055
$$ -159585 50303 187432 130488 -58099 -288281 -610366 -1102783 -1636962 -1933774 -1883719
34858a883719K39296K76331L51252M68533M50278K81942J53950J36998J14648
$$ -1883719 -1644423 -1368092 -1016840 -548307 -98029 183913 337863 474861 589509
34849E89509P5154J34284J89918o2519n99744r31720p39972l11793n1004R1941
$$ 589509 664663 798947 988865 926346 326602 -605118 -1345090 -1656883 -1707887 -1615946
34839a615946L28426N08161L83907J60215K09274L65316J19566m68291o79873
$$ -1615946 -1287520 -779359 -395452 -235237 -25963 339353 458919 -9372 -689245
$$ [...]
##END NTUPLES=NMR SPECTRUM
##END=
