##TITLE=31Pdec_92-2025
CDCl3, 64 sc
 8.8.2025
##JCAMPDX= 6.0         $$ Bruker NMR JCAMP-DX V2.0
##DATA TYPE= NMR SPECTRUM
##DATA CLASS= NTUPLES
##ORIGIN= UXNMR, Bruker Analytische Messtechnik GmbH
##OWNER= root
$$ XWIN-NMR		Version 3.5
$$ Fri Aug  8 14:01:57 2025 Russian Standard Time (UT+4h)  she@DPX200
##.OBSERVE FREQUENCY= 81.013821
##.OBSERVE NUCLEUS= ^31P
##.ACQUISITION MODE= SIMULTANEOUS
##.ACQUISITION SCHEME= undefined
##.AVERAGES= 24
##.DIGITISER RES= 17
##SPECTROMETER/DATA SYSTEM= spect
##.PULSE SEQUENCE= zgpg30
##.SOLVENT NAME= CDCl3
##.SHIFT REFERENCE= (INTERNAL, CDCl3, 0, 198.062)
##AUDIT TRAIL= $$ (NUMBER, WHEN, WHO, WHERE, WHAT)
$$ ##TITLE= Audit trail, XWIN-NMR		Version 3.5
$$ ##JCAMPDX= 5.01
$$ ##ORIGIN= Bruker BioSpin GmbH
$$ ##OWNER= she
$$ F:/spectra/data/she/nmr/P31/2/pdata/1/auditp.txt
$$ ##AUDIT TRAIL=  $$ (NUMBER, WHEN, WHO, WHERE, WHAT)
(   1,<2025-08-08 14:01:05.62 +0400>,<she>,<DPX200>,
      <created by zg, POWCHK disabled, PULCHK disabled
       configuration hash MD5:
       00 E9 B6 7A A2 85 ED C7 34 08 36 98 17 FE 4E 26
       data hash MD5: 32K
       AA 08 FE 99 E1 1F 81 AA 82 85 3C C0 14 A6 C3 DC>)
(   2,<2025-08-08 14:01:07.89 +0400>,<she>,<DPX200>,
      <Start of raw data processing
       efp BC_mod = 2 LB = 1.5 FT_mod = 6 PKNL = 1 PHC0 = 2129.209 PHC1 = -1135.501 SI = 64K 
       data hash MD5: 64K
       24 59 95 77 BA 63 78 70 27 3A 07 73 DD E1 A8 68>)
(   3,<2025-08-08 14:01:23.18 +0400>,<she>,<DPX200>,
      <pk PHC0 = 157.2742 PHC1 = 0 
       data hash MD5: 64K
       99 36 9D A1 4B D6 2C CA 56 D5 52 38 99 A2 A0 2A>)
(   4,<2025-08-08 14:01:27.25 +0400>,<she>,<DPX200>,
      <abs ABSG = 5 
       data hash MD5: 64K
       FE 4E CD 8A B7 12 9F CA 68 08 B2 56 38 11 41 89>)
$$ ##END=
$$ 
$$ hash MD5
$$ E5 3E 6E A4 25 B2 4B B8 3B 9A B1 87 85 BF 1A 5D
##$RELAX= 
##$RELAX= 
##$RELAX= 
##$RELAX= 
##$RELAX= 
##$RELAX= 
##$RELAX= 
##$RELAX= 
$$ Bruker specific parameters
$$ --------------------------
##$DU= <F:/spectra>
##$EXPNO= 2
##$NAME= <P31>
##$PROCNO= 1
##$TYPE= <nmr>
##$USER= <she>
##$AMP= (0..31)
100 100 100 100 100 100 100 100 100 100 100 100 100 100 100 100 100 100 
100 100 100 100 100 100 100 100 100 100 100 100 100 100 
##$AQSEQ= 0
##$AQ_mod= 1
##$AUNM= <au_zg>
##$AUTOPOS= <>
##$BF1= 81.014009
##$BF2= 200.13
##$BF3= 200.13
##$BF4= 200.13
##$BF5= 200.13
##$BF6= 200.13
##$BF7= 200.13
##$BF8= 200.13
##$BYTORDA= 1
##$CFDGTYP= 0
##$CFRGTYP= 5
##$CHEMSTR= <none>
##$CNST= (0..31)
1 1 145 1 1 1 1 1 1 1 1 1 1 1 1 1 1 1 1 1 1 1 1 1 1 1 1 1 1 1 1 1 
##$CPDPRG= <waltz16>
##$CPDPRG1= <>
##$CPDPRG2= <waltz16>
##$CPDPRG3= <>
##$CPDPRG4= <mlev>
##$CPDPRG5= <mlev>
##$CPDPRG6= <mlev>
##$CPDPRG7= <mlev>
##$CPDPRG8= <mlev>
##$CPDPRGB= <>
##$CPDPRGT= <>
##$D= (0..31)
0 1 0 0 0 0 0 0 0 0.06 0 0.03 2e-05 3e-06 0 0 0.0002 0 0 0 0 0 0 0 0 0 
0 0 0 0 0 0 
##$DATE= 1754647264
##$DBL= (0..7)
120 120 120 11 120 120 24 19 
##$DBP= (0..7)
150 150 150 150 150 150 150 150 
##$DBP07= 0
##$DBPNAM0= <>
##$DBPNAM1= <>
##$DBPNAM2= <>
$$ [...]
##$SUBNAM3= <"">
##$SUBNAM4= <"">
##$SUBNAM5= <"">
##$SUBNAM6= <"">
##$SUBNAM7= <"">
##$SUBNAM8= <"">
##$SUBNAM9= <"">
##$SW= 400.765351723535
##$SWIBOX= (0..15)
0 1 3 0 0 0 0 0 0 0 0 0 0 0 0 0 
##$SW_h= 32467.5324675325
##$TD= 32768
##$TD0= 1
##$TE= 0
##$TE2= 300
##$TE3= 300
##$TEG= 300
##$TL= (0..7)
0 120 53 12 22 120 120 120 
##$TP= (0..7)
150 150 150 150 150 150 150 150 
##$TP07= 0
##$TPNAME0= <>
##$TPNAME1= <>
##$TPNAME2= <>
##$TPNAME3= <>
##$TPNAME4= <>
##$TPNAME5= <>
##$TPNAME6= <>
##$TPNAME7= <>
##$TPOAL= (0..7)
0.5 0.5 0.5 0.5 0.5 0.5 0.5 0.5 
##$TPOFFS= (0..7)
0 0 0 0 0 0 0 0 
##$TUNHIN= 0
##$TUNHOUT= 0
##$TUNXOUT= 0
##$USERA1= <user>
##$USERA2= <user>
##$USERA3= <user>
##$USERA4= <user>
##$USERA5= <user>
##$V9= 5
##$VALIST= <valist>
##$VCLIST= <CCCCCCCCCCCCCCC>
##$VD= 0
##$VDLIST= <DDDDDDDDDDDDDDD>
##$VPLIST= <PPPPPPPPPPPPPPP>
##$VTLIST= <TTTTTTTTTTTTTTT>
##$WBST= 1024
##$WBSW= 4
##$XGAIN= (0..3)
0 0 0 0 
##$XL= 0
##$YL= 0
##$YMAX_a= 9600
##$YMIN_a= -6154
##$ZGOPTNS= <>
##$ZL1= 120
##$ZL2= 120
##$ZL3= 120
##$ZL4= 120
##$ABSF1= 198.0616
##$ABSF2= -202.7028
##$ABSG= 5
##$ABSL= 3
##$ALPHA= 0
##$AQORDER= 0
##$ASSFAC= 0
##$ASSFACI= 0
##$ASSFACX= 0
##$ASSWID= 0
##$AUNMP= <proc_1d>
##$AZFE= 0.1
##$AZFW= 0.5
##$BCFW= 0
##$BC_mod= 2
##$BYTORDP= 0
##$COROFFS= 0
##$CY= -3
##$DATMOD= 1
##$DC= 0
##$DFILT= <>
##$DTYPP= 0
##$F1P= 0
##$F2P= 0
##$FCOR= 1
##$FTSIZE= 65536
##$FT_mod= 6
##$GAMMA= 0
##$GB= 0
##$INTBC= 1
##$INTSCL= 9.790993e-09
##$ISEN= 30
##$LB= 1.5
##$LEV0= 0
##$LPBIN= 0
##$MAXI= 10000
##$MC2= 0
##$MEAN= 0
##$ME_mod= 0
##$MI= 50
##$NCOEF= 0
##$NC_proc= -6
##$NLEV= 6
##$NOISF1= 182.463
##$NOISF2= 159.3651
##$NSP= 0
##$NTH_PI= 0
##$NZP= 0
##$OFFSET= 198.0616
##$PC= 4
##$PHC0= 2286.483
##$PHC1= -1135.501
##$PH_mod= 1
##$PKNL= yes
##$PPARMOD= 0
##$PSCAL= 0
##$PSIGN= 0
##$REVERSE= no
##$SF= 81.0140089999434
##$SI= 65536
##$SIGF1= 159.3651
##$SIGF2= -187.1042
##$SINO= 113.3802
##$SIOLD= 16384
##$SREGLST= <1H.CDCl3>
##$SSB= 0
##$STSI= 65536
##$STSR= 0
##$SW_p= 32467.5324675325
##$SYMM= 0
##$S_DEV= 0
##$TDeff= 32768
##$TDoff= 0
##$TI= <>
##$TILT= no
##$TM1= 0
##$TM2= 0
##$TOPLEV= 0
##$USERP1= <user>
##$USERP2= <user>
##$USERP3= <user>
##$USERP4= <user>
##$USERP5= <user>
##$WDW= 1
##$XDIM= 65536
##$YMAX_p= 480250592
##$YMIN_p= -18945276
$$ End of Bruker specific parameters
$$ ---------------------------------
##NTUPLES= NMR SPECTRUM
##VAR_NAME=  FREQUENCY,     SPECTRUM/REAL,   SPECTRUM/IMAG
##SYMBOL=    X,             R,               I
##VAR_TYPE=  INDEPENDENT,   DEPENDENT,       DEPENDENT
##VAR_FORM=  AFFN,          ASDF,            ASDF
##VAR_DIM=   65536,         65536,           65536
##UNITS=     HZ,            ARBITRARY UNITS, ARBITRARY UNITS
##FACTOR=    0.49542278885378, 1,            1
##FIRST=     16045.7642231865, 0,            0
##LAST=      -16421.768244346, 0,            0
##MIN=       -16421.768244346, -18945276,    0
##MAX=       16045.7642231865, 480250592,    0
$$ Real data points
##PAGE= N=1
##DATA TABLE= (X++(R..R)), XYDATA
$$ [...]
40145c67685m03248m31055j82800K07549M33216L60476J36025j5452j4414N4545
40135b22843R0799Q7958P2113o155k04219m15011m06368j00847K88350M76105
40125c40118L87448J79257O2928J26380K36472J28856k72764o68833p17619n08548
40115a386541m06456m38794k48928K35637N51977L78512M5128O097J57803J17765
40105i87800r1781j24991R2860L13274L94705L69571K03296r5284k54966q1785
40095b62901J14064p6211m50091m52667p0327J62049M9816l5766Q7743J33344
40085h00947J7732J10599M93005O40112K72754r4489J8663K40421r179n06859
40075C81812n77931j61426K13408L45641N14658P46471O54115J47823l06027l63392
$$ plain form
40145 -367685 -770933 -1201988 -1384788 -1177239 -744023 -383547 -247522 -262974 -277388 -222843
40135 -222843 -132044 -44086 28027 21872 -182347 -597358 -1003726 -1104573 -816223 -340118
40125 -340118 47330 226587 289515 415895 652367 781223 508459 -160374 -877993 -1386541
40115 -1386541 -1792997 -2231791 -2480719 -2245082 -1693105 -1314593 -1269465 -1263368 -1105565 -987800
40105 -987800 -1079581 -1204572 -1111712 -798438 -403733 -34162 169134 73850 -181116 -262901
40095 -262901 -148837 -225048 -675139 -1127806 -1198133 -1036084 -986268 -1022034 -934291 -800947
40085 -800947 -783215 -672616 -179611 460501 733255 638766 657429 897850 888671 381812
40075 381812 -196119 -357545 -144137 201504 716162 1462633 2116748 2264571 1958544 1595152
40065A595152k58611l33141n06566n03636l19069j63240j10696m1940J36411L55866
40055a49470M38523K59091p6674k63120j46897J8157j16723m72214o06189l20262
40045a435778R7342L24681M05225N10985N44629K55881l14710p41753o29936m5234
40035a028668N17456O03512K26525k04801l64336k92010j75820n5031J10005K52010
40025d11158K96859L09671L17923J59972j97736l80377n9605M29197M32489o9855
40015H27380m14902k56771k1724j18093k77435j03221K04602K02854n8466k07543
40005b23319k08165k66613k63128P7940N01496L83744k92233p37607l97681L09369
39995a116197O18357L73824o777k00811j97909o0817J23743J63129k7302k08610
$$ plain form
40065 1595152 1336541 1003400 496834 -6802 -325871 -489111 -599807 -641747 -505336 -149470
40055 -149470 289053 548144 471470 208350 61453 79610 -37113 -509327 -1115516 -1435778
40045 -1435778 -1338436 -1013755 -608530 -97545 447084 702965 388255 -353498 -983434 -1028668
40035 -1028668 -511212 92300 318825 114024 -250312 -542322 -718142 -773173 -663168 -411158
40025 -411158 -114299 195372 513295 673267 475531 95154 35549 464746 897235 827380
40015 827380 412478 155707 133983 15890 -261545 -364766 -160164 42690 -15776 -223319
40005 -223319 -431484 -698097 -961225 -883285 -381789 1955 -290278 -1027885 -1425566 -1116197
39995 -1116197 -497840 -124016 -130793 -331604 -529513 -590330 -466587 -303458 -330760 -539370
39985e39370j23741P8780O5238j20179j11853J63296L55830K64735J12702P9543
39975B24981j2666k63720l43823j658L77806K53280k03621l16965L5013K14066
39965c7307j54162n74914m72967o0103J11069O5253K17016M79820L19206k63582
39955c70671n37180j09893M17931L16926k09367l82054K830L90053L60163J15550
39945e712l9599j75859m12775n16025k27491K13929L15936M9882q7796J79535
39935g05975M73303L01502k27778n58103m25263j07552M5562J913j06137k07296
39925a515824k09155L7563M71723P20883N04460o020m25465n77986m75271j17971
39915a593063L56906N47511K31968j87746j40152K98595N29812L25441L5071j23907
$$ plain form
39985 -539370 -663111 -584331 -519093 -639272 -751125 -587829 -231999 32736 145438 224981
39975 224981 212315 -51405 -395228 -396886 -19080 234200 30579 -286386 -251373 -37307
39965 -37307 -191469 -766383 -1239350 -1299453 -1188384 -1123131 -906115 -426295 -107089 -370671
39955 -370671 -907851 -1017744 -599813 -282887 -492254 -874308 -871478 -481425 -121262 -5712
39945 -5712 -45311 -221170 -633945 -1149970 -1377461 -1163532 -847596 -797714 -885510 -705975
39935 -705975 -232672 68830 -158948 -717051 -1142314 -1249866 -1204304 -1202391 -1308528 -1515824
39925 -1515824 -1724979 -1687416 -1215693 -494810 9650 3630 -421835 -999821 -1475092 -1593063
39915 -1593063 -1236157 -688646 -456678 -644424 -784576 -485981 43831 369272 404343 280436
39905B80436l44108o36952o22030k13420R1998L808o6005K27860M75617K11657
39895e91139k04968j61365J45952P3632k82272j95983M28999Q33289N81720J28154
39885G56019o0176j61722m03912n01826j94098J94808K56960J64054L11747O02813
39875I64667N94041J83766k77686m69461l78697j89253j13375k19625l04049j35508
39865c45180J07463P027l70710m21917O1932M57721K42069j64227p5371L71784
39855a29409N24644K98784J57076J70215n3940m90234n76009j50245K28931J81331
39845A61144N1718K01438L52508J06596l37686m90508k86583l4919J16404K26260
39835F6372K24888m9997n20213q68158q54329m68201J16733N69297N69995J91099
$$ plain form
39905 280436 -63672 -700624 -1322654 -1536074 -1444076 -1440268 -1506273 -1278413 -802796 -591139
39895 -591139 -796107 -957472 -811520 -737888 -1020160 -1216143 -787144 46145 627865 756019
39885 756019 695843 534121 130209 -371617 -565715 -370907 -113947 50107 361854 964667
39875 964667 1558708 1742474 1464788 995327 616630 427377 314002 94377 -209672 -345180
39865 -345180 -237717 -230690 -601400 -1023317 -961385 -503664 -261595 -425822 -501193 -129409
39855 -129409 395235 694019 851095 1021310 967370 477136 -98873 -249118 -20187 161144
39845 161144 212862 414300 766808 873404 535718 45210 -241373 -276292 -159888 66372
39835 66372 291260 241263 -278950 -1147108 -2001437 -2469638 -2352905 -1783608 -1213613 -1022514
39825a022514n9760J67380N84904O57566L17004m6971k03495l05023m87315n99055
39815i97279m45388p1539L02055M85117M21872K26705J13980J51994J33379j25076
39805A95820m23330l91146m8816J66450J4432k27287k20002m4792K7907J4195
39795i36569J22883L07912K89914M0013j00096R5649M03775M88840L64993K78315
39785A355629K66986J42294j09871k20464m8034J42597J5401l58936n80429m25555
39775A79618p7103J51046J40467j9990j96377l01283l07682k35655r4612J41544
39765f20027M22374N34441K95871j44364l81756k08580J54771L60361L10603J31024
39755H54718o8902k39839l15652k79122k33283k41356j78175O2024K86047J92591
$$ plain form
39825 -1022514 -1082274 -914894 -329990 327576 644580 597609 394114 89091 -398224 -997279
39815 -997279 -1442667 -1514206 -1212151 -727034 -305162 -78457 35523 187517 320896 195820
39805 195820 -227510 -618656 -667472 -501022 -486590 -713877 -933879 -978671 -950764 -936569
39795 -936569 -813686 -505774 -215860 -175847 -275943 -180294 223481 712321 1077314 1355629
39785 1355629 1622615 1764909 1655038 1434574 1386540 1529137 1544538 1185602 605173 179618
39775 179618 102515 253561 394028 374038 177661 -123622 -431304 -666959 -761571 -620027
39765 -620027 -197653 336788 632659 488295 106539 -102041 52730 413091 723694 854718
39755 854718 785816 545977 230325 -48797 -282080 -523436 -701611 -639587 -353540 -160949
39745a60949j57800l43293j36036J99425L11985K36098K27136K93031J98250j04400
39735E63447l48600l30508j67430o6361m2423k4923o0718j93577k67540j08733
39725a047366J57355K42458J37547J23738K96855M05936L02810K28718M06334
39716A254385O12982M88121R1150j98468k33497j96637k03141j74677j14146j44144
39706A181928k15679j20599J19786K06428R211k54795l96851m68746m72640k53851
39696f65808J07612K06791p5701k47369J17931O89244Q20439M38722l33k53546
39686A137982m30113m91752k28818J99831K75884j32891m98821l50252J11505
39677d07445L70482K67232M1638o9460k8656N6401J4432k16294m08655k61128
$$ plain form
39745 -160949 -318749 -662042 -798078 -598653 -286668 -50570 176566 469597 667847 563447
39735 563447 214847 -115661 -283091 -349452 -391875 -416798 -477516 -671093 -938633 -1047366
39725 -1047366 -890011 -647553 -510006 -386268 -89413 316523 619333 848051 1254385
39716 1254385 1867367 2355488 2446638 2248170 2014673 1818036 1614895 1440218 1326072 1181928
39706 1181928 966249 845650 965436 1171864 1181075 926280 529429 60683 -411957 -665808
39696 -665808 -558196 -351405 -427106 -674475 -556544 132700 953139 1391861 1391528 1137982
39686 1137982 707869 216117 -12701 187130 463014 330123 -168698 -518950 -407445
39677 -407445 -36963 230269 271907 202447 173791 230192 244624 28330 -380325 -641453
39667f41453J32614L34553K02054R2808K13935K06554k29224o84458n69484m6206
39657i88307J99016J8904l4750L07676N66094L04930j68386l09359j22383J8263
39647b08302K2981O4025J03706k9755j89233n5193K65771L04601k5920k65686
39637a3005j60480o1102k62183m24498j24199L73891M52127N9028k75669k71951
39627g08041j78959j89112j29720J02977K89416K87744K65980K95677J35916k72232
39617a00354n01930k34583J74614J94409o6314o6043K79502M73654K30127j14261
39607B68821j32719J21073K77473J43551j47292l39234k98246j32093p9528k01923
39597e20117k65178o7385K32362L12362J02489k19404m97118n88742k78483M03224
$$ plain form
39667 -641453 -508839 -174286 27768 120576 334511 541065 311841 -372617 -942101 -988307
39657 -988307 -789291 -770387 -805137 -497461 68633 373563 205177 -104182 -226565 -208302
39647 -208302 -185321 -121296 -17590 -47345 -236578 -291771 -26000 278601 252681 -13005
39637 -13005 -173485 -234587 -496770 -921268 -1045467 -671576 -219449 -160421 -436090 -708041
39627 -708041 -887000 -1076112 -1205832 -1102855 -813439 -525695 -259715 35962 171878 -100354
39617 -100354 -602284 -836867 -662253 -467844 -534158 -600201 -320699 152955 383082 268821
39607 268821 136102 257175 534648 678199 530907 191673 -106573 -238666 -318194 -520117
39597 -520117 -785295 -852680 -620318 -307956 -205467 -424871 -921989 -1510731 -1789214 -1385990
39587a385990R01201O62933q0444n46064m22798j37113m1776L9762K42116K52787
39577e15386j17626m48132k75555J89242L85220J89526o4269j52287j01895Q5429
39567h25733M16455O76176N86048J71704k82239n47210m95895n1849N65278P66467
39557I79202K30718n05271o00171k6847L80091P6060n03656o25014k07541K27996
39547e74433L01000J13394n0482p4851k4367L1386J01635J90360K01857L6804
39537B52303k07706k85124j29704J8417m8121k00360j89282j9584J08749J13564
39527e86848O5611K5037N8624K71408N66017N50991L8386n11552m73414P1383
39517G5643M02604J34776l30521m49551k15127K5085J04831J32231K29530L82386
$$ plain form
39587 -1385990 -484789 178144 97700 -448364 -871162 -1008275 -1050051 -1010289 -768173 -515386
39577 -515386 -633012 -1081144 -1356699 -1167457 -782237 -592711 -656980 -809267 -911162 -825733
39567 -825733 -409278 266898 852946 1024650 742411 195201 -300694 -352543 212735 979202
39557 979202 1209920 704649 104478 77631 457722 533782 30126 -594888 -802429 -574433
39547 -574433 -273433 -160039 -210521 -285372 -309739 -278353 -176718 13642 215499 252303
39537 252303 44597 -240527 -370231 -351814 -399935 -600295 -789577 -809161 -700412 -586848
39527 -586848 -521237 -496200 -437576 -166168 399849 950840 989226 477674 4260 75643
39517 75643 478247 613023 282502 -167049 -382176 -357091 -252260 -120029 109501 491887
39507D91887M62447L29668J1412k50616k94217k81397l96047m34675j02991L56399
39497a08130L61955j11565l89576n9850M31682M57491M2549l47283m85418m45021
39487f53166k64527K2107K09138J53561M5068J18877K52958J73758q1210k35820
39477b59256j99183j11421o2462m2440o9803j11561n052K77492M43812K61601
39467A21727l7120p8585O5593J3825k80276m45555k78710k9386l720j67594k46571
39456a366372l8416M01622P42136O08491J5530n45979o69726n14972m49677m31332
39446b248695j71491K27944L28724M6755k04789j36265R2895K47661K90888K09234
39436a317139P473n3551K86987O98159N14247k06154n27953O1301Q07501P10327
$$ plain form
39507 491887 954334 1284002 1295414 1044798 750581 469184 73137 -361538 -464529 -108130
39497 -108130 253825 142260 -247316 -307166 124516 582007 624556 277273 -208145 -653166
39487 -653166 -917693 -895586 -686448 -532887 -487819 -368942 -115984 57774 -23436 -259256
39477 -259256 -458439 -569860 -632322 -674762 -744565 -856126 -861178 -583686 -139874 121727
39467 121727 84607 6022 71615 85440 -194836 -640391 -919101 -948487 -952207 -1119801 -1366372
39456 -1366372 -1404788 -1003166 -261030 347461 362991 -182988 -852714 -1367686 -1817363 -2248695
39446 -2248695 -2420186 -2192242 -1863518 -1816763 -2021552 -2157817 -2064922 -1817261 -1526373 -1317139
39436 -1317139 -1309666 -1363217 -1076230 -378071 136176 -69978 -597931 -536630 270871 981198
39426I81198r1965o32850m92606j32812K439l450K9932O0902Q3568K12315L53831
39415C70502K22913j58422l80398k39396k5594o775p324K01635M12231K57140
39405F46512k04716n35710m70460j34677K17344M16325L78871J61107j824M7426
39395E20198J09515j20534n13829n56350o6094M60769M73953R9737q5695J23154
39385D44824L55880K79615K6346j31071j98326l10519l97294l00271j05665n8201
39375c94682j75143k15671n0756J77345L07308L43535L19003J90608j9626j64479
39365C17442j78183j80758k46691k42080p4443M4618j54510n30597n72034k779
39355a820015Q00922J135147O93166j03516n28624k91000K01498L46366K5717
$$ plain form
39426 981198 889233 256383 -236223 -369035 -366596 -370046 -340114 -279212 -195644 16671 370502
39415 370502 593415 434993 54595 -184801 -210395 -217170 -224494 -22859 389372 646512
39405 646512 441796 -93914 -564374 -699051 -481707 -65382 313489 474596 472772 520198
39395 520198 629713 509179 -4650 -561000 -627094 -166325 307628 407365 321670 444824
39385 444824 800704 1080319 1106665 975594 777268 466749 69455 -230816 -336481 -394682
39375 -394682 -569825 -785496 -836252 -658907 -351599 -8064 310939 501547 481921 317442
39365 317442 139259 -41499 -288190 -530270 -604713 -560095 -714605 -1245202 -1817236 -1820015
39355 -1820015 -1019093 116054 809220 705704 177080 -113920 87578 433944 459661
39346D59661l44179l85473j68801j410j1575q2053o8220N5881J95196K01674M6524
39335a02775m4635J70171N01709M18284k03541p23432n07310J65756M52226J07454
39325B33907k57481j50069J59909K42958K30021M53151P12875M99654j52975o04538
39315A367412m87608j79537j85480m26415m59282j73963R6334R5376n1724j10439
39305e15326o9179p3274j68508k44411j77561N3507L55982N67860N63632L72934
39295F65656J52689J391j30351k92186l99896l59361k38623j64246j01654P8317
39285g88264L29948M31608K89304N5164j07454j86102j85698n9418J14246J24223
39275A7557l2024m3223K36695M41251J74362l28934m70211j67986K5424k06711
$$ plain form
39346 459661 115482 -269991 -438792 -440202 -451777 -533830 -602050 -546169 -350973 -149299 -102775
39335 -102775 -147410 22761 524470 942754 739213 15781 -491529 -325773 126453 233907
39325 233907 -23574 -173643 -13734 229224 459245 912396 1625271 2124925 1971950 1367412
39315 1367412 879804 700267 514787 88372 -370910 -544873 -448539 -353163 -404887 -515326
39305 -515326 -584505 -657779 -826287 -1070698 -1248259 -1194752 -838770 -270910 292722 665656
39295 665656 818345 819736 689385 397199 -2697 -362058 -600681 -764927 -866581 -788264
39285 -788264 -458316 -26708 262596 317760 210306 24204 -161494 -220912 -106666 17557
39275 17557 -14467 -57690 179005 620256 794618 465684 -4527 -172513 -147089 -353800
39265c53800m50521k22230K65556M21877J48704p3119O1349K77328K09358m0735
39255B43767j02096P1783J13343k26333o84090p78489m00373P5719K80348K66542
39245a139879L28030N37786O60866M95976J24466k08374l22226j85077R1327K86389
39235F69284K22406n0066k96332l53070k52832j04882Q820K3108m1062J8665L74551
39224B18590P91514P42843Q0903o54410q42918n02031j15409P5272K24501L98179
39214D17034L70790K8016l54998m37724k22495L2531J61810J83920J42456L0757
39204C52097j33945k68439k82771j64513r936N6401L7849Q3440K51139L26016
39194B47338N9747m25093o98959n53328k37564n3696M5218K37789M16983L23671
$$ plain form
39265 -353800 -804321 -1026551 -760995 -339118 -190414 -263533 -202184 75144 284502 243767
39255 243767 141671 213454 326797 100464 -583626 -1362115 -1762488 -1686769 -1406421 -1139879
39245 -1139879 -811849 -274063 386803 882779 1007245 798871 476645 291568 382895 669284
39235 669284 891690 841624 545292 192222 -60610 -165492 -156672 -133564 -174626 -155961 218590
39224 218590 1010104 1752947 1833850 1179440 336522 -165509 -280918 -205646 18855 417034
39214 417034 787824 815840 460842 23118 -199377 -166846 -5036 178884 321340 352097
39204 352097 218152 -50287 -333058 -497571 -507507 -451106 -413257 -329817 -78678 247338
39194 247338 307085 -118008 -816967 -1370295 -1607859 -1661555 -1616337 -1378548 -961565 -637894
39184f37894M0261j1790L22266O20518M11250j60379m82805k68232R5363R5740
39174B4298k24031l66528o5304L94568N75791L82106M0275k28787l48217l11037
39164a26866j68522n6744p2550j41013j37007q9195j03467j39037p0788N0743
39154a054446N0947l9495N925J84072J63417j88815m69860k52276K57177M57781
39144h85573J90006p8326L2045K99452L13034R1193l0462L9584O7959m0363n4653
39133e6104J79733M37382M32173K39879J17491K7463k88854p54374q80523m39531
39123i85265J19595K32590l4760j69024J1509J88741J27413k0726r3824j92332
39113h16083l80785m60284k85859l3018J10031K50455M86324N50077J71355l47625
$$ plain form
39184 -637894 -597633 -609423 -287157 333361 744611 584232 101427 -166805 -71442 24298
39174 24298 -199733 -566261 -631565 -236997 338794 720900 761175 532388 184171 -126866
39164 -126866 -295388 -352132 -424682 -565695 -702702 -791897 -895364 -1034401 -1105189 -1054446
39154 -1054446 -1003499 -1042994 -1037069 -852997 -689580 -878395 -1348255 -1600531 -1343354 -885573
39144 -885573 -695567 -773893 -741848 -442396 -129362 -38169 -68631 -29047 38912 -1451 -56104
39133 -56104 123629 561011 993184 1233063 1350554 1378017 1089163 334789 -545734 -985265
39123 -985265 -865670 -633080 -667840 -836864 -825355 -636614 -509201 -529927 -623751 -816083
39113 -816083 -1196868 -1657152 -1943011 -1976029 -1865998 -1615543 -1129219 -579142 -407787 -755412
39103g55412l87381J41282O13635M68359j51241o75410p59934m81790q8511K29128
39093a847275L97295M51842M57044L86859J61046j64808l60953k63305J8261K10920
39083e53074J61089m2299j91196j63875j8151J04016J41987J33650Q2547n9261
39073d04567k27738k41129q2122J77j33113k22800J0643L67559M38947K73334
39063b20809K76056M25985J88284n50798j030886n75106L84417Q15970M29607
39054A42720q7831j44459N7321O8483p4106k7714K34575L81000K18974p1528k19424
39043D78011j62473j4344J10333J54305R6380l2471j40270j45956n6082N8716
39033C46149J32742J09572o1910l24940m39765j89302K86039N44569L54487l2089
$$ plain form
39103 -755412 -1142793 -1001511 -387876 80483 -70758 -746168 -1506102 -1987892 -2076403 -1847275
39093 -1847275 -1449980 -998138 -541094 -154235 6811 -157997 -518950 -782255 -763994 -553074
39083 -553074 -391985 -434284 -625480 -789355 -807506 -703490 -561503 -427853 -345306 -404567
39073 -404567 -632305 -873434 -955556 -955379 -1088492 -1311292 -1300649 -933090 -494143 -220809
39063 -220809 55247 481232 669516 118718 -912168 -1487274 -1102857 -286887 142720
39054 142720 54889 -89570 -32249 36234 -37872 -65586 168989 549989 768963 697435 478011
39043 478011 315538 301194 411527 565832 662212 629741 489471 343515 287433 346149
39033 346149 478891 588463 526553 201613 -238152 -427454 -141415 403154 757641 725552
39023G25552k79421m16214n92605o08485j68362M51577N71079Q8815k70877j0652
39013e09593L76827K07666k59242j86499N29394J057157Q04599J29754l32919
39004A817144m80466n36537m99314k44267Q3712K06055J15417J3204n8689k15315
38994B00944m19778m72400l11928r9967M276k4332j47750k86224k94657j04168
38984a955984J30272K01867J38026J17045J50056J08768N1470J85074M24316L54143
38974i4947j57052o22206n23328n805L70554M02470L38409K92577Q4039k48867
38964a64156k95868Q0142L68992R8156m01858m15064J21799N36379L92672K0431
38954C41625r9393j0631k2044j15860m4366J36355N7116m09994q99669r63508
$$ plain form
39023 725552 446131 29917 -562688 -1171173 -1339535 -887958 -316879 -228064 -498941 -509593
39013 -509593 -132766 74900 -184342 -370841 158553 1215710 2020309 2150063 1817144
39004 1817144 1336678 800141 300827 56560 140272 346327 461744 474948 416259 200944
38994 200944 -218834 -691234 -1003162 -1103129 -1098853 -1123185 -1270935 -1557159 -1851816 -1955984
38984 -1955984 -1825712 -1623845 -1485819 -1368774 -1218718 -1109950 -1058480 -873406 -449090 -94947
38974 -94947 -251999 -874205 -1397533 -1403338 -1032784 -630314 -291905 672 84711 -164156
38964 -164156 -460024 -379882 -10890 87266 -314592 -729656 -607857 -71478 321194 341625
38954 341625 242232 231601 209557 93697 49331 185686 242802 -167192 -1066861 -2030369
38944b030369n52687o037L21818L50057K66145K86374M10234M38811K54150j9094
38934b80598k07945l17953m08303l57647j5168M27761N11015Q0336m26360m66989
38924a461851n5125K82518J81327j39803k09324R7153M46699M98607K94930J32443
38914F7574J61387K46677J95751j0865k44935l89651m27036m16854m07345l44491
38904a569788j26578J81048K96097O2753k35072j65128K59114N75521N12549K91977
38894H2493J71722P0824r8471r4413K57498N87339L81001k44447o28321m35422
38884D9803k5110J25965J1439m4226J35893M01064M54817J58570k77633m72300
38874E18282l37988k01287k83254l22076n1851K03005o5328o73630q80237m15893
$$ plain form
38944 -2030369 -2583056 -2589093 -2267275 -1917218 -1651073 -1364699 -954465 -515654 -261504 -280598
38934 -280598 -488543 -806496 -1214799 -1572446 -1587614 -1159853 -648838 -568502 -994862 -1461851
38924 -1461851 -1516976 -1234458 -1053131 -1192934 -1402258 -1305105 -858406 -359799 -64869 67574
38914 67574 228961 475638 671389 660524 415589 25938 -401098 -817952 -1225297 -1569788
38904 -1569788 -1696366 -1515318 -1219221 -1156468 -1391540 -1556668 -1297554 -722033 -209484 82493
38894 82493 254215 325039 226568 132155 389653 976992 1357993 1113546 485225 49803
38884 49803 24693 150658 162097 117871 253764 654828 1109645 1268215 990582 518282
38874 518282 180294 -20993 -304247 -626323 -678174 -475169 -540497 -1214127 -2094364 -2510257
38864b510257J97154M50926L96259K35439o429j47604J78751Q27827J005241L35024
38854I62331m42101m35300J58524M69785K77180J08901J66885J8984m96967q21366
38844c3144m81932J66210M12683Q5982l78122n56364m08250j25635J21333K66978
38834i30261L11026K55618J04988n3664o1154J05580K13259K7924l43719n34510
38824i04913l25201J59201O07228P23911L68786k77728p26725o11537j24821J89942
38814i21857R3622j32239j48438K9261J85303K35515K20801J12639j63226n13568
38804a002187o29974k56782M65727R91117Q43599J50636m48076n12208k49075
38795f47223j09570j51036p9717K08898M81374N41916M32995K12244j66502o24718
$$ plain form
38864 -2510257 -2313103 -1862177 -1465918 -1230479 -1236908 -1384512 -1205761 -377934 627307 962331
38854 962331 520230 84930 243454 713239 990419 1099320 1266205 1285189 788222 -33144
38844 -33144 -515076 -348866 63817 149799 -228323 -784687 -1192937 -1318572 -1197239 -930261
38834 -930261 -619235 -363617 -258629 -312293 -373447 -267867 -54608 -26684 -370403 -904913
38824 -904913 -1230114 -1070913 -463685 260226 629012 351284 -375441 -986978 -1111799 -921857
38814 -921857 -828235 -960474 -1108912 -1079651 -894348 -658833 -438032 -325393 -488619 -1002187
38804 -1002187 -1632161 -1888943 -1423216 -432099 411500 562136 114060 -398148 -647223
38795 -647223 -756793 -907829 -987546 -778648 -297274 244642 677637 889881 723379 98661
38785I8661q55791o36359j23915K94589L94852K76800J74590J66490J05564j25269
38775b29788l44961k41762J54116M13129K71783P415J4992K41944L50382K44082
38765H81332P6684r8548k85312k91869J7583L12337J49122k93161l90289k7525
38755E0354K31163Q4634l8165K13713M24224M8546o56028r22629n19848J5184
38745a068852J50194n4977j86365q064L32909M91249K83678q1627k07862J0201
38735c39516K54603K16301k2612j79005j76546j78781l03126m55341m29304j31746
38725a745073K46803L48614Q3787j49529N9733N17577O35488K37013k53661m53192
38715d72440l89210j60738K36437N78637M74589K2442j59724J06565J82006l39200
$$ plain form
38785 98661 -757130 -1393489 -1517404 -1222815 -827963 -551163 -376573 -210083 -104519 -229788
38775 -229788 -574749 -816511 -662395 -249266 22517 29932 44924 286868 637250 881332
38765 881332 958016 859468 574156 282287 299870 612207 761329 468168 77879 50354
38755 50354 281517 366151 327986 541699 965923 1014469 358441 -564188 -1084036 -1068852
38745 -1068852 -918658 -973635 -1160000 -1168064 -835155 -343906 -60228 -141855 -349717 -339516
38735 -339516 -84913 131388 108776 -70229 -246775 -425556 -728682 -1184023 -1613327 -1745073
38725 -1745073 -1498270 -1149656 -1065869 -1215398 -1155665 -638088 -2600 234413 -19248 -472440
38715 -472440 -861650 -1022388 -785951 -207314 267275 289717 129993 236558 418564 79364
38705G9364q20453m99712K77788N48871J41676k46085k21633j02873j42992j44144
38695a130193K165O1478m5453m8596J57450K92665J82181K4419j4014m8222j37987
38684g04107j11249P6483J84648R0850J854O6766J14362j9010j96129k00696O046
38673f90182L69508P82972R47491N61331j89131o86516o15966l01037j36441p7263
38663c5234O8244K25787K51751K25553K22872P6800l04970o31090n72572k18756
38653f91615J18785L51684N41417N79531L18747p9830k73865j75837K89P8895
38643G68201P4657M4300j0986j04437k33649l41695k87033j9838J94473J1892
38633I5885m46715o34320l16493J02469K06522J09290P3181K2940j54114k27739
$$ plain form
38705 79364 -741089 -1240801 -963013 -414142 -272466 -518551 -740184 -843057 -986049 -1130193
38695 -1130193 -1128028 -1066550 -1112003 -1160599 -1003149 -710484 -528303 -503884 -517898 -566120 -704107
38684 -704107 -815356 -738873 -554225 -463375 -461521 -394755 -280393 -299403 -495532 -696228 -690182
38673 -690182 -320674 462298 1409789 1971120 1781989 1095473 479507 178470 42029 -35234
38663 -35234 33010 258797 510548 736101 958973 1035773 730803 99713 -472859 -691615
38653 -691615 -572830 -221146 320271 899802 1218549 1138719 864854 689017 689306 768201
38643 768201 842858 887158 876172 771735 538086 196391 -90642 -110480 83993 95885
38633 95885 -350830 -985150 -1301643 -1199174 -992652 -883362 -810181 -787241 -941355 -1169094
38623a169094l5188R0033j51503m04962j99360J99976K06641o0242m893L24838
38613a203754K98577p9863m5603N66753Q50223K34094n25167m73223J31773L67370
38603A21180Q7053r1971N6602J33106m0511j47414l1053M0770r9169k77126l83623
38592f32156n09671n59247k49371L17125N81622K98357o5549j3614K77808L10617
38582b44079J7460k46672k69766j38549N2673K62656L29235J16568j47243n1927
38572c19644L70434N49368J27165m55847m59436J70414O75149M33695k56213n86613
38562B48472k64529K00274K35297j05758l64058l20481j34694J4960J06568J21939
38552b62010K3391p6305J7213K75088M41574L94958K69163J52195m8765l22630
$$ plain form
38623 -1169094 -1204282 -1114249 -1265752 -1670714 -1870074 -1670098 -1463457 -1523699 -1528592 -1203754
38613 -1203754 -905177 -985040 -1030643 -463890 386333 620427 95260 -377963 -246190 121180
38603 121180 208233 116262 172864 305970 265459 118045 86992 127762 28593 -248533 -632156
38592 -632156 -1141827 -1701074 -1950445 -1633320 -1051698 -753341 -818890 -832504 -554696 -244079
38582 -244079 -226619 -473291 -743057 -881606 -828933 -566277 -237042 -120474 -267717 -319644
38572 -319644 50790 600158 727323 271476 -187960 -17546 657603 1091298 835085 248472
38562 248472 -16057 184217 419514 313756 -50302 -370783 -505477 -490517 -383949 -262010
38552 -262010 -238619 -314924 -297711 -22623 418951 813909 1083072 1235267 1186502 863872
38542H63872m39162l09464j85968k72065l86924k81777m6677J00044J95468L51571
38532d11082M00991J39181k33598l59530k95491l49996m37279j79137L24897M72711
38522i28333R3524k06274M1612M49505M13033K7859j62042l2528O2452n3477j86831
38511d81500j95098j56753j11242K141J26158J25113N3120Q8545K02678J91641
38501a55197M4300k7987L7726N4220q3105k37751k92050l17192l78741l78904
38491a734681k06369R3731L59814M22124K07110j14456j72991J69829N24239M16310
38481c5340l7992k94112j96546j44441l31188l66806K9586M39050L24042j12405
38471g26152j96714K22557N93109M85418J11130j26071j86819k51861l08772k02674
$$ plain form
38542 863872 424710 115246 -70722 -342787 -729711 -1011488 -1058165 -958121 -762653 -411082
38532 -411082 -10091 129090 -104508 -464038 -759529 -1109525 -1546804 -1725941 -1401044 -928333
38522 -928333 -834809 -1041083 -999471 -549966 -136933 -109074 -271116 -303644 -241192 -294669 -481500
38511 -481500 -676598 -833351 -944593 -942452 -816294 -691181 -638061 -549516 -346838 -155197
38501 -155197 -110897 -138884 -101158 -46938 -130043 -367794 -659844 -977036 -1355777 -1734681
38491 -1734681 -1941050 -1847319 -1487505 -1065381 -858271 -972727 -1145718 -975889 -451650 -35340
38481 -35340 -73332 -367444 -563990 -708431 -1039619 -1406425 -1376839 -937789 -613747 -726152
38471 -726152 -922866 -700309 -107200 378218 489348 363277 176458 -75403 -384175 -586849
38461e86849K4122J42142Q6495O4052K30202M25885L71894M1946l03499m35655
38451F0735l71210k46735j17735L8159K11408L43939L72758K48018j2792k58877
38441B67668l19761k31036j84831j99209p5703J89123K53495n5190l70988l01918
38431a028350n2341n3202j70997R6771O87280R23936N45135J21330J51173L37423
38421A558158J81886k02458l88692l63436l96397m42925k51250P2095J48620o1124
38411a45523k09176j19153L7956J36192K36461K86752R7439k71983m67485l22635
38401g41155p1724N2929J20877K27050K18278n0018l90438m82796k87621m4675
38391a449293O6537P3612O3070O2540P9729J34805K20870K89723K88925J97288
$$ plain form
38461 -586849 -562727 -420585 -334090 -270038 -39836 386049 757943 799889 496390 60735
38451 60735 -310475 -557210 -674945 -636786 -425378 -81439 291319 539337 526545 267668
38441 267668 -52093 -283129 -467960 -667169 -742872 -553749 -300254 -355444 -726432 -1028350
38431 -1028350 -1080691 -1133893 -1304890 -1208119 -520839 403097 948232 1069562 1220735 1558158
38421 1558158 1740044 1537586 1148894 785458 389061 -53864 -305114 -233019 -84399 -145523
38411 -145523 -354699 -473852 -435896 -299704 -63243 223509 320948 48965 -418520 -741155
38401 -741155 -812879 -759950 -639073 -412023 -193745 -243763 -634201 -1116997 -1404618 -1449293
38391 -1449293 -1382756 -1309144 -1246074 -1183534 -1103805 -969000 -748130 -458407 -169482 27806
38381B7806N8720q15J31287L70226M14654M4948n50144q74318o37072r4469K31746
38370h77431J38608r1066j07026J00823K94632L13169J48124j58788m80950n67534
38360a287439k87332J33376L54554L48959L09077K01583j77530o60126o90198
38351a755076q1823N89009O70048K38024j13614q2430J09227J76468J17093Q0111
38341e2963J18675J27187m4810l76994n89561m49133j58172j33780l38321k43751
38331b141623L44249Q72597P87926L01455j4215m5894o3783j11094l1013P7320
38321b4075j3400j84619j43596L5790O0041j3950Q2457K27795P8667k12501j38675
38310b46066K69533M11738R5693j88506j70624k04360m40580l78053K39607P56849
$$ plain form
38381 27806 86526 85711 216998 587224 1001878 1046826 496682 -377636 -1014708 -1109177 -877431
38370 -877431 -738823 -829889 -936915 -836092 -541460 -228291 -80167 -238955 -719905 -1287439
38360 -1287439 -1574771 -1441395 -1086841 -737882 -428805 -227222 -404752 -1064878 -1755076
38351 -1755076 -1836899 -1247890 -577842 -339818 -453432 -535862 -426635 -250167 -133074 -52963
38341 -52963 65712 192899 148089 -228905 -818466 -1267599 -1425771 -1559551 -1897872 -2141623
38331 -2141623 -1797374 -924777 -136851 164604 150389 104495 40712 -70382 -101395 -24075
38321 -24075 -37475 -222094 -365690 -329900 -269859 -283809 -201352 26443 105110 -107391 -246066
38310 -246066 23467 435205 530898 342392 171768 -32592 -473172 -851225 -611618 145231
38300A45231M99553j74803m35027k15765j47075m50357o54061m00858R2855M71468
38290a268839O31408N70081K71417j11982k86637j62892N7972J95712K50183K16519
38280C62942K0676k61857l59203j23539K34266L46017O3734l99209o48332m46003
38270a210508N2154M23867M10221J60616j5685j8489N3819J48657K76556L47471
38260F28679K22369n6640k62730k33776J911L25324N97884O59022M39283Q6514
38250B407840j92968m14662p20190r84172q21766j57666M77993N20448R2722j84842
38240B2737n8571Q3083j02959l59186k53706J30007L34681K14252M4415p275o3606
38229a6128j31566J6069L77622N71771L95817J36377L7256j20310n13483p63201
$$ plain form
38300 145231 644784 469981 34954 -180811 -327886 -778243 -1432304 -1833162 -1740307 -1268839
38290 -1268839 -637431 -67350 204067 92085 -194552 -357444 -299472 -103760 146423 362942
38280 362942 383618 121761 -237442 -360981 -126715 219302 283036 -116173 -764505 -1210508
38270 -1210508 -1158354 -734487 -324266 -163650 -179335 -197824 -144005 4652 281208 628679
38260 628679 851048 794408 531678 297902 299813 625137 1223021 1882043 2321326 2407840
38250 2407840 2214872 1800210 1080020 95848 -725918 -883584 -405591 114857 207579 22737
38240 22737 -35834 47249 -55710 -414896 -668602 -538595 -203914 10338 54753 47478 -16128
38229 -16128 -147694 -131625 245997 817768 1213585 1349962 1387218 1266908 753425 -9776
38219i776m61480Q0844K19510o4063k10895j0744J54035K2213j80359j99056o5297
38208g25068J53938M43046N84601L13847j68077l35893j07532N6549n5617j13566
38198D6228M6249M2652l62863p37798n63721N2532O20597Q50131O80094J39259
38188H13360m70522o44804k93042P3855Q3587R134J91632M23031L43658M5376
38178E75265j75079k87349l24734j26702K56531L47707m9382l78322j49973K30940
38168h1098J47316j60702l3592M19738M85229N2805k35019n0383K18256K16630
38158I79180M9193j58937m53204o66658m62463Q6299M95986N53710M77399L53779
38148A254284J6688m18097n17607k12706L7875m8313k18324j96704n3029J12630
$$ plain form
38219 -9776 -471256 -390412 -170902 -234965 -445860 -456604 -302569 -280356 -460715 -659771 -725068
38208 -725068 -571130 -128084 456517 770364 602287 266394 158862 215411 159794 46228
38198 46228 92477 135129 -227734 -965532 -1529253 -1476721 -856124 -5993 674101 813360
38188 813360 342838 -301966 -595008 -521153 -437566 -428432 -236800 186231 529889 575265
38178 575265 400186 112837 -211897 -338599 -82068 265639 216257 -162065 -312038 -81098
38168 -81098 66218 -94484 -128076 291662 776891 829696 594677 544294 762550 979180
38158 979180 1028373 869436 416232 -250426 -712889 -626590 -130604 423106 900505 1254284
38148 1254284 1270972 852875 335268 122562 160437 112124 -106200 -302904 -355933 -243303
38138b43303L51060N48910M19201J116k82852k37730j18184j12142r6615m6295
38128A83166j44881l05138j38449L55131O16440L34480r8055k42778k06318k19934
38118A33664j42702J76011M60508L93430J11980q2437k01663l67351m22219j58027
38108i8806K71606N14432M34433J23255k79078n53147m56042n0126K69778K72928
38098D49233J40330O5299k5056j56886j34823O6369J50685J6053j8198J93258
38088G46264K77804j4145l01402j85110O0838l8473l54107m10421j79012k2928
38078d20692l0909K9634K06687L06070K55214J16824j25121m11996m49566j28492
38068f52347J21146j17939n54686n80618j74007J68642K65732L68740M85024K61615
$$ plain form
38138 -243303 107757 656667 1075868 1076984 794132 556402 438218 326076 229461 183166
38128 183166 38285 -266853 -405302 -50171 566269 900749 802694 559916 353598 133664
38118 133664 -9038 166973 627481 1020911 1132891 1050454 848791 481440 59221 -98806
38108 -98806 172800 687232 1121665 1244920 965842 412695 -43347 -93473 176305 449233
38098 449233 589563 654862 629806 472920 338097 404466 555151 571204 553006 746264
38088 746264 1024068 1009923 708521 523411 584249 545776 191669 -218752 -397764 -420692
38078 -420692 -451601 -421967 -215280 90790 346004 462828 337707 -74289 -523855 -652347
38068 -652347 -531201 -649140 -1203826 -1784444 -1958451 -1789809 -1524077 -1155337 -670313 -408698
38058d08698l19728p07714m77758J36421N97222O36370L45609j4997j76393m9940
38048d39606J63691K02393M7716j39581k44858j68877J94914O68061P48674K52881
38038A285408k83208l10556q2294j72673m58411l41337J54154L68276J25424j0900
38028B73883K10784K96216l0202k57276j098K33729j34753p48101q31878l62894
38018a351590K6241Q7859J73951M61652O27799M08905j3154l34788m68331m33144
38008h14600k38327j8649j5222k52838m30445k86701P0423L39233M11135M20970
37998h15021M69886M75171L38847J34173N210o1744k04381m02814m25512j80831
37988f67016N5035j2659k32803j86870J89683M86391M00069J33458L6108R6839
$$ plain form
38058 -408698 -728426 -1436140 -1913898 -1777477 -1180255 -543885 -198276 -213273 -389666 -439606
38048 -439606 -275915 -73522 -25806 -165387 -410245 -579122 -384208 283853 1032527 1285408
38038 1285408 1002200 691644 609350 436677 -21734 -363071 -208917 159359 284783 273883
38028 273883 484667 780883 750681 493405 492307 726036 591283 -156818 -988696 -1351590
38018 -1351590 -1325349 -1237490 -1063539 -601887 25912 434817 421663 86875 -381456 -814600
38008 -814600 -1052927 -1071576 -1086798 -1339636 -1770081 -2056782 -1986359 -1647126 -1235991 -815021
37998 -815021 -345135 130036 468883 603056 608266 546522 342141 -60673 -486185 -667016
37988 -667016 -611981 -624640 -857443 -1044313 -854630 -368239 31830 165288 201396 298235
37978B98235M8323j73288l53659l41761k16472q3349P9237K73200L47082J84886
37968F2434l6094J6870L77379O37131M12780j48508n32949m82457k11807J518
37958I6297J44232K66579K52861L2598j85661j67859j6706j9571k17563l68835
37948a83628k88602k0182K72593M00897K30029j41767l82547k96296o6532O2370
37938d13665J48108L18769M01201J79267j29689j20369J43847K05843m0965j81738
37928E10609L4073K99873K45597n3749k96305l85887m12850m13237l47537j95862
37918a015275J9324J93152J51369r9769k21763N5841M66001N28389K83887K10573
37908E71729L95254L76708l7617m06021l82987k40667k79000k52985J11473M81359
$$ plain form
37978 298235 346558 173270 -180389 -522150 -738622 -821971 -742734 -469534 -122452 62434
37968 62434 26340 43210 420589 1057720 1470500 1321992 789043 306586 94779 96297
37958 96297 240529 507108 759969 792567 606906 439047 422341 402770 185207 -183628
37948 -183628 -472230 -492412 -219819 181078 411107 269340 -113207 -409503 -476035 -413665
37938 -413665 -265557 53212 454413 633680 503991 383622 527469 733312 692347 510609
37928 510609 544682 844555 1090152 1036403 740098 354211 -58639 -471876 -819413 -1015275
37918 -1015275 -995951 -802799 -651430 -751199 -972962 -917121 -451120 77269 361156 571729
37908 571729 966983 1343691 1306074 900053 517066 276399 -2601 -255586 -144113 337246
37898C37246L90044K7520o2956J32537J54683r3348k13361n8016j2301l47733
37888B54315p66154q29400n02099m0568L72306O39590O31005L35308J3693n3219
37878E4777P1825Q5779j00792k38397j41841o211j17791l62976l11648J73290
37868h93985O86856P88000N20649K26582O0363k8325k1474R0788Q0891k56921
37858A253424o65233o68990k69440M3638J5204j03637r4683p9125j14175P618
37848f75399K97866L90253J37013o2182J00057K90993P0758l77163n23860k41784
37838e93448J68074M61795N48473L40363o7387k94335j58548P81j00963j52411
37828A52394J73990M73947J76404l99306m08079J81380N12254J95644j60455m8015
$$ plain form
37898 337246 727290 754810 691854 824391 979074 885726 672365 614349 602048 254315
37888 254315 -511839 -1341239 -1843338 -1883906 -1511600 -872010 -241005 94303 107996 54777
37878 54777 126602 212381 111589 -126808 -268649 -274860 -392651 -755627 -1067275 -893985
37868 -893985 -207129 580871 1101520 1328102 1388465 1360140 1338666 1429454 1510345 1253424
37858 1253424 588191 -80799 -350239 -306601 -291397 -395034 -489717 -568842 -683017 -675399
37848 -675399 -377533 12720 149733 87551 187608 478601 549359 172196 -351664 -593448
37838 -593448 -425374 36421 584894 925257 857870 563535 404987 405768 304805 152394
37828 152394 326384 800331 976735 577429 169350 350730 862984 1058628 898173 850158
37818H50158J69193L2932j95663r6205R6935q7933m91446n39213j43426K01272
37808b03396J59369r7037k73652k80416j43637P8672K47622K54269J93954K33177
37798A68925L42307L67927L04677K53966J74699l9898k59259k07126Q7095K33565
37788A426878J3189k92018k90236j2945J68156M7044k22109l93771l75257j85139
37778a16208J25715M22476N12325L51760J30908K5981m2478k47938n29668o41805
37768h932n18812l48295k24531R90L70500N81410L70162l2614j60722M0634J69202
37757B38992j7374k90564l70739l24829l18332k32770J41243O46966Q39025N44659
37747H56277Q1077j77351k39116l58955n99496p15031m58242J11263O39557P57667
$$ plain form
37818 850158 1019351 1052283 856620 760415 857350 769417 277971 -261242 -404668 -203396
37808 -203396 -44027 -141064 -414716 -695132 -838769 -760097 -512475 -258206 -64252 168925
37798 168925 511232 879159 1183836 1437802 1612501 1572603 1313344 1106218 1193313 1426878
37788 1426878 1440067 1148049 857813 844868 1013024 1060068 837959 444188 68931 -116208
37778 -116208 9507 431983 944308 1296068 1426976 1452957 1410479 1162541 632873 -8932
37768 -8932 -527744 -876039 -1100570 -1099580 -729080 -147670 222492 189878 29156 69790 238992
37757 238992 221618 -68946 -439685 -764514 -1082846 -1315616 -1174373 -527407 311618 856277
37747 856277 937354 760003 520887 161932 -437564 -1152595 -1610837 -1499574 -860017 -102350
37737a02350L93540j21122l08183k2181L56385L46391l0811k75854r4838J91695
37727C32672J20317k35450l79073j18885J82391J72513k827N837J96298K51526
37717E25319N6593j13204R549K95492L72668R7787k68150l81568k09806o931M5208
37706D22957K668o0417k18979m81237n86950k96964J91322M20595K70210P5644
37696b61151J01990K24350K60364K83340L63038K85402j17310n30962m59363O3349
37686B13047M32858K38523k36878m43474k48196M2724J84398K04674J39735r6923
37676D30488m31159n08547j60179K02325P3659l23669k20538N57192J161279Q01117
37666A581968j65837p15969m49265J46773N36285O32391N01443J71073j67559
$$ plain form
37737 -102350 291190 170068 -138115 -160296 196089 542480 511669 235815 140977 332672
37727 332672 452989 217539 -161534 -280419 -98028 74485 71658 77495 273793 525319
37717 525319 581912 468708 478257 773749 1146417 1244204 976054 594486 384680 377749 422957
37706 422957 425625 365208 146229 -335008 -921958 -1218922 -1027600 -607005 -336795 -261151
37696 -261151 -159161 65189 325553 608893 971931 1257333 1140023 609061 149698 213047
37686 213047 645905 884428 647550 204076 -44120 -1396 183002 387676 527411 430488
37676 430488 -671 -509218 -669397 -467072 -393413 -717082 -937620 -380428 780851 1581968
37666 1581968 1416131 700162 250897 397670 933955 1566346 2067789 2238862 2071303
37657B071303k50811j44606j51895k90279l10412k36200l50668n98015n89062
37648h50645k98662j27490j38327N3489M12239L18483l31116o83638j77025N25473
37638a297219N83741K87339M03467P46249M83141l63413q21373m41009R6593R6987
37628b25497k02346j87879J87204M53227L26318J6399q2064J44506L76887K39313
37618A046068j56729k94918m838K35133K2534l37109l44155q8834J3930j5163
37608G5919J56383M57269M52326N9293l18816l85489k38124r7561j24653l98117
37598c61570p19954o42416p1979M38678M43457K70759L77297M75232P2315m85391
37588b03572m36470J41449M58428K83249J15286J34226M47k44206j20755K85467
$$ plain form
37657 2071303 1820492 1675886 1523991 1233712 923300 687100 336432 -261583 -850645
37648 -850645 -1149307 -1276797 -1415124 -1361635 -949396 -630913 -962029 -1645667 -1822692 -1297219
37638 -1297219 -713478 -426139 -22672 723577 1206718 843305 21932 -419077 -322484 -225497
37628 -225497 -427843 -615722 -428518 24709 351027 367426 285362 429868 806755 1046068
37618 1046068 889339 594421 589583 824716 847250 510141 165986 77152 91082 75919
37608 75919 232302 689571 1141897 1201190 882374 496885 258761 161200 36547 -361570
37598 -361570 -1081524 -1723940 -1795919 -1357241 -913784 -643025 -265728 209504 281819 -203572
37588 -203572 -640042 -498593 -40165 243084 358370 492596 493043 248837 128082 413549
37578D13549K95820j62276l49089Q687K73172R4181j0927K45706L11794j01990
37568A018627l36865L7392L14231j80815q39518p03079N081L37493J36582L0623
37558a80248K28780L43624K58091K32624K07263j46566o57621p14323j90659L45013
37548b74022M62862L39871K71279K33895J12193m6577j75527k90705l39446k01939
37538I1884O5053K01947O4373j62418j52318J75153M78114L05445k93109o37986
37528A36138k10768N56882P47986J74442m32385m98750k36802k5893J41142K73222
37518F25214J17114k81765l70072N7770L74639N9680m30822l88808L7869K03944
37508D763M8187K2580J87789J68615r3466k54744k10817k06193k97248k50406
$$ plain form
37578 413549 709369 547093 198004 206691 479863 574044 563117 808823 1120617 1018627
37568 1018627 681762 719154 1033385 852570 13052 -690027 -684946 -347453 -210871 -180248
37558 -180248 48532 392156 650247 882871 1090134 943568 285947 -428376 -619035 -274022
37548 -274022 188840 528711 799990 1033885 1146078 1099501 923974 633269 293823 91884
37538 91884 156937 358884 423257 260839 108521 283674 761788 1067233 774124 136138
37528 136138 -74630 482252 1230238 1404680 972295 473545 236743 210850 351992 625214
37518 625214 742328 460563 90491 148261 522900 582580 151758 -237050 -199181 4763
37508 4763 52950 75530 263319 431934 338468 83724 -127093 -333286 -630534 -880940
37498h80940p407K08177K74928K83441K73979J97867J03291P8793Q3042M4334
37488F59505j5468j15728l13744m17993j10766M28612N45563Q0387k79966p3037
37478C87365J72086j25307n34801l37203K06247K91434n7787r8885K98219M65226
37468F66594J18370k18412j43816P0406P6861o8613k24005l79410m06540j25962
37458f34527K55053K76875j05689m53874m72700k44229J23339N42010O85298K91904
37448B63460k58725k90982J96507N20198L40810N8661M3590J12155Q828j49210
37438H45292j81226j41503p2769J26901L80975L70696J2197l35992l36151o9582
37428E98838J56982J49041r8720l97715m10192J4560N34600O39005K81951r7052
$$ plain form
37498 -880940 -888347 -680170 -405242 -121801 152178 350045 453336 532129 615171 659505
37488 659505 644037 528309 214565 -203428 -314194 114418 659981 740368 460402 387365
37478 387365 559451 434144 -100657 -437860 -231613 59821 2034 -96851 201368 666594
37468 666594 784964 566552 422736 493142 570003 501390 277385 -102025 -508565 -634527
37458 -634527 -379474 -102599 -208288 -662162 -1134862 -1379091 -1255752 -713742 -28444 263460
37448 263460 4735 -286247 -89740 430458 771268 829929 873519 985674 994502 845292
37438 845292 664066 522563 449794 576695 957670 1328366 1340563 1004571 668420 598838
37428 598838 755820 904861 806141 408426 -1766 12794 547394 1186399 1468350 1371298
37418A371298j77109q1378q6142k59959m16151k86699J69684N55722L96751j53538
37408A032479l73498J4957L92389J92753k22013j99698J61482K83504N3235j97047
37398A138543l49627m58439l37240J16263M65652L03755j2806R3424M62190N34858
37388A956573L14745J69704J2957m21810p83962n31837P7401L44252K22543J43987
37378A504553Q6472j68796k36971K47604N84150q3883j111075j097602j29116
37369d04664L46791j18597m50197q6004K23779R3666K39732Q61215R23948m7238
37359A582431r16532o91404o0803j03973n61667n29685l83L83330M37041L43167
37349a18478M4062m29924n73186j03321M47178M73391J34018q5866j06133p2265
$$ plain form
37418 1371298 1194189 1112811 1026669 766710 350559 63860 233544 789266 1186017 1032479
37408 1032479 658981 673938 1066327 1259080 1037067 837369 998851 1282355 1335590 1138543
37398 1138543 788916 330477 -6763 109500 575152 878907 866101 959525 1421715 1956573
37388 1956573 2271318 2441022 2453979 2032169 1248207 716370 793771 1138023 1360566 1504553
37378 1504553 1591025 1422229 1185258 1432862 2017012 1933129 822054 -275548 -404664
37369 -404664 -57873 -176470 -626667 -712671 -488892 -395226 -155494 705721 1629669 1582431
37359 1582431 665899 -25505 -86308 -190281 -751948 -1281633 -1282016 -898686 -461645 -118478
37349 -118478 -74416 -504340 -1077526 -1180847 -733669 -260278 -126260 -212126 -318259 -390524
37339c90524p821m3663l86663p46500n05271K52738O90310M84315K40026L31758
37329h1295L41293M4536j01151P7912Q5138j82820j05562M02381N02517o8075
37319I14874l47853K40829Q59633O98742K65024K55135K74785k23662p20119m90440
37309A726948J16582L29230J73574J02094R3519k2524l4294J06621m5458n46370
37299A999922o94456j92869K53227J33364j02149r6767k44336o03174m24988M31942
37289D59716R18364M74727m7387j8724j15073p61992j041401l38444M11549L75935
37279C17270K38510O59966Q64206J92307m42936j66511K65089l89k87840J30258
37269A769930M96130J25857j23395L65496M79821m81032j039701k1492J065239
$$ plain form
37339 -390524 -398345 -442008 -828671 -1575171 -2080442 -1827704 -1137394 -653079 -413053 -81295
37329 -81295 259998 304534 203383 281295 366433 183613 78051 480432 982949 914874
37319 914874 567021 807850 1667483 2366225 2631249 2886384 3161169 2937507 2217388 1726948
37309 1726948 1843530 2172760 2346334 2448428 2541947 2519423 2485129 2591750 2546292 1999922
37299 1999922 1305466 1112597 1365824 1499188 1397039 1300272 1055936 452762 27774 459716
37289 459716 1378080 1852807 1805420 1786696 1671623 909631 -131770 -470214 -58665 317270
37279 317270 555780 1215746 2079952 2272259 1829323 1662812 1927901 1927512 1639672 1769930
37269 1769930 2266060 2391917 2268522 2634018 3113839 2632807 1593106 1571614 2636853
37260B636853M81215p02555n72966K99520K37075l79731j76753L50382p0224p61164
37250A341652l21984N97896N49550O0920L58792P00308p8538q16817N4955J343704
37240C790438J072694O5496J79713O67454p4150r10723k0734J319407J103706
37231G193301O83789K017316L146391J507647o12463L74372K735158K643691J559886
37222B1249088L244781N862005N207850L571195O253480J1453214J3968266J6529317
37214H7339196K4900320L4240911L6815231M2040402O5859349R4015996Q2377804
37207D67589209J2661383p1481110j08411560q7576745n0746305l2571265k8437113
37200A01026494k1624266j2787176j0127046j0721699p387748k596189k532239
$$ plain form
37260 2636853 3118068 2415513 1842547 2142067 2379142 1999411 1822658 2173040 2102816 1341652
37250 1341652 1019668 1617564 2167114 2228034 2586826 3287134 3208596 2391779 2446734 3790438
37240 3790438 4863132 4928628 5108341 5775795 5701645 4790922 4770188 6089595 7193301
37231 7193301 7877090 9894406 13040797 14548444 13935981 14310353 17045511 19689202 21249088
37222 21249088 24493869 30355874 35563724 39134919 45388399 56841613 70809879 87339196
37214 87339196 112239516 146480427 183295658 225336060 291195409 385211405 467589209
37207 467589209 480250592 408769482 300357922 212781177 162034872 129463607 101026494
37200 101026494 79402228 66615052 56488006 45766307 38378559 35782370 33250131
37193C3250131n101051m563170k019987j974925l408037k590795p05687j142924
37185A1743555k605050j723819L58263K68120j273409j178387J76680K14341p05575
37176E274719m28018M54462j00362j311758j012741J07155j10329j068895o66032
37167A138201N36574M07343o23838m56718O07693N14494n77557o72730K68336
37158A141798M32603l35185m51748K36135L20958l06131l71006J72916J81499
37149A021839k37415L9225P00518M07136n49145n86036K91084N05163k30884n67602
37139G93883j09037O9848l11728k61109L90122N35283j74635p42702o16501l50284
37129g76860k32427J14788N72904N09746N1408o8458Q7153j50099n89868m33790
$$ plain form
37193 33250131 28149080 23585910 21565923 19590998 16182961 13592166 12886479 11743555
37185 11743555 9138505 7414686 7772949 8041069 6767660 5589273 5765953 5980294 5274719
37176 5274719 4846701 5301163 5200801 3889043 2876302 2983457 2873128 1804233 1138201
37167 1138201 1674775 2082118 1458280 1001562 1609255 2123749 1546192 873462 1141798
37158 1141798 1574401 1239216 787468 1023603 1344561 1038430 667424 840340 1021839
37149 1021839 784424 823649 1524167 1931303 1382158 796122 1087206 1592369 1361485 793883
37139 793883 684846 754694 442966 181857 571979 1107262 932627 189925 -426576 -776860
37129 -776860 -1009287 -894499 -321595 188151 239559 171101 258254 108155 -481713 -915503
37119i15503J53690K81368j4552O6468M43118L10711j93216j61421L33781L52408
37109F56852j08486j36771K71599J59284n18861o88354l2587N38946N39128M88363
37099A169113O23164N10022J99616L61355J034962J533842J658375J681135J223881
37090I995465k83023k029203k409975j359321m61758n31933p51839m88278k33392
37081A446743k83671j34928K51965J13852o20776r51945m73210r729p3374j10249
37071h45322J64624J39706l55716n02533L4428M34781K10702K3832K98482L73199
37061b3817j48586m96573p6345M67543M24130J41084J03134j6877m66197o17780
37051g10284m6141N31444L55656j63740k50459R671J25255J44211K81484K76183
$$ plain form
37119 -915503 -761813 -480445 -494997 -428529 14589 325300 132084 -29337 304444 656852
37109 656852 548366 411595 683194 842478 323617 -364737 -397324 141622 680750 1169113
37099 1169113 1792277 2302299 2501915 2863270 3898232 5432074 7090449 8771584 9995465
37090 9995465 9712442 7683239 5273264 3913943 3452185 2920252 2168413 1680135 1446743
37081 1446743 1163072 1028144 1280109 1393961 773185 -178760 -651970 -661699 -735073 -845322
37071 -845322 -680698 -540992 -896708 -1399241 -1364813 -930032 -719330 -695498 -397016 -23817
37061 -23817 -172403 -668976 -745321 -277778 146352 287436 390570 373693 -92504 -710284
37051 -710284 -756425 -224981 130675 -33065 -283524 -273853 -148598 -4387 277097 553280
37041E53280p6302l70604k69314r7119j47231j14352J79861K84004k3803j79960
37031b61540K08248O65000P38588P06636P29901K96197o85901j243210p45348
37022D08571l0877r1768n06829l30423K33587K99421j45372l93898l06853k88323
37012a152764l10513m2703L17117L24520J42354K12877L81548K27843p0360r6711
37002f6792n4591l27737n49249j25591O01359P62783L27862L1220R5048O5987
36992G60299j52579j44499J17844J82412K398J5078K49459K24582j38606l36430
36982G79958j69258j9569o8131l891K54227K82793q7959l78987j82651K25677
36972F32209L36498Q1819k22626l20075j92894j5697j7079j99551k47894L4619
$$ plain form
37041 553280 476978 106374 -162940 -260059 -407290 -521642 -341781 -57777 -81580 -261540
37031 -261540 -53292 611708 1350296 2056932 2786833 3083030 2397129 1153919 408571
37022 408571 377694 285926 -220903 -551326 -317739 -18318 -163690 -557588 -864441 -1152764
37012 -1152764 -1463277 -1505980 -1188863 -864343 -721989 -509112 -127564 100279 29919 -66792
37002 -66792 -121383 -449120 -998369 -1123960 -522601 240182 568044 599264 694312 760299
36992 760299 607720 463221 581065 763477 765875 780953 1030412 1254994 1116388 779958
36982 779958 610700 591131 523000 519109 773336 1056129 968170 589183 406532 632209
36972 632209 968707 1050526 827900 507825 314931 299234 282155 82604 -165290 -130671
36962a30671L39934K62945n2338j24498J06708K35732Q3796o9469j3077Q3416
36952G22478Q563j79997k97004k50964q5771L5331m4920k28577k24140j1748P1376
36941d85373o1250M924M46251P08339L23480k34252k34847J33189J17269l15828
36931D01902m78826j56335J46560J88623K83410M49054K14771m05938o38752j14098
36921a09629M57848L37233j61273k56613J30929M56471M39722K37512m0944l80626
36911A110630n35660k16584L88896P25821N54769J82994j8048M258J45262L51377
36901B693715M97777L24539k31668p61836p41296j91940K77090K20934r3135j38551
36891A855629P4431O5552l06137n90928m45199j24814k1204j02267j52343k08435
$$ plain form
36962 -130671 209263 472208 419870 295372 402080 637812 721608 652139 639062 722478
36952 722478 731041 551044 254040 3076 -82695 -47364 -92284 -320861 -545001 -556749 -485373
36941 -485373 -546623 -541699 -95448 612891 936371 702119 467272 600461 717730 401902
36931 401902 -76924 -233259 -86699 101924 385334 834388 1049159 643221 4469 -109629
36921 -109629 348219 685452 524179 267566 398495 854966 1294688 1532200 1491256 1110630
36911 1110630 574970 358386 747282 1473103 2027872 2210866 2192818 2197076 2342338 2693715
36901 2693715 3191492 3516031 3284363 2522527 1781231 1589291 1866381 2087315 1994180 1855629
36891 1855629 1930060 1995612 1689475 1098547 653348 528534 507330 405063 252720 44285
36881D4285l35713k74480J79281O48796N91079J42848j9052L14928N74978K61406
36871B128356l71443p40164o91966n24326m37700k89631R1915N39779O37723K14817
36861E57360l61904n70032l62720j37429o4291J28639N19508O32195J30654n05191
36851c3211n48906m9395K96835J87010K7090J72473M06890L54191R552l40961
36841D81568m78674l94719k39206j70025j37453Q3990M87427O62693L23462j98194
36831D20869l64395j69776k9057o5215k6477J35080J52610j8548o0202J63357
36821A38246L52713K53908L6359j0110J14583J93749R1416j35362k87097j68621
36811E79784J73132M13922L16217J0517k63552m74846n92768l65205K53904P11131
$$ plain form
36881 44285 -291428 -565908 -386627 262169 853248 996096 977044 1291972 1866950 2128356
36871 2128356 1756913 1016749 324783 -199543 -637243 -926874 -834959 -295180 342543 557360
36861 557360 195456 -374576 -737296 -874725 -939016 -810377 -290869 341326 471980 -33211
36851 -33211 -582117 -631512 -334677 -147667 -120577 51896 458786 812977 822529 481568
36841 481568 2894 -391825 -631031 -801056 -938509 -854519 -367092 295601 619063 420869
36831 420869 56474 -113302 -142359 -207574 -234051 -98971 53639 35091 -25111 138246
36821 138246 490959 744867 781226 771116 885699 1079448 1170864 1035502 748405 579784
36811 579784 752916 1166838 1483055 1493572 1230020 755174 162406 -202799 51105 762236
36801G62236M56770k03136m63033j53151J24931L540j98428j72196j15543k56769
36791b14779m08793l12333l3107K36325M32860M93468L14092R283j17444j0017
36781C89555N0423j00907k97217l57290k82071j00234J14873R4581l03515o50737
36771a442539l81685L04170O07345K85789m4002N9092K68953K41002K05810L60445
36761D64380L48792p7886m52533k81769J10184R1488k66054l62539m4688K38230
36751b32395J74311n5109j61066q5140O5080J57489J44597J59262L25479L95266
36741H87774m7716q30212j123399n15018L03008M22737p6106l91503j85093J42829
36731a412699K22245J25273K0177m4992K6566L06147N55630M36246M1887j78123
$$ plain form
36801 762236 1219006 1015870 552837 399686 524617 528157 329729 157533 41990 -214779
36791 -214779 -623572 -935905 -969012 -732687 -299827 193641 507733 517016 399572 389555
36781 389555 439978 339071 41854 -315436 -597507 -697741 -582868 -488287 -791802 -1442539
36771 -1442539 -1824224 -1520054 -912709 -626920 -670922 -611830 -342877 -101875 103935 464380
36761 464380 813172 735286 282753 984 111168 202656 -63398 -425937 -470625 -232395
36751 -232395 -58084 -113193 -274259 -359399 -294319 -136830 7767 167029 492508 887774
36741 887774 840058 9846 -1113553 -1628571 -1325563 -902826 -978932 -1370435 -1555528 -1412699
36731 -1412699 -1190454 -1065181 -1045004 -1089996 -1063430 -757283 -201653 234593 276480 98357
36721I8357q2999k1564k38488m83515m19952j41938k1930j69137k79487n1721
36711a812374L87652O05135M01457N7194q7833r3726j67725j42956K84917Q32088
36701B63829P69758o368o56752n14469J2962J30318k24161n22716n48467m86310
36691a782376l27034J23036O63624P56247K81249k22031k26932J86880N33510
36682a3827M91929J85832k589J02864K02282q8517n72899o05598m1942M51966
36672A09501L61011N5849P6547K14005m787l43781k15968K38628L37035J8597
36662H46637j02550J03405L0481n04760p66120k35572M82249M94766j37297n95013
36652c83774m29218M9954L54492L41770J84577R8905J18377O5143j67651l42707
$$ plain form
36721 98357 15358 -6206 -244694 -728209 -1148161 -1290099 -1312029 -1481166 -1760653 -1812374
36711 -1812374 -1424722 -819587 -418130 -360936 -448769 -542495 -710220 -853176 -568259 263829
36701 263829 1033587 1027219 370467 -144002 -131040 -722 -224883 -747599 -1296066 -1782376
36691 -1782376 -2109410 -1986374 -1322750 -566503 -285254 -507285 -734217 -547337 -13827
36682 -13827 478102 663934 661345 764209 966491 877974 305075 -300523 -342465 109501
36672 109501 470512 526361 602908 816913 812126 468345 252377 491005 828040 846637
36662 846637 744087 847492 877973 373213 -392907 -628479 -146230 348536 211239 -383774
36652 -383774 -812992 -763038 -408546 -66776 117801 216706 335083 400226 232575 -110132
36642a10132j47717K68629M02418J22898j16124K4341K62353J71195j70461l39246
36632C68154j50974K19583N23604N74241K66979k64937o42155o25797l99958k63546
36622c94806j89245N1960M30229O14299L99741l5776l56768m16649l32344k87637
36612e16996l09427k48096L719L11563M07447J99285j15361k56369j18799J53054
36602d89980K84142J26399j19661o3504L54205O63571M33852j04061l44373j38600
36592F01990P2019j2226j31753K6692K70609J61324l38543p52588o08626M8000
36582f63102O54094O56075J02381l84925l62633j08602j33572l57198k63316J86323
36572f74475M03534R0105k78153j91679J65739L30052K76585K47261J92452n5830
$$ plain form
36642 -110132 -257849 10780 413198 536096 419972 444313 706666 877861 707400 368154
36632 368154 217180 436763 960367 1534608 1801587 1536650 894495 268698 -131260 -394806
36622 -394806 -584051 -532091 -101862 512437 912178 876402 519634 102985 -229359 -516996
36612 -516996 -826423 -1074519 -1070800 -759237 -351790 -152505 -267866 -524235 -643034 -489980
36602 -489980 -205838 -79439 -199100 -262604 91601 755172 1189024 1084963 740590 601990
36592 601990 674009 661783 530030 556722 827331 988655 650112 -102476 -711102 -663102
36582 -663102 -9008 647067 749448 364523 1890 -106712 -240284 -597482 -860798 -674475
36572 -674475 -270941 -180836 -458989 -650668 -484929 -154877 121708 368969 561421 505591
36562E05591k61660m4646L86652L63794k52102p34176m21805L85857Q24036N34119
36552A285660l7350l38817l19726k23556j11096R6770K52114O2642l86932n69091
36542b89382k04809K66081K42903k01889m52023k16316J72890L36425K74723J13875
36532D2478j45029m23729m76857k50289m0564n7687r6501R9953L94762M63314
36522d90149K57680j1438j97035k51054q8008K85641N89315N00184N7052l64039
36512B88149m54726k12100J56110M05714L96228J97424J2619o8961j24778j54417
36502D41262p992K98695M38628J75292k77180n45688n80969n68405n09767k47242
36492a383366J44791L42998K14061R257J4298J73101J78034j18091m46338l38280
$$ plain form
36562 505591 243931 199285 585937 949731 697629 -36547 -458352 -72495 751541 1285660
36552 1285660 1248310 909493 589767 366211 255115 351885 603999 666641 279709 -289382
36542 -289382 -494191 -228110 14793 -187096 -639119 -855435 -682545 -346120 -71397 42478
36532 42478 -102551 -526280 -1003137 -1253426 -1293990 -1351677 -1448178 -1348225 -953463 -490149
36522 -490149 -232469 -243907 -440942 -691996 -780004 -494363 94952 595136 652188 288149
36512 288149 -166577 -378677 -222567 183147 579375 776799 789418 720457 595679 441262
36502 441262 433270 731965 1170593 1345885 1068705 523017 -57952 -626357 -1136124 -1383366
36492 -1383366 -1238575 -895577 -681516 -672259 -657961 -484860 -306826 -424917 -871255 -1209535
36482a209535L10870R50769Q88134J45429m84796l99957J09266L73498K49046
36473I32724J01096R3783P340k49158m02827k27615J14755K80686J08008k76984
36463D81808n52027m16108Q7015M95225L98956n5173l71379l52995k41937k40690
36453g67305k47512j23189R8108L46931N78437O26420L12773j95976m59703l28421
36443a59437j30487j49788k36450j33988J20595L61674N56515O27246L30092l09934
36433H76038p10252l58678M02608P21150L41322j28620j37553J20291J79258M5529
36423A351093O8162K85877L35797J3864m04909n29657l47646j94789k91616m56204
36413a70028l50995L9601L21159J67258k20309l22567L0132M24964L98699P869
$$ plain form
36482 -1209535 -898665 52104 940238 1085667 600871 200914 310180 683678 932724
36473 932724 1033820 1127603 1134943 885785 482958 255343 370098 650784 758792 481808
36463 481808 -70219 -486327 -399312 95913 494869 439696 68317 -284678 -526615 -767305
36453 -767305 -1014817 -1138006 -1039898 -692967 -114530 511890 824663 628687 168984 -159437
36443 -159437 -289924 -439712 -676162 -810150 -689555 -327881 228634 855880 1185972 876038
36433 876038 165786 -192892 209716 930866 1272188 1143568 1006015 1126306 1305564 1351093
36423 1351093 1419255 1705132 2040929 2054793 1649884 1120227 772581 577792 286176 -170028
36413 -170028 -521023 -481422 -160263 6995 -213314 -535881 -505749 -80785 317914 325783
36403C25783l11275l18078j70696r5533q9196j9586J21852J74125o774l31721
36393g21099m70008j68863L66299N88814K72694j23505l6238L93554M89126O772
36383E97546n13956n14260j17963J86367K19748J33243R131j73806l04623k14054
36373f92627N9385L13378M16586L21354R308l54786m27805j33713J17713l359
36363c74566k08907n5946K91460L27162P4727L1453K64962K75360j11977m05488
36353A08240k54059L1299Q8912O0013J41669J32660j00518j87672J64694N46126
36343G31364L87795j53371m53086l45791j85100j26548J1138J95816J12434k50826
36333g6175m62492k54548J40394M02962M97057M60804J94259k87492o42559n37742
$$ plain form
36403 325783 14508 -303570 -474266 -569799 -658995 -678581 -556729 -382604 -389378 -721099
36393 -721099 -1191107 -1359970 -993671 -404857 -132163 -255668 -291906 101648 590774 597546
36383 597546 83590 -430670 -548633 -362266 -142518 -9275 -144 -173950 -478573 -692627
36373 -692627 -633242 -319864 96722 418076 427384 72598 -355207 -488920 -371207 -374566
36363 -374566 -583473 -639419 -347959 -20797 53930 85383 350345 625705 513728 108240
36353 108240 -145819 -114520 -25608 34405 176074 308734 208216 20544 185238 731364
36343 731364 1119159 965788 512702 166911 -18189 -144737 -133599 62217 174651 -76175
36333 -76175 -538667 -793215 -652821 -249859 247198 708002 902261 614769 -27790 -565532
36323e65532j07215J45625p4362m84659n12416L1360O56914P28963K46095j82209
36313a17436j66210L2663O4988N1582K20988L66185J66159j96152k78037p8940
36303F5790N3822R2692K79974M62535J85798m36787o59652j85148L33309K57965
36293D50298j27278j77914R9636J97905j6181j97804j74421j19903q8921Q1934
36283g2649L16769K50000j54515l73508n5773L39668J01086o68655j053334m97728
36273a868639M57115Q89821O22049K19051O7406j0375j94647k71451n5752J98145
36263E2723J62082o5343j70273j08772k5559R7224L00246L30462n8364n69256
36253e4830o20014j52025K79012K78895L4748j34382j86713j44281R4150M62594
$$ plain form
36323 -565532 -672747 -527122 -601484 -1086143 -1598559 -1567199 -910285 -181322 64773 -117436
36313 -117436 -283646 -250983 -185995 -134413 86575 452760 618919 422767 144730 65790
36303 65790 119612 212304 492278 954813 1140611 703824 44172 -140976 192333 450298
36293 450298 323020 145106 244742 442647 426466 228662 54241 -65662 -154583 -72649
36283 -72649 244120 494120 339605 -33903 -89676 249992 351078 -317577 -1370911 -1868639
36273 -1868639 -1411524 -521703 100346 319397 386803 376428 181781 -89670 -145422 52723
36263 52723 214805 149462 -20811 -129583 -155142 -57918 242328 572790 514426 -54830
36253 -54830 -674844 -826869 -547857 -268962 -234214 -368596 -555309 -699590 -605440 -142846
36243a42846N97248K93149j56168l34499k06717j8447Q8168J04606o405k18363
36233b74l07571q4804K94418M74206L27631O3952p9142r5459j36764k72602l73570
36222a89979k50416P4024L03548J96184r4319j84160K6758K11647O5036k85129
36212a26806m52375k79308k297P2720l7622k2294K75426N71973N01064J70681
36202F71162J6431Q0566p7508n49546p25663k33795K81207J1103p27628q78471
36192b132142j64664O23072Q46125O70106L98306K8036k86468j65547K58411L17221
36182C92456j00597k40807K61500O58549K68278m07769n51801l40159m42922p33790
36172a237062n48574O8880M22210L39251L10387M67582L78552l0541k40568m7304
$$ plain form
36243 -142846 454402 747551 591383 256884 50167 31720 119888 224494 218089 -274
36233 -274 -307845 -392649 -98231 375975 703606 767558 688416 592957 456193 183591 -189979
36222 -189979 -440395 -366371 -62823 133361 39042 -145118 -118360 93287 158323 -126806
36212 -126806 -579181 -858489 -860786 -788066 -825688 -847982 -572556 -583 500481 671162
36202 671162 687593 768159 690651 141105 -584558 -818353 -537146 -526043 -1253671 -2132142
36192 -2132142 -2296806 -1673734 -827609 -157503 240803 268839 -17629 -183176 75235 392456
36182 392456 291859 51052 312552 971101 1239379 831610 279809 -60350 -503272 -1237062
36172 -1237062 -1785636 -1716756 -1294546 -955295 -644908 -177326 201226 170685 -69883 -117187
36162a17187R7715o2668j36357J64509M69828L83437J28836R3345J52572n1219
36152A122811m33978n46177k08586K69156M54495J81195l37530o52858m60859
36143f12331N5913L95740K98706k8900k66873l05297j55949J66425N18097O09625
36133F75156L01034k05872n65437n72308k52887J41815K55301j4786k89454j41302
36123f68740K52331K84676j72136m86930j28689N89385R50638P17219K13585k30665
36113A320674n10554n52929l18599o36J16534M2473N2531K32589L35608J93680
36103I11371k584l0654j9872k18143m94769m49720o1876J66996n9476l17059q7761
36092f63547L49113K54449l77143o62010j08305O08828O32311J45411m9063J92872
$$ plain form
36162 -117187 -19472 -82140 -218497 -53988 415840 799277 928113 1021458 1174030 1122811
36152 1122811 688833 142656 -65930 203226 657721 838916 501386 -151472 -612331
36143 -612331 -556418 -160678 138028 109128 -157745 -463042 -618991 -452566 65531 675156
36133 675156 976190 770318 204881 -367427 -620314 -478499 -223198 -237984 -527438 -668740
36123 -668740 -416409 -131733 -303869 -790799 -919488 -330103 620535 1337754 1551339 1320674
36113 1320674 810120 257191 -61408 -62044 54490 96963 149494 382083 717691 911371
36103 911371 908787 878133 858261 640118 145349 -304371 -366247 -199251 -258727 -575786 -663547
36092 -663547 -314434 -59985 -437128 -1099138 -1207443 -598615 33696 179107 130044 322916
36082C22916K79324m9139l63765l40894k11939k15438j98523m2178K5410j35636
36072i29862k47128o0029K04419J93156o9731l15709m31913m33751k49287J62320
36062b177515O04927P98996O58043K91639j07313k88602j01018K47186L43943
36053B70286J23776m0683N0154J03608j13522l00055r2186L00290L92309J51275
36043H45252m9090p4948j44284l19074l47292r6736K09190K99227J39236j57249
36033C04232m62525o13274m74936j13733K39439M24988M29107K69850N303j69617
36023a61166o6222K20529L70670K23437o0042k55173l29899l78450m29490l98791
36013a264597j78411K37167O64142Q20920O07119K41425N302r0573k35932m72287
$$ plain form
36082 322916 602240 553101 189336 -151558 -363497 -578935 -777458 -819636 -794226 -929862
36072 -929862 -1176990 -1237019 -1032600 -839444 -909175 -1224884 -1656797 -2090548 -2339835 -2177515
36062 -2177515 -1572588 -773592 -115549 176090 68777 -219825 -320843 -73657 270286
36053 270286 394062 353379 403533 507141 393619 93564 1378 301668 693977 845252
36043 845252 796162 721214 576930 257856 -89436 -186172 23018 322245 461481 304232
36033 304232 -158293 -771567 -1246503 -1360236 -1120797 -695809 -266702 3148 8451 -161166
36023 -161166 -227388 -6859 363811 587248 527206 272033 -57866 -436316 -865806 -1264597
36013 -1264597 -1443008 -1205841 -541699 279221 886340 1127765 1133067 1042494 806562 334275
36003C34275o14352n36139l52880k44721k23638j64895p208J59522K13072J74707
35993a262257K06424L71810M62390K29426k02690l78408p9379L51692M34797J40707
35983B74512j54579j82093j8603J10724N1937k01260m55146m05252J7047M55928
35973e06785N13607K54586P2483J12616J45388K4313q0131k1790N1743l7902j96170
35962C31958k30172j59598j24398r7195N5391K50410J82837k59720p37732p74917
35952a563136k98712K61818M44224K17196q4823j87424r7234M8577J56878J65076
35942i37560L7716j24897j18804J07840L43624L61622J69774o9406k26992k20974
35932f78057k3489K06237J93065o7424k03310J2570K54666R3515l16186m15791
$$ plain form
36003 334275 -280077 -816216 -1169096 -1413817 -1637455 -1802350 -1809558 -1650036 -1436964 -1262257
35993 -1262257 -1055833 -684023 -221633 7793 -194897 -573305 -652684 -300992 133805 274512
35983 274512 119933 -62160 -80763 29961 81898 -119362 -574508 -979760 -962713 -506785
35973 -506785 6822 261408 333891 446507 591895 616208 536077 514287 566030 528128 331958
35962 331958 101786 -57812 -182210 -279405 -224014 26396 209233 -50487 -788219 -1563136
35952 -1563136 -1861848 -1600030 -1155806 -938610 -1023433 -1210857 -1308091 -1259514 -1102636 -937560
35942 -937560 -899844 -1024741 -1143545 -1035705 -692081 -330459 -160685 -230091 -457083 -678057
35932 -678057 -701546 -495309 -302244 -369668 -572978 -560408 -305742 -212227 -528413 -944204
35922i44204n0415L38686L70047J63088Q055m2762p6952r6599p5540m1278J8893
35911d28981J30336J46631j27273n30633n96935j85185K61672L20980J35637O1688
35901h12063Q7334J1736l9801K08177N82604N68111O6815m24496n33870m56620
35891g42073m41013k71754L05462R20499Q84518J43799n50398n75964j69910K4781
35881d72053j46689k78690j02395J61432K24379J60969K03779L30894L34392K03737
35871F19755J55671K62878L00124P2964k67452l96659k32378k6504l7420k28473
35861B22506l54793k81768j14790j6133j4446o4775j73640l06249k59392J19156
35851a244324N78975O36077K18012j49111j6552L85183N23277L14451R0869m0721
$$ plain form
35922 -944204 -994619 -655933 -285886 -122798 -114743 -157505 -234457 -331056 -406596 -447874 -428981
35911 -428981 -298645 -152014 -279287 -809920 -1406855 -1592040 -1330368 -1009388 -873751 -812063
35901 -812063 -724729 -712993 -752794 -544617 37987 606098 672913 248417 -285453 -742073
35891 -742073 -1183086 -1454840 -1149378 -228879 655639 799438 249040 -326924 -496834 -472053
35881 -472053 -618742 -897432 -999827 -838395 -614016 -453047 -249268 81626 416018 619755
35871 619755 775426 1038304 1338428 1411392 1143940 747281 514903 488399 450979 222506
35861 222506 -132287 -414055 -528845 -544978 -559424 -624199 -797839 -1104088 -1363480 -1244324
35851 -1244324 -665349 -29272 188740 39629 23077 408260 931537 1245988 1336857 1296136
35841A296136k90841o17318n98312q3700M64241N81358M05300L16194K66654o7162
35831A672550o02340q13870m48054J11503L41525J70272r9892k50917l10613l55439
35821e85275l66577l02285j87369p4754L3626J80730L71698N27747N53600M48751
35811E99892L09698K04102R4699o6811k22245k66734k06626j56702j57112r8563
35801C3598Q8482K50378J66484j05639k12581N3479M22767M51762J07750j94261
35791A062219j80131p4103k08348n07563o27895m72667k68177j78413j46180j20840
35781a722098j39657j27129Q0466L97968M78806K16752j4569J32614M56780M81010
35771B40943J02967l29066n00730l98232j41814J46940L07478K47367J20310J45010
$$ plain form
35841 1296136 1005295 387977 -210335 -294035 170206 751564 1156864 1473058 1739712 1672550
35831 1672550 1070210 256340 -191714 -80211 261314 431586 331694 80777 -229836 -585275
35821 -585275 -951852 -1254137 -1441506 -1516260 -1482634 -1301904 -930206 -402459 151141 599892
35811 599892 909590 1113692 1208391 1141580 919335 652601 445975 289273 132161 33598
35801 33598 122080 372458 538942 433303 220722 274201 696968 1148730 1256480 1062219
35791 1062219 882088 807985 599637 92074 -535821 -1008488 -1276665 -1455078 -1601258 -1722098
35781 -1722098 -1861755 -1988884 -1908418 -1510450 -1031644 -814892 -829461 -696847 -240067 240943
35771 240943 343910 14844 -485886 -884118 -1025932 -878992 -571514 -324147 -203837 -58827
35761e8827K26808O0611l20155m48999p8214L82411L81322l2662l40013l04489
35751e32207j96068k45632k75816n2995K78694L71526J43766j50479k58782j55945
35741a073938L8549K13215L26546M09445M91925M76443J82715l60590p73825o76899
35731g46414j52688L30489M53860L13798J48301K7609r9997k38073l30173l11108
35721f04396j28693J58814L11224J27460k48582m72079m57276m00984l32262o0144
35711b106918L05364K94096j49674l37490K19504R49140R39326K41865k69532
35702H5681j99603Q599L1717J32575M17929M17531j32155o86393o10784o7142
35692f02045L30096L74720K62729M5193l26225n97815m32276M2385L81090M46287
$$ plain form
35761 -58827 167981 228592 -91563 -540562 -618776 -236365 144957 112295 -227718 -532207
35751 -532207 -728275 -973907 -1249723 -1302718 -1024024 -652498 -508732 -659211 -917993 -1073938
35741 -1073938 -1035389 -822174 -495628 -86183 405742 882185 1064900 704310 -69515 -746414
35731 -746414 -899102 -568613 -114753 199045 347346 374955 274958 36885 -293288 -604396
35721 -604396 -733089 -574275 -263051 -135591 -384173 -856252 -1313528 -1714512 -2046774 -2106918
35711 -2106918 -1801554 -1507458 -1657132 -1994622 -1775118 -825978 113348 355213 85681
35702 85681 -113922 -105323 -73606 58969 476898 894429 762274 75881 -534903 -602045
35692 -602045 -271949 102771 365500 410693 84468 -513347 -945623 -903238 -522148 -75861
35682g5861M26117L20727n0429n15557n77366j30863K94324K18815k06873n03519
35672h00485m39579j10064K83897N15802M17337R7961r1886M87J03727p2843l80350
35661d75996m19011q4977L15004M68663L70496K06891R8422L6451j1545l3831
35651D70567k7165o7616k49024n14868o27181m01542N4317M28257N10210L33784
35641i0261O6874j22821j46051p8739j24670l37576m52947k14234J96774L53228
35631i50423K03089J39302L63724N70031M65420K28716J18951l9841n08991r70665
35621c80687p91481K1580O60445N12235r0679l92750j78988J25446J40358m6549
35611d21070j16592R4697M83935P68167O73702K02445k80473l89854j65512J584
$$ plain form
35682 -75861 350256 670983 620554 104997 -472369 -603232 -308908 -90093 -296966 -800485
35672 -800485 -1240064 -1350128 -1066231 -550429 -133092 -35131 -127017 -126530 -22803 -95646 -475996
35661 -475996 -895007 -979984 -664980 -196317 174179 381070 479492 515943 504398 470567
35651 470567 443402 375786 126762 -388106 -1015287 -1416829 -1362512 -934255 -424045 -90261
35641 -90261 -23387 -146208 -292259 -370998 -495668 -833244 -1286191 -1500425 -1303651 -950423
35631 -950423 -747334 -608032 -244308 325723 791143 1019859 1138810 1098969 589978 -380687
35621 -380687 -1172168 -1150588 -490143 22092 -68587 -461337 -640325 -514879 -374521 -421070
35611 -421070 -537662 -442965 40970 809137 1482839 1685284 1404811 1014957 849445 851029
35601H51029q8801k05610r7792Q2233N411k98811m24693j44430K53840L14960
35591B47336k9307m09044m67157k15827P1619J97596J78240J01647j6997j78863
35581e20757k83744j97800M5205K18250J46727q0349k16802j38102N1855J58539
35571h16978P8195j20817k34300r4032K11684L56951J49929j66765j73643J63587
35561f46189M08945K28886j51203k57007j4060J69087j5092l43867l77596p2447
35551a070543J59132K8240k24910j91041R2937J97138l0684k02451K2147L93344
35541h26691M42459J91724P1662J94878J84510j58239m44915k41893K50327M05249
35531F9071k4178n83045o35828p1242N74450O88831K61474j06692M2641M29360
$$ plain form
35601 851029 762228 556618 458826 541059 546470 247659 -177034 -321464 -67624 247336
35591 247336 218029 -191015 -658172 -873999 -802380 -604784 -426544 -324897 -341894 -520757
35581 -520757 -804501 -1002301 -957096 -738846 -592119 -672468 -889270 -1027372 -975517 -816978
35571 -816978 -738783 -859600 -1093900 -1187932 -976248 -619297 -469368 -636133 -809776 -646189
35561 -646189 -237244 -8358 -159561 -416568 -430628 -261541 -276633 -620500 -998096 -1070543
35551 -1070543 -911411 -883171 -1108081 -1299122 -1206185 -1009047 -1039731 -1242182 -1220035 -826691
35541 -826691 -384232 -192508 -120846 74032 258542 100303 -344612 -586505 -336178 69071
35531 69071 44893 -538152 -1173980 -1245222 -670772 18059 279533 172841 215482 644842
35521F44842M47388L7705k72061k07843j22389l28337n38481l43961J06376L50459
35511b26302L01961K39860K58606J86853n047j40912j80415k51642l31463k47595
35501c96096k5481J10371J18905J79255K87951J91139j53167l97706k93451o7178
35491d45458o5780k32832k15691J02752M31365M50165K09666O4168K22034M47208
35481I67597L37569j00370l83078j96286J33329Q7521l14146o00973n49783l74534
35471i93154k55995j38438m6032j41119l32006k57035J47368M64898M09303K20674
35461i21536J82178J41908j15247l63295k55107Q5038K52213J99933K31858M26550
35451a35507N20021L79112J91729J12123N8452l8484q6913n5519p7246j85640
$$ plain form
35521 644842 1092230 1129935 857874 650031 527642 199305 -339176 -683137 -576761 -226302
35511 -226302 75659 315519 574125 760978 755931 615019 434604 182962 -148501 -396096
35501 -396096 -421577 -311206 -192301 -13046 274905 466044 312877 -84829 -378280 -445458
35491 -445458 -511238 -744070 -959761 -857009 -425644 24521 234187 298355 520389 967597
35481 967597 1305166 1204796 821718 625432 758761 846282 532136 -68837 -618620 -993154
35471 -993154 -1249149 -1387587 -1433619 -1574738 -1906744 -2163779 -2016411 -1551513 -1142210 -921536
35461 -921536 -739358 -597450 -712697 -1075992 -1331099 -1246061 -993848 -793915 -562057 -135507
35451 -135507 384514 763626 955355 1067478 1125930 1087446 1000533 945014 867768 682128
35441F82128j77403P7458L54407L11417o4247m21910m55414k20774j2465m920
35431F8277j02914j46649j51423k19458k68684p2173L48618N85749L08840k48771
35421A01412n07403k16595L01906N94395N40602L10665N9099j74377l46494l65166
35411B98044k00928K9432J51871J13196L4828N5590J54244J99283J49675Q5856
35401A071091L4764o9595j86454j25483J44398L27282J82918n7190J8057L32935
35391A672723L45689j44644n90749l92961K43296N30135R5038o19402r78579q14934
35381f54388l42539K21500O70804P15389K74311k30223k60773J35222L63194Q4063
35371I76560l79453n77579n09878m16897l12013p7671J67514J78458k1115j76242
$$ plain form
35441 682128 504725 582183 936590 1248007 1183760 761850 306436 85662 73197 68277
35431 68277 -34637 -181286 -332709 -552167 -820851 -893024 -544406 41343 350183 101412
35421 101412 -405991 -622586 -320680 273715 814317 1124982 1184081 1009704 663210 298044
35411 298044 97116 126548 278419 391615 426443 482033 636277 835560 985235 1071091
35401 1071091 1105855 1036260 849806 724323 868721 1196003 1378921 1321731 1339788 1672723
35391 1672723 2018412 1873768 1283019 890058 1133354 1663489 1758527 1139125 160546 -654388
35381 -654388 -996927 -775427 -104623 610766 885077 654854 394081 529303 892497 976560
35371 976560 597107 19528 -490350 -907247 -1219260 -1296931 -1129417 -950959 -972074 -1148316
35361a148316j78601j14265K947K28259M41695M22360J80372n7867j80243k19732
35351f23391j04093K54098O04313N08954l1276m64431l67763N3773L08326J91183
35341C29693j33607l88514l83816j59214J3731k4754k4972K96380O62693N28451
35331G16071j9577k78724j2103J72947j33107m15660j03249M22179L90273j72571
35321E66479n60888m63453k17765j18188j18557j64542k40567j42305K45739N37396
35311f76651L12146r1089M8284O46557P87063Q1882o78950o27569L0175M49872
35301B81720L04300j8112j18825k817J38927K00011J86133J52898J24085L2440
35291A280760j67365l36539k90114j04153m6643j71721k57133k02078j74721k51823
$$ plain form
35361 -1148316 -1326917 -1441182 -1438235 -1209976 -768281 -345921 -165549 -223416 -403659 -623391
35351 -623391 -727484 -473386 130927 639881 608605 144174 -223589 -169816 138510 329693
35341 329693 196086 -192428 -576244 -735458 -721727 -746481 -771453 -475073 187620 716071
35331 716071 696494 417770 405667 578614 445507 29847 -73402 348777 739050 566479
35321 566479 5591 -457862 -675627 -793815 -912372 -1076914 -1317481 -1459786 -1214047 -676651
35311 -676651 -364505 -455594 -407310 239247 1026310 1108192 429242 -198327 -168152 281720
35301 281720 586020 567908 449083 446266 585193 785204 971337 1124235 1248320 1280760
35291 1280760 1113395 776856 486742 382589 335946 164225 -92908 -294986 -469707 -721530
35281g21530k35180j2371J83388J06860j19447j92995m4065J49583K43738K33477
35271d08542J51413J3397j55476l02714l30845j38191K12300M31209K98776j9552
35261b48225j70203p8443L9796Q5649J67946K78133K32882J9168j30066r3319
35251A03318J3769J25971K89009L73916J54197k12758k45691J18981L21058n63
35241A041207m42249m73566k19514j31878k22359j77891k2759p5972l12250l15196
35231a352427O1389M28474L92960K7058l26542m55296l37941j4584M13160P34706
35221d29043P51048M91705K46555K72745M39417L17867k30718p33534o61179j73398
35211B91465J04728o88n6279J33822J54799k42231n78797l55900J36694K98825
$$ plain form
35281 -721530 -956710 -969081 -785693 -678833 -798280 -991275 -1035340 -885757 -642019 -408542
35271 -408542 -257129 -243732 -399208 -701922 -1032767 -1170958 -958658 -527449 -228673 -248225
35261 -248225 -418428 -496871 -457075 -371426 -203480 74653 307535 326703 196637 103318
35251 103318 117087 243058 532067 905983 1060180 847422 601731 720712 1041770 1041207
35241 1041207 598958 125392 -94122 -226000 -448359 -626250 -649009 -724981 -1037231 -1352427
35231 -1352427 -1291038 -862564 -469604 -442546 -769088 -1224384 -1562325 -1576909 -1163749 -429043
35221 -429043 322005 813710 1060265 1333010 1772427 2090294 1859576 1126042 464863 291465
35211 291465 396193 395505 339226 473048 627847 385616 -193181 -549081 -412387 -113562
35201a13562J62975K13888M89604N54802L00171R1055N7559j27316n69806q09377
35191B49993m64384J63666M63409K49775j53126l92127l84206k21175j0023J56587
35181c41611J88358M5333j73911k46682n5128J93144J61383j31639k66188j9635
35171f46576K58187J48481j81065k13229J29278L53245J00622l64629n17937k05570
35161a139193K32406L73853J53722j06266j02812Q0220J47277P1652J06057K84790
35151A01706L10339R6248n917J97575L49724J41505j01711N0685L46702K01258
35141A688114l68507p74430p20140m55431k34893p7301k1089q9042n2235K43510
35131h61444M15878J6976o17840o87369r0671M51783N11857M23852M72892L92267
$$ plain form
35201 -113562 49413 263301 752905 1307707 1607878 1698933 1756492 1629176 1059370 249993
35191 249993 -214391 -50725 412684 662459 509333 117206 -267000 -488175 -498198 -341611
35181 -341611 -153253 -107920 -281831 -528513 -583641 -390497 -229114 -360753 -626941 -646576
35171 -646576 -388389 -239908 -420973 -634202 -504924 -151679 -51057 -415686 -933623 -1139193
35161 -1139193 -906787 -532934 -379212 -485478 -588290 -508070 -360793 -289141 -183084 101706
35151 101706 412045 508293 502376 699951 1049675 1191180 1089469 1140154 1486856 1688114
35141 1688114 1319607 545177 -174963 -630394 -865287 -942588 -963677 -1052719 -1104954 -861444
35131 -861444 -445566 -428590 -1046430 -1733799 -1824470 -1372687 -860830 -436978 35914 428181
35121D28181j0717l95883m22640k05458L4810K35280K16336k07135o27869l26585
35111a281680N36650Q59130J84640n33635m06953M2410q9967m84390j84728O66686
35101f91837R40687K73990m28889l94438P1607L12010K20160N2989q7951k17695
35091E0633k71763k21116j51922j02476k4424O7998J15986J34162J10237o0211
35081c52896k92672k19006K66668O46636M38341m4603j61291M8149L607l86906
35071e3973n90950l70794j11213r4164j14554j1913L1367m7302N801K50541L66126
35060g41028K07851M4619K1485p7341k75882j83075L35991P79700O85185K39886
35050A037391j37919l72312n02387l56353P9930L74641K24004k7917P4014L67311
$$ plain form
35121 428181 417464 21581 -401059 -606517 -571707 -336427 -120091 -327226 -955095 -1281680
35111 -1281680 -745030 114100 298740 -234895 -641848 -599438 -689405 -1173795 -1358523 -691837
35101 -691837 248850 522840 93951 -300487 -228880 83130 303290 356279 268328 50633
35091 50633 -221130 -442246 -594168 -696644 -721068 -653070 -537084 -402922 -292685 -352896
35081 -352896 -645568 -864574 -597906 48730 487071 442468 281177 329326 332933 -53973
35071 -53973 -644923 -1015717 -1126930 -1221094 -1335648 -1347561 -1316194 -1363496 -1357695 -1107154 -741028
35060 -741028 -533177 -488558 -467073 -544414 -820296 -1003371 -667380 112320 797505 1037391
35050 1037391 899472 527160 24773 -331580 -251650 122991 346995 319078 393092 760403
35040G60403L90436J39995k8636k9026l9836n8650K0340M1890j80800m10603k80857
35029C24656P4435K19803J43796K03407L89521K79781j95221n39271m32461j73891
35019B94555j44688k57624k11632L5689L03236M46847L94189J39273j60957l00799
35009E38089l13988l87420m45908j92027L19297N65082K67940j37823r9571K62239
34999C75910L56701j8247m12703l36332J49829N41492M53334M508l32082k58996
34989E23414K9228J62893J26073J96975L85774L30966r0671m46654l49155n7092
34979H11751o7007l12326k64729K11752O08409N03985J37540o035R9964P3704
34969A797008k28609m63247k85944J50608L92803K79904Q6279M1646l52k17798
$$ plain form
35040 760403 1150839 1290834 1262198 1233172 1193336 1134686 1155026 1196916 1016116 605513 324656
35029 324656 399091 618894 762690 966097 1355618 1635399 1440178 900907 468446 294555
35019 294555 149867 -107757 -319389 -283700 19536 466383 860572 999845 838888 538089
35009 538089 224101 -163319 -609227 -801254 -481957 83125 351065 213242 113671 375910
34999 375910 732611 714364 301661 -34671 115158 656650 1109984 1114492 782410 523414
34989 523414 552642 715535 841608 1038583 1424357 1755323 1664652 1217998 868843 811751
34979 811751 744744 432418 167689 379441 987850 1491835 1629375 1623340 1723304 1797008
34969 1797008 1568399 1105152 819208 969816 1362619 1642523 1728802 1770448 1770096 1552298
34959A552298m02173k58752p55j53908p00180r26381l91599L86709O15311K78977
34949d53K4641J69479L57894K12055j46397l62329l09426j36193n6537j82082
34939d29348m05970m46061j77172J30003J33276q1200j18851J40663M21380N13913
34929c19367M87529L90110J35107j93560l09446j57534j3524J6816J84692N44508
34919G65331O52303J98508m10538n58047k61865m9099j46423k69895j68737M7176
34909b01286J48497L7116k46712n05296m27966O0559N58079N85524J69130k60712
34899h3067m44195m28093k52683O1900K71184J19467j87272j89279J07043K25297
34889g99698K6353m9719K36844M76604L01375K2337J03046L75278L18751j10665
$$ plain form
34959 1552298 1150125 891373 890618 736710 36530 -889851 -1281450 -894741 -279430 -453
34949 -453 24188 193667 551561 763616 617219 254890 -54536 -190729 -247266 -429348
34939 -429348 -835318 -1281379 -1458551 -1328548 -1195272 -1276472 -1395323 -1254660 -833280 -319367
34929 -319367 168162 558272 693379 499819 190373 32839 19315 36131 220823 765331
34919 765331 1417634 1616142 1205604 647557 385692 336593 190170 -79725 -248462 -201286
34909 -201286 -52789 -15673 -262385 -767681 -1195647 -1135088 -577009 8515 177645 -83067
34899 -83067 -527262 -955355 -1208038 -1146138 -874954 -755487 -942759 -1132038 -1024995 -799698
34889 -799698 -773345 -823064 -586220 -109616 191759 214096 317142 692420 1011171 900506
34879I00506m56459m42888k16167J9648J77134J41354j29913l64175k28088J48082
34869d50966K77629J641l06461l02246n8041K32125N29898P18517M94166j45339
34859I90923o05137l53839K72499M33979n8332m93955l36496K551j14536m77887
34849g40230l41038L34308P04569K97733k63891k42221R1596j4746n07958o02243
34839a284121o1600M30125L53438N6838M2565K01597K18744K00886L60351M92296
34829A011119L40865J49077K43976L56076J7361n50817o63890k26191J57583J59664
34819I94823R8518J85415J26927k15205m17295j75666J36516Q1228j20544l1823
34809F62894J81736K0428m33853n32883k9804N31682N64766J47477k36570l35187
$$ plain form
34879 900506 444047 1159 -215008 -195360 -18226 123128 -6785 -370960 -599048 -450966
34869 -450966 -173337 -171696 -478157 -780403 -838444 -606319 -76421 642096 1136262 990923
34859 990923 385786 31947 304446 738425 680093 186138 -150358 -147807 -262343 -740230
34849 -740230 -1081268 -746960 -42391 255342 -8549 -250770 -159174 -173920 -681878 -1284121
34839 -1284121 -1345721 -915596 -562158 -505320 -462755 -261158 -42414 158472 518823 1011119
34829 1011119 1351984 1501061 1745037 2101113 2118474 1567657 903767 677576 835159 994823
34819 994823 1093341 1278756 1405683 1190478 773183 597517 734033 815261 694717 662894
34809 662894 844630 865058 431205 -101678 -131482 400200 964966 1112443 875873 540686
34799E40686k38714p6758R6572J94006J26896l4129j04886m1378o625j04830j84068
34788A66772o6501J05997P954l46778n01557j66336L09243L85159J01297j0061
34778a4811K37318L90236O3611m48980n66075j75434K99605M42229J89003k46510
34768A70192n45065m65608r2937J75019J02253l8096J34749M75913M75268N7063
34758D48751k26247R845L77557K60800k74570n61832k85642R4091K6476l84107
34748e14878o17708m89454k55307m6887L20110Q28433R92773M79146k68297m67995
34738d0064J1973N34506N75162K90043P4628k2392j61744k97460k64662j34463
34728E65527j38249k84890l41275j92797K8685K06120L90369O06579O99887N17506
$$ plain form
34799 540686 301972 225214 321786 515792 642688 608559 503673 462295 455670 350840 166772
34788 166772 100271 206268 214222 -132556 -634113 -800449 -491206 -106047 -4750 -14811
34778 -14811 222507 612743 676354 227374 -338701 -514135 -214530 227699 416702 170192
34768 170192 -374873 -840481 -933418 -758399 -656146 -694242 -559493 -83580 391688 448751
34758 448751 222504 232349 609906 870706 596136 34304 -251338 -157247 -130771 -514878
34748 -514878 -1132586 -1622040 -1877347 -1924234 -1604124 -775691 217082 696228 427931 -40064
34738 -40064 -28091 506415 1081577 1371620 1446248 1423856 1262112 964652 699990 565527
34728 565527 427278 142388 -198887 -391684 -362999 -156879 233490 840069 1539956 2057462
34718B057462J47072j60072k72741k83083l17491l34043j83647J46840M42670
34709A242967M61979J82262j94790m27903l86433j23304J06091J9624l38150n34825
34699G518k64406J79700K51679p3399k60771j9178K73874J67292j98825l49667
34689b86183j59583Q0037J55373J52671K06077K91985L14187K29682O4134j09164
34679I39216k21192k73461k83571j84364M8608J93799J0431k88405j96643K86943
34669C1361M92172L5836n18636m57874J5000J56492j32352k52637K8623K46889
34659c55126J07719l9146J08742K50807K3683l65035m77296k81430l0678K30231
34649h27529O02903R29707Q57871L04793l85130p45490n50929n702L32516L6769
$$ plain form
34718 2057462 2204534 2044462 1771721 1488638 1171147 837104 653457 800297 1242967
34709 1242967 1704946 1887208 1692418 1264515 878082 754778 860869 880493 542343 7518
34699 7518 -256888 -77188 174491 101092 -159679 -178857 95017 262309 63484 -286183
34689 -286183 -445766 -365729 -210356 -57685 148392 440377 754564 984246 1048380 939216
34679 939216 718024 444563 160992 -23372 25236 219035 229466 -58939 -255582 31361
34669 31361 523533 559369 40733 -417141 -402141 -245649 -378001 -630638 -602015 -355126
34659 -355126 -247407 -286553 -177811 72996 96679 -268356 -745652 -1027082 -1057760 -827529
34649 -827529 -224626 705081 1562952 1867745 1482615 737125 186196 180494 513010 549779
34639E49779o21858q44214k72865M62995N00245j53708o72089m91478P4972L81771
34629a086450K56488M6500L8754R1015r9148m78696n88213j40511M99935O91018
34619g69308L31310m7981q0128k5913k00835l67973j49291K48573K83096n3321
34609h31771j82921J80762O27557O95672M74378L03424K34139J15385l8576j11971
34599A466078j64051l15294m50691l54647j05319j8148j63771k45446o6503J53176
34589b64616J24651m7860k0617K56875M38629K46261j76657m59998m08378j20507
34579d32217J70251K83115K11069J21629J41199J22414j78271o25583o98186j76405
34569a060985M29244M85376Q5906j32666P5306L21801L05000K29814L08284L22512
$$ plain form
34639 549779 -72079 -916293 -1189158 -726163 -225918 -379626 -1051715 -1543193 -1468221 -1086450
34629 -1086450 -829962 -783462 -744708 -653693 -752841 -1231537 -1819750 -1960261 -1460326 -769308
34619 -769308 -437998 -485979 -566107 -592020 -792855 -1160828 -1310119 -1061546 -778450 -831771
34609 -831771 -1014692 -833930 -206373 489299 963677 1267101 1501240 1616625 1578049 1466078
34599 1466078 1302027 986733 536042 181395 76076 57928 -105843 -351289 -417792 -264616
34589 -264616 -139965 -187825 -208442 48433 487062 733323 556666 96668 -311710 -432217
34579 -432217 -261966 21149 232218 353847 495046 617460 439189 -186394 -884580 -1060985
34569 -1060985 -631741 -146365 -60459 -193125 -117819 203982 508982 738796 1047080 1369592
34559A369592K1183l99004n73358m80317l31913j74778L9014J60615J4245k32164
34549e86885k25832P1793L43784L55808J82361K1485l989Q7870J03116j60522
34539A88989n26821m66029J84234P86270O41729l3890m23381k77372j26181k96134
34529c48586m15219j42021K24105K45580Q843j12077j2233J81928L96177N10368
34519E36865K90218k05486m49134j08497L70392L32435j27152l22755k0484K59438
34509E55840P3243l24909m27158j82556K4801o5854k95758l24679n9365K01863
34499h24532J31705j13765J0628O46213J114773P03124k93264q35584m68171J64986
34489B36113L04742M7614l3406J67137K34123m3396l75586m15585j55953J70351
$$ plain form
34559 1369592 1390775 991771 418413 -61904 -393817 -568595 -529581 -368966 -354721 -586885
34549 -586885 -812717 -740924 -397140 -41332 141029 162514 158525 246395 349511 188989
34539 188989 -337832 -803861 -619627 166643 808372 774482 351101 73729 -52452 -348586
34529 -348586 -763805 -905826 -681721 -436141 -427298 -539375 -551608 -369680 26497 536865
34519 536865 827083 621597 172463 63966 434358 766793 639641 316886 296402 555840
34509 555840 629083 304174 -122984 -305540 -280739 -346593 -642351 -967030 -1026395 -824532
34499 -824532 -692827 -806592 -795964 -149751 965022 1668146 1374882 539298 71127 236113
34489 236113 540855 588469 555063 722200 956323 912927 537341 121756 -34197 136154
34479A36154L24779J53823l11786p65613q32120m73159n2221R2854J6576J6788
34469a693925K38635N48383P24555O45752L30445o9749l09025k19596P8109K30136
34459E03720K8081l04356l33389O0874N13657N97552K95342p2918k97236m47453
34449E43874n96630o02436l03903J82102N24558N19090K58733k4627j87150k19964
34439I3647j57265j7015J61638K68433J82318o1604k03208J9691N19192Q29177
34429A635004N60050j40382p05906p51795m37519j77589j24940r1554P9178K65164
34419A09711K48579j0526l86231p39717r16635p17899j11010N54731P91696M95200
34409f82101L7694j91539j22972J41637M83725O32320K52429n18422r38945n03139
$$ plain form
34479 136154 460933 614756 302970 -462643 -1294763 -1767922 -1820143 -1727289 -1710713 -1693925
34469 -1693925 -1455290 -906907 -182352 463400 793845 724096 415071 195475 273584 503720
34459 503720 531801 227445 -105944 -45070 468587 1066139 1361481 1288563 991327 543874
34449 543874 -52756 -655192 -959095 -776993 -252435 266655 525388 500761 313611 93647
34439 93647 -63618 -80633 81005 349438 531756 470152 266944 286635 805827 1635004
34429 1635004 2195054 2054672 1348766 596971 159452 -18137 -143077 -234631 -155453 109711
34419 109711 358290 347764 -38467 -778184 -1694819 -2412718 -2523728 -1968997 -1177301 -682101
34409 -682101 -644407 -835946 -958918 -817281 -333556 298764 551193 32771 -906174 -1409313
34399a409313L09087O22570L58263K20970N04127O16973O5494p13126r50154n58664
34389i33773o2881J91594K61068K19809M2914j77787k85973k98554k87387j19479
34379a450449L32485P88999P61338J80080m78330p24734m85803l7194K53485J89158
34369f70965j6961R5835N71412P88702K90040m23448n29877j15563P692l47111
34359c50244m92839j42299M0424l81326p73380m46374K10038M20912K79212L84885
34349a250991O47325M77446j3919o9198M12825O23387J38551m25180m45088k05608
34339a10450k48172m34110k98337P6368K01431q141j59153m5605J20377J69095
34329g36697K28860L93816M62002K12442k16702m24164k04584K04591L90740K35004
$$ plain form
34399 -1409313 -1100226 -477656 -119393 101577 605704 1222677 1288171 575045 -375109 -933773
34389 -933773 -996654 -805060 -543992 -324183 -281269 -459056 -745029 -1043583 -1330970 -1450449
34379 -1450449 -1117964 -328965 432373 612453 134123 -590611 -1076414 -1113608 -860123 -670965
34369 -670965 -687926 -592091 -20679 768023 1058063 634615 104738 -10825 -3133 -350244
34359 -350244 -843083 -985382 -944958 -1326284 -2099664 -2546038 -2336000 -1915088 -1635876 -1250991
34349 -1250991 -603666 -126220 -140139 -209337 203488 826875 965426 540246 95158 -110450
34339 -110450 -358622 -792732 -1091069 -1014701 -813270 -821411 -980564 -1026169 -905792 -736697
34329 -736697 -507837 -114021 347981 560423 343721 -80443 -285027 -80436 310304 545308
34319E45308O487l9917m735j33395l88818m82693l06532p2769J8878K4679Q4293
34308g49214J94700K49497J73930j4221j53736L780M78558Q59880P16891K04847
34298A964912q8903M9698K10479M3436k37606k96864k38505l50244n47584m95727
34288A3092j72748O4409k6067k78889l60375j48837J38187J54937j60638m03675
34278a180604j39650M59758P28810L56370k27835m83506l86417j72823J15729
$$ plain form
34319 545308 551795 511878 507143 373748 -15070 -497763 -804295 -877064 -858186 -833507 -749214
34308 -749214 -554514 -305017 -131087 -145308 -299044 -295264 183294 1043174 1760065 1964912
34298 1964912 1876009 1925707 2136186 2179622 1942016 1645152 1406647 1056403 508819 13092
34288 13092 -159656 -95247 -121314 -400203 -760578 -909415 -771228 -616291 -776929 -1180604
34278 -1180604 -1320254 -860496 -131686 224684 -3151 -486657 -873074 -1045897 -930168
$$ [...]
##END NTUPLES=NMR SPECTRUM
##END=
