##TITLE=31Pdec_92-2021
 CDCl3, 24 sc
 23.09.2021
##JCAMPDX= 6.0         $$ Bruker NMR JCAMP-DX V2.0
##DATA TYPE= NMR SPECTRUM
##DATA CLASS= NTUPLES
##ORIGIN= UXNMR, Bruker Analytische Messtechnik GmbH
##OWNER= root
$$ XWIN-NMR		Version 3.5
$$ Thu Sep 23 10:22:06 2021 Russian Standard Time (UT+4h)  she@DPX200
##.OBSERVE FREQUENCY= 81.013821
##.OBSERVE NUCLEUS= ^31P
##.ACQUISITION MODE= SIMULTANEOUS
##.ACQUISITION SCHEME= undefined
##.AVERAGES= 24
##.DIGITISER RES= 16
##SPECTROMETER/DATA SYSTEM= spect
##.PULSE SEQUENCE= zgpg30
##.SOLVENT NAME= CDCl3
##.SHIFT REFERENCE= (INTERNAL, CDCl3, 0, 248.564)
##AUDIT TRAIL= $$ (NUMBER, WHEN, WHO, WHERE, WHAT)
$$ ##TITLE= Audit trail, XWIN-NMR		Version 3.5
$$ ##JCAMPDX= 5.01
$$ ##ORIGIN= Bruker BioSpin GmbH
$$ ##OWNER= she
$$ F:/spectra/data/she/nmr/P31/1/pdata/1/auditp.txt
$$ ##AUDIT TRAIL=  $$ (NUMBER, WHEN, WHO, WHERE, WHAT)
(   1,<2021-09-23 10:21:02.98 +0400>,<she>,<DPX200>,
      <created by zg, POWCHK disabled, PULCHK disabled
       configuration hash MD5:
       00 E9 B6 7A A2 85 ED C7 34 08 36 98 17 FE 4E 26
       data hash MD5: 32K
       51 9F D6 E8 17 F3 28 4D B0 40 2C B0 CB B5 CC 62>)
(   2,<2021-09-23 10:21:08.45 +0400>,<she>,<DPX200>,
      <Start of raw data processing
       efp BC_mod = 2 LB = 1 FT_mod = 6 PKNL = 1 PHC0 = -8192.735 PHC1 = 328.2697 SI = 64K 
       data hash MD5: 64K
       4C A1 97 9F 8C AE D3 5C 74 CC 41 EB 3C D4 A4 D7>)
(   3,<2021-09-23 10:21:25.93 +0400>,<she>,<DPX200>,
      <pk PHC0 = -23.72333 PHC1 = 0 
       data hash MD5: 64K
       11 32 AA E5 90 D3 84 16 F0 09 77 83 E2 59 13 01>)
$$ ##END=
$$ 
$$ hash MD5
$$ D7 E8 FB 35 0D 48 2A 27 EF 4A 39 FF 79 AA 5E BB
##$RELAX= 
##$RELAX= 
##$RELAX= 
##$RELAX= 
##$RELAX= 
##$RELAX= 
##$RELAX= 
##$RELAX= 
$$ Bruker specific parameters
$$ --------------------------
##$DU= <F:/spectra>
##$EXPNO= 1
##$NAME= <P31>
##$PROCNO= 1
##$TYPE= <nmr>
##$USER= <she>
##$AMP= (0..31)
100 100 100 100 100 100 100 100 100 100 100 100 100 100 100 100 100 100 
100 100 100 100 100 100 100 100 100 100 100 100 100 100 
##$AQSEQ= 0
##$AQ_mod= 1
##$AUNM= <au_zg>
##$AUTOPOS= <>
##$BF1= 81.014009
##$BF2= 200.13
##$BF3= 200.13
##$BF4= 200.13
##$BF5= 200.13
##$BF6= 200.13
##$BF7= 200.13
##$BF8= 200.13
##$BYTORDA= 1
##$CFDGTYP= 0
##$CFRGTYP= 5
##$CHEMSTR= <none>
##$CNST= (0..31)
1 1 145 1 1 1 1 1 1 1 1 1 1 1 1 1 1 1 1 1 1 1 1 1 1 1 1 1 1 1 1 1 
##$CPDPRG= <waltz16>
##$CPDPRG1= <>
##$CPDPRG2= <waltz16>
##$CPDPRG3= <>
##$CPDPRG4= <mlev>
##$CPDPRG5= <mlev>
##$CPDPRG6= <mlev>
##$CPDPRG7= <mlev>
##$CPDPRG8= <mlev>
##$CPDPRGB= <>
##$CPDPRGT= <>
##$D= (0..31)
0 1 0 0 0 0 0 0 0 0 0 0.03 2e-05 3e-06 0 0 0 0 0 0 0 0 0 0 0 0 0 0 0 0 
0 0 
##$DATE= 1632378062
##$DBL= (0..7)
120 120 120 11 120 120 24 19 
##$DBP= (0..7)
150 150 150 150 150 150 150 150 
##$DBP07= 0
##$DBPNAM0= <>
##$DBPNAM1= <>
##$DBPNAM2= <>
##$DBPNAM3= <>
##$DBPNAM4= <>
##$DBPNAM5= <>
##$DBPNAM6= <>
##$DBPNAM7= <>
##$DBPOAL= (0..7)
0.5 0.5 0.5 0.5 0.5 0.5 0.5 0.5 
##$DBPOFFS= (0..7)
0 0 0 0 0 0 0 0 
$$ [...]
##$SUBNAM2= <"">
##$SUBNAM3= <"">
##$SUBNAM4= <"">
##$SUBNAM5= <"">
##$SUBNAM6= <"">
##$SUBNAM7= <"">
##$SUBNAM8= <"">
##$SUBNAM9= <"">
##$SW= 501.771253377433
##$SWIBOX= (0..15)
0 1 3 0 0 0 0 0 0 0 0 0 0 0 0 0 
##$SW_h= 40650.406504065
##$TD= 32768
##$TD0= 1
##$TE= 0
##$TE2= 300
##$TE3= 300
##$TEG= 300
##$TL= (0..7)
0 120 53 12 22 120 120 120 
##$TP= (0..7)
150 150 150 150 150 150 150 150 
##$TP07= 0
##$TPNAME0= <>
##$TPNAME1= <>
##$TPNAME2= <>
##$TPNAME3= <>
##$TPNAME4= <>
##$TPNAME5= <>
##$TPNAME6= <>
##$TPNAME7= <>
##$TPOAL= (0..7)
0.5 0.5 0.5 0.5 0.5 0.5 0.5 0.5 
##$TPOFFS= (0..7)
0 0 0 0 0 0 0 0 
##$TUNHIN= 0
##$TUNHOUT= 0
##$TUNXOUT= 0
##$USERA1= <user>
##$USERA2= <user>
##$USERA3= <user>
##$USERA4= <user>
##$USERA5= <user>
##$V9= 5
##$VALIST= <valist>
##$VCLIST= <CCCCCCCCCCCCCCC>
##$VD= 0
##$VDLIST= <DDDDDDDDDDDDDDD>
##$VPLIST= <PPPPPPPPPPPPPPP>
##$VTLIST= <TTTTTTTTTTTTTTT>
##$WBST= 1024
##$WBSW= 4
##$XGAIN= (0..3)
0 0 0 0 
##$XL= 0
##$YL= 0
##$YMAX_a= 7005
##$YMIN_a= -7557
##$ZGOPTNS= <>
##$ZL1= 120
##$ZL2= 120
##$ZL3= 120
##$ZL4= 120
##$ABSF1= 0
##$ABSF2= 0
##$ABSG= 0
##$ABSL= 0
##$ALPHA= 0
##$AQORDER= 0
##$ASSFAC= 0
##$ASSFACI= 0
##$ASSFACX= 0
##$ASSWID= 0
##$AUNMP= <proc_1d>
##$AZFE= 0.1
##$AZFW= 0.5
##$BCFW= 0
##$BC_mod= 2
##$BYTORDP= 0
##$COROFFS= 0
##$CY= -3
##$DATMOD= 1
##$DC= 0
##$DFILT= <>
##$DTYPP= 0
##$F1P= 0
##$F2P= 0
##$FCOR= 1
##$FTSIZE= 65536
##$FT_mod= 6
##$GAMMA= 0
##$GB= 0
##$INTBC= 1
##$INTSCL= 5.30512e-09
##$ISEN= 30
##$LB= 1
##$LEV0= 0
##$LPBIN= 0
##$MAXI= 10000
##$MC2= 0
##$MEAN= 0
##$ME_mod= 0
##$MI= 50
##$NCOEF= 0
##$NC_proc= -6
##$NLEV= 6
##$NOISF1= 182.463
##$NOISF2= 159.3651
##$NSP= 0
##$NTH_PI= 0
##$NZP= 0
##$OFFSET= 248.5645
##$PC= 4
##$PHC0= -8216.459
##$PHC1= 328.2697
##$PH_mod= 1
##$PKNL= yes
##$PPARMOD= 0
##$PSCAL= 0
##$PSIGN= 0
##$REVERSE= no
##$SF= 81.014009
##$SI= 65536
##$SIGF1= 159.3651
##$SIGF2= -187.1042
##$SINO= 113.3802
##$SIOLD= 16384
##$SREGLST= <1H.CDCl3>
##$SSB= 0
##$STSI= 65536
##$STSR= 0
##$SW_p= 40650.406504065
##$SYMM= 0
##$S_DEV= 0
##$TDeff= 32768
##$TDoff= 0
##$TI= <>
##$TILT= no
##$TM1= 0
##$TM2= 0
##$TOPLEV= 0
##$USERP1= <user>
##$USERP2= <user>
##$USERP3= <user>
##$USERP4= <user>
##$USERP5= <user>
##$WDW= 1
##$XDIM= 65536
##$YMAX_p= 388683530
##$YMIN_p= -145320018
$$ End of Bruker specific parameters
$$ ---------------------------------
##NTUPLES= NMR SPECTRUM
##VAR_NAME=  FREQUENCY,     SPECTRUM/REAL,   SPECTRUM/IMAG
##SYMBOL=    X,             R,               I
##VAR_TYPE=  INDEPENDENT,   DEPENDENT,       DEPENDENT
##VAR_FORM=  AFFN,          ASDF,            ASDF
##VAR_DIM=   65536,         65536,           65536
##UNITS=     HZ,            ARBITRARY UNITS, ARBITRARY UNITS
##FACTOR=    0.620285442955139, 1,           1
##FIRST=     20137.2065510759, 0,            0
##LAST=      -20513.1999529892, 0,           0
##MIN=       -20513.1999529892, -145320018,  0
##MAX=       20137.2065510759, 388683530,    0
$$ Real data points
##PAGE= N=1
##DATA TABLE= (X++(R..R)), XYDATA
$$ [...]
39985C35526j93381j179448j126847P6985J365393J611726P42237k71482m31456
$$ 335526 142145 -1037303 -2164150 -2087165 -721772 889954 1632191 1360709 929253
39976I29253K20737O08111n3858j058707r54248M10595J416572P67202o98219
$$ 929253 1149990 1758101 1704243 645536 -308712 101883 1518455 2285657 1587438
39967A587438j142949k15717O49407L44956n10473o27983J94023R18750O25884
$$ 1587438 444489 228772 878179 1223135 712662 84679 278702 1197452 1823336
39958A823336m30398j184945r83629k26839K69066K74899J45265N788m00935r73967
$$ 1823336 1392938 207993 -775636 -1002475 -733409 -458510 -313245 -307457 -708392 -1682359
39948a682359j084034m71795L30896Q66686J346514J870902J830849Q59082k80472
$$ -1682359 -2766393 -3238188 -2907292 -2040606 -694092 1176810 3007659 3866741 3586269
39939C586269o76466o02280q57846j270965j038477k44642K21943J08051r8882
$$ 3586269 2909803 2307523 1449677 178712 -859765 -1104407 -882464 -774413 -873295
39930h73295l41627q52574r45301L23998K073375K110066K10216j063982J7948
$$ -873295 -1214922 -2067496 -3012797 -2688799 -615424 1494642 1704858 640876 658824
39921F58824J742616J584408r0116r86129m59377J45888J62852K72544N84235
$$ 658824 2401440 3985848 3895732 2909603 2450226 2596114 2758966 3031510 3615745
39912C615745K53697o74395j013795m97102k56200o86003o91472J49793N52986
$$ 3615745 3869442 3195047 2181252 1684150 1427950 741947 50475 200268 753254
39903G53254k25989q73494j98078P38144M19611m88596l44772N53339N10811n37274
$$ 753254 527265 -346229 -544307 193837 613448 124852 -219920 333419 844230 306956
39893C06956q49488J72876J015540N62651k86264l20628J99109M09390K53726
$$ 306956 -542532 -369656 645884 1208535 922271 601643 800752 1210142 1463868
39884A463868N9679k67197o91634o15099N9268L09456m98544j280649o57523Q51682
$$ 1463868 1523547 1256350 564716 -50383 8885 318341 -180203 -1460852 -2118375 -1266693
39874a266693J417259M47247p59433r38408k56483M31163O73031M10191k40498
$$ -1266693 150566 597813 -161620 -1100028 -1356511 -925348 -252317 157874 -82624
39865h2624p53239m85669L40826O36997o7727q00281m77432M95061Q21196J99426
$$ -82624 -835863 -1321532 -980706 -343709 -411436 -1211717 -1689149 -1194088 -372892 -173466
39855a73466l58635j09585M32447M06576j93596o99705o86726k43765L38483P02630
$$ -173466 -532101 -641686 -209239 197337 3741 -695964 -1382690 -1626455 -1287972 -585342
39845e85342N22156p9042m37732j49426K86412J68164k99526l16233K10251N20856
$$ -585342 -63186 -142228 -579960 -729386 -442974 -274810 -574336 -890569 -680318 -159462
39835a59462K59928n539J87098M80173M34449K19330O7121k13268o11347n81296
$$ -159462 100466 94927 282025 762198 1196647 1415977 1483098 1269830 658483 77187
39825G7187m286L31170J4133j23442N17390R00269j03982j506027j346526K80495
$$ 77187 72901 404071 418204 294762 812152 1712421 1608439 102412 -1244114 -963619
39815i63619J293159P27767j87941l71353k84747l55105K6307R12290J016524
$$ -963619 329540 1057307 869366 498013 213266 -141839 -115532 796758 1813282
39806A813282j96008j225359p69288K14429K52048k21679k3585L99633j07708
$$ 1813282 1617274 391915 -377373 -162944 89104 -132575 -156160 243473 135765
39797A35765r70808o70897M92196P51331j33311n27619K22013Q04431L51793j99531
$$ 135765 -835043 -1505940 -1013744 -262413 -395724 -923343 -701330 103101 454894 255363
39787B55363L2780M04007Q3957n41519p20589m23420J27094Q71362J306107P20488
$$ 255363 288143 692150 776107 234588 -486001 -909421 -782327 89035 1395142 2115630
39777B115630m32422p77256j45308J31116l42706k15524R79613J458105Q536j686783
$$ 2115630 1683208 905952 760644 891760 549054 333530 1313143 2771248 2779784 1093001
39767A093001j505732r6860N14062J81773J28475K62230l77653j196447p52247
$$ 1093001 -412731 -509591 4471 186244 314719 576949 199296 -997151 -1749398
39758a749398M72054O66315r9590j5237J035272J071369m33230j451408p68114
$$ -1749398 -1277344 -611029 -710619 -725856 309416 1380785 947555 -503853 -1271967
39749a271967K38898L31076L07802P56146M84909r64583j630976j63868J525172
$$ -1271967 -1033069 -701993 -394191 361955 846864 -117719 -1748695 -1912563 -387391
39740c87391J112636l81001l99005R34052J294452M0174j197159j388612j018408
$$ -387391 725245 344244 -54761 879291 2173743 2213917 1016758 -371854 -1390262
39731a390262l92328N53078R87463J05358r37778m50708P34816L96354j049857
$$ -1390262 -1782590 -1229512 -242049 -136691 -1074469 -1525177 -790361 -394007 -1443864
39722a443864q81132J210648K226690P69444o30169R5412J067250p6439j924348
$$ -1443864 -2324996 -1114348 1112342 1881786 1251617 1347029 2414279 2337840 413492
39713D13492j642098K87016J021449K0230n28058L76695J176476O12109m73507
$$ 413492 -1228606 -941590 79859 100089 -427969 -51274 1125202 1737311 1263804
39704A263804q04174l41263K69301N45445J39021q44187j385332n99666P76517
$$ 1263804 459630 118367 387668 933113 1072134 227947 -1157385 -1757051 -980534
39695i80534J177333L89679l73044m41778k61582o0379M33774Q61025M98551j37859
$$ -980534 196799 586478 213434 -228344 -489926 -550305 -116531 744494 1243045 1105186
39685A105186K41462J270032R65512j026878k286311j044578J033796J291900
$$ 1105186 1346648 2616680 3582192 2555314 269003 -775575 258221 1550121
39677A550121n9226o51916K33722Q74451J08641r43533q12723K02418P82531M53735
$$ 1550121 1490895 838979 1072701 1947152 2055793 1112260 299537 501955 1284486 1738221
39667A738221k39887p86444r99212o34495L43315J190150R48511k34056j093236
$$ 1738221 1498334 711890 -287322 -921817 -578502 611648 1560159 1326103 232867
39658B32867q60218j62257J54977K99605P75892J061059L45258p35554o70370
$$ 232867 -627351 -789608 -634631 -335026 440866 1501925 1847183 1111629 441259
39649D41259N10071J031527R1760q99940o96800j72869n53926j161183o86461
$$ 441259 951330 1982857 2074617 1174677 477877 305008 -248918 -1410101 -2096562
39640b096562L93217O47494J58196J03852M35089J28818n49128l09665O56615
$$ -2096562 -1703345 -1055851 -897655 -793803 -358714 -229896 -779024 -1088689 -432074
39631d32074P50524k24890o43696P0255M83729j75788p03241l12135q6620o86867
$$ -432074 318450 93560 -550136 -479881 3848 -171940 -875181 -1187316 -1273936 -1960803
39621a960803p71499N69495J739786J024056n28405p93626J09454M90961J41040
$$ -1960803 -2732302 -2162807 -423021 601035 72630 -720996 -611542 -120581 20459
39612B0459K80425R42962P90711m54451j466560j436836r78813o26067l5866Q80883
$$ 20459 300884 1243846 2034557 1580106 113546 -1323290 -2302103 -2928170 -2964036 -2083153
39602b083153J412906J131289M45801k57553j008579j495725r83126N35674J910827
$$ -2083153 -670247 461042 906843 649290 -359289 -1855014 -2838140 -2302466 -391639
39593c91639K042284J007697k35590q13128n41626l2628j23853q01411j020967
$$ -391639 1650645 2658342 2422752 1609624 1067998 1035370 911517 110106 -910861
39584i10861j70732Q09561O70559k51990n63420J8697L65151j17823n72932j44058
$$ -910861 -1081593 -272032 398527 146537 -416883 -398186 -33035 -150858 -723790 -867848
39574h67848P31156J057729N69848k14238o81682n22433J00904N52550L09007
$$ -867848 -136692 921037 1490885 1276647 594965 72532 173436 725986 1034993
39565A034993l50505o54895l30836J86313M46361L53725l7066n01278n57324l8358
$$ 1034993 684488 29593 -301243 -114930 331431 685156 648090 146812 -410512 -448870
39555d48870M21924J83882l27136j99001M67928O43759J381n49821k43032M86304
$$ -448870 -26946 156936 -170200 -369201 98727 742486 743867 194046 -48986 437318
39545D37318P19803K26503m52370p04393m09682p380L2127r7422K13174Q27524
$$ 437318 1157121 1383624 931254 226861 -182821 -190201 -158074 -255496 -42322 785202
39535G85202P41270l08154j067224n69638K52047Q6523n25185j87423Q08598R45511
$$ 785202 1526472 1218318 151094 -418544 -166497 -79974 -605159 -792582 16016 961527
39525I61527J06768l87509k18049k82113m58736L29924J493543R70820j116986
$$ 961527 1068295 680786 462737 180624 -278112 51812 1545355 2516175 1399189
39516A399189j863485l8336J630895O58923j247529j085401O14373R83497l99346
$$ 1399189 -464296 -502632 1128263 1787186 539657 -545744 68629 1052126 652780
39507F52780j196553l58821N56119L02281l93546n69580l17547J46020Q59250
$$ 652780 -543773 -902594 -346475 -44194 -437740 -1007320 -1324867 -1178847 -319597
39498c19597J191520L25509j004217j099821J055M21783l92184o29064P13363
$$ -319597 871923 1197432 193215 -906606 -905551 -483768 -875952 -1505016 -791653
39489g91653J804404Q16095j010945j240491N5829P57784J70705l19436M7193
$$ -791653 1012751 1828846 817901 -422590 -366761 391023 561728 242292 289485
39480B89485L16761j14074l63750J23197L28430n37717j320906n76051R22379
$$ 289485 606246 492172 128422 251619 580049 42332 -1278574 -1854625 -932246
39471i32246J114700j76932q67576K37181J589087J183890n41419j500182r84566
$$ -932246 182454 5522 -862054 -624873 964214 2148104 1606685 106503 -878063
39462h78063l15546m88596p10430O0831J235608J342358J98928p61280m37948
$$ -878063 -1193609 -1682205 -2392635 -2331804 -1096196 246162 445090 -316190 -754138
39453g54138N06607O50078k29848r07356m37060N58264Q11928J81752l07731r9083
$$ -754138 -247531 402547 172699 -734657 -1171717 -613453 198475 380227 72496 -26587
39443b6587J90675K074k02238J09938M45330Q9323n93293p08262k32668K15732
$$ -26587 164088 166162 -36076 73862 519192 608515 15222 -693040 -925708 -709976
39433g09976N72592J063965J165618K98028p17212n86598J91574m9332j138219
$$ -709976 -137384 926581 2092199 2390227 1673015 1086417 1277991 1228659 90440
39424I0440r89941Q26154J904982O99928r07010o10099P06361O83211o65985j402857
$$ 90440 -899501 -73347 1831635 2531563 1624553 1014454 1720815 2404026 1738041 335184
39414C35184j007588o49274o21799q2169P76083P19084j97802n12208J56160N79349
$$ 335184 -672404 -1321678 -1943477 -2025646 -1249563 -530479 -728281 -1240489 -1084329 -504980
39404e04980K13004l2117K72025L77419Q4601J32608L60540l25729j486946j086508
$$ -504980 -291976 -324093 -52068 325351 409952 542560 903100 577371 -909575 -1996083
39394a996083J034511K131985O01975j323631r99760O16029R01153j55162n31270
$$ -1996083 -961572 1170413 1772388 448757 -551003 65026 966179 811017 279747
39385B79747K3272j38660j198078j338895O8592J275312Q68277l39483r32755
$$ 279747 303019 164359 -1033719 -2372614 -2304022 -1028710 -160433 -499916 -1432671
39376a432671p30731j91645N71772J316908J360626N49528l24596o41981o68953
$$ -1432671 -2163402 -2355047 -1783275 -466367 894259 1443787 1119191 477210 -191743
39367a91743p62618p48051m67421j02798L19816Q62242R95616J30720r93565q32426
$$ -191743 -954361 -1702412 -2169833 -2272631 -1952815 -1090573 -94957 35763 -957802 -1790228
39357a790228O28467J526778Q00984k77441k39816L46478J47462o02069o83596
$$ -1790228 -1161761 365017 1166001 888560 648744 995222 1142684 540615 -142981
39348a42981q3770J03125l54414n27474J0484N81713O24656L81075J57605j01427
$$ -142981 -226751 -123626 -478040 -1005514 -995030 -413317 211339 592414 750019 648592
39338F48592k69153J1397N20444M44036m25607j174132r46769j16822K89142K0097
$$ 648592 379439 390836 911280 1355316 929709 -244423 -1191192 -1308014 -1018872 -998775
39328i98775j51627L79035J110548J043499O5125p92051o97397j11852L9445j55625
$$ -998775 -1150402 -771367 339181 1382680 1447805 655754 -41643 -153495 -114050 -269675
39318b69675J04639P46816P65091m2871n73597j68936L96310M04648L64139O81898
$$ -269675 -165036 581780 1346871 1304000 730403 561467 957777 1362425 1726564 2408462
39308B408462M95140p82142j890124j377320M9881O19579K20568J09718M78280
$$ 2408462 2903602 2121460 231336 -1145984 -1096103 -476524 -255956 -146238 332042
39299C32042M54733J88058O11312J209563M90863j097408j331079J17722Q58388
$$ 332042 786775 974833 1586145 2795708 3286571 2189163 858084 975806 1834194
39290A834194l26261j448703p31309M78192K82254m75610j4886J007851P40008
$$ 1834194 1507933 59230 -672079 -193887 88367 -387243 -402129 605722 1345730
39281A345730m16821n19028L93853M09992p52451j195614j65315P05135K83700
$$ 1345730 928909 409881 803734 1213726 461275 -734339 -899654 -194519 89181
39272H9181k60515K57161Q89734K29204j132091j437064l27081Q44288R49498
$$ 89181 -171334 85827 975561 1204765 72674 -1364390 -1691471 -847183 102315
39263A02315K40270l56380k91308L10780Q94391R19485L15558m68741r24673r19712
$$ 102315 342585 -13795 -305103 5677 900068 1819553 2135111 1666370 741697 -178015
39253a78015o88965n14793l92706k132P75512J332878Q69972l62083j076929o69071
$$ -178015 -866980 -1381773 -1774479 -1776611 -1001099 331779 1201751 839668 -237261 -906332
39243i06332j02419l41146p46434j88473R06177J103361K76865k20369J95215
$$ -906332 -1008751 -1349897 -2096331 -2284804 -1378627 -275266 1599 -218770 -23555
39234b3555M93758p5811o68585k76163N73552N92500l70239j176723r51801m8340
$$ -23555 470203 394392 -274193 -550356 23196 615696 245457 -931266 -1883067 -1931407
39224a931407N85906N41166K40169K26902M01131K26570l38490o10915j31994
$$ -1931407 -1345501 -804335 -564166 -337264 63867 290437 -48053 -658968 -790962
39215g90962O30987R12475N45577j22437o76482o38301K36404J187383R18181
$$ -790962 -159975 752500 1298077 1175640 499158 -139143 97261 1284644 2202825
39206B202825m77931j193273l07648N77410k00133j516036j134064O63539J553454
$$ 2202825 1724894 531621 223973 801383 601250 -914786 -2048850 -1385311 168143
39197A68143Q76821K85876O25468P75419J23235k96512k1711k39727j486659k298565
$$ 168143 1044964 1330840 1956308 2731727 2854962 2558450 2536739 2297012 810353 -1488212
39187a488212j490466k0623P75113J154435J699487J625962J18236j752222k178339
$$ -1488212 -2978678 -2999301 -2224188 -1069753 629734 2255696 2373932 621710 -1556629
39178a556629j024261L03194Q19681O59348L55935L68258Q03656J025011L05167
$$ -1556629 -2580890 -2277696 -1458015 -798667 -442732 -74474 729182 1754193 2059360
39169B059360p60164p27308L45025O49616m98365j420553q74089j03604m49497
$$ 2059360 1299196 571888 916913 1566529 1068164 -352389 -1226478 -1330082 -1779579
39160a779579q33462K06083J590945J358373P0413j48601P33639P54833n11746
$$ -1779579 -2613041 -2406958 -816013 542360 612773 464172 1197811 1952644 1440898
39151A440898j230833m01888O83498O95934O5808j77283J20865N29655O66760
$$ 1440898 210065 -191823 491675 1187609 1253417 1076134 1196999 1726654 2393414
39142B393414K17486o88039j116590m30154M54416J74782r45540j321880m88857
$$ 2393414 2610900 1922861 806271 376117 830533 1005315 59775 -1262105 -1750962
39133a750962M94552R13030J024903Q46141N0401p81053n86658K31260J03698
$$ -1750962 -1256410 -343380 681523 1527664 1578065 797012 210354 441614 545312
39124E45312j053428j394655p8722J211315P97941n05776q27508j9108M92840
$$ 545312 -508116 -1902771 -1981493 -770178 27763 -478013 -1305521 -1324629 -831789
39115h31789M2926m70140p2766R32500J384193P00022l59610n54376K46650Q89660
$$ -831789 -788863 -1259003 -1331769 -399269 984924 1684946 1325336 770960 1017610 1907270
39105A907270N94756l8787k80572n03627j138653j423051o27004L69822M02748
$$ 1907270 2502026 2463239 2182667 1679040 540387 -882664 -1509668 -1139846 -737098
39096g37098P6267N53580J139993M56340o45212j90341J187688Q61062j222907
$$ -737098 -660831 -107251 1032742 1489082 843870 653529 1841217 2702279 1479372
39087A479372k068787n72184O48186j46351r31535J43405J272048M06458p04710
$$ 1479372 -589415 -1161599 -513413 -659764 -1591299 -1447894 -175846 230612 -474098
39078d74098M84758K422036J649195j303846k436369m69000J465356R37949n10203
$$ -474098 10660 2432696 4081891 2778045 341676 -127324 1338032 2275981 1765778
39069A765778n41700M03202N15595l60955r68902p52419k06003K49766N89489
$$ 1765778 1224078 1627280 2142875 1781920 813018 60599 -145404 104362 693851
39060F93851P10045M11974k49513q94716j002912l11855O53119Q55374J15981
$$ 693851 1403896 1815870 1566357 671641 -331271 -643126 9993 865367 981348
39051I81348l58858L41734J290025J054868k8644m83652j90217l96974j260968
$$ 981348 622490 964224 2254249 3309117 3280473 2796821 2606604 2209630 948662
39042I48662j400259l52285M70469J19835l46958K07627J044990Q74960n0185
$$ 948662 -451597 -803882 -333413 -213578 -560536 -352909 692081 1567041 1516856
39033A516856o07389o64086q16955r57969n64031M9648J80709J05229N69218J146501
$$ 1516856 909467 245381 -571574 -1529543 -2093574 -2043926 -1863217 -1757988 -1188770 -42269
39023d2269O66773o52732j110729j3712J196677J080503K05679m4402L17218K16467
$$ -42269 624504 -28228 -1138957 -1152669 44008 1124511 1330190 1285788 1603006 1819473
39013A819473m62511o64069J2534N79688J96333n49938n72556J38094O35978M25150
$$ 1819473 1356962 692893 705427 1285115 1481448 931510 358954 497048 1133026 1558176
39003A558176J2919L4022L84450M91037J78168q2508J13435L62190j34714j267934
$$ 1558176 1571095 1605117 1989567 2480604 2658772 2576264 2689699 3051889 2917175 1649241
38993A649241j718994o26253Q68712Q45681o51874j470022m13621J006734R48962
$$ 1649241 -69753 -696006 172706 1018387 366513 -1103509 -1517130 -510396 438566
38984D38566o018j32963M19651Q4791j040485j051391M44639J295525J72117j177162
$$ 438566 432548 299585 719236 804027 -236458 -1287849 -843210 452315 624432 -552730
38974e52730o79272P82539R27274k56039p75911p3546K52981o18069j291248m87002
$$ -552730 -1232002 -449463 477811 221772 -554139 -627685 -374704 -992773 -2284021 -2771023
38964b771023R08967J299802O85327K53891M28603N87602L74534J20857j4887
$$ -2771023 -1862056 -562254 123073 376964 805567 1393169 1767703 1888560 1873673
38955A873673l43070q64714r78541l56796M25240N93778J67888k19033k44265
$$ 1873673 1530603 665889 -312652 -669448 -244208 349570 517458 298425 54160
38946E4160r3134J52183O34878J085142P76336m11037j443975j305559l12917
$$ 54160 -38974 113209 748087 1833229 2609565 2198528 754553 -551006 -863923
38937h63923M48509O41734P18274P08137J64568o15479o14464K27279N94397k22331
$$ -863923 -415414 226320 944594 1652731 1817299 1201820 587356 814635 1409032 1186701
38927A186701j072290o68041M24905P72972K98898N9186K29439q5465j023503
$$ 1186701 114411 -553630 -128725 644247 943145 1002331 1231770 1146305 122802
38918A22802j472549p90722K33615O72498O50807O41106N22302J11344j27797
$$ 122802 -1349747 -2140469 -1906854 -1234356 -583549 57557 579859 691203 563406
38909E63406K09629N71275J63442p24666r97432k85897N98934Q55377O13412L65858
$$ 563406 773035 1344310 1507752 783086 -214346 -500243 98691 954068 1567480 1933338
38899A933338Q5598n16346j134852r78430Q2438J004087P27186l52378p43951
$$ 1933338 2018936 1502590 367738 -610692 -528254 475833 1203019 850641 106690
38890A06690J36834J029929N01840r44936j428057l12168Q52773N36188o07812
$$ 106690 243524 1273453 1775293 830357 -597700 -909868 -57095 479093 -128719
38881a28719p84518L06022J172533Q28347M2722j79200j61416o47391j207610
$$ -128719 -913237 -607215 565318 1393665 1436387 1257187 1095771 448380 -759230
38872g59230q60338J34516N24216R4216l16P07177J065621K48671o82818m10675
$$ -759230 -1619568 -1485052 -960836 -866620 -866936 -159759 905862 1154533 471715 61040
38862F1040M27533K21595r52382j380893l91955O81734O36582M3462P165M20014
$$ 61040 488573 710168 -242214 -1623107 -2015062 -1333328 -696746 -653284 -646119 -226105
38852b26105M28697p5047m07549k05768J83230L16883J69354P2046L43338Q40834
$$ -226105 202592 127545 -280004 -485772 -302542 14341 183695 255741 599079 1439913
38842A439913R19119K19107o13711o75199k31316m41428j423160j721009l78293
$$ 1439913 2359032 2578139 1964428 1289229 1057913 616485 -806675 -2527684 -2905977
38833b905977J433584J839105O69183n99957r27723o43181l87288j53059L13566
$$ -2905977 -1472393 366712 1035895 435938 -491785 -1134966 -1522254 -1675313 -1361747
38824a361747Q19985Q89393M13853j42929k60725j4397J3052l74659n47747n705
$$ -1361747 -541762 347631 761484 618555 357830 343433 356485 -18174 -565921 -571626
38814e71626N82481J65114r79370j382872m22209Q59020J320429J040769N66928
$$ -571626 10855 175969 -803401 -2186273 -2608482 -1749462 -429033 611736 1178664
38805A178664m2009p06071q72948m07964n4040k15341k31202K87088M87753k32360
$$ 1178664 1136655 430584 -442364 -850328 -904368 -1119709 -1350911 -1063823 -576070 -808430
38795h08430q35172j62933J001594J012106p5249o97623k74410J41666k64825
$$ -808430 -1643602 -1806535 -804941 207165 131916 -565707 -840117 -698451 -963276
38786i63276r61932j029867j97959J099585J876594J159459o17306j384170N9591
$$ -963276 -1925208 -2955075 -3153034 -2053449 -176855 982604 365298 -1018872 -959281
38777i59281J946543J672578m34085j569874o01559N69248K60020o58201p20159
$$ -959281 987262 2659840 2225755 655881 54322 623570 883590 225389 -494770
38768d94770k23159k16395n53804m22278J44202N58152P53494Q87031O43877j45540
$$ -494770 -717929 -934324 -1488128 -1910406 -1766204 -1208052 -454558 432473 1076350 930810
38758I30810p86060n69984J29221M42528K36269J8530M3599J78626K83214K00204
$$ 930810 144750 -425234 -296013 146515 382784 401314 444913 623539 906753 1106957
38748A106957k04326o12445m51414J47377L61167J9759n1449M33536N18555l11366
$$ 1106957 902631 290186 -161228 -13851 347316 367075 315626 749162 1267717 956351
38738I56351r54336m18957L54733l0857r48262o10178R35610J677655P13049m28287
$$ 956351 2015 -416942 -62209 -93066 -1041328 -1651506 -715896 961759 1674808 1246521
38728A246521k40188N51549L69103p01637j141253l22195O48167N38615m27766
$$ 1246521 1006333 1557882 1926985 1225348 84095 -238100 410067 948682 520916
38719E20916j015859n45823M39033R55935O57856K1594k84919k829O02321R50560
$$ 520916 -494943 -1040766 -601733 354202 1012058 1033652 748733 745904 1348225 2298785
38709B298785N59152m31147j182539r92285j99647J86724j74518n42597k28027
$$ 2298785 2857937 2426790 1244251 251966 52319 239043 64525 -478072 -706099
38700g06099M24914N88083M2639p37311j261480j308793p93457J35783R52652
$$ -706099 -281185 306898 349537 -387774 -1649254 -2958047 -3751504 -3615721 -2663069
38691b663069J132566O88156R6094k31423k11762L0052L27873N90606Q37228R84499
$$ -2663069 -1530503 -842347 -746253 -977676 -1189438 -1159386 -831513 -240907 596321 1580820
38681A580820O74109k80128j250136j215962j22878P94009N50828k50516l43632
$$ 1580820 2254929 1974801 724665 -491297 -614175 179834 730662 480146 136514
38672A36514L17826N40754k22802r30714m06550Q70620J237693L9634j402745
$$ 136514 454340 995094 772292 -158422 -564972 305648 1543341 1582975 180230
38663A80230j411261n4977J040803Q42011K7753k63327M8245L33593M22208N22410
$$ 180230 -1231031 -1286008 -245205 596806 624559 361232 409477 743070 1165278 1687688
38653A687688M26992j88940q97747r44873m26370o5677L5517L15127N58187J35680
$$ 1687688 2114680 1925740 1027993 83120 -343250 -408927 -373410 -58283 499904 635584
38643F35584n35660l22044N59899N09350q11939j581445n99671P17914N64138
$$ 635584 99924 -222120 337779 847129 35190 -1546255 -2145926 -1428012 -863874
38634h63874m94111o94252J13723P23629Q19882J011049J136944M87877n47169
$$ -863874 -1357985 -2052237 -1938514 -1214885 -395003 616046 1752990 2240867 1693698
38625A693698q88287o48040p99570j130329n12791P65589J084479K12128k45011
$$ 1693698 805411 157371 -642199 -1772528 -2285319 -1519730 -435251 -223123 -468134
38616d68134L12031M63900m41219q33635K50406J081421M5389j298037n68323
$$ -468134 -156103 307797 -133422 -967057 -716651 364770 410159 -887878 -1456201
38607a456201J290974J251729q58522j846571j13354J828272J244797p38618j083455
$$ -1456201 -165227 1086502 227980 -1618591 -1731945 96327 1341124 602506 -480949
38598d80949N54914J601577N62354j023262j155228j60007K38844l57286o52338
$$ -480949 73965 1675542 2237896 1214634 59406 -100601 138243 -219043 -871381
38589h71381J44412J031837O91917n35256j062515k21731R14975J087144L91049
$$ -871381 -726969 304868 996785 461529 -600986 -822717 92258 1179402 1570451
38580A570451k40799m13401l38752k2719O11544R95810M20603o76046j057608
$$ 1570451 1329652 916251 577499 554780 1166324 2162134 2582737 1906691 849083
38571H49083n57303l32131p53040n13263J086093K361651J482617m87503r47572
$$ 849083 291780 -40351 -793391 -1306654 -220561 2141090 3623707 3136204 2188632
38562B188632K63878P24216m93856j260072m1830J327523N24884j446644j824893
$$ 2188632 2452510 3176726 2682870 1422798 1380968 2708491 3233375 1786731 -38162
38553c8162l92108N03760j24417o67854M6708R58117Q86943M00629M00464N09252
$$ -38162 -430270 73490 -50927 -718781 -672073 286044 1172987 1573616 1974080 2483332
38543B483332J42379k02738m7237p9405p89457j110028o6635J174040Q23763n71860
$$ 2483332 2625711 2422973 2375736 2296331 1506874 396846 330211 1504251 2328014 1756154
38533A756154q16070M52949J175698K02976q91139l84279Q98122R80923k29677
$$ 1756154 940084 1393033 2568731 2771707 1880568 1496289 2394411 3375334 3145657
38524C145657r96713m27999M60080M75961k19437p92246j014752j152133j099332
$$ 3145657 2148944 1720945 2181025 2656986 2437549 1645303 630551 -521582 -1620914
38515a620914m50314O41476J350525J160724N24362K02833K40589M9810n96096
$$ -1620914 -2071228 -1429752 -79227 1081497 1605859 1808692 2049281 2099091 1502995
38506A502995j187635j224370q61730n17769k10484K77456P97100R20530O24316
$$ 1502995 315360 -909010 -1770740 -2288509 -2498993 -2221537 -1424437 -503907 120409
38497A20409M06906N67476P64780N85923K55379L11937O51095M58903o14618j669270
$$ 120409 527315 1094791 1859571 2445494 2700873 3012810 3663905 4122808 3508190 1838920
38487A838920j518679k59614Q10134Q86500M97282L56895K40060l18893q99029
$$ 1838920 320241 60627 870761 1757261 2254543 2611438 2851498 2532605 1633576
38478A633576p36965r257M43037M56491N64298P68580M29947m93724j181056j159161
$$ 1633576 896611 887354 1330391 1786882 2351180 3119760 3549707 3055983 1874927 715766
38468G15766p85831l27824L36618Q51261M96337l94850m97822L94543P90933o9094
$$ 715766 -70065 -397889 -61271 789990 1286327 891477 393655 788198 1579131 1510037
38458A510037p64042j1382J021012N47983q07551j003382L3742L74303o03996
$$ 1510037 745995 734613 1755625 2303608 1496057 492675 526417 900720 296724
38449B96724j208975k94616R02530P93374k32602o85285j49962N29085O00769
$$ 296724 -912251 -1206867 -304337 489037 256435 -428850 -578812 -49727 551042
38440E51042N5536o43817q66454k82151N46790N98486j83593n92281J70505J225631
$$ 551042 606578 -37239 -903693 -1185844 -639054 -40568 -224161 -816442 -645937 579694
38430E79694J184581O5297q47209q19164m66033o31117j138836j042907J03992
$$ 579694 1764275 1829572 982363 163199 -302834 -933951 -2072787 -3115694 -3011702
38421c011702J526081J889222P16731r68401j604793o80571Q20311J529455J033137
$$ -3011702 -1485621 403601 1120332 151931 -1452862 -2133433 -1313122 216333 1249470
38412A249470R0515k96126L7024K79868k68827j094867r66693L27036J454977
$$ 1249470 1339985 1043859 1080883 1360751 1091924 -2943 -969636 -642600 812377
38403H12377J235678J60262m95640m38218k71282j72578J39481L82517m9158q22870
$$ 812377 2048055 2208317 1712677 1274459 1003177 830599 970080 1352597 1303439 480569
38393D80569q89062j01364N76125O65539P20257R54435O62242m00067j269180
$$ 480569 -408493 -509857 66268 731807 1452064 2406499 3068741 2668674 1399494
38384A399494j178447o62960m57030k76159L66491R92105Q69336K73137n394M3482
$$ 1399494 221047 -441913 -898943 -1175102 -808611 183494 1052830 1325967 1320573 1364055
38374A364055j82522p39397j039407p56084j44795L85318N26111J76628k87595
$$ 1364055 1181533 442136 -597271 -1353355 -1498150 -1112832 -586721 -410093 -697688
38365f97688k57044K20147L65096r5304m04802r6894R8708l91682o41786M28650
$$ -697688 -954732 -734585 -369489 -464793 -869595 -966489 -867781 -1259463 -1901249 -1472599
38355a472599J980411K091100M84962j077672j258890o03028j91097j07161J15702
$$ -1472599 507812 2598912 3083874 2006202 747312 144284 -46813 -153974 -38272
38346c8272M75167O69764O80679N48537K6740r30514j621160j162251L42609J588299
$$ -38272 436895 1106659 1787338 2335875 2362615 1432101 -189059 -1351310 -1008701 579598
38336E79598J300032l09714j568920j146189L29557J037950L61856l86506j9328
$$ 579598 1879630 1569916 996 -1145193 -815636 222314 584170 197664 178336
38327A78336P88464P11223j40781o02951l81559j86309j98273R4741N08813J50847
$$ 178336 966800 1678023 1537242 934291 552732 366423 168150 262891 771704 922551
38317I22551q59426j120662m9053J032463P60527l52715q42611l39289L21889
$$ 922551 63125 -1057537 -1106590 -74127 686400 333685 -508926 -848215 -526326
38308e26326M96478K73116n5830k40751o661N82444Q88371M21275l98145p38444
$$ -526326 -29848 243268 187438 -53313 -59974 522470 1410841 1832116 1433971 695527
38298F95527m21418K0465J52302J0222j55770o2140M85632J203909J295043L25861
$$ 695527 274109 294574 446876 457098 301328 239188 724820 1928729 3223772 3549633
38288C549633j002054j488378q07567J82600M88876k1328o55335o26932K22779
$$ 3549633 2547579 1059201 251634 434234 923110 901782 246447 -380485 -157706
38279a57706J203292J340535L70330r10367j424405q29707K88086R77853O40180
$$ -157706 1045586 2386121 2756451 1846084 421679 -408028 -119942 857911 1498091
38270A498091m11680j006053k47043J213861J672673M87204j002707j226425l65539
$$ 1498091 1086411 80358 -166685 1047176 2719849 3207053 2204346 977921 612382
38261F12382K13070n1577n04154n69863l90869j52275K62955P18660P00656Q6965
$$ 612382 825452 773875 269721 -300142 -691011 -843286 -580331 138329 838985 925950
38251I25950m94572l97540K83847Q66693P58422l2404q28037q23958L7080R23049
$$ 925950 431378 33838 317685 1184378 1942800 1910396 1082359 258401 295481 1218530
38241A218530J114094P89099M30228k8285p77342j338290j109703m24340r4125
$$ 1218530 2332624 3121723 3551951 3523666 2746324 1408034 298331 -126009 -220134
38232b20134j02742J95723O93697N45061l31450r59503q01483m18705k60069P5246
$$ -220134 -322876 -127153 566544 1111605 780155 -179348 -980831 -1399536 -1659605 -1584359
38222a584359Q18200J322213J062929M71721J01004k13318o64345p87291k87099
$$ -1584359 -766159 556054 1618983 2090704 2191708 1978390 1314045 526754 239655
38213B39655J73632o8819n11100k39780N37578P12200q6259r14270p18389L88038
$$ 239655 413287 344468 -166632 -406412 131166 843366 757107 -157163 -875552 -487514
38203d87514J242478R01830k47502q20881j16148Q91471Q31132j79996q87305
$$ -487514 754964 1656794 1409292 588411 472263 1363734 2194866 2014870 1127565
38194A127565q06513m94746j06884O80927J228807L48923j358569j652696m864
$$ 1127565 321052 -173694 -280578 400349 1629156 1978079 619510 -1033186 -1038050
38185a038050J307138O79799m18865k05067M26630q8841q63160j79202J122331
$$ -1038050 269088 948887 530022 324955 751585 662744 -200416 -379618 742713
38176G42713Q47119p81940j489141o38811K42469L89463M91537N63390j16814
$$ 742713 1589832 807892 -681249 -1320060 -1077591 -688128 -196591 366799 249985
38167B49985q70567j75094J421133J679789K92190o66860l14055n1358m78401
$$ 249985 -620582 -795676 625457 2305246 2597436 1930576 1616521 1565163 1086762
38158A086762l10586O67090O95359o20297j133881J23198J076865K77153o03169
$$ 1086762 776176 1443266 2138625 1518328 384447 507645 1584510 1861663 1258494
38149A258494q9723K97305q14773j588668j91808J443479O24508j373696j401365
$$ 1258494 1168771 1466076 651303 -937365 -1129173 314306 938814 -434882 -1836247
38140a836247K85330Q36275j24280l68957M32620K32582j153215j273254O43592
$$ -1836247 -1550917 -714642 -838922 -1207879 -775259 -542677 -1695892 -2969146 -2325554
38131b325554K107724J331437k40057p18310m17897k46715J26588Q42735O81007
$$ -2325554 -217830 1113607 873550 155240 -262657 -509372 -382784 459951 1140958
38122A140958q78092k098427j322226M40952J035350K84473j75824L83498R23549
$$ 1140958 262866 -1835561 -3157787 -2716835 -1681485 -1397012 -1572836 -1189338 -265789
38113b65789M73860m65123p42541j14444M86137J80639o52062q41509j27874L85262
$$ -265789 208071 -257052 -999593 -1114037 -627900 -447261 -1099323 -1940832 -2068706 -1683444
38103a683444l6720n09300J3030Q85771P69699j18570l55903L86789J028110R57799
$$ -1683444 -1720164 -2229464 -2216434 -1330663 -560964 -679534 -1035437 -648648 379462 1337261
38093A337261O30229K83812l18653p87640l75213M80923N11278k56868m12546
$$ 1337261 1967490 2251302 1932649 1145009 769796 1250719 1761997 1505129 1092583
38084A092583M34084Q80336l1876j345506j655007p75035N94318J679109J753827
$$ 1092583 1526667 2407003 2375127 1029621 -625386 -1400421 -806103 873006 2626833
38075B626833O88692m13954m30472j2726n39485j457670r12028Q29442J256286
$$ 2626833 3315525 2901571 2471099 2458373 1918888 461218 -450810 378632 1634918
38066A634918l45097j512736n87139O26296P0430j087056o17629R41269J285149
$$ 1634918 1289821 -222915 -810054 -183758 -113328 -1200384 -1818013 -876744 408405
38057D08405L3790j095908j141068o69265j12588O62109J308056J220665O92500
$$ 408405 442195 -653713 -1794781 -2464046 -2576634 -1914525 -606469 614196 1306696
38048A306696M95933N71883L29249j64935m39081n20781m94687Q2856J120800
$$ 1306696 1802629 2374512 2703761 2538826 2099745 1578964 1084277 1167133 2287933
38039B287933J292642j08583j555977j285685n2797J35069o53982n79315O14173
$$ 2287933 3580575 3471992 1916015 630330 577533 712602 58620 -520695 93478
38030I3478J073577j7751j124382r07092m6261L96677O05781Q78552N10561p78756
$$ 93478 1167055 1149304 24922 -882170 -928431 -531754 74027 952579 1463140 684384
38020F84384j599344o91207Q64538R19693o27594j642955p93960P11618J032395
$$ 684384 -914960 -1606167 -741629 178064 -449530 -2092485 -2886445 -2174827 -1142432
38011a142432J86730l72427k4124M21229L28896K14027O10177R54003M84980l74156
$$ -1142432 -955702 -1328129 -1352253 -931024 -602128 -388101 222076 1176079 1661059 1286903
38001A286903n72875l5367L31556O5903m31451p92386r48091o21628K69154Q04104
$$ 1286903 714028 678661 1010217 1076120 644669 -147717 -1095808 -1717436 -1448282 -644178
37991f44178M3102j172618j003904N85841J589351R90527J31890K46108N92432
$$ -644178 -601076 -1773694 -2777598 -2191757 -602406 388121 520011 766119 1358551
37982A358551K54585q7516K68369M00292n04908j268023n91138M64096J06320
$$ 1358551 1613136 1525620 1793989 2194281 1689373 421350 -169788 294308 400628
37973D00628j090711j140956n390N55193J75196K79620J104767R53816p57337
$$ 400628 -690083 -1831039 -1836429 -1281236 -1106040 -826420 278347 1232163 474826
37964D74826j982539q95364J372405K306399J282599j47121o67447n35213n00163
$$ 474826 -1507713 -2403077 -1030672 1275727 2558326 2411205 1743758 1208545 708382
37955G08382m92691P686P61557P88187j57903q86290l22813P77883Q36184j41994
$$ 708382 215691 223377 984934 1773121 1615218 728928 406115 1183998 2020182 1878188
37945A878188o65743k52706j3924l95548l69503L26579K86496r48410j478568
$$ 1878188 1212445 959739 945815 550267 180764 507343 793839 -154571 -1633139
37936a633139o574J689360J344150l44856j144376p64327m54936l06563M19288
$$ -1633139 -1639713 49647 1393797 1048941 -95435 -859762 -1314698 -1621261 -1201973
37927a201973J118753O25483m52952o46028k29186m33686p70742J05634J441068
$$ -1201973 -83220 542263 89311 -556717 -785903 -1219589 -1990331 -1884697 -443629
37918d43629J242282k20642p66733q53L91140l795J19331P15528K24279j077388
$$ -443629 798653 578011 -188722 -189575 201565 197770 317101 1032629 1256908 179520
37908A79520r75455O65012J226516k25305j258258k97095P87473J94785p51221
$$ 179520 -795935 -130923 1095593 870288 -387970 -685065 102408 297193 -454028
37899d54028k88431O59875M03093o32050j151498j217731j205034m30672J178449
$$ -454028 -742459 -82584 320509 -311541 -1463039 -2680770 -3885804 -4316476 -3138027
37890c138027J923610Q45368m26824l02860K22613k38042p53864k4170Q19108
$$ -3138027 -1214417 -369049 -795873 -1098733 -876120 -1114162 -1868026 -1892196 -1073088
37881a073088J37493j001777m80553J127542J444009J89738o82247l84019r6289
$$ -1073088 -935595 -1937372 -2417925 -1290383 153626 343364 -338883 -722902 -819191
37872h19191m11865m40326K61711Q83979Q48761N65743M76476N18873N36415L39288
$$ -819191 -1231056 -1671382 -1409671 -525692 323069 888812 1365288 1884161 2420576 2759864
37862B759864k85134r26658p43799M156l9223q89110o59185J143000J989909J96624
$$ 2759864 2474730 1548072 804273 808429 769206 -119904 -779089 363911 2353820 2550444
37852B550444j789500r27383J422048J611516m36819j465376m29415L13566m14492
$$ 2550444 760944 -166439 1255609 2867125 2430306 964930 535515 849081 434589
37843D34589q25484J44887R43635M94481M7425M82664N99351l37363r42115k76525
$$ 434589 -390895 -246008 697627 1192108 1239533 1722197 2321548 1984185 1042070 765545
37833G65545L19418k79830q93818l14594M05114j1869o24153q9032P02684K06737
$$ 765545 1084963 805133 -88685 -403279 1835 -10034 -634187 -723219 -20535 186202
37823A86202q47648o25619O04414R65212K03656n4395P41919J177853L72332n99574
$$ 186202 -661446 -1287065 -682651 282561 486217 431822 1173741 2351594 2723926 2124352
37813B124352n63255k9505j69601r73356j363656o99558N00390J197542Q76426
$$ 2124352 1561097 1531592 1361991 388635 -975021 -1674579 -1174189 23353 899779
37804H99779n326n45286l74306P5579L01528K84661J20837l21222r36682j110379
$$ 899779 894453 349167 -25139 50440 351968 636629 757466 436244 -500438 -1610817
37794a610817m73439M83616J081058J252800J114189L77642r16120j651877q37483
$$ -1610817 -2084256 -1600640 -519582 733218 1847407 2225049 1308929 -342948 -1180431
37785a180431O79549R96071k45127j311005q09785N48076J275343J085924N86944
$$ -1180431 -500882 495189 250062 -1060943 -1870728 -1322652 -47309 1038615 1625559
37776A625559q9124j048238j566274p50968P70621J270960L40063m85023j07686
$$ 1625559 1536435 488197 -1078077 -1829045 -1058424 212536 552599 67576 -40110
37767d0110M96146J03736n24973J14315J499304J510557l40354j964895j554957
$$ -40110 456036 559772 34799 149114 1648418 3158975 2818621 853726 -701231
37758g01231J41817J237788J122166M43851k77390q27415q01942j30164L55190
$$ -701231 -559414 678374 1800540 2244391 1967001 1139586 337644 207480 562670
37749E62670o8987q14407q00144q6942M02263M84464P91761J309632J133478k2110
$$ 562670 493683 -320724 -1120868 -1207810 -805547 -321083 470678 1780310 2913788 2891678
37739B891678j151081j272716o14507P484L20930N40797O43478L47036k64005
$$ 2891678 1740597 467881 -146626 -139142 181788 722585 1366063 1713099 1449094
37730A449094n62720m7240Q99718J183132K14020j154830j433351l48299P43695
$$ 1449094 886374 839134 1738852 2921984 3136004 1981174 547823 199524 943219
37721I43219O43627j66064m01887J89640P23206N86578R5021k02646j48302J41404
$$ 943219 1586846 1420782 1018895 1208535 1931741 2518319 2613340 2410694 2262392 2403796
37711B403796M61503N34737K43151j62827l75807m36276n72214q10503r53981
$$ 2403796 2865299 3400036 3643187 3480360 3104553 2668277 2096063 1285560 331579
37702C31579p52718p7239P14071P51796k54900j091080l97735J045678J059451
$$ 331579 -421139 -498378 215693 967489 712589 -378491 -776226 269452 1328903
37693A328903n29701j277806M3604J231470J38348j633210j181095R57907J679069
$$ 1328903 799202 -478604 -435000 796470 934818 -698392 -1879487 -921580 757489
37684G57489K98731o53625J83033J023980K68325r49815r55060j21015L02908
$$ 757489 1056220 402595 585628 1609608 1877933 928118 -26942 -147957 154951
37675A54951L18622N82421Q83901O34078L2035l74851o11333r19693j140547j044990
$$ 154951 473573 1055994 1939895 2573973 2606008 2231157 1619824 700131 -440416 -1485406
37665a485406o24213K18734J346412J694170L03521j705785j927686l4588J496444
$$ -1485406 -2109619 -1890885 -544473 1149697 1453218 -252567 -2180253 -2214841 -718397
37656g18397R53616k47711j63062N82692K62547p92245q18589L28157J023793
$$ -718397 235219 -12492 -175554 407138 669685 -122560 -941149 -612992 410801
37647D10801N67346k9792q9478k52354r12794j193254k99476J112701J784049
$$ 410801 978147 948355 858877 606523 -306271 -1499525 -1799001 -686300 1097749
37638A097749J485625J017505Q17058L45507q58274k014027j763615j23686J101017
$$ 1097749 2583374 3600879 4417937 4763444 3905170 1891143 127528 3842 1104859
37629A104859N66974o92906p67809K72715O54916j14472n25297K05175P03679
$$ 1104859 1671833 978927 211118 483833 1138749 1024277 498980 704155 1407834
37620A407834j62266j218714q61303L24397N74781k75726q02667l49692K46531
$$ 1407834 1245568 26854 -834449 -510052 64729 -210997 -1013664 -1363356 -1116825
37611a116825K25185j16151j46082K76487P83468P93606L8975q43723p98835J47824
$$ -1116825 -891640 -1007791 -1153873 -877386 -93918 699688 738663 -105060 -903895 -756071
37601g56071O80523Q5843o04059k10623P95248J148102O24945o6565n09950o36966
$$ -756071 -75548 10295 -593764 -804387 -9139 1138963 1763908 1697343 1187393 550427
37591E50427k95683K43316J88915m08300l14585P50599J078755l43682j654572
$$ 550427 254744 498060 686975 278675 -35910 714689 1793444 1449762 -204810
37582b04810q00328R39639Q34880q09197j188653K80715J127900J26530q20610
$$ -204810 -1005138 -65499 769381 -39816 -1228469 -947754 180146 306676 -513934
37573e13934j75576P59081M03767m88987n54767j50677j49986r4115O04250J063490
$$ -513934 -689510 69571 473338 -15649 -570416 -721093 -871079 -965194 -360944 702546
37563G02546M13731l76625o3063N87272R5613j027642j063939l4928L69801l02009
$$ 702546 1116277 739652 676589 1263861 1359474 331832 -732107 -767035 -397234 -699243
37553f99243o00568K69680J170507R86505K86418J43238M64809M45052r5652o56698
$$ -699243 -1299811 -1030131 140376 1126881 1413299 1556537 2021346 2466398 2370746 1714048
37543A714048q49733o18349n8965M98403N93423K04062j53689k02207l12992p57656
$$ 1714048 864315 245966 187001 685404 1278827 1482889 1329200 1126993 814001 56345
37533E6345j062984o89791M0666L93622L40934M36111O63215L76300l75343n03633
$$ 56345 -1006639 -1696430 -1655764 -1262142 -921208 -485097 178118 554418 179075 -324558
37523c24558M31420J100085J67217j362870j184164Q49870K100351Q14391j223848
$$ -324558 106862 1206947 1374164 11294 -1172870 -323000 1777351 2591742 1367894
37514A367894j265139L95313J117132Q7764p15316r8627L42360q50817k128252
$$ 1367894 102755 498068 1615200 1702964 987648 889021 1231381 380564 -1747688
37505a747688j126566J455625K599051J250247m65857o36558M643k0714m37784
$$ -1747688 -2874254 -1418629 1180422 2430669 1964812 1328254 1332897 1312183 874399
37496H74399j55944N02101L11336o41149r90928l02368L43639K46371Q9959M50399
$$ 874399 718455 1220556 1531892 890743 -100185 -402553 -58914 187457 277416 727815
37486G27815O50707O2682n52158k31086M54491K51997o62926r34914k23498M03546
$$ 727815 1378522 1441204 889046 657960 1112451 1364448 701522 -233392 -456890 -53344
37476e3344M11050N48418J163120J278102K42503r45858j064776m36704j13389
$$ -53344 357706 906124 2069244 3347346 3589849 2643991 1579215 1142511 1029122
37467A029122j31904J03661L40998j39993r60860r24054J14470R45403P65363
$$ 1029122 897218 1000879 1341877 1201884 241024 -683030 -568560 376843 1142206
37458A142206J00419k84353l44929k75944j9449K97554K25606k55986n15078j97273
$$ 1142206 1242625 958272 613343 337399 317950 615504 841110 585124 70046 -127227
37448a27227K24683K00772j64479m60540m91363j58039N60336J187752R93966
$$ -127227 97456 298228 133749 -326791 -818154 -976193 -415857 771895 1765861
37439A765861Q6052m25660Q5522P53307M25475o36370j164296p29619k03757k99606
$$ 1765861 1851913 1426253 1511775 2265082 2690557 2054187 889891 160272 -43485 -343091
37429c43091n63820k58462M12563O52391L63847L03674Q17906J151686N26469
$$ -343091 -906911 -1165373 -752810 -100419 263428 567102 1385008 2536694 3063163
37420C063163o16440j200686j035532q11194o91760j14644P71186Q35813j67166
$$ 3063163 2446723 1246037 210505 -600689 -1292449 -1407093 -635907 199906 32740
37411C2740p99420q4137P96215M16611m01647L8801J242676J174815k65551r55836
$$ 32740 -766680 -850817 -54602 362009 -39638 -837 1241839 2416654 2151103 1195267
37401A195267o3928O78813Q6137n08913K09857J132218O73536n06211p53517j64339
$$ 1195267 1131339 1810152 1896289 1387376 1597233 2729451 3402987 2896776 2143259 1978920
37391A978920J0052j99264K02418R41775P14320m75428j173684p86096k53502
$$ 1978920 1988972 1789708 1992126 2933901 3648221 3172793 1999109 1213013 959511
37382I59511j86377j0574N81151Q32208K04215p15814j138070r28007k12304Q11512
$$ 959511 773134 762560 1343711 2175919 2380134 1664320 526250 -401757 -614061 197451
37372A97451J378162O73855p00453j000405L21443J682205J467277q71j313775
$$ 197451 1575613 2249468 1549015 548610 870053 2552258 4019535 4018664 2704889
37363B704889j712029j151511K14722J548726J401344l85532j736674q38581J114874
$$ 2704889 992860 -158651 56071 1604797 3006141 2620609 883935 45354 1160228
37354A160228J443165j49532j249461m07879R36355R53768L890n28857n36023
$$ 1160228 2603393 2453861 1204400 796521 1732876 2686644 2690534 2161677 1625654
37345A625654p12604p34802K38080J563099J446130m32653k128877j896575k87789
$$ 1625654 913050 178248 416328 1979427 3425557 2992904 864027 -1032548 -1320337
37336a320337R52232J110875O93196J43307m46122o93537j77658O40020P34489
$$ -1320337 -368105 742770 1435966 1579273 1133151 439614 261956 901976 1636465
37327A636465l3963o33375l13730M30908P59883O27487M58895K68398j79982o63535
$$ 1636465 1602502 969127 655397 1086305 1846188 2473675 2932570 3200968 3020986 2357451
37317B357451o67619j58170L71969N77062N22308L49855J36521N2206K43669N58181
$$ 2357451 1689832 1531662 1903631 2480693 3003001 3352856 3489377 3541583 3785252 4343433
37307D343433P09761O60483N43369L80095K38265M08855R14521J109018M49047
$$ 4343433 5053194 5713677 6257046 6637141 6875406 7284261 8198782 9307800 9756847
37298I756847n37600q82089o34985o56168r28241m23771Q79039J297454j58909
$$ 9756847 9219247 8337158 7702173 7046005 6117764 5693993 6573032 7870486 7711577
37289G711577j861804j565978L61633J459352O91985l95416l44973K03305N5031
$$ 7711577 5849773 4283795 4645428 6104780 6796765 6401349 6056376 6259681 6314712
37280F314712m75679l76090J63863J37148m78652p21619l00710N4318j4790L0157
$$ 6314712 5839033 5462943 5626806 5763954 5285302 4563683 4262973 4317291 4302501 4332658
37270D332658M45938O14697J68816k14807J44531P83553P78584J32027l13716
$$ 4332658 4778596 5393293 5562109 5347302 5491833 6275386 7053970 7185997 6872281
37261F872281j30630K28469J76542l23415q33247q49815k17313N83596P53513
$$ 6872281 6741651 6970120 7146662 6823247 5990000 5140185 4922872 5506468 6259981
37252F259981J17243n11280l35990L38189O00525K66813k5952K3803j5077l62899
$$ 6259981 6377224 5865944 5529954 5868143 6468668 6735481 6709529 6733332 6718255 6355356
37242F355356n06140o4569M45207K98460l65720p27452l30355N32620J302333
$$ 6355356 5849216 5784647 6229854 6528314 6162594 5435142 5104787 5637407 6939740
37233F939740J549158J028468q8838r91843p86396M48965J527637J415517M06881
$$ 6939740 8488898 9517366 9428528 8436685 7650289 8099254 9626891 11042408 11449289
37224A1449289l10951j01584N85473J109051J441858J733015J611565O63954n49627
$$ 11449289 11138338 11036754 11622227 12731278 14173136 15906151 17517716 18181670 17632043
37215A7632043p68126M62981K163420L076396K927503K279547J797184K076375
$$ 17632043 16863917 17326898 19490318 22566714 25494217 27773764 29570948 31647323
37207C1647323L464065N346846O291208N844457N668796P706565J1540192J4958310
$$ 31647323 35111388 40458234 46749442 52593899 58262695 65969260 77509452 92467762
37199I2467762J7093870J9402491K3110106K7313849L0561458L2862662L4615729
$$ 92467762 109561632 128964123 152074229 179388078 209949536 242812198 277427927
37192B77427927L4490094L0331172K2220348J3174843O423865K898340J447866
$$ 277427927 311918021 342249193 364469541 377644384 384068249 386966589 388414455
37185C88414455K69075k308367p105752j3009121j7229834j7778737j5526451
$$ 388414455 388683530 386375163 379269411 366260290 349030456 331251719 315725268
37178C15725268j3039489j1705144j1022130j0476653j0541184j1217643j1000915
$$ 315725268 302685779 290980635 279958505 269481852 258940668 247723025 236722110
37171B36722110q611139n012210k286366r15267K14571J173995K79222l298949
$$ 236722110 228110971 223098761 220812395 219897128 220111699 221285694 221564916 218265967
37163B18265967p883073j1360058j3517515j4991539j5273411j3703544j1542885
$$ 218265967 210382894 199022836 185505321 170513782 155240371 141536827 129993942
37156A29993942j0761870j1038947j0240032p995288o434582o733667p223840
$$ 129993942 119232072 108193125 97953093 89957805 83523223 76789556 69565716
37149F9565716o131080m243735l322968l426617l513331l471183l748514l891426
$$ 69565716 63434636 59190901 55867933 52441316 48927985 45456802 41708288 37816862
37141C7816862l255273k502437k651947l194666k900712k001193j684372j800787
$$ 37816862 34561589 32059152 29407205 26212539 23311827 21310634 19626262 17825475
37133A7825475j171757p6572j39229j416723j941636r54743l07991j327487k347118
$$ 17825475 16653718 16577146 16437917 15021194 13079558 12124815 11816824 10489337 8142219
37124H142219j272795R14137J459296j76036j844416j953175j090602k67194N01257
$$ 8142219 6869424 7783561 9242857 9066821 7222405 5269230 4178628 3911434 4412691
37115D412691J213659J135269N6515q47323n26227L46976L79400m86770j067741
$$ 4412691 5626350 6761619 6818134 5970811 5444584 5791560 6170960 5684190 4616449
37106D616449q10957l95858m11048n29661l49446j29253j46879o4030M02410P54276
$$ 4616449 3805492 3409634 2998586 2468925 2119479 1990226 1843347 1779317 2181727 2936003
37096B936003M24965j86874k23820L22438O40357L32224j93020n24089o09375
$$ 2936003 3360968 3174094 2950274 3272712 3913069 4245293 4052273 3528184 2918809
37087B918809k94247N80491J447430J329757K37892o13944l88920M03947R22387
$$ 2918809 2624562 3205053 4652483 5982240 6220132 5606188 5217268 5621215 6543602
37078F543602J041189Q57752J49997q91625j284499n32983M40842N52319K2562
$$ 6543602 7584791 8442543 8592540 7700915 6416416 5883433 6324275 6876594 6899156
37069F899156l37994n08974p97918p82899q4034M31538k44761j351199j175486
$$ 6899156 6561162 6052188 5254270 4471371 4387337 4818875 4574114 3222915 2047429
37060B047429L57740J515283J224437K14348m59048n96960l57573O2153M3155
$$ 2047429 2405169 3920452 5144889 5359237 4900189 4303229 3945656 4007809 4050964
37051D050964q04893j491391o68209J036654J486163K26598p52760k14725M19133
$$ 4050964 3246071 1754680 1086471 2123125 3609288 3835886 3083126 2868401 3287534
37042C287534l52828j476185j074504M96613J280581O41449k58716n03663l40583
$$ 3287534 2934706 1458521 384017 880630 2161211 2802660 2543944 2040281 1699698
37033A699698k00329j31648k05490m79006o20677l35712P8841K72870M83404R13344
$$ 1699698 1499369 1367721 1162231 683225 62548 -273164 -194323 78547 561951 1475295
37023A475295J066266N68430L6438J37509L80873n8436q44693r89561m32508N5361
$$ 1475295 2541561 3109991 3146429 3283938 3664811 3606375 2761682 1772121 1339613 1394974
37013A394974J77199J83978M7611k65611j60739O37294R89731k38651k002364
$$ 1394974 1572173 1756151 1803762 1538151 1377412 2014706 3004437 2765786 763422
37004G63422k096259l33214J128548R22678J41854K40646Q95693R21394J22791
$$ 763422 -1332837 -1666051 -537503 385175 527029 767675 1663368 2584762 2707553
36995B707553p65911j190002j027004l61404L97341P12072N92565M87456L71294
$$ 2707553 1941642 751640 -275364 -636768 -239427 472645 1065210 1552666 1923960
36986A923960k12457j030828j132485l13307M12757K97471j37401j09692L04137
$$ 1923960 1711503 680675 -451810 -765117 -352360 -54889 -192290 -301982 2155
36977B155O18869P01678N72960K03090j01641O7935L20673j92756j229463j470574
$$ 2155 621024 1322702 1895662 2098752 1997111 2065046 2385719 2192963 963500 -507074
36967e07074n47963L02258K63504J59893P46384J244018P73691p8043m42557o30687
$$ -507074 -1055037 -752779 -489275 -329382 417002 1661020 2434711 2356668 1914111 1283424
36957A283424r75251n93053Q98133J740203L75328j565816j244616R41810J783554
$$ 1283424 308173 -284880 613253 2353456 2728784 1162968 -81648 860162 2643716
36948B643716K02161j214425m44791R70958P08057p76325j416446p82230j11019
$$ 2643716 2845877 1631452 1186661 2157619 2865676 2089351 672905 -109325 -220344
36939b20344L1943K15848O27184O92595J91761m21590p91834q61071m66552L66180
$$ -220344 -188401 27447 654631 1347226 1538987 1117397 325563 -535508 -1002060 -635880
36929f35880R05059M29251n97156r63656l28948M70856P81046Q55151R69272P40251
$$ -635880 269179 698430 101274 -862382 -1191330 -720474 60572 915723 1884995 2625246
36919B625246r9193r13552q81324j64895L10402J04679l38305n38012n71318n88948
$$ 2625246 2526053 1612501 731177 566282 876684 981363 643058 105046 -466272 -1055220
36909a055220l27453L96700J076568J025939L53374k11364m03617n82574p30980
$$ -1055220 -1382673 -985973 90595 1116534 1469908 1258544 854927 272353 -458627
36900d58627k55472P81944J210487L47970p52085p23038P4000K41289l47287n14930
$$ -458627 -714099 67845 1278332 1626302 874217 151179 225179 466468 119181 -395749
36890c95749R30P0704o47980q06639L90268J536132R93894n60610j138090l28345
$$ -395749 -394819 -324115 -972095 -1778734 -1388466 147666 1141560 580950 -557140 -885485
36880h85485M23068J76930m17080n27533k89380j45097m7970K02840N16840P43786
$$ -885485 -462417 -285487 -702567 -1230100 -1519480 -1664577 -1712547 -1509707 -992867 -249081
36870b49081Q34242O42977J28853k46455K065N29997N94768L02804L95408P02727
$$ -249081 585161 1228138 1356991 1110536 1112601 1642598 2237366 2540170 2935578 3638305
36860C638305J22246j378108k113526j007186N99576P77157k11646n49534J89367
$$ 3638305 3760551 2382443 268917 -738269 -138693 638464 426818 -122716 66651
36851F6651N46849k49974r94365m96588N28187O70723M539k06172M55562J026913
$$ 66651 613500 363526 -630839 -1127427 -599240 71483 76022 -130150 325412 1352325
36841A352325O71166k57171q79658q06965j94923O32862J238407J154935L53891
$$ 1352325 2023491 1766320 886662 79697 -115226 517636 1756043 2910978 3264869
36832C264869n55776r12458o70667k69154j1890J22761J83458J42478J33854M44096
$$ 3264869 2709093 1796635 1125968 856814 844924 967685 1151143 1293621 1427475 1871571
36822A871571J058295J422559R43914k73654j386585j602127r55220k31166j19184
$$ 1871571 2929866 4352425 5296339 5022685 3636100 2033973 1078753 847587 728403
36813G28403m94282o10714l7098P26552P88138K2904o66142n08119Q4789K14527
$$ 728403 234121 -376593 -413691 312861 1100999 1123903 457761 -50358 34431 248958
36803B48958K0707N18822J662819J766360j34574k258284k027395K81166J731372
$$ 248958 269665 788487 2451306 4217666 4083092 1824808 -202587 78579 1809951
36794A809951Q54716m81845l30620K91894m61479j715313j184169O96668J054323
$$ 1809951 2664667 2182822 1852202 2144096 1682617 -32696 -1216865 -520197 534126
36785E34126p57580j860031l73480J541098J117375p62155j259370j9680Q71882
$$ 534126 -223454 -2083485 -2456965 -915867 201508 -560647 -1820017 -1839697 -967815
36776i67815N89747L84738P98484P18099l22659j170453j088877p99672p21131
$$ -967815 -378068 6670 805154 1523253 1200594 30141 -1058736 -1858408 -2579539
36767b579539q1699J219356J698189N34137q39964q53849j28339o5430l43074
$$ -2579539 -2661238 -1441882 256307 790444 -49520 -903369 -1031708 -1097138 -1440212
36758a440212K31628J211400J024693k69911q47980M2591R79772O87661j31754
$$ -1440212 -1208584 2816 1027509 757598 -90382 -47791 931981 1619642 1487888
36749A487888j83857L99310N18351j12704o95313n99965p8395K77713K47662K3308
$$ 1487888 1304031 1703341 2221692 2108988 1413675 813710 735315 1013028 1260690 1283998
36739A283998j73182l28600n02673n57235k35857L82239P63930N32388R514j90130
$$ 1283998 1110816 782216 279543 -277692 -513549 -131310 632620 1165008 1174522 984392
36729I84392J7340J43229j31032n31097n79237j69016L33469M62906J13985l54822
$$ 984392 1001732 1144961 1013929 482832 -96405 -265421 68048 530954 644939 290117
36719B90117n16138k81440K01422P80943J081739M63900j035404k028412j185244
$$ 290117 -226021 -507461 -306039 474904 1556643 2020543 985139 -1043273 -2228517
36710b228517P06500J453639M87793m01099q1M43247m63983j698529j389345K40950
$$ -2228517 -1522017 -68378 419415 18316 18235 461482 -2501 -1701030 -3090375 -2849425
36700b849425J479201J753559J596622Q19051q67854j972535p36434J538565J598117
$$ -2849425 -1370224 383335 1979957 2799008 1931154 -41381 -777815 760750 2358867
36691B358867q78009k467747j080590J084447J269780J73547L750O63690N26175
$$ 2358867 1480858 -986889 -2067479 -983032 286748 460295 464045 1127735 1653910
36682A653910l95379p14224k96624j88901m22117j44284L76741O8787p54073o65205
$$ 1653910 1258531 544307 247683 58782 -363335 -507619 -130878 -62091 -816164 -1481369
36672a481369L10286N30583m47462r18530K74458J787309J653748l4748j450423
$$ -1481369 -1171083 -640500 -1087962 -2006492 -1732034 55275 1709023 1674275 223852
36663B23852j342718j26996R31610R69571J79909m45295k00652M98016O92679
$$ 223852 -1118866 -1245862 -314252 655319 835228 389933 189281 687297 1379976
36654A379976J23439o36463j062443j012774m14519N54644J160060R00705M11530
$$ 1379976 1503415 866952 -195491 -1208265 -1622784 -1068140 91920 992625 1404155
36645A404155N39360P71619l4281j413444j496999J06604J358765O60775q18591
$$ 1404155 1943515 2715134 2680853 1267409 -229590 -122986 1235779 1896554 1077963
36636A077963r98334Q9988P28002K66608k77426k62225m22087j339376k111376
$$ 1077963 79629 169617 897619 1164227 886801 624576 202489 -1136887 -3248263
36627c248263j431958M93060J938214J616924J42188p82459l93735M44689O83965
$$ -3248263 -4680221 -4187161 -2248947 -632023 -489835 -1272294 -1666029 -1221340 -537375
36618e37375N06209O59168R31204M09354q05922j365312n46711O67034R95333
$$ -537375 -31166 628002 1559206 1968560 1162638 -202674 -749385 -82351 912982
36609I12982M80882j4448j74633k22310j23889K40635M53822K5207o87860q50863
$$ 912982 1393864 1379416 1204783 982473 858584 1099219 1553041 1578248 890388 39525
36599C9525l71966O696j46013l99690j84885M49924R41105P48496j80357j183359
$$ 39525 -332441 -325745 -471758 -871448 -1056333 -606409 334696 1083192 902835 -280524
36589b80524j299619l24877P48661Q45891J58071k39906L0229K47117j30947n79279
$$ -280524 -1580143 -1905020 -1156359 -310468 -152397 -392303 -362074 -114957 -245904 -825183
36579h25183l09960N70778J202921J014095K30022n19150p79088m83922J49093
$$ -825183 -1135143 -564365 638556 1652651 1882673 1363523 584435 100513 249606
36570B49606P77307J006094N15708n73998j462929j268788j64261N36269l6012
$$ 249606 1026913 2033007 2548715 1974717 511788 -757000 -921261 -384992 -421004
36561d21004r99745p96022N86483J454592P26785n59050o99079M18874J373818
$$ -421004 -1420749 -2216771 -1630288 -175696 551089 -7961 -707040 -288166 1085652
36552A085652J143684O3603j016985j595855j409164l90832Q14602J061456Q8757
$$ 1085652 2229336 2292939 1275954 -319901 -1729065 -2119897 -1305295 -243839 -155082
36543a55082q46994m89338O69654J071047L00343m76953l92286j2170r2942k73955
$$ -155082 -1002076 -1491414 -821760 249287 549630 72677 -319609 -331779 -424721 -698676
36533f98676R6019O17897M32813k96499o24380l34333j08865k31976k20202J21638
$$ -698676 -602657 15240 448053 151554 -472826 -807159 -916024 -1148000 -1368202 -1246564
36523a246564L24565J93397J42660K78711J23527l42666l69335K71218O42772
$$ -1246564 -921999 -728602 -585942 -307231 -183704 -526370 -895705 -624487 18285
36514A8285K0746r31244j152328o12278N3779O08541J028137R52242L03069j58535
$$ 18285 39031 -892213 -2044541 -2656819 -2603040 -1994499 -966362 -14120 288949 130414
36504A30414R1222L24226k68797j032271q01545J21037M64778J14125O8106M36308
$$ 130414 221636 545862 277065 -755206 -1556751 -1435714 -970936 -856811 -788705 -352397
36494c52397K98597l17856k47272N93077P53876j87688n79652N74704J651761
$$ -352397 -53800 -371656 -618928 -25851 728025 540337 -39315 535389 2187150
36485B187150Q44791r05683j416134o37747k97708p32031m66541R43383J881823
$$ 2187150 3031941 2126258 710124 72377 -225331 -957362 -1423903 -480520 1401303
36476A401303J155345k68376r15934p94819o92739o18733j42750M19955L48624
$$ 1401303 2556648 2288272 1372338 577519 -115220 -733953 -876703 -456748 -108124
36467a08124k61374n63843j44027N62002R61790Q78529M90292J18483L948J2375
$$ -108124 -369498 -933341 -1077368 -515366 446424 1324953 1815245 1933728 1937676 1950051
36457A950051k31764o56542n76645L19385J186334R11780l49427j235995q52374
$$ 1950051 1718287 1061745 485100 804485 1990819 2902599 2553172 1317177 464803
36448D64803K26787Q24177N23220j55363n84922o24706m66079k27278J25100N03056
$$ 464803 691590 1515767 2038987 1883624 1298702 673996 207917 -19361 105739 608795
36438F08795N61172Q7528n06631m88860K17872P80653N46307k3985q4705K56871
$$ 608795 1169967 1257495 750864 262004 479876 1260529 1806836 1782851 1698146 1955017
36428A955017J39379o10125j149473r27376m22486j59845J56953Q39610J248662
$$ 1955017 2094396 1484271 334798 -592578 -1015064 -1174909 -1017956 -178346 1070316
36419A070316O09654n50201q26214J63859J191286R94008k31602j273359j335113
$$ 1070316 1679970 1129769 303555 467414 1658700 2652708 2421106 1147747 -187366
36410a87366o19658J82027N54650M39531J75201J60122M28144N80651K16471n92373
$$ -187366 -807024 -624997 -70347 369184 544385 704507 1132651 1713302 1929773 1337400
36400A337400j263763j142483j09682J130425J560496Q90776o2053l34416K4770
$$ 1337400 73637 -1068846 -1178528 -48103 1512393 2403169 2341116 2006700 2031470
36391B031470J96113j37261l99055j30956K59153J72819k21747k68678J51249
$$ 2031470 2227583 2090322 1691267 1560311 1819464 1992283 1770536 1501858 1653107
36382A653107M42596J78018k90076l24642J21399M20813P7952o18463r62116p33127
$$ 1653107 2095703 2273721 1983645 1659003 1780402 2201215 2279167 1660704 698588 -34539
36372c4539l65929j62846J38054O55294P62234o5874j088292r53240L89883J399455
$$ -34539 -400468 -563314 -425260 230034 992268 926394 -161898 -1115138 -725255 674200
36362F74200R67436j28367m65042K3307K09478l94202r69874o76118J73907N98026
$$ 674200 1641636 1513269 1048227 1071534 1281012 886810 -83064 -759182 -585275 12751
36352A2751K12045l82040m01174J61831N24723R0837p34414r92636l83722M19998
$$ 12751 224796 -157244 -558418 -396587 128136 218973 -515441 -1508077 -1891799 -1471801
36342a471801P77080Q32055R04611O83274k49733j325354j286154J69768J654837
$$ -1471801 -694721 137334 1041945 1725219 1475486 150132 -1136022 -966254 688583
36333F88583J529790j26660j520042j252435J4054N03526k68251q80734j30510
$$ 688583 2218373 2091713 571671 -680764 -666710 -163184 -431435 -1312169 -1442679
36324a442679J123830J168033o1100r28156m64099N09431Q51727M77420j64034
$$ -1442679 -318849 849184 788084 -140072 -604171 -94740 756987 1234407 1070373
36315A070373q10013j025194k80978R13584J123917M0021q16480m07097J78271
$$ 1070373 260360 -764834 -1045812 -132228 991689 1031710 215230 -191867 -13596
36306a3596k71277q44407j36295J022860P60277n96929r66665J5942N47609q6365
$$ -13596 -284873 -1129280 -1265575 -242715 517562 -79367 -1046032 -1030090 -482481 -568846
36296e68846l86186N14390J312630R82843N51752R57924J083074k60323j904978
$$ -568846 -955032 -440642 871988 1854831 2406583 3364507 4447581 4187258 2282280
36287B282280j917097n88538J45507l47674r02604o83406r3141L92932Q26099
$$ 2282280 365183 -223355 -77848 -425522 -1328126 -2011532 -2104673 -1711741 -885642
36278h85642J095479Q35107J85105k65760l34765k65964n1072M14642O88656K53936
$$ -885642 209837 1044944 1230049 964289 629524 363560 312488 727130 1415786 1669722
36268A669722m56941m80979K09866N76654l0124j069124j603458j225832j04054
$$ 1669722 1212781 731802 941668 1518322 1488198 419074 -1184384 -2410216 -2514270
36259b514270J229732J993830J646869M82108n97175r38523n54695J07059M58499
$$ -2514270 -1284538 709292 2356161 2838269 2241094 1302571 747876 854935 1313434
36250A313434R9851p17796j191245q79750k07558K34689L85791L67821J20728
$$ 1313434 1413285 695489 -495756 -1375506 -1583064 -1348375 -962584 -594763 -474035
36241d74035j41421J11422P22294P05993j58598o62547p8595M53325j86374j007832
$$ -474035 -615456 -504034 218260 924253 765655 103108 24513 477838 291464 -716368
36231g16368n08090O21583N45588n83958r05201l409O35699L91027K82798O47638
$$ -716368 -1224458 -602875 -57287 -641245 -1546446 -1549855 -914156 -523129 -240331 407307
36221D07307M76356l20327l79093N58968R09966O1853m62279J09923K22860j049650
$$ 407307 883663 563336 184243 743211 1653177 1715030 1252751 1362674 1585534 535884
36211E35884j876716o31745J128634J120116J1886o6324O80912L57863j038338
$$ 535884 -1340832 -1972577 -843943 276173 288059 221735 902647 1260510 222172
36202B22172j618621q19741Q5198N23779J082488J473921O69736p15792p50799
$$ 222172 -1396449 -2216190 -2130992 -1607213 -524725 949196 1618932 903140 152341
36193A52341O26785J222916P7604j080352q37727k33047n55858j058344n10081
$$ 152341 779126 2002042 2079646 999294 161567 -71480 -627338 -1685682 -2195763
36184b195763N47330Q13158L50269J19864K65838K75134J51203J76529J03410
$$ -2195763 -1648433 -835275 -485006 -365142 -99304 175830 327033 503562 606972
36175F06972l28929o60843m77865k59140m74191n24759K89913J308125J201725
$$ 606972 278043 -382800 -860665 -1119805 -1593996 -2118755 -1828842 -520717 681008
36166F81008j32506j378404j370412j78990J118438J268810m5374j469880j142690
$$ 681008 548502 -829902 -2200314 -2379304 -1260866 7944 -37430 -1507310 -2650000
36157b650000Q15080K012714Q97237j011499j328779j79548M30735r9886m38110
$$ -2650000 -1834920 177794 1075031 63532 -1265247 -1444795 -1014060 -1113946 -1552056
36148a552056J01332O03571N43144P29386J488087J631251L62248j137632j327633
$$ -1552056 -1450724 -847153 -304009 425377 1913464 3544715 3906963 2769331 1441698
36139A441698n61187l53797r70016j134086o8140J334112J655185N75644r44635
$$ 1441698 880511 526714 -443302 -1577388 -1645528 -311416 1343769 1919413 974778
36130I74778j690297j178743Q4293J095865J183170N01102k11282l59515m6941
$$ 974778 -715519 -1894262 -1809969 -714104 469066 970168 758886 399371 352430
36121C52430Q5005l04105o31482l8154J193497J551785K49527j336378j234992
$$ 352430 437435 133330 -498152 -536306 657191 2208976 2458503 1122125 -112867
36112a12867L85711J354813M99266q68263j032833j62611M63174M72155L76847
$$ -112867 272844 1627657 2126923 1258660 225827 63216 526390 998545 1375392
36103A375392K38229k31980o08922k56623K44437k67392j334156j048350R24942
$$ 1375392 1613621 1381641 772719 516096 760533 493141 -841015 -1889365 -964423
36094i64423K215362R26425j410976j830438n7403J386470R75916q1370l50012
$$ -964423 1250939 2177364 766388 -1064050 -1121453 265017 1240933 1159563 809551
36085H09551l33992r44552j414554m78915J218980J713483N19927p11778n53403
$$ 809551 475559 -468993 -1883547 -2362462 -1143482 570001 1089928 378150 -175253
36076a75253M49724Q31320J07560q98772j125796l02097Q22768J197530O06089
$$ -175253 274471 1105791 1213351 314579 -811217 -1113314 -290546 906984 1513073
36067A513073j63742n29258q22440j192614p74153P86632J851804P41371j295004
$$ 1513073 1349331 820073 -2367 -1194981 -1969134 -1182502 669302 1410673 115669
36058A15669j385611O07447J664978K77811j224203n51273R27934P84062l48620
$$ 115669 -1269942 -662495 1002483 1280294 56091 -495182 432752 1216814 868194
36049H68194j95625R69243Q28683q16269j624287o16071M87877M50611K68866
$$ 868194 672569 1641812 2470495 1654226 29939 -586132 -98255 352356 621222
36040F21222P13533O76231n33863j398079n29291Q35666O57067p53527j393864
$$ 621222 1334755 2010986 1477123 79044 -450247 385419 1042486 288959 -1104905
36031a104905o66550J31534J36540n4054J73418M40303K52271j42008k70334j53279
$$ -1104905 -1771455 -1639921 -1503381 -1557435 -1384017 -943714 -691443 -833451 -1103785 -1257064
36021a257064n9745L4521L34598P22653O89770o1675r89537j024580J45161J356962
$$ -1257064 -1316809 -1282288 -947690 -225037 464733 403058 -586479 -1611059 -1465898 -108936
36011a08936J147724l95039j623703j279492J89853J411434J528348O55453m51098
$$ -108936 1038788 643749 -979954 -2259446 -2069593 -658159 870189 1525642 1074544
36002A074544r18408n08915Q624j73204o18051k28697Q83570J322197N06295m44162
$$ 1074544 156136 -352779 -344155 -517359 -1135410 -1364107 -480537 841660 1347955 903793
35992I03793n10856j82053k15615k30322L21112P79146K22437q77618j255930
$$ 903793 392937 210884 -4731 -235053 86059 865205 1087642 210024 -1045906
35983a045906o82831k4501J76950Q6016j59879m96895m82273J88445R02757Q24847
$$ -1045906 -1728737 -1753238 -1576288 -1490272 -1650151 -2147046 -2629319 -2440874 -1538117 -713270
35973g13270J75594j13581J74977M27546L45211K27213J77344m5636l86906n12476
$$ -713270 -537676 -651257 -476280 -48734 296477 523690 701034 655398 268492 -243984
35963b43984m25412l50399j84014J87389L30672o6968l26641K99087J095534O33701
$$ -243984 -669396 -1019795 -1203809 -1016420 -685748 -752716 -1079357 -780270 315264 948965
35953I48965r44409j810689r40406N91602J313825J158428Q59378N93369J40642
$$ 948965 4556 -1806133 -2746539 -2154937 -841112 317316 1176694 1770063 1910705
35944A910705k86958k88235K0994K23101K24850J40936r9420m76917n34258O2401
$$ 1910705 1623747 1335512 1356506 1579607 1804457 1945393 1845973 1369056 834798 897199
35934H97199P84176P08930k40844j089186j012830k97421K19612K82685K70355
$$ 897199 1681375 2390305 2149461 1060275 47445 -249976 -30364 252321 522676
35925E22676K92056l1569o85044r09803l11925L07496P4411m80303j71139Q49120
$$ 522676 814732 783163 98119 -811684 -1123609 -816113 -741702 -1222005 -1393144 -544024
35915e44024J141610J24538j101869j357466o26775N57210J668765J843609N25270
$$ -544024 597586 722124 -379745 -1737211 -2363986 -1806776 -138011 1705598 2230868
35906B230868j079146r42721P03407J243745l51209j713434q51650O16059L42413
$$ 2230868 1151722 209001 912408 2156153 1804944 91510 -760140 -144081 198332
35897A98332p56503l99063Q00231M82875r93469j011482O28042J254805m1766
$$ 198332 -558171 -957234 -157003 325872 -667597 -1679079 -1051037 203768 162002
35888A62002r46842k9576J033221P25170J62291N74168R38410Q8461r73402q56622
$$ 162002 -784840 -814416 218805 943975 1106266 1680434 2618844 2707305 1733903 877281
35878H77281j22564J544k79787k21255j10404l54780l45582K73273N59493p6301
$$ 877281 754717 756261 476474 255219 144815 -209965 -555547 -282274 277219 200918
35868B00918o07586k10690K08356j59470l55497M16434R17237L4685q27162J863
$$ 200918 -406668 -617358 -409002 -568472 -923969 -507535 409702 444387 -382775 -380912
35858c80912J222393M28041j723783k229178l00654J672443J850311R97975L76331
$$ -380912 841481 1269522 -454261 -2683439 -2984093 -1311650 538661 1536636 1912967
35849A912967n8585o02675q52640o09736l16747q5924M23819R17066O44704j31699
$$ 1912967 1854382 1251707 399067 -210669 -527416 -613340 -189521 727545 1372249 1240550
35839A240550l33982Q5167Q0526m39975k74724Q18149J303113K19001j193470
$$ 1240550 906568 991735 1072261 632286 357562 1175711 2478824 2697825 1504355
35830A504355j351726n65101j61220l64966m08411j24408m6083j35278L23856
$$ 1504355 152629 -412472 -573692 -938658 -1347069 -1471477 -1517560 -1652838 -1328982
35821a328982J367518J861134Q88537q69497j743134r86018M17376J052440P43015
$$ -1328982 38536 1899670 2788207 1918710 175576 -810442 -393066 659374 1402389
35812A402389M09536N36077N95575J09389n46949p84887n97305l05638r4753j34130
$$ 1402389 1811925 2348002 2943577 3052966 2506017 1721130 1123825 818187 723434 589304
35802E89304n22538q33023m86748J77158K08150k94066j37204Q48003J246636
$$ 589304 66766 -766257 -1253005 -1075847 -867697 -1161763 -1298967 -450964 795672
35793G95672M79019Q303P85987J294181M9590j528590j170973M82538R05906j88146
$$ 795672 1274691 1282994 2068981 3363162 3412752 1884162 713189 1195727 2101633 1913487
35783A913487o43814L05288Q81735k6352j058441p56047K80207O92768K97242
$$ 1913487 1269673 1574961 2456696 2430344 1371903 615856 896063 1588831 1886073
35774A886073k51145n52895n18300k63413k79852p76654r20150O3229J279916
$$ 1886073 1634928 1082033 563733 300320 20468 -756186 -1676336 -1613107 -333191
35765c33191J223075J87933k27061J29711r7663j010276j090286o4349M00421
$$ -333191 889884 1077817 850756 980467 882804 -127472 -1217758 -1282107 -881686
35756h81686l03432n37323N90899J470919P59968l04593j70061M09927M4253o53879
$$ -881686 -1185118 -1722441 -1131542 339377 1099345 794752 624691 1034618 1078871 424992
35746D24992k88750O96955Q15700Q2092k83300p7168j32520n14927m33349K27275
$$ 424992 136242 833197 1648897 1730989 1447689 1370521 1238001 723074 289725 517000
35736E17000P08647N92345J17560m55132q86469p88915k37053K1773k91263m24881
$$ 517000 1225647 1817992 1935552 1480420 593951 -194964 -432017 -410244 -701507 -1126388
35726a126388N7759M08011J02672o8890M80338P79823n8905j020596p35830J66049
$$ -1126388 -1068629 -660618 -557946 -626836 -146498 633325 574420 -446176 -1182006 -1015957
35716a015957J76718m56396l24234M91531N96937j20041l10318L29545N16943
$$ -1015957 -839239 -1295635 -1619869 -1128338 -531401 -651442 -961760 -632215 -115272
35707a15272k60973q29608m02908J77361R6913o0666M04987Q80366M23912o02773
$$ -115272 -376245 -1205853 -1608761 -1431400 -1334487 -1395153 -990166 -109800 314112 -288661
35697b88661r67488k66065O39997P85902J69219m08495l41514Q9103J64903k12705
$$ -288661 -1256149 -1522214 -882217 -96315 72904 -335591 -677105 -588002 -423099 -635804
35687f35804l77407N5536O10610P49390N74832K89837k77870r85059j020628p3856
$$ -635804 -1013211 -957675 -347065 402325 977157 1266994 989124 4065 -1016563 -1090419
35677a090419Q75717Q47264K53853O5650K85884K95410L5468k25011o07320j034581
$$ -1090419 -214702 632562 886415 952065 1237949 1533359 1568827 1343816 736496 -298085
35667b98085p54692L58742J000908L42264l51555K38484R61873m480j729566j645388
$$ -298085 -1052777 -694035 306873 649137 297582 536066 1497939 1493459 -236107 -1881495
35657a881495K85626J452184P65249l1541K01348K51023o31524r89973J15728
$$ -1881495 -1595869 -143685 621564 590023 791371 1042394 410870 -579103 -463375
35648d63375J085537M31304o19555l48590L78627k61315j601298j342084O81021
$$ -463375 622162 1053466 433911 85321 463948 202633 -1398665 -2740749 -2059728
35639b059728K103505J452870j41226j009299r60837o50433k90651K25049P25370
$$ -2059728 43777 1496647 1355421 346122 -614715 -1265148 -1555799 -1330750 -605380
35630f05380R18477P35431K44003m11019q85969q46694l57588K41247P63267J134497
$$ -605380 313097 1048528 1292531 881512 -4457 -851151 -1208739 -967492 -204225 930272
35620I30272J076577L21274q24644j510789j102482J74095J346551J490328N86813
$$ 930272 2006849 2328123 1503479 -7310 -1109792 -935697 410854 1901182 2487995
35611B487995m31071p09935m23181l12147m92079l99407R9486L81252Q6284k81307
$$ 2487995 2056924 1346989 923808 611661 119582 -279825 -180339 200913 287197 5890
35601E890j32986M31205R36208J045971N52039m77188j314188j099752k5551P92805
$$ 5890 -127096 304109 1240317 2286288 2838327 2361139 1046951 -52801 -78352 714453
35591G14453Q38775O35346M43624j86454j031833q39272O33387J590108O18360
$$ 714453 1553228 2188574 2632198 2445744 1413911 574639 1208026 2798134 3416494
35582C416494r91725j047353K63320Q39498r81p54501m06346J38164r0010n46569
$$ 3416494 2424769 1377416 1640736 2480234 2479253 1724752 1318406 1456570 1366560 819991
35572H19991m09148p3642k84171o77159l71436M96006Q97232L89361l91426o91179
$$ 819991 410843 337201 53030 -624129 -995565 -499559 397673 787034 395608 -295571
35562b95571m30768M1899M82930Q26038R70482P15234j7714q66924j123123m58001
$$ -295571 -726339 -684440 -201510 624528 1595010 2310244 2292530 1425606 302483 -155518
35552a55518M99668P67374K50650j62949M0310K12204l58144j130389r67956J24037
$$ -155518 344150 1111524 1362174 1199225 1239535 1451739 1093595 -36794 -1004750 -880713
35542h80713Q96731O22349K3604M211K81597M4057n88892p25431j36554M04102
$$ -880713 16018 638367 661971 666182 947779 991836 402944 -322487 -459041 -54939
35532e4939L11275q6954k47660j35601N7552K84826L88123P4844m59117m89977
$$ -54939 256336 169382 -78278 -213879 -156327 128499 516622 591466 132349 -357628
35522c57628J88137P81525N97813J8226k56599k91414m55304m88372k6039M13806
$$ -357628 -169491 612034 1209847 1228073 971474 680060 224756 -263616 -289655 124151
35512A24151J06125m97953k68624P95636J445841R61852m5687p65888j046711
$$ 124151 230276 -267677 -536301 259335 1705176 2667028 2621341 1855453 808742
35503H08742r17820l42872K35327J35753m17905m13298L12576O42428q3973r74490
$$ 808742 -109078 -451950 -216623 -80870 -498775 -912073 -599497 42931 -41042 -1015532
35493a015532r28484j39221N07830P14753O76344M47397J68172K41974N85994
$$ -1015532 -1944016 -2083237 -1575407 -860654 -184310 263087 431259 673233 1259227
35484A259227M41021l54991p65393j36964M89503j50261j427353j560961j60293
$$ 1259227 1700248 1345257 579864 442900 932403 782142 -645211 -2206172 -2366465
35475b366465J321014J613711Q95384n1737p66681q99226j36751J086460J534192
$$ -2366465 -1045451 568260 1463644 1411907 645226 -254000 -390751 695709 2229901
35466B229901M86542j223461k010908j260784J08889P97015N21695M7182k5335
$$ 2229901 2716443 1492982 -517926 -1778710 -1669821 -872806 -351111 -303929 -329264
35457c29264M5724q3890p091P02516J324747P31181p23615j371875o42524P8722
$$ -329264 -283540 -367430 -374521 327995 1652742 2383923 1660308 288433 -354091 -275369
35447b75369k90426p90501j21685J046590J031444k18611j047965n15566N16453
$$ -275369 -565795 -1356296 -1477981 -431391 600053 381442 -666523 -1182089 -665636
35438f65636Q49806L70140k73721n75055m63150k00960j07054j19985J07256M06953
$$ -665636 184170 554310 280589 -294466 -757616 -958576 -1065630 -1185615 -1078359 -671406
35428f71406K8302j049621j512349l80548J353359J928296J178092M00004K02281
$$ -671406 -643104 -1692725 -3205074 -3585622 -2232263 -303967 874125 1274129 1476410
35419A476410l7000n82900p19885j00525M86599K48462n34831r94447o39508L61996
$$ 1476410 1439410 856510 136625 36100 522699 771161 236330 -758117 -1397625 -1035629
35409a035629J307979J340354L04059q43025j096823o48802l34979k45900J03121
$$ -1035629 272350 1612704 1916763 1073738 -23085 -671887 -1006866 -1252766 -1149645
35400a149645N63328N35555J73888J45410L28244Q5250k97525L9787P74712O76494
$$ -1149645 -586317 -50762 123126 268536 596780 682030 384505 424292 1199004 1875498
35390A875498k23654n40550N4592K54627m66412q47925j40168N62940M29596L62455
$$ 1875498 1651844 1111294 1165886 1420513 954101 106176 -33992 528948 958544 1320999
35380A320999R30888Q16504p70159j930025p46040J265767J145036q99935j835930
$$ 1320999 2251887 3068391 2298232 368207 -377833 887934 2032970 1133035 -702895
35371g02895n52127P58367M45595k31255K28498R43940M33051o94915p68336K32247
$$ -702895 -1255022 -496655 -51060 -282315 -53817 890123 1323174 628259 -140077 92170
35361I2170Q27990M26147p7288K1165L13839K26445j55100m99773p22139p57610
$$ 92170 920160 1346307 1269019 1290184 1604023 1830468 1675368 1175595 453456 -304154
35351c04154m11932K67007Q56733J019777P94310L21303l32280r16267r97251
$$ -304154 -716086 -449079 407654 1427431 2221741 2543044 2210764 1294497 297246
35342B97246n35216j08974j48463k19108L72789J382967J713370Q51957l80052
$$ 297246 -237970 -346944 -495407 -714515 -341726 1041241 2754611 3606568 3226516
35333C226516q75419n57285j93125k56308n01353m72916J2875P16457R56441J09795
$$ 3226516 2351097 1793812 1600687 1344379 843026 370110 382985 1099442 2055883 2165678
35323B165678j391285k056919j081803L79743O87733N9250O7418R44998J133842
$$ 2165678 774393 -1282526 -2364329 -1984586 -1296853 -1237603 -1170185 -225187 908655
35314I08655k2641r24962j61625J143818R75002n25953j359805o10836N52444
$$ 908655 886014 -38948 -200573 943245 1918247 1392294 32489 -578347 -25903
35305b5903Q34803L62867l8000m7783R2690N8570k83192o37195m12197L77248
$$ -25903 808900 1171767 1133767 1085984 1178674 1237244 954052 316857 -95340 281908
35295B81908O85873k29037j372748j093118M67598J344722M75822q45163q76926
$$ 281908 967781 738744 -634004 -1727122 -1259524 85198 561020 -284143 -1161069
35286a161069K77483J130814Q27919j26295p12374l59233N85080J006837J72951
$$ -1161069 -883586 247228 1075147 948852 236478 -122755 462325 1469162 1642113
35277A642113j058923j013727M51428J452756O45161q50233j178888l93825R6939
$$ 1642113 583190 -430537 20891 1473647 2118808 1268575 89687 -304138 -207199
35268b07199l6345O9074M97294L68849k74573k67895N27245O62660m78381j371958
$$ -207199 -243544 -174470 322824 691673 417100 149205 676450 1339110 860729 -511229
35258e11229o87336M75382K69933r43561j135650L01141J729112J636889M26816
$$ -511229 -1198565 -723183 -453250 -1396811 -2532461 -2231320 -502208 1134681 1561497
35249A561497n27189n66554p3572J99555j56651p38817o42276K91748R47173M32232
$$ 1561497 1034308 467754 394182 593737 437086 -301731 -944007 -652259 294914 727146
35239G27146m28833l06133L89050J30764r60424j004614N13005J595220P96574
$$ 727146 298313 -7820 381230 511994 -448430 -1453044 -940039 655181 1451755
35230A451755m83190l76336M00178k7874j307629j341658K12231J334607Q19190
$$ 1451755 968565 592229 992407 964533 -343096 -1684754 -1472523 -137916 681274
35221F81274q4289M7855O62973M75348m18438r36819p85886o41371q47347r00537
$$ 681274 596985 644840 1307813 1783161 1364723 427904 -357982 -999353 -1846700 -2747237
35211b747237k97020O92411J287686J043254L09044j89831j90010n8955q3830
$$ -2747237 -3044257 -2351846 -1064160 -20906 288138 98307 -91703 -150658 -234488
35202b34488q9796l0855k89547q25328p56619L19953J266033Q41230l05861m94245
$$ -234488 -324284 -355139 -644686 -1470014 -2226633 -1906680 -640647 200583 -105278 -599523
35192e99523M49255J077565O75916N5227j64265l38212m95836k0794P72539N47442
$$ -599523 -150268 927297 1603213 1658440 1494175 1155963 660127 639333 1411872 1959314
35182A959314p28815j194499J5772J074495J92971j518404j765507m17872Q28475
$$ 1959314 1230499 36000 51772 1126267 1319238 -199166 -1964673 -2382545 -1554070
35173a554070J181314J089862N70471o25408j546447r17192N82933R56898j10220
$$ -1554070 -372756 717106 1287577 662169 -884278 -1801470 -1218537 -261639 -371859
35164c71859q97206n07602O744j15215q7175N55311P92774P4253k78088Q30449
$$ -371859 -1269065 -1776667 -1769923 -1885138 -1972313 -1417002 -624228 -549975 -828063 2386
35154B386K115433J634557k40788j388719r76731j75120J6977n7478K4191j35891
$$ 2386 2117819 3752376 3511588 2122869 1146138 971018 987995 930517 954708 818817
35144H18817p30959r75367k32638Q05987R64943K15405l77917k04384J90328Q8831
$$ 818817 87858 -887509 -1120147 -314160 650783 866188 488271 283887 474215 563046
35134E63046l65418n02690j09170L61039L97813p6585p09638r24111l16278P72006
$$ 563046 197628 -305062 -414232 -53193 344620 268035 -441603 -1365714 -1681992 -909986
35124i09986J301194O89806k65918l45010L39544N07369k49769p92141l19075
$$ -909986 391208 1081014 815096 470086 809630 1316999 1067230 275089 -43986
35115d3986L02705P2363l64938J44381J092401R40335l59420j170646o43776J93008
$$ -43986 258719 331082 -33856 110525 1202926 2143261 1783841 613195 -30581 162427
35105A62427K47434j40330j83494N5076J70489K99975O63818R07708O35524M0738
$$ 162427 409861 269531 86037 141113 311602 611577 1275395 2183103 2818627 2859365
35095B859365n46427j102772j407500r06766K60942R43052N00218j34016J31124
$$ 2859365 2312938 1210166 -197334 -1104100 -843158 99894 600112 466096 597220
35086E97220Q32417Q01647P8594l53719l00440l87884o14878l83872P2163j20448
$$ 597220 1429637 2231284 2309878 1956159 1655719 1267835 652957 269085 341248 220800
35076B20800p10534m36689O72317R16499l17868j218679l09522J054064P89871
$$ 220800 -489734 -926423 -254106 662393 344525 -874154 -1183676 -129612 660259
35067F60259n33455o78132N68774J168896K88496m97843o0755N12278R5004n24682
$$ 660259 126804 -551328 17446 1186342 1474838 976995 916240 1428518 1523522 998840
35057I98840l39941q6509p31836j357488o05056P10078O70775n54230r05378K36335
$$ 998840 658899 572390 -159446 -1516934 -2121990 -1411912 -741137 -1295367 -2200745 -1964410
35047a964410J197908Q72527K66311M17285P10817L62293n7145J44050L43729
$$ -1964410 -766502 106025 372336 789621 1500438 1862731 1805586 1949636 2293365
35038B293365k39384j017401j022388n69993n76139q88584o61136P8363N28774
$$ 2293365 2053981 1036580 14192 -555801 -1131940 -2020524 -2681660 -2603297 -2074523
35029b074523M91189M81131O48247O04569K35292j24250j96461J11925P29977
$$ -2074523 -1583334 -1102203 -453956 150613 385905 261655 65194 177119 907096
35020I07096J098283M99755o96727j043451p6486P29581J95230n98519j72775
$$ 907096 2005379 2505134 1808407 764956 688470 1418051 1613281 1014762 841987
35011H41987O61944J12732j336306j453704R0042J128948M74394l92062K299Q14123
$$ 841987 1503931 1616663 280357 -1173347 -1083305 45643 520037 127975 130274 944397
35001I44397N55085m69056q20610p8114Q87816J197631O60421l37006j053918
$$ 944397 1499482 1030426 209816 131702 1019518 2217149 2877570 2540564 1486646
34992A486646r37661k48627L07713N36138O44329M36867k99675q30079k76413
$$ 1486646 548985 300358 608071 1144209 1788538 2225405 1925730 1095651 819238
34983H19238O98518O03400m52124q45459j70514J53027m78792p55541J04485R05916
$$ 819238 1517756 2121156 1669032 823573 653059 806086 327294 -428247 -323762 582154
34973E82154O58081K27978M40073M46773m05978r26939j37823P00210J53144q18023
$$ 582154 1240235 1468213 1908286 2355059 1949081 1022142 884319 1584529 1737673 919650
34963I19650n70282L06367K16482m25180k9995J093255J191080J60105m17439
$$ 919650 349368 655735 872217 447037 417042 1510297 2701377 2861482 2444043
34954B444043j22242m1615l32161l995P16857L91133q60391j106875K07234J238241
$$ 2444043 2321801 2280186 1948025 1944030 2660887 3052020 2191629 1084754 1291988 2530229
34944B530229P79608Q428P7648J47464p41067j688484j451101m89388L8572J30347
$$ 2530229 3309837 3318265 3395913 3543377 2802310 1113826 -337275 -826663 -788091 -657744
34934f57744L42561M18437n8455n38041l65556L2926M6028J08519P62533J316674
$$ -657744 -315183 103254 44799 -493242 -858798 -825872 -779844 -671325 91208 1407882
34924A407882Q42407j71444n91550m83142o72856r41209l49071P59890Q23688
$$ 1407882 2250289 2078845 1487295 1004153 331297 -609912 -958983 -199093 624595
34915F24595n40890j708939j268674P8724O66159J31818l69440Q7077J032425
$$ 624595 83705 -1625234 -2893908 -2815184 -2149025 -2017207 -2386647 -2299570 -1267145
34906a267145J323909O30241j34769M6746R31549J235946L34286q22191r53990
$$ -1267145 56764 687005 552236 598982 1530531 2766477 3100763 2278572 1324582
34897A324582j74803K72997j67409o65616l14184N70746R36084L78581m89222
$$ 1324582 1149779 1422776 1255367 589751 275567 846313 1782397 2160978 1671756
34888A671756r31104q59582o25183m10511j19612K73098N58412N07577R2682m83438
$$ 1671756 740652 -118930 -744113 -1154624 -1274236 -1001138 -442726 64851 157533 -325905
34878c25905q19672n18502L02850Q17770L49972n51327n94203M77621J379301
$$ -325905 -1145577 -1664079 -1361229 -543459 -193487 -744814 -1339017 -861396 517905
34869E17905J010640j22449q81099j069559j102011q40970q76P96702P39578L06573
$$ 517905 1528545 1406096 524997 -544562 -1646573 -2487543 -2488419 -1691717 -952139 -645566
34859f45566O21770J488523J565345M96939o81648j356529j866142k004381r16186
$$ -645566 -23796 1464727 3030072 3527011 2845363 1488834 -377308 -2381689 -3297875
34850c297875R28918J634844O88278n6028N94365J138674P2207j244708o68354
$$ -3297875 -2368957 -734113 -45835 -101863 492502 1631176 1703383 458675 -209679
34841b09679J134685J718447O55938k98817m20960o89604j210541o98653Q11210
$$ -209679 925006 2643453 3299391 3000574 2579614 1890010 679469 -19184 792026
34832G92026J238115l75860k011892j475866M73284J383117M65686q16803r36980
$$ 792026 2030141 1654281 -357611 -1833477 -1360193 22924 488610 -328193 -1265173
34823a265173J67119J416088J586454L46958j123130j148665K76329J208418L68533
$$ -1265173 -1098054 318034 1904488 2251446 1128316 -20349 255980 1464398 1832931
34814A832931r98492r95717J35075O12737n3659n45107P228Q27523Q88186K21492
$$ 1832931 834439 -161278 -26203 586534 532875 -12232 -5004 822519 1710705 1932197
34804A932197n86879j152749j132287l03499P50584R87756L69810k1026K19480
$$ 1932197 1345318 192569 -939718 -1243217 -492633 495123 864933 843907 1063387
34795A063387J50669o10033p35839O52051J863510P02807j904365k686949o49389
$$ 1063387 1214056 604023 -131816 520235 2383745 3086552 1182187 -1504762 -2154151
34786b154151J410898R72500p10740q78682N04528J069422n3853j057832m69766
$$ -2154151 -743253 229247 -481493 -1360175 -855647 213775 159922 -897910 -1367676
34777a367676P15065Q28993l9870o27080n29677l56993l35383k4330O30783J001408
$$ -1367676 -652611 176382 136512 -490568 -1020245 -1377238 -1712621 -1736951 -1106168 -104760
34767a04760P26599J84114k41306o74642j149066j093801p8038J220150J535965
$$ -104760 621839 805953 564647 -109995 -1259061 -2352862 -2430900 -1210750 325215
34758C25215N88270n11075p11518l13316k59472o00748n30406J79459P76301P83930
$$ 325215 913485 402410 -309108 -622424 -881896 -1482644 -2013050 -1833591 -1057290 -273360
34748b73360O76767Q11976O60807j14306p12955m02019P4774l70095j166716q28722
$$ -273360 403407 1215383 1876190 1761884 1048929 646910 721684 351589 -815127 -1643849
34738a643849N12825J093485K38102o66976m70023J67510L14404K92216N53843
$$ -1643849 -1131024 -37539 200563 -466413 -936436 -768926 -454522 -162306 391537
34729C91537M94188k86747q09760k95041K48821k99808r84922k73655J082178
$$ 391537 885725 598978 -210782 -505823 -257002 -556810 -1541732 -1815387 -733209
34720g33209J047624k22714n01874P45693J363588Q4750j345109j028965J60767
$$ -733209 314415 91701 -410173 335520 1699108 1783858 438749 -590216 -429449
34711d29449L52307k16894p442Q85205Q80119k85062r94217k79730P81904P89327
$$ -429449 -77142 -294036 -301478 583727 1463846 1178784 184567 -95163 686741 1476068
34701A476068j34588q98988r23781l78313L67180Q42553N06439o35916j646040
$$ 1476068 1341480 442492 -481289 -859602 -492422 350131 856570 220654 -1425386
34692a425386j452125n7812J366084J648597P36067l57732o39193j40236K26633
$$ -1425386 -2877511 -2935323 -1569239 79358 815425 457693 -181500 -321736 -95103
34683i5103j67206q64670q97553J9401J190109J726832J298567K03995q60230
$$ -95103 -262309 -1126979 -2024532 -2005131 -815022 911810 2210377 2414372 1554142
34674A554142j146130m89816L22097L34648l18218n41497J24106P71549M85636
$$ 1554142 408012 -81804 240293 574941 256723 -284774 -160668 610881 1096517
34665A096517k86795n26249k44514k25451m37752l176J069646J418907K60370
$$ 1096517 809722 283473 38959 -186492 -624244 -627420 442226 1861133 2121503
34656B121503j241317j460891m48228M65913O81219P27681Q57288N68626k00259
$$ 2121503 880186 -580705 -1028933 -563020 118199 845880 1703168 2271794 2071535
34647B071535n78073o4390N40636K53401o50822j107382p90613l48395k52218
$$ 2071535 1493462 1429072 1969708 2223109 1572287 464905 -325708 -674103 -926321
34638i26321k05838J72247O85947Q62309N69007J01836j33496R7241O60306J006922
$$ -926321 -1132159 -959912 -273965 588344 1157351 1259187 1125691 1222932 1883238 2890160
34628B890160N87897m43062j145598p65225K80557Q07200L35779l33000l43935
$$ 2890160 3478057 3034995 1889397 1124172 1404729 2211929 2547708 2214708 1870773
34619A870773o6642m23664j218840j191634M5447J190165J018380Q0137k99515
$$ 1870773 1804131 1380467 161627 -1030007 -984560 205605 1223985 1304122 1004607
34610A004607j3469K2186l68331m22993L8568K52084q6293k98595l5645O8417
$$ 1004607 991138 1013324 644993 222000 260568 512652 426359 127764 92119 160536
34600A60536l36311m83315K45414J102040R71929j3070p54166o50678j5050N99676
$$ 160536 -175775 -659090 -413676 688364 1660293 1647223 893057 242379 227329 827005
34590H27005P92790L85725k86318n18737j95614q7223o00958q95144j06654J075085
$$ 827005 1619795 2005520 1719202 1200465 1004851 917628 316670 -578474 -685128 389957
34580C89957J137048j54868j366764j163309K28667J383839J091326m70060j707485
$$ 389957 1527005 1372137 5373 -1157936 -929269 454570 1545896 1075836 -631649
34571f31649j182748N23587J265636J33734j210939r03995M74067R97232L23560
$$ -631649 -1814397 -1290810 -25174 108560 -1102379 -2006374 -1532307 -535075 -211515
34562b11515k02580L3909K58704P8723J18969N24208M35647m23584r95647m47767
$$ -211515 -414095 -380186 -121482 -42759 76210 600418 1036065 612481 -383166 -830933
34552h30933N93487J049305P27334Q4586m86014o20226q7639N88805M87933k85075
$$ -830933 -237446 811859 1539193 1623779 1137765 517539 429900 1018705 1506638 1221563
34542A221563m97026L52137J109111O50446m89090j086825r88418q28306o47267
$$ 1221563 724537 1076674 2185785 2836231 2347141 1260316 271898 -556408 -1203675
34533a203675r714P92197Q40180p854p22271m02760N99217J187662Q50309J60928
$$ -1203675 -1213389 -421192 418988 411134 -311137 -713897 -114680 1072982 1923291 2084219
34523B084219k8331L33667N03288L7464n77435p10605n03483m09672k93190J43957
$$ 2084219 2055888 2389555 2892843 2930307 2352872 1642267 1138784 729112 435922 579879
34513E79879L96642k48369j273276j347469l26635M39296J38292m30063l50115
$$ 579879 976521 728152 -545124 -1892593 -2219228 -1779932 -1641640 -2071703 -2421818
34504b421818P0474K17156L31792Q20609J244965R62743J61961n59851j064624
$$ -2421818 -2351344 -2134188 -1802396 -981787 263178 1225921 1387882 828031 -236593
34495b36593j382581j176087k98259O32273R67438Q79542Q36869P76856M70010
$$ -236593 -1619174 -2795261 -3093520 -2461247 -1493809 -614267 222602 999458 1469468
34486A469468J45766N2762o9211m02840n29127k13838q8590o86577j339848r90897
$$ 1469468 1615234 1667996 1598785 1195945 666818 452980 364390 -322187 -1662035 -2652932
34476b652932K49447J241674J282511O78382O2325k06052j19748J7013r6243k56685
$$ -2652932 -2403485 -1161811 120700 799082 861407 655355 535607 552620 456377 199692
34466A99692k6294L76997K62082k33585j38953N71681N27756q29263j932727j269581
$$ 199692 173398 550395 812477 578892 439939 1011620 1539376 710113 -1222614 -2492195
34456b492195K80751Q30188K97461J22650P72013J303266J154840P31321K85339
$$ -2492195 -2211444 -1381256 -1083795 -961145 -189132 1114134 2268974 3000295 3285634
34447C285634l22284p76462n69287q9171j86574o98916o65869Q633L69345m8713
$$ 3285634 2963350 2186888 1617601 1528430 1341856 642940 -22929 -14296 355049 306336
34437C06336o34337p34180l00471M17066R11728M63774q16678j460299m13005
$$ 306336 -328001 -1062181 -1362652 -945586 -33858 429916 -386762 -1847061 -2260066
34428b260066J170442J388378L48716k65545K7322J74383j43290q7602L63238
$$ -2260066 -1089624 298754 647470 381925 409247 583630 440340 352738 715976
34419G15976K15292m27842k58010P32739R15502j03925o38985P4366M77249l34114
$$ 715976 931268 503426 245416 978155 1893657 1789732 1150747 1225113 1702362 1368248
34409A368248o91079O52989J823576O06507j721953k124055l72903Q94323L00869
$$ 1368248 677169 1330158 3153734 3760241 2038288 -85767 -458670 435653 736522
34400G36522p46393q08627l26738j62589j13731K32885M89497J95230k84051k80223
$$ 736522 -9871 -818498 -1145236 -1307825 -1421556 -1188671 -699174 -503944 -787995 -1068218
34390a068218K60922Q06203Q26651K15649n50465p13772n9810P32845R45397O73705
$$ -1068218 -807296 -1093 825558 1041207 490742 -223030 -282840 450005 1395402 2069107
34380B069107L46386r8359p84660j100643l56615R23733J397970O47468l78039
$$ 2069107 2415493 2317134 1532474 431831 75216 998949 2396919 3044387 2666348
34371B666348p85938p36232p39222p56634m97080r6460L8255j24907j67563J61685
$$ 2666348 1880410 1144178 404956 -351678 -848758 -945218 -906963 -1031870 -1199433 -1037748
$$ [...]
##END NTUPLES=NMR SPECTRUM
##END=
