##TITLE=31Pdec_91-2025
CDCl3, 24 sc
 8.8.2025
##JCAMPDX= 6.0         $$ Bruker NMR JCAMP-DX V2.0
##DATA TYPE= NMR SPECTRUM
##DATA CLASS= NTUPLES
##ORIGIN= UXNMR, Bruker Analytische Messtechnik GmbH
##OWNER= root
$$ XWIN-NMR		Version 3.5
$$ Fri Aug  8 14:10:23 2025 Russian Standard Time (UT+4h)  she@DPX200
##.OBSERVE FREQUENCY= 81.013821
##.OBSERVE NUCLEUS= ^31P
##.ACQUISITION MODE= SIMULTANEOUS
##.ACQUISITION SCHEME= undefined
##.AVERAGES= 24
##.DIGITISER RES= 17
##SPECTROMETER/DATA SYSTEM= spect
##.PULSE SEQUENCE= zgpg30
##.SOLVENT NAME= CDCl3
##.SHIFT REFERENCE= (INTERNAL, CDCl3, 0, 198.062)
##AUDIT TRAIL= $$ (NUMBER, WHEN, WHO, WHERE, WHAT)
$$ ##TITLE= Audit trail, XWIN-NMR		Version 3.5
$$ ##JCAMPDX= 5.01
$$ ##ORIGIN= Bruker BioSpin GmbH
$$ ##OWNER= she
$$ F:/spectra/data/she/nmr/P31/2/pdata/1/auditp.txt
$$ ##AUDIT TRAIL=  $$ (NUMBER, WHEN, WHO, WHERE, WHAT)
(   1,<2025-08-08 14:09:23.79 +0400>,<she>,<DPX200>,
      <created by zg, POWCHK disabled, PULCHK disabled
       configuration hash MD5:
       00 E9 B6 7A A2 85 ED C7 34 08 36 98 17 FE 4E 26
       data hash MD5: 32K
       6B 41 6B 30 B0 AB 31 B7 A7 AF 96 EB 6D EC 57 F2>)
(   2,<2025-08-08 14:09:26.95 +0400>,<she>,<DPX200>,
      <Start of raw data processing
       efp BC_mod = 2 LB = 1.5 FT_mod = 6 PKNL = 1 PHC0 = 2286.483 PHC1 = -1135.501 SI = 64K 
       data hash MD5: 64K
       8A 1A 2D BD EE 2B 04 01 E0 72 3C CA 5B 78 40 67>)
(   3,<2025-08-08 14:09:44.57 +0400>,<she>,<DPX200>,
      <pk PHC0 = -0.3226885 PHC1 = 0 
       data hash MD5: 64K
       BB 08 0A A8 A0 03 FC 10 DC 05 ED 3C 5C 74 D0 9B>)
(   4,<2025-08-08 14:09:58.40 +0400>,<she>,<DPX200>,
      <abs ABSG = 5 
       data hash MD5: 64K
       30 49 D6 18 81 81 2D 81 63 AA 0B 48 37 84 54 7C>)
$$ ##END=
$$ 
$$ hash MD5
$$ 46 0E 9D AA AE AD 92 46 4C 8D E9 7E DE 6C 6F 7A
##$RELAX= 
##$RELAX= 
##$RELAX= 
##$RELAX= 
##$RELAX= 
##$RELAX= 
##$RELAX= 
##$RELAX= 
$$ Bruker specific parameters
$$ --------------------------
##$DU= <F:/spectra>
##$EXPNO= 2
##$NAME= <P31>
##$PROCNO= 1
##$TYPE= <nmr>
##$USER= <she>
##$AMP= (0..31)
100 100 100 100 100 100 100 100 100 100 100 100 100 100 100 100 100 100 
100 100 100 100 100 100 100 100 100 100 100 100 100 100 
##$AQSEQ= 0
##$AQ_mod= 1
##$AUNM= <au_zg>
##$AUTOPOS= <>
##$BF1= 81.014009
##$BF2= 200.13
##$BF3= 200.13
##$BF4= 200.13
##$BF5= 200.13
##$BF6= 200.13
##$BF7= 200.13
##$BF8= 200.13
##$BYTORDA= 1
##$CFDGTYP= 0
##$CFRGTYP= 5
##$CHEMSTR= <none>
##$CNST= (0..31)
1 1 145 1 1 1 1 1 1 1 1 1 1 1 1 1 1 1 1 1 1 1 1 1 1 1 1 1 1 1 1 1 
##$CPDPRG= <waltz16>
##$CPDPRG1= <>
##$CPDPRG2= <waltz16>
##$CPDPRG3= <>
##$CPDPRG4= <mlev>
##$CPDPRG5= <mlev>
##$CPDPRG6= <mlev>
##$CPDPRG7= <mlev>
##$CPDPRG8= <mlev>
##$CPDPRGB= <>
##$CPDPRGT= <>
##$D= (0..31)
0 1 0 0 0 0 0 0 0 0.06 0 0.03 2e-05 3e-06 0 0 0.0002 0 0 0 0 0 0 0 0 0 
0 0 0 0 0 0 
##$DATE= 1754647763
##$DBL= (0..7)
120 120 120 11 120 120 24 19 
##$DBP= (0..7)
150 150 150 150 150 150 150 150 
##$DBP07= 0
##$DBPNAM0= <>
##$DBPNAM1= <>
$$ [...]
##$SUBNAM3= <"">
##$SUBNAM4= <"">
##$SUBNAM5= <"">
##$SUBNAM6= <"">
##$SUBNAM7= <"">
##$SUBNAM8= <"">
##$SUBNAM9= <"">
##$SW= 400.765351723535
##$SWIBOX= (0..15)
0 1 3 0 0 0 0 0 0 0 0 0 0 0 0 0 
##$SW_h= 32467.5324675325
##$TD= 32768
##$TD0= 1
##$TE= 0
##$TE2= 300
##$TE3= 300
##$TEG= 300
##$TL= (0..7)
0 120 53 12 22 120 120 120 
##$TP= (0..7)
150 150 150 150 150 150 150 150 
##$TP07= 0
##$TPNAME0= <>
##$TPNAME1= <>
##$TPNAME2= <>
##$TPNAME3= <>
##$TPNAME4= <>
##$TPNAME5= <>
##$TPNAME6= <>
##$TPNAME7= <>
##$TPOAL= (0..7)
0.5 0.5 0.5 0.5 0.5 0.5 0.5 0.5 
##$TPOFFS= (0..7)
0 0 0 0 0 0 0 0 
##$TUNHIN= 0
##$TUNHOUT= 0
##$TUNXOUT= 0
##$USERA1= <user>
##$USERA2= <user>
##$USERA3= <user>
##$USERA4= <user>
##$USERA5= <user>
##$V9= 5
##$VALIST= <valist>
##$VCLIST= <CCCCCCCCCCCCCCC>
##$VD= 0
##$VDLIST= <DDDDDDDDDDDDDDD>
##$VPLIST= <PPPPPPPPPPPPPPP>
##$VTLIST= <TTTTTTTTTTTTTTT>
##$WBST= 1024
##$WBSW= 4
##$XGAIN= (0..3)
0 0 0 0 
##$XL= 0
##$YL= 0
##$YMAX_a= 6925
##$YMIN_a= -5986
##$ZGOPTNS= <>
##$ZL1= 120
##$ZL2= 120
##$ZL3= 120
##$ZL4= 120
##$ABSF1= 198.0616
##$ABSF2= -202.7028
##$ABSG= 5
##$ABSL= 3
##$ALPHA= 0
##$AQORDER= 0
##$ASSFAC= 0
##$ASSFACI= 0
##$ASSFACX= 0
##$ASSWID= 0
##$AUNMP= <proc_1d>
##$AZFE= 0.1
##$AZFW= 0.5
##$BCFW= 0
##$BC_mod= 2
##$BYTORDP= 0
##$COROFFS= 0
##$CY= -3
##$DATMOD= 1
##$DC= 0
##$DFILT= <>
##$DTYPP= 0
##$F1P= 0
##$F2P= 0
##$FCOR= 1
##$FTSIZE= 65536
##$FT_mod= 6
##$GAMMA= 0
##$GB= 0
##$INTBC= 1
##$INTSCL= 9.790993e-09
##$ISEN= 30
##$LB= 1.5
##$LEV0= 0
##$LPBIN= 0
##$MAXI= 10000
##$MC2= 0
##$MEAN= 0
##$ME_mod= 0
##$MI= 50
##$NCOEF= 0
##$NC_proc= -6
##$NLEV= 6
##$NOISF1= 182.463
##$NOISF2= 159.3651
##$NSP= 0
##$NTH_PI= 0
##$NZP= 0
##$OFFSET= 198.0616
##$PC= 4
##$PHC0= 2286.16
##$PHC1= -1135.501
##$PH_mod= 1
##$PKNL= yes
##$PPARMOD= 0
##$PSCAL= 0
##$PSIGN= 0
##$REVERSE= no
##$SF= 81.0140089999434
##$SI= 65536
##$SIGF1= 159.3651
##$SIGF2= -187.1042
##$SINO= 113.3802
##$SIOLD= 16384
##$SREGLST= <1H.CDCl3>
##$SSB= 0
##$STSI= 65536
##$STSR= 0
##$SW_p= 32467.5324675325
##$SYMM= 0
##$S_DEV= 0
##$TDeff= 32768
##$TDoff= 0
##$TI= <>
##$TILT= no
##$TM1= 0
##$TM2= 0
##$TOPLEV= 0
##$USERP1= <user>
##$USERP2= <user>
##$USERP3= <user>
##$USERP4= <user>
##$USERP5= <user>
##$WDW= 1
##$XDIM= 65536
##$YMAX_p= 459072664
##$YMIN_p= -18322606
$$ End of Bruker specific parameters
$$ ---------------------------------
##NTUPLES= NMR SPECTRUM
##VAR_NAME=  FREQUENCY,     SPECTRUM/REAL,   SPECTRUM/IMAG
##SYMBOL=    X,             R,               I
##VAR_TYPE=  INDEPENDENT,   DEPENDENT,       DEPENDENT
##VAR_FORM=  AFFN,          ASDF,            ASDF
##VAR_DIM=   65536,         65536,           65536
##UNITS=     HZ,            ARBITRARY UNITS, ARBITRARY UNITS
##FACTOR=    0.49542278885378, 1,            1
##FIRST=     16045.7642231865, 0,            0
##LAST=      -16421.768244346, 0,            0
##MIN=       -16421.768244346, -18322606,    0
##MAX=       16045.7642231865, 459072664,    0
$$ Real data points
##PAGE= N=1
##DATA TABLE= (X++(R..R)), XYDATA
$$ [...]
42364 -1370562 -1169785 -1069616 -715631 -221895 5930 -109344 -289650 -418282 -692283
42355 -692283 -1208734 -1719693 -1945632 -1928682 -1916639 -2024878 -2164701 -2224981 -2167761 -1964253
42345 -1964253 -1574859 -1035328 -493325 -117878 13024 -56075 -213003 -390702 -654290 -1110331
42335 -1110331 -1656749 -1923892 -1660609 -1166567 -1083153 -1623726 -2222862 -2174298 -1486866 -837958
42325 -837958 -729773 -993423 -1180064 -1145826 -1065299 -1051104 -994744 -757607 -384043 -108065
42315 -108065 -164344 -532367 -869655 -821245 -420916 -44061 57891 -27625 -177976 -464247
42305 -464247 -880990 -1107729 -861688 -352996 -59349 -111931 -232183 -253511 -335435 -573205
42295 -573205 -744098 -650410 -474629 -537107 -816796 -954673 -729604 -360713 -268887 -595237
42285 -595237 -1020298 -1090432 -695209 -133700 294464 586605 816426 828960 433220 -197854
42275 -197854 -639182 -724246 -647948 -545342 -318120 10920 122925 -191050 -697783 -1021829
42265 -1021829 -1070196 -939617 -626089 -130656 287307 296120 -86684 -502000 -668301 -597097
42255 -597097 -427238 -270071 -237357 -428269 -820019 -1262328 -1582584 -1628621 -1292301 -650050
42245 -650050 -45246 139660 -173430 -720928 -1171271 -1349337 -1262487 -1056557 -934627 -995119
42235 -995119 -1131473 -1142384 -911299 -460828 58216 383960 313576 -36623 -299940 -302573
42225 -302573 -246168 -312159 -344858 -163607 78191 184499 332332 763650 1225734 1227161
42215 1227161 798961 476822 488590 485401 201375 -138904 -280456 -318021 -333564 -107904
42205 -107904 428132 827812 662027 168366 -81030 3273 -10076 -360219 -763979 -847760
42195 -847760 -594508 -266829 -84640 -55704 -18491 169926 447203 613092 609999 573772
42185 573772 539106 330850 -104288 -514633 -711204 -863463 -1142919 -1322396 -1114758 -730908
42175 -730908 -654878 -943191 -1199570 -1242339 -1332946 -1628802 -1821424 -1545284 -892044 -313467
42165 -313467 -153340 -385463 -692517 -752570 -560501 -446656 -641517 -919813 -900698 -582116
42155 -582116 -254174 20839 412696 821422 871150 532442 276968 392167 569744 451012
42145 451012 179234 61328 32026 -125620 -291792 -201858 31644 36038 -255860 -568005
42135 -568005 -789158 -1126283 -1683907 -2200557 -2314883 -1910933 -1166293 -424087 -3884 43144
42125 43144 -21522 29710 90295 -33877 -215477 -175993 -16011 -186619 -845012 -1574498
42115 -1574498 -1905860 -1854485 -1751261 -1741348 -1666879 -1350995 -836965 -381033 -265124 -533034
42105 -533034 -877687 -908807 -571587 -169994 46107 129096 206979 230994 106208 -87747
42095 -87747 -191263 -178480 -106336 63984 398015 761406 843067 457927 -258136 -968837
42085 -968837 -1381003 -1386896 -1092395 -767220 -681483 -873246 -1071300 -950427 -528265 -221557
42075 -221557 -374303 -780045 -884936 -502816 -71056 -41092 -270376 -304650 -75137 72657
42065 72657 -25857 -149818 -120581 -23293 112448 439318 885878 1005792 547851 -120769
42055 -120769 -514197 -704207 -1086301 -1646637 -1948379 -1820968 -1585676 -1484110 -1302472 -807512
42045 -807512 -259386 -151939 -530160 -861906 -675943 -174077 -39745 -615144 -1418128 -1651426
42035 -1651426 -1140551 -511898 -384448 -689276 -983207 -1136056 -1350982 -1680278 -1929075
42026 -1929075 -1979007 -1827123 -1344855 -431730 549501 950093 611770 79872 -142531 -162425
42016 -162425 -279615 -420827 -389900 -371020 -678375 -1135086 -1196457 -721081 -219056 -218708 -666677
42005 -666677 -1072775 -1046342 -592632 -35066 273649 259798 165694 197208 217819 -21023
41995 -21023 -418366 -571377 -311933 71104 229753 134493 -60063 -284114 -498727 -555259
41985 -555259 -344238 -12004 155305 30801 -292031 -669293 -996505 -1184954 -1210014 -1176390
41975 -1176390 -1206555 -1263949 -1196305 -945194 -593511 -206417 234134 694331 1020591 1098641
41965 1098641 994437 828959 565721 61483 -649737 -1249386 -1419109 -1201189 -978126
41956 -978126 -1080485 -1490774 -1950828 -2250793 -2331784 -2208620 -1959241 -1773771 -1832275 -2060007
41946 -2060007 -2131264 -1817902 -1254641 -766473 -509621 -400200 -341157 -357619 -475535 -588176
41936 -588176 -529319 -245524 151351 485758 642177 599217 379147 4143 -472392 -915077
41926 -915077 -1154157 -1119116 -896836 -640649 -460413 -410748 -508308 -694827 -824542 -755305
41916 -755305 -450314 10709 459414 680516 568672 320901 315493 642975 897589 669612
41906 669612 151194 -59553 241550 608656 599736 337372 181367 146593 13732 -164314
41896 -164314 -110173 143996 197007 -132675 -516155 -603128 -508595 -561936 -799867 -1009482
41886 -1009482 -1113210 -1154518 -971882 -306702 655979 1223328 939822 189816 -237259 -78871
41876 -78871 212563 196819 10444 50934 383194 757831 1072885 1444878 1800504 1775212
41866 1775212 1214219 491095 45849 -180593 -487434 -741057 -469975 309445 889537
41857 889537 770146 332227 200034 254743 -160445 -1174954 -2115138 -2371606 -2048363 -1585206
41847 -1585206 -1182397 -855929 -680806 -637268 -479758 -92763 238068 243292 151045 355021
41837 355021 742993 802750 365273 -189886 -514024 -661178 -771006 -774544 -622244 -497518
41827 -497518 -562091 -706353 -765694 -791559 -892397 -973304 -866362 -614911 -435464 -476749
41817 -476749 -745993 -1140365 -1407880 -1246291 -643799 8714 338457 387190 395088 376495
41807 376495 195802 -80489 -250053 -319551 -442432 -554967 -437806 -147513 -12037 -133355
41797 -133355 -260242 -250742 -275218 -399562 -362431 -29371 278469 252325 126410 345288
41787 345288 861447 1169128 988953 567711 291178 295215 483523 660449 600105 225679
41777 225679 -214921 -358521 -176426 -31053 -223021 -659242 -1041142 -1210544 -1213516 -1164111
41767 -1164111 -1156418 -1219953 -1273754 -1186013 -929055 -616012 -366857 -218721 -179120 -266292 -461150
41756 -461150 -693132 -896924 -1034796 -1083008 -1053692 -981506 -833238 -542296 -223509 -163303
41746 -163303 -394352 -488064 -106601 394159 359552 -224356 -701796 -708246 -590316 -674390
41736 -674390 -707795 -409745 -76304 -128033 -419190 -534143 -490650 -590406 -798261 -873860
41726 -873860 -954608 -1341467 -1773452 -1632431 -940518 -444763 -520038 -676146 -466730 -233528
41716 -233528 -480142 -1032924 -1371984 -1409829 -1382070 -1263355 -886706 -467087 -421139 -724538
41706 -724538 -966380 -1023682 -1174694 -1491635 -1616852 -1312668 -844000 -595314 -577413 -516523
41696 -516523 -248098 140085 434635 470365 279832 104077 146255 330875 435980 392910
41686 392910 267408 44367 -287923 -506622 -356905 14300 201990 171590 329013 821958
41676 821958 1196644 1014795 459614 4046 -239006 -471964 -740335 -912500 -1012811 -1173046
41666 -1173046 -1274361 -1003234 -335416 301902 449112 49487 -548939 -892336 -762918
41657 -762918 -388385 -265030 -605419 -1044689 -1104705 -836008 -685682 -792296 -824989 -598153
41647 -598153 -417993 -578180 -845713 -787238 -408101 -114139 -130952 -296330 -410044 -466570
41637 -466570 -484618 -407992 -315189 -473467 -969100 -1456628 -1531002 -1258262 -1066056 -1133808
41627 -1133808 -1193961 -1010199 -742903 -640331 -621996 -477962 -332661 -537607 -1113882 -1650803
41617 -1650803 -1825256 -1694626 -1368309 -764448 49059 584068 393624 -326963 -947415
41608 -947415 -1137568 -1061574 -893440 -558068 -70524 230834 59226 -382059 -577436 -267477
41598 -267477 311772 727538 767116 553199 331869 203930 77319 -148955 -438453 -686253
41588 -686253 -835614 -853739 -706803 -485640 -443839 -720699 -1086297 -1160621 -858814 -435761
41578 -435761 -131781 10222 8439 -117942 -253319 -278357 -296694 -529083 -945970 -1264002
41568 -1264002 -1347717 -1321319 -1226958 -930781 -501778 -301099 -457938 -597156 -383367 -39025
41558 -39025 12552 -242582 -526731 -766303 -1044871 -1231591 -1124371 -888536 -900650 -1168386
41548 -1168386 -1327872 -1227162 -1087209 -1042325 -968129 -877618 -1045732 -1534073 -1958174 -1966733
41538 -1966733 -1666565 -1364423 -1162017 -1007554 -865772 -620474 -107413 493247 601925
41529 601925 -72183 -1019259 -1485525 -1372862 -1194399 -1271332 -1420940 -1408936 -1264720 -1072070
41519 -1072070 -825465 -607893 -576714 -641205 -481137 -66415 154511 -155389 -690835 -879761
41509 -879761 -632510 -375100 -404465 -573012 -665877 -748760 -943342 -1083253 -868585 -298584
41499 -298584 286455 617325 757722 878827 934651 713966 152990 -538753 -1048929 -1162057
41489 -1162057 -832275 -211453 367709 576411 350899 -71117 -396008 -504440 -465402 -443347
41479 -443347 -593621 -903635 -1112355 -950564 -502367 -144249 -81947 -193340 -401448 -834844
41469 -834844 -1381183 -1484952 -867818 -190963 -378108 -1328487 -1951574 -1608585 -878981 -595044
41459 -595044 -724523 -729198 -568413 -653180 -1008156 -1191627 -1076882 -1083954 -1450786 -1787672
41449 -1787672 -1631021 -1045994 -379285 247986 830972 1114539 787684 -3934 -707232
41440 -707232 -971750 -955968 -990402 -1181126 -1429064 -1634213 -1747066 -1736375 -1619038 -1462203
41430 -1462203 -1303421 -1138373 -1010951 -1010806 -1141262 -1300935 -1442030 -1612121 -1767455 -1711401
41420 -1711401 -1367077 -972766 -801604 -782304 -652500 -448814 -522364 -968680 -1338475 -1142210
41410 -1142210 -464102 164896 382242 227584 -137440 -600912 -954457 -910442 -456250 6564
41400 6564 77173 -204803 -496258 -608129 -617732 -584186 -393410 40420 554636 817021 609372
41389 609372 34252 -528143 -704424 -434224 13401 335535 424297 276036 -148397 -796759
41379 -796759 -1363797 -1488248 -1120569 -544703 -60001 204557 231804 118262 120773 423310
41369 423310 808176 837473 451344 98912 141517 430340 674727 906807 1262117 1565484
41359 1565484 1557507 1387666 1428633 1630377 1503605 820068 -61124 -687646 -976924 -1032691
41349 -1032691 -869996 -588497 -524593 -887453 -1403905 -1634216 -1530433 -1390816 -1359708 -1309731
41339 -1309731 -1194136 -1157313 -1216042 -1156298 -911703 -774667 -994651 -1358886 -1460180 -1282882
41329 -1282882 -1210774 -1451373 -1765118 -1874705 -1859965 -1925237 -1973806 -1709726 -1085671 -364823
41319 -364823 239583 690634 880424 624526 64512 -259127 -23802 410912 469108 119444
41309 119444 -177007 -162449 -27204 19093 10746 -27407 -232903 -631845 -969739 -985367 -686564
41298 -686564 -277356 -2723 -81452 -508523 -880814 -767082 -342612 -252949 -689434 -1070334
41288 -1070334 -932845 -662073 -870126 -1436147 -1741873 -1617241 -1436673 -1393404 -1287780 -1023999
41278 -1023999 -751625 -481230 -108686 126636 -189959 -871056 -1130803 -653844 -116241
41269 -116241 -260319 -908257 -1334014 -1241162 -883182 -486897 -77844 251501 360250 308595
41259 308595 253593 171051 -17403 -163233 -76302 121273 181374 152954 215843 197443 -240737
41248 -240737 -922399 -1197450 -827430 -364537 -393699 -781659 -994289 -862297 -672338 -682620
41238 -682620 -898253 -1233099 -1573444 -1697706 -1408370 -807770 -281963 -160428 -466482 -967007
41228 -967007 -1360600 -1463595 -1350720 -1308005 -1538253 -1916460 -2117507 -1956550 -1523099 -1037627
41218 -1037627 -687421 -538752 -453206 -126066 601468 1444751 1869916 1650011 1075216 543660
41208 543660 126944 -320238 -790437 -1106906 -1224315 -1296864 -1394343 -1358609 -1074068 -743794
41198 -743794 -709870 -1015457 -1292085 -1137537 -538683 129176 483224 456050 247182 33713
41188 33713 -179044 -414893 -560304 -474189 -235531 -125756 -306177 -622648 -798062 -712347
41178 -712347 -409689 38439 514551 785245 667048 283539 -6132 16538 234958 388422
41168 388422 319017 6292 -474445 -938984 -1161037 -1056032 -744196 -407702 -188109 -220085
41158 -220085 -554161 -946795 -951307 -435332 130879 160169 -331188 -744490 -648045 -246437
41148 -246437 -10299 -77413 -226707 -307615 -412955 -592606 -644316 -378109 27677 182749
41138 182749 15704 -98349 125542 435894 380951 -48659 -432091 -527994 -512371 -549244
41128 -549244 -502337 -263682 -43888 -53999 -136999 -32351 163221 138934 -125664 -340380
41118 -340380 -358444 -339010 -445911 -664987 -946073 -1252497 -1417350 -1217617 -692997 -185303
41108 -185303 23326 -70108 -367481 -813223 -1250036 -1378062 -1056119 -500289 -14363 354413
41098 354413 716058 998562 943225 476258 -72898 -248232 46293 419806 420638 46217
41088 46217 -296750 -330564 -192109 -95857 12130 213202 265810 -99574 -625997 -721392
41078 -721392 -264753 183512 118466 -315263 -653122 -713140 -617497 -463857 -275921 -157325
41068 -157325 -245029 -548224 -960672 -1356751 -1602377 -1606676 -1444440 -1284573 -1149695 -940231
41058 -940231 -729747 -753458 -1005630 -1157791 -1025116 -792056 -601085 -303282 109537 241395
41048 241395 -106679 -410804 -55690 694178 949351 401174 -274449 -328053 190311 640551
41038 640551 553426 9375 -529749 -645395 -350457 -69846 -115416 -293046 -252624 -76773
41028 -76773 -174311 -673453 -1306992 -1857667 -2300173 -2514215 -2341052 -2011360 -2029666 -2455208
41018 -2455208 -2742998 -2520994 -2093365 -1891196 -1841380 -1656522 -1403414 -1328009 -1337889 -1124089
41008 -1124089 -696710 -384945 -338277 -393336 -438119 -552686 -705751 -621833 -136246 488700
40998 488700 803525 696962 529927 668627 966617 902557 299187 -332996 -425642 -149015
40988 -149015 -170558 -665784 -1074559 -971869 -669524 -657683 -898273 -1088389 -1264384 -1635278
40978 -1635278 -2045512 -2134023 -1915206 -1708764 -1560312 -1229473 -743416 -454058 -467854 -494261
40968 -494261 -399878 -466780 -883639 -1350457 -1442300 -1091891 -505948 119006 574806 611646
40958 611646 221571 -216474 -320404 -104421 184482 445784 719350 970083 1135357 1266080
40948 1266080 1376000 1267541 781753 146709 -206368 -151609 59036 201212 266507 233605
40938 233605 -8050 -360955 -435933 -26513 487093 493491 -110324 -771757 -932500 -635031
40928 -635031 -356276 -380947 -563018 -700021 -889424 -1330562 -1895932 -2154117 -1861562 -1247583
40918 -1247583 -718516 -418551 -208037 22336 172788 52973 -418718 -1115095 -1727446
40909 -1727446 -1943484 -1707092 -1287443 -1001655 -886635 -736459 -441954 -165701 -137569 -358301
40899 -358301 -568221 -496722 -130048 266176 415312 322981 238400 311681 415923 381713
40889 381713 241623 66465 -287803 -968423 -1703039 -1943322 -1537661 -959072 -690455 -657539
40879 -657539 -515980 -252619 -145132 -259313 -387599 -476376 -721485 -1143584 -1427035 -1375084
40869 -1375084 -1242438 -1363354 -1645698 -1706318 -1392752 -917518 -552218 -434620 -625375 -1083587
40859 -1083587 -1561268 -1752700 -1609284 -1337997 -1075566 -779661 -488147 -434336 -755598 -1253911
40849 -1253911 -1592628 -1614766 -1367230 -967065 -583906 -410585 -480208 -615773 -706871 -902545
40839 -902545 -1343718 -1839310 -2060219 -1982032 -1873930 -1882838 -1900392 -1843767 -1775864 -1681740 -1411599
40828 -1411599 -980487 -682664 -725248 -917351 -899019 -556776 -69598 331815 507403 430370
40818 430370 218185 47285 -69090 -276543 -543076 -548758 -133570 340210 378106 -13341
40808 -13341 -394170 -485059 -332929 25923 581536 974374 641230 -389040 -1263787 -1246564
40798 -1246564 -611282 -223389 -459989 -974751 -1375934 -1624374 -1745927 -1642334 -1376256
40789 -1376256 -1296401 -1636593 -2184135 -2517601 -2415837 -1918524 -1193651 -524580 -254573 -508736
40779 -508736 -1017159 -1352375 -1299452 -935122 -477718 -162150 -109392 -171198 -34215 377154
40769 377154 753454 826253 761350 877214 1127338 1194790 1027853 911580 974844 970579 656277
40758 656277 116207 -411878 -776623 -857520 -538042 72559 586307 693070 431937 998
40748 998 -481030 -871501 -934836 -650307 -393026 -501011 -793085 -823049 -511606 -203896
40738 -203896 -161798 -330188 -581072 -842330 -953449 -735144 -297075 8757 29016 -68276
40728 -68276 -172485 -390143 -690363 -748528 -384036 139253 518459 840802 1274351 1570024
40718 1570024 1311899 577769 -71759 -285239 -240775 -209776 -148761 98371 426398 517200
40708 517200 201619 -321020 -602583 -332481 273657 541025 8040 -982100 -1606227 -1502115
40698 -1502115 -1116425 -1047664 -1353959 -1687750 -1833659 -1827742 -1708535 -1453943 -1125154 -852072
40688 -852072 -690611 -646624 -785611 -1149219 -1592766 -1845403 -1709159 -1135400 -246937 579993
40678 579993 852149 448359 -139882 -345177 -214255 -233279 -534887 -719661 -543122 -325720
40668 -325720 -432050 -692477 -679766 -348205 -53129 -29911 -151401 -185634 -71328 78328
40658 78328 113877 10031 -43020 175625 534982 528009 -162499 -1191119 -1864106 -1843173
40648 -1843173 -1335854 -713542 -231682 -62587 -258906 -614953 -816811 -801700 -764428 -784578
40638 -784578 -710002 -491882 -370720 -564798 -952415 -1222474 -1217958 -1010076 -756365 -614260
40628 -614260 -699677 -999384 -1353807 -1584364 -1610342 -1461311 -1268763 -1210890 -1314444 -1330776
40618 -1330776 -998095 -434079 -57973 -91748 -359522 -619958 -833908 -1014199 -1093845 -1108948
40608 -1108948 -1268259 -1634869 -1926398 -1839681 -1437318 -1040038 -860529 -880060 -947868 -887908
40598 -887908 -665424 -527107 -755631 -1213735 -1447125 -1359194 -1368077 -1650444 -1700059 -1075956
40588 -1075956 -196337 180516 -7259 -237927 -369723 -754338 -1374273 -1611123 -1123280
40579 -1123280 -377898 7887 2201 -92862 -228797 -535881 -904359 -1048413 -917360 -759092
40569 -759092 -782035 -921548 -945987 -729499 -430121 -350282 -531796 -610973 -290082 169400
40559 169400 255472 -57678 -294642 -220902 -134216 -277563 -428084 -339388 -208640 -360073
40549 -360073 -722208 -940523 -836270 -513016 -190918 -138125 -536512 -1169803 -1448286 -996822
40539 -996822 -64031 829264 1423481 1713671 1706243 1478440 1246692 1074721 729852 124956
40529 124956 -354699 -349672 -141766 -325782 -970669 -1529658 -1544610 -1063192 -384891 229054
40519 229054 564163 510667 203331 -105186 -322248 -491165 -570895 -483662 -318885 -239887
40509 -239887 -241093 -223664 -220643 -303497 -380276 -353203 -338263 -429989 -422930 -148346 72004 -224950
40497 -224950 -926770 -1465607 -1611048 -1624449 -1631381 -1443173 -1130983 -1168751 -1711641 -2224420
40487 -2224420 -2182267 -1758233 -1454436 -1374128 -1258792 -1028680 -883726 -946832 -1108664 -1204271
40477 -1204271 -1152278 -952365 -672010 -399814 -169008 -12322 -69850 -453405 -996559 -1363467
40467 -1363467 -1429587 -1319179 -1076675 -630350 -125755 86546 -69566 -277757 -338617 -431497
40457 -431497 -680364 -848252 -748446 -630358 -823597 -1237200 -1516869 -1501330 -1260328 -887741
40447 -887741 -521934 -380733 -523934 -744023 -874302 -983922 -1107343 -1095069 -954044 -981027
40437 -981027 -1266966 -1435746 -1229747 -978600 -1048720 -1190851 -974815 -574688 -501129 -745162
40427 -745162 -836284 -660871 -580336 -740969 -884887 -913421 -1057714 -1366297 -1548442 -1468101
40417 -1468101 -1305914 -1100338 -645484 -34796 213005 -139455 -646765 -803069 -708490 -785280
40407 -785280 -1114037 -1386226 -1341149 -999838 -601160 -454552 -682745 -1015444 -1061891 -845532
40397 -845532 -761944 -943747 -1074460 -971691 -884515 -958000 -891457 -527485 -346936 -840064
40387 -840064 -1663783 -1989427 -1546670 -799686 -175611 337881 801080 1045493 957919 683287
40377 683287 378429 26560 -377188 -690151 -801137 -775007 -738943 -773347 -934191 -1190386
40367 -1190386 -1322931 -1122433 -740234 -588956 -786891 -951034 -718659 -268241 -80966
40358 -80966 -296686 -561610 -508109 -173730 120181 155327 -26651 -269794 -465766 -562534
40348 -562534 -539028 -466700 -533393 -870491 -1338395 -1595720 -1438811 -1005047 -601798 -405167
40338 -405167 -359287 -287780 -62058 263272 462577 391809 234151 326025 698140 998246
40328 998246 955983 678833 341846 -117549 -714106 -1093775 -924632 -481144 -379115 -742823
40318 -742823 -1096672 -1156176 -1240347 -1675793 -2212952 -2381088 -2138057 -1795037 -1486139 -1108451
40308 -1108451 -710039 -553993 -748898 -1090583 -1334330 -1417348 -1375798 -1251109 -1130095 -1074359
40298 -1074359 -941084 -483978 252809 836620 914543 640372 438219 441635 414283 213605
40288 213605 57001 188485 460723 467876 60075 -461911 -713267 -646381 -505763 -449608
40278 -449608 -363186 -60503 442627 926650 1193327 1236175 1210653 1287033 1522579 1818467
40268 1818467 1971528 1801360 1290073 635786 141378 -27635 -15127 -146883 -562269 -1024283
40258 -1024283 -1204146 -1112726 -1067443 -1197894 -1210046 -803165 -145531 310327 391561 306282
40248 306282 224965 100910 -31718 43223 315975 366393 -84958 -676274 -861491 -731488
40238 -731488 -902574 -1578499 -2216333 -2293876 -1977803 -1746328 -1692356 -1566206 -1276466 -946669
40228 -946669 -594590 -142178 296182 489648 455355 414681 370438 92365 -389114 -649636
40218 -649636 -430457 -32474 94787 -72541 -236256 -275295 -345478 -576349 -939179 -1364311
40208 -1364311 -1750074 -1906338 -1740691 -1467882 -1366414 -1343547 -1060978 -537165 -247537 -436830
40198 -436830 -678389 -450837 84796 314728 94572 -29843 368015 973105 1174193 857436
40188 857436 438426 256019 271200 332836 426758 586864 780397 969307 1126685 1140786
40178 1140786 876121 395025 -54728 -350046 -613109 -929695 -1138514 -1044339 -688093 -263735
40168 -263735 90362 286492 248658 48895 -82129 -65620 -123274 -412706 -721669 -801817
40158 -801817 -806164 -1036110 -1405376 -1568358 -1479928 -1362740 -1164880 -596883 201082 583455
40148 583455 234406 -376666 -666388 -664118 -732307 -922804 -1030331 -1038467 -1084533 -1130184 -1053712
40137 -1053712 -959920 -1026822 -1119270 -931963 -512918 -297889 -550696 -1025693 -1272269 -1096337
40127 -1096337 -653899 -214652 105712 408289 782495 1048482 922077 487372 217311
40118 217311 334858 433158 22303 -777689 -1440045 -1738074 -1841013 -1833048 -1612308 -1274053
40108 -1274053 -1143382 -1305531 -1453259 -1350310 -1178300 -1274223 -1711044 -2243269 -2527254 -2354746
40098 -2354746 -1813548 -1240473 -914840 -852748 -981329 -1299550 -1653657 -1631584 -1079782 -531219
40088 -531219 -637922 -1287463 -1790620 -1861458 -1818402 -1823564 -1617861 -1189499 -1046730 -1493689
40078 -1493689 -2144318 -2472101 -2383262 -1974582 -1262167 -521684 -361532 -962627 -1668287 -1815589
40068 -1815589 -1565252 -1394804 -1218547 -691009 -53076 114335 -139872 -159778 304389 768754
40058 768754 806977 588931 458738 447704 390952 159977 -347429 -1100386 -1717727 -1711385
40048 -1711385 -1078177 -364589 -60973 -200027 -571791 -994774 -1306744 -1406556 -1388217 -1382921
40038 -1382921 -1292209 -996389 -752126 -927842 -1343704 -1393476 -923442 -469085 -441923 -595045
40028 -595045 -550328 -371872 -282820 -219500 -26003 232285 464824 750396 1052033 1094798
40018 1094798 841123 700308 886689 964951 504358 -172456 -449526 -341361 -337770 -516925
40008 -516925 -490536 -191185 -50091 -280585 -545043 -514530 -306743 -177398 -153702 -162185
39998 -162185 -212477 -293208 -332830 -348707 -380757 -264546 187332 744113 898341 544428
39988 544428 114504 -74787 -160057 -247208 -105057 332816 621957 400893 -27207 -183489
39978 -183489 -177409 -419042 -773347 -662416 -23786 450157 224552 -402849 -805758 -842504
39968 -842504 -839764 -1003914 -1208429 -1295341 -1291384 -1282643 -1262827 -1184658 -1062595 -946653 -835097
39957 -835097 -686577 -522875 -442065 -464717 -428797 -169510 206547 402642 346091 327344
39947 327344 582496 907248 903584 506802 28653 -268312 -386971 -399068 -307082 -178321
39937 -178321 -188961 -402075 -636162 -654301 -396809 1894 306193 292647 -39505 -342667
39927 -342667 -236998 164436 294128 -160919 -834810 -1181782 -1170833 -1178046 -1350091 -1464942
39917 -1464942 -1398356 -1331514 -1382809 -1361890 -1087255 -708771 -480163 -374642 -177512 141511
39907 141511 412855 574279 702059 709042 335645 -391521 -966689 -960125 -609157 -517499
39897 -517499 -831237 -1110321 -1081191 -1075382 -1449595 -1925449 -1944560 -1513575 -1218815 -1398220
39887 -1398220 -1739582 -1821930 -1673722 -1582775 -1646299 -1760464 -1851969 -1884749 -1797156 -1640670
39877 -1640670 -1617288 -1765528 -1789553 -1464007 -1046453 -965825 -1206358 -1352413 -1197505 -930555
39867 -930555 -690027 -331394 209640 651337 692390 391275 14354 -314260 -592081 -713918
39857 -713918 -533819 -120702 256482 419848 416331 343149 174214 -169380 -641747 -1047540
39847 -1047540 -1217207 -1185041 -1148138 -1226388 -1313911 -1229538 -972410 -732135 -649501 -652656 -541153
39836 -541153 -177773 378882 868940 1015299 812963 566684 509751 483439 215982 -148789
39826 -148789 -131514 395961 916381 863001 302911 -206951 -321022 -221752 -265877 -515861
39816 -515861 -689623 -506726 -35920 334767 307309 -15292 -333434 -569247 -850468 -1115248
39806 -1115248 -1064583 -622272 -150180 -13497 -153303 -280163 -276324 -191713 -48316 100754
39796 100754 96435 -77009 -134721 127358 450469 448449 205031 149639 377121 491427 189948
39785 189948 -335864 -691439 -705897 -479710 -251120 -296237 -715118 -1213239 -1321881 -951940
39775 -951940 -528960 -471094 -735462 -1003351 -1107230 -1098382 -1043954 -956195 -859035 -774051 -660399
39764 -660399 -462386 -217698 -86089 -258477 -775349 -1388327 -1713515 -1640570 -1461937 -1426438
39754 -1426438 -1345042 -948961 -492162 -528919 -1066945 -1436213 -1187572 -688841 -542408 -777085
39744 -777085 -993114 -1049142 -1170048 -1463636 -1701446 -1606402 -1143074 -532597 -113018 -86247
39734 -86247 -259111 -190213 217850 461220 39286 -838989 -1479507 -1540792 -1301905 -1134551
39724 -1134551 -1083439 -1037429 -987210 -962146 -922860 -838956 -724177 -540489 -243382 27521
39714 27521 2672 -381080 -857559 -1128830 -1153315 -1083922 -1060510 -1104735 -1075806 -730227 -39587
39703 -39587 541539 442106 -260778 -772360 -530835 56064 193144 -187143 -389717 -24365
39693 -24365 428337 355841 -94220 -268202 42852 340414 100397 -644129 -1486741 -2098972
39683 -2098972 -2331110 -2125846 -1596416 -1064793 -786092 -703346 -656631 -707005 -980646 -1278593
39673 -1278593 -1202251 -711560 -222388 -34992 15650 162610 267260 59268 -381794 -680361
39663 -680361 -601736 -214791 264488 580906 538738 244511 113203 353887 594562 357630
39653 357630 -223851 -592097 -596209 -620858 -821788 -796013 -277846 308907 388514 1415
39643 1415 -375323 -536096 -630741 -689748 -552696 -278675 -201313 -462041 -810359 -995938
39633 -995938 -1084211 -1227897 -1358083 -1298836 -1042402 -735782 -488969 -328254 -245645 -175570
39623 -175570 -24065 149613 83908 -390373 -1068554 -1535925 -1565115 -1223406 -682370 -122188
39613 -122188 243664 309932 251324 295612 304557 -97139 -864717 -1364195 -1120070 -445452
39603 -445452 10919 117677 243821 539650 739551 684811 541949 375254 -34766 -731733
39593 -731733 -1358080 -1667018 -1878200 -2177382 -2224942 -1644106 -762055 -313891 -479961 -743644
39583 -743644 -743945 -754195 -1120560 -1635365 -1777195 -1367787 -739402 -349437 -387573 -684359
39573 -684359 -895610 -829837 -636314 -601602 -780593 -966642 -1010466 -976285 -950554 -893944 -758584
39562 -758584 -588503 -424873 -246203 -58501 84413 177502 236549 178236 -67342 -306101
39552 -306101 -194659 305050 812938 982605 856906 665314 498411 338193 205080 98815
39542 98815 -36583 -138635 -13332 329327 535560 332113 -83908 -333824 -392273 -542631
39532 -542631 -871124 -1096710 -927978 -390665 222528 589930 559804 241380 -93403 -246597
39522 -246597 -183255 95297 561192 986658 1052879 812524 746533 1078129 1312575 856989
39512 856989 -107291 -838645 -1006640 -947712 -982454 -1025645 -982860 -1013250 -1166303 -1191780 -997711
39501 -997711 -929095 -1256397 -1685137 -1748432 -1472712 -1263423 -1264439 -1232053 -1010865 -761902
39491 -761902 -652485 -607933 -480287 -265433 -53763 92081 137387 75233 -16679 -35012
39481 -35012 -20996 -149089 -459867 -704466 -579769 -93104 400568 531248 229629 -275637
39471 -275637 -685184 -807041 -589429 -112168 417564 759786 822155 713609 568760 394041
39461 394041 176142 35744 76095 114792 -173788 -762823 -1153846 -928952 -261385 320383
39451 320383 541971 515759 372368 96573 -235836 -389103 -302088 -249142 -455154 -738435
39441 -738435 -789135 -649037 -580897 -531013 -142227 590613 1079735 841288 160950 -286186
39431 -286186 -309746 -299531 -515004 -725338 -655323 -406363 -238767 -229862 -366089 -711255
39421 -711255 -1206630 -1496672 -1260499 -624031 -2364 362370 473898 343867 13620 -248677
39411 -248677 -120830 365893 857043 1126964 1239052 1257589 1113149 816400 511982 234483
39401 234483 -109487 -431162 -441048 -79653 320248 460002 385401 209257 -151623 -706855
39391 -706855 -1144291 -1171216 -909211 -660510 -476138 -265436 -143818 -304966 -667348 -993960
39381 -993960 -1249329 -1483226 -1496547 -1068873 -452121 -144224 -150231 17783 495085 752880
39371 752880 380516 -292346 -705956 -827442 -990790 -1258964 -1388836 -1271357 -994738 -573568
39361 -573568 -12037 430737 456454 220728 208412 531196 723491 397678 -219800 -624979
39351 -624979 -654986 -518673 -401462 -337616 -391732 -669782 -1102778 -1412136 -1370500 -1013499
39341 -1013499 -585548 -371919 -565056 -1130981 -1731575 -1904118 -1463934 -724631 -237401
39332 -237401 -301505 -775756 -1342425 -1837586 -2259450 -2555547 -2574269 -2272527 -1860503 -1642814
39322 -1642814 -1739979 -2009780 -2197413 -2117695 -1763707 -1332531 -1099518 -1154618 -1276206 -1168586
39312 -1168586 -816637 -502412 -479367 -744657 -1125486 -1446656 -1589851 -1537186 -1414187 -1373098
39302 -1373098 -1404313 -1402766 -1426530 -1658784 -2025917 -2111894 -1651641 -920385 -406454 -242967
39292 -242967 -194172 -65873 138673 365856 528339 450144 87285 -261187 -276572 -97765
39282 -97765 -114921 -319171 -292789 94689 443365 437989 271333 225869 249118 240076 358969
39271 358969 667960 809680 509102 139178 269992 795610 1021516 581576 -186973 -774706
39261 -774706 -978671 -842874 -550226 -429669 -676839 -1006221 -960101 -593276 -397363 -469051
39251 -469051 -295919 399370 1127457 1329665 1184597 1229072 1455389 1341370 701877 11640
39241 11640 -205712 37094 341680 429464 360813 353994 466571 455554 23065 -743470 -1305504
39230 -1305504 -1197394 -546941 65832 216503 -12819 -218226 -78187 375208 778169
39221 778169 776798 412251 57576 -94777 -278962 -708554 -1082751 -863249 -3571 903365
39211 903365 1274424 1106239 794787 576686 347714 153 -261829 -120834 343361 565592
39201 565592 130738 -619260 -931181 -595175 -187957 -245746 -583924 -697949 -498333 -278883
39191 -278883 -203047 -234520 -406839 -726601 -916727 -712052 -372974 -446070 -984917 -1457812
39181 -1457812 -1513914 -1397987 -1455918 -1657811 -1838993 -2024606 -2201144 -2067524 -1393279 -480541
39171 -480541 56869 -67711 -604092 -1120565 -1364123 -1311327 -1060625 -724098 -361431 -9730
39161 -9730 244634 311509 204853 -5222 -304712 -622567 -665763 -172494 618853 1076132
39151 1076132 892508 422723 147795 104519 64062 -25887 -92466 -200055 -405893 -508479
39141 -508479 -302911 9132 30311 -249784 -441644 -345112 -205126 -284991 -485698 -555293
39131 -555293 -468791 -410459 -479023 -570748 -552531 -474025 -551042 -884331 -1222717 -1168222 -688355
39120 -688355 -234605 -197164 -434294 -573878 -588080 -710310 -877258 -689900 -12484 741641
39110 741641 1069472 868809 362833 -190579 -566196 -609655 -415383 -288783 -365921 -449114
39100 -449114 -366741 -262536 -301911 -307613 -3173 495797 755296 560808 108438 -332833
39090 -332833 -673856 -879644 -863385 -640992 -421024 -405433 -587876 -818699 -977185 -1031375
39080 -1031375 -1031517 -1091650 -1271550 -1438154 -1374058 -1082475 -843887 -881685 -1107968 -1310583
39070 -1310583 -1447536 -1594212 -1716443 -1703061 -1566427 -1408583 -1223155 -945108 -680214 -626115
39060 -626115 -712485 -589160 -110536 401508 572379 459677 379512 388498 234565 -215778
39050 -215778 -775351 -1178884 -1295191 -1084044 -608904 -171057 -163700 -619001 -1079688 -1099767
39040 -1099767 -744272 -423294 -341206 -304623 -34382 486790 966375 1018119 500868 -247066
39030 -247066 -604637 -267330 385468 674629 355813 -170448 -369191 -134706 188054 214925
39020 214925 -115231 -527660 -703397 -575185 -314530 -53907 246557 598094 814898 715887
39010 715887 399570 132836 24154 -12242 -32105 -29677 -108831 -432571 -951292 -1396612
39000 -1396612 -1614592 -1712535 -1805685 -1819955 -1651018 -1345195 -1008289 -679802 -387921 -170282
38990 -170282 45625 387150 738628 714772 132635 -651334 -1098332 -1069635 -845214 -673457
38980 -673457 -550573 -397042 -211265 -33813 71941 12571 -217753 -454229 -543635 -537674
38970 -537674 -538547 -469912 -249029 -77569 -216948 -503971 -483876 -94884 182876 27897
38960 27897 -258221 -248314 -13868 95734 32188 -15749 -104990 -489993 -1109335 -1548347 -1594690
38949 -1594690 -1473213 -1417704 -1357661 -1219932 -1234997 -1645753 -2260995 -2572385 -2286893 -1583943
38939 -1583943 -887534 -506370 -438673 -406195 -120250 391347 771100 718793 316286 -111612
38929 -111612 -358867 -451107 -492929 -541606 -585238 -549069 -379376 -170992 -79825 -45115 175129
38918 175129 532320 529737 -136107 -981259 -1222754 -788581 -368714 -423688 -632177 -490720
38908 -490720 -10812 452511 687455 609653 83179 -832145 -1660149 -1952651 -1848701 -1819715
38898 -1819715 -1948271 -1867182 -1408795 -905530 -725458 -811251 -832629 -596594 -180257 208263
38888 208263 415405 468302 513628 550339 332745 -271893 -941289 -1191712 -959905 -596027
38878 -596027 -324811 -81704 103323 -8692 -454692 -923644 -1201629 -1401151 -1547558 -1356573
38868 -1356573 -764156 -309016 -519030 -1142130 -1471479 -1299155 -1039084 -942186 -731049 -152763
38858 -152763 550228 962814 991697 808063 530571 207050 -52982 -177624 -288779 -552230
38848 -552230 -900138 -1075932 -969011 -769505 -735592 -883650 -981731 -834923 -505189 -201154
38838 -201154 -3276 186139 411870 537507 445519 247006 151833 203736 284006 316026
38828 316026 317568 299555 263980 260473 303084 297210 212595 236037 527597 900307 1012678
38817 1012678 828466 571781 260406 -311379 -1061908 -1536710 -1515762 -1290637 -1089308 -668014
38807 -668014 127420 788309 697825 47408 -395876 -355210 -267635 -412661 -472608 -202784
38797 -202784 34043 -184420 -655320 -871268 -759737 -632418 -572591 -394472 -186126 -360600
38787 -360600 -989598 -1495204 -1302730 -570089 24331 92042 -148732 -312498 -305224 -266474
38777 -266474 -288382 -371462 -544911 -832372 -1117358 -1225395 -1187520 -1261075 -1583229 -1932955
38767 -1932955 -1990808 -1746707 -1457438 -1245184 -980555 -604194 -310023 -261212 -315707 -229852
38757 -229852 -4638 181856 292627 438874 600758 592495 347952 24376 -253249 -549628
38747 -549628 -900327 -1107664 -939118 -458406 -2500 158365 40015 -154536 -261094 -282617
38737 -282617 -363957 -660216 -1199978 -1850942 -2384938 -2560280 -2231728 -1518584 -839696 -590376
38727 -590376 -708934 -715034 -279288 383038 807849 827666 638592 425088 162283 -190266
38717 -190266 -492796 -519196 -185460 337259 707500 676593 354500 132854 212871 300298
38707 300298 -30432 -722636 -1249270 -1278725 -1076899 -1122675 -1517405 -1936622 -2039446 -1769495
38697 -1769495 -1331809 -1006418 -931428 -971841 -861367 -547521 -300120 -375323 -671195 -852450
38687 -852450 -743067 -448833 -149812 57014 125903 50715 -73267 -105823 -28181 47679
38677 47679 65336 93409 143313 53815 -289661 -676644 -698464 -210752 461257 881028 968970
38666 968970 969718 1023035 999812 808465 612134 569638 554582 368818 87568 -100775 -288521
38655 -288521 -705864 -1206632 -1335005 -1013107 -722906 -786328 -897745 -716096 -520173 -767528
38645 -767528 -1268363 -1401480 -1057688 -750833 -741398 -669659 -279765 51207 -106126 -526976
38635 -526976 -662512 -429884 -207382 -155853 -2358 459113 1012889 1300901 1235558 1008896
38625 1008896 822824 704995 524811 156712 -324587 -642210 -601171 -340452 -185465 -268793
38615 -268793 -418782 -409774 -188057 148139 439314 500018 210004 -353552 -966277 -1479731
38605 -1479731 -1886885 -2135367 -2048012 -1555788 -880450 -314055 105552 512394 863562 932564
38595 932564 703954 505672 564143 634033 356161 -125210 -271996 71830 392470 215493
38585 215493 -208001 -296511 -46116 -61100 -623802 -1188117 -1065138 -325155 315513 369820
38575 369820 22885 -261838 -281617 -173796 -169274 -373275 -681816 -864357 -819507 -740105
38565 -740105 -870651 -1094498 -991628 -427504 118404 30525 -730640 -1601545 -2043208 -1974213
38555 -1974213 -1608902 -1162118 -829434 -805539 -1091432 -1415505 -1573281 -1749689 -2230416 -2822116
38545 -2822116 -2895193 -2140653 -1033057 -332136 -285191 -540510 -718487 -777351 -819137 -803299
38535 -803299 -573856 -57462 621350 1148937 1185066 683941 56787 -184468 -7991 99015
38525 99015 -236497 -794232 -1075692 -953405 -793088 -974009 -1471050 -1935728 -2078041 -1927972
38515 -1927972 -1752869 -1715819 -1641051 -1225654 -505055 63248 102662 -232925 -479843 -432182
38505 -432182 -286030 -269928 -353524 -348578 -132194 257718 608137 610849 134105 -543976 -938778
38494 -938778 -859846 -571278 -416068 -465562 -622709 -857695 -1153582 -1355313 -1288635 -974661
38484 -974661 -557756 -91226 401428 704384 523064 -112928 -791239 -1180812 -1356455 -1504642
38474 -1504642 -1511627 -1125432 -440947 93788 198660 21903 -206154 -500492 -912914 -1235809
38464 -1235809 -1218747 -971643 -833280 -856062 -746776 -400653 -181518 -450830 -1000771 -1216277
38454 -1216277 -771368 18751 574454 682573 687199 1031462 1627571 1817127 1108135 -140289
38444 -140289 -1024016 -1085610 -713796 -494456 -518277 -534001 -451638 -345792 -172831 129723
38434 129723 370432 299005 29715 -68819 102023 263833 177218 -117846 -450794 -612594
38424 -612594 -361399 289212 825782 726303 213707 10818 269558 364366 -9214 -211920
38414 -211920 362280 1252898 1568016 1279193 1094285 1215515 1082203 444070 -97554 51762
38404 51762 659875 1088008 1089195 800276 321398 -229390 -501309 -261242 133847 75517
38394 75517 -469179 -867488 -651884 -103948 160713 -62163 -451491 -632913 -524965 -267940
38384 -267940 -37104 14865 -212620 -667205 -1115732 -1320086 -1251931 -1073255 -905039 -704041
38374 -704041 -417474 -178878 -234912 -665907 -1250164 -1640021 -1651331 -1377567 -1054661 -840765
38364 -840765 -732698 -677026 -688897 -785057 -856149 -768597 -614942 -667212 -976698 -1220594 -1144499
38353 -1144499 -991739 -1204872 -1774570 -2203453 -2129713 -1676153 -1118405 -548861 -44645 148178
38343 148178 -86813 -422483 -406959 -61971 116943 -204132 -787324 -1140910 -1085052 -859231
38333 -859231 -737617 -709172 -611637 -465427 -458908 -550750 -346402 360775 1075281 1028195 151556
38322 151556 -777559 -1110100 -1037675 -1070922 -1204759 -1052064 -567606 -124090 64548 136577
38312 136577 203693 211211 221848 420070 730421 819309 616953 478169 664093 1014150
38302 1014150 1312381 1606810 1913431 1962918 1586068 1076273 805506 704558 506594 312427
38292 312427 464345 936358 1279662 1189242 775543 262218 -242248 -628946 -771172 -710187
38282 -710187 -608599 -485956 -268334 -102112 -264718 -682395 -901345 -700008 -401008 -368291
38272 -368291 -497295 -467043 -250882 -80107 -78023 -220547 -521472 -963021 -1338884 -1456767
38262 -1456767 -1443521 -1578904 -1862391 -2017689 -1921632 -1750173 -1650739 -1528339 -1262335 -936895
38252 -936895 -730883 -706481 -795463 -887852 -882492 -779939 -778477 -1119970 -1741954 -2224490 -2214674
38241 -2214674 -1800142 -1330985 -980603 -670648 -374303 -255995 -436264 -781508 -1046486
38232 -1046486 -1136974 -1121593 -1052429 -912521 -727772 -596148 -566872 -581927 -568241 -500922 -360863
38221 -360863 -157038 -23857 -117186 -318016 -250992 212644 675578 725959 558353 681593
38211 681593 1087590 1220044 859905 509965 619980 886432 745809 248172 -41611 154407
38201 154407 570777 853317 869020 623085 244091 9823 42299 52622 -245538 -599321
38191 -599321 -576494 -362654 -576900 -1248260 -1661887 -1445180 -1131889 -1256557 -1502213 -1303223
38181 -1303223 -814616 -607714 -688702 -518131 87624 698141 927583 821123 523574 45048
38171 45048 -513491 -888757 -956494 -832996 -630291 -406718 -361768 -693503 -1183945 -1314146
38161 -1314146 -939708 -513919 -478135 -745921 -963750 -968360 -774374 -404192 2576 134802
38151 134802 -156486 -601476 -794579 -620504 -266182 25660 85366 -109829 -366835 -492847
38141 -492847 -658103 -1205363 -1950799 -2126212 -1354867 -268636 313250 453008 744399
38132 744399 1185596 1179624 605122 71585 -78747 -278346 -870428 -1360728 -1069423 -131912
38122 -131912 695119 984990 893903 620446 133407 -540591 -1150640 -1442389 -1341848 -930098
38112 -930098 -421170 -90794 -12117 46881 239181 301574 -76708 -674662 -951829 -815856
38102 -815856 -719144 -910346 -1067103 -893224 -647184 -711026 -928629 -805258 -243503 312224
38092 312224 457281 231239 -113343 -477941 -912028 -1379500 -1686054 -1657134 -1353089 -1055757
38082 -1055757 -974985 -997220 -848501 -490088 -153224 48532 265128 537970 589824 248056
38072 248056 -188132 -359131 -411724 -710260 -1119147 -1121974 -673240 -350753 -469676 -587587
38062 -587587 -243646 246363 206546 -449262 -1158398 -1459879 -1364282 -1055510 -677211 -446274
38052 -446274 -572750 -944576 -1181191 -1090736 -811760 -452133 72598 697047 1033551 801629
38042 801629 223211 -255777 -482471 -606121 -718871 -762374 -722005 -657848 -565509 -424550
38032 -424550 -354498 -480056 -640213 -502704 -49387 294279 153353 -360624 -862424 -1172699
38022 -1172699 -1377731 -1521201 -1489029 -1212395 -799805 -417739 -156182 -29432 12213 89635
38012 89635 274691 420012 260179 -217574 -620416 -504881 156282 948991 1401410 1302649
38002 1302649 724556 -93694 -848199 -1281402 -1291920 -962104 -505807 -181337 -142119 -283838
37992 -283838 -329160 -181113 -92649 -307900 -623341 -578980 -101630 334460 309916 -30742
37982 -30742 -263221 -269414 -277451 -431578 -610030 -668358 -624130 -545898 -447930 -377981 -451840
37971 -451840 -660830 -717569 -264153 678728 1522545 1529473 564311 -617273 -1036098 -513391
37961 -513391 154534 154678 -420948 -826727 -651787 -205814 55457 118326 268229 595662
37951 595662 853265 721365 94851 -821471 -1606273 -1874012 -1542929 -873310 -246035 69989
37941 69989 -2033 -352364 -741294 -960986 -992462 -953424 -912721 -847387 -747838 -637007 -508738
37930 -508738 -385231 -397995 -635155 -933776 -1023013 -852548 -562562 -191776 252896 458379
37920 458379 5631 -937684 -1591245 -1524509 -1223886 -1296033 -1498327 -1147663 -265981 369929
37910 369929 329022 32525 -13869 74839 -43889 -268240 -213650 150433 413652 242012
37900 242012 -257664 -681470 -703236 -350397 9295 32295 -211369 -362045 -316833 -389831
37890 -389831 -780031 -1168129 -1138723 -800092 -604329 -640216 -528847 -84642 313364 221336
37880 221336 -262511 -650912 -681057 -516759 -400819 -366353 -336614 -299537 -262505 -168785 -10925
37869 -10925 48227 -148611 -453584 -480749 -68512 466533 676881 481363 144327 -159314
37859 -159314 -509777 -949030 -1271955 -1257040 -968462 -689452 -629717 -787430 -1010946 -1101805
37849 -1101805 -935974 -577136 -216997 35656 205708 268881 104598 -266927 -591859 -688016
37839 -688016 -676875 -730025 -757195 -576006 -234730 101402 433320 770658 828190 314371
37829 314371 -492278 -905736 -666401 -209250 27272 132911 338248 492416 280373 -276739
37819 -276739 -850007 -1159462 -1074228 -592424 8498 248294 -927 -252826 -46111 389944
37809 389944 533999 407622 449648 675645 633601 281385 235768 836404 1487864 1362814
37799 1362814 428290 -631584 -1274039 -1486198 -1489212 -1467191 -1560343 -1810131 -2078059 -2205243
37789 -2205243 -2222536 -2237762 -2193181 -1945332 -1542258 -1210511 -1068724 -1029615 -992239 -970739
37779 -970739 -997531 -1015135 -916039 -657068 -341467 -187667 -332103 -631565 -771048 -619080
37769 -619080 -358152 -219642 -246551 -375475 -554023 -684669 -673865 -649834 -863825 -1220434
37759 -1220434 -1245688 -795859 -441899 -715319 -1245387 -1197215 -433906 350912 654380 706518
37749 706518 843794 917107 651890 192793 -86156 -79450 47660 178243 293471 327296
37739 327296 213840 29617 -67478 -11536 118126 148923 -78987 -538977 -986094 -1259946
37729 -1259946 -1522541 -1933127 -2213733 -1962256 -1356157 -1020042 -1120727 -1173764 -929507 -801166
37719 -801166 -1049064 -1183110 -746861 -169138 -126202 -430526 -349434 171275 432990 125933
37709 125933 -235527 -178309 84979 119274 -141281 -498631 -761357 -729339 -322704 120159
37699 120159 107144 -296106 -498991 -311676 -285612 -813843 -1424798 -1431888 -872368 -291045
37689 -291045 92400 453244 802611 906509 704399 376077 36534 -272852 -382028 -182450
37679 -182450 39900 -124265 -605489 -911307 -810474 -593588 -589660 -757016 -841743 -668204
37669 -668204 -222000 286546 427593 -62756 -857899 -1317855 -1236991 -983062 -856466 -726521
37659 -726521 -426708 -81317 173053 402656 576643 447621 22763 -251888 -162860 -201315
37649 -201315 -858350 -1738373 -1971232 -1371296 -597346 -199529 -96088 -53051 -85622 -163622
37639 -163622 -3807 542081 1216824 1711700 1996383 2092330 1845944 1207130 475903 -18789
37629 -18789 -297181 -542435 -737214 -754163 -649527 -605149 -692549 -897975 -1233602 -1618522
37619 -1618522 -1817430 -1721935 -1525499 -1399018 -1203185 -797271 -409353 -337263 -445616 -360101
37609 -360101 -65554 90592 -53333 -304089 -477199 -565588 -544043 -354931 -101240 67192
37599 67192 234287 538491 772583 595205 131520 -115079 1875 124606 64736 65858
37589 65858 202848 97883 -422618 -881679 -785813 -319281 31958 220357 517028 882307
37579 882307 963624 653605 253445 83559 189943 390190 418298 122924 -317950 -527323
37569 -527323 -403158 -234572 -205788 -109813 212328 501318 481712 324273 333376 451309
37559 451309 469939 468612 603637 698398 513246 234782 228121 463686 640497 701176 760575
37548 760575 732560 553166 555872 1000728 1400124 1035679 99056 -424727 -74834 598449
37538 598449 978473 1072471 1019498 627380 -181863 -978728 -1282796 -1065358 -563060 -246
37528 -246 306425 67458 -468568 -587916 -2490 767313 1178898 1333028 1493801 1468939
37518 1468939 982674 275816 -202457 -421308 -602497 -700260 -560424 -384079 -497395 -780553
37508 -780553 -825176 -592589 -441057 -510273 -531806 -328003 -122788 -210001 -558175 -885660
37498 -885660 -996128 -940475 -882903 -843133 -639784 -199352 166681 64766 -399728 -683127
37488 -683127 -518564 -185976 62010 369510 783624 860000 238539 -694356 -1232958 -1267148
37478 -1267148 -1288245 -1583112 -1891249 -1861238 -1454017 -844358 -227625 216267 384938 322879
37468 322879 123918 -152480 -361034 -263033 151458 516828 519949 319389 281432 456862
37458 456862 606749 616397 581460 565575 545889 546700 610848 698421 765911 828336 822108 604287
37446 604287 222581 -76137 -256842 -562138 -953771 -947763 -398924 -7466 -473445 -1443353
37436 -1443353 -1918308 -1535925 -831971 -329826 -11979 271920 465632 535885 604363 690568
37426 690568 642387 430370 258739 325257 640856 1018425 1071891 445572 -659069 -1431253
37416 -1431253 -1323035 -752615 -492350 -600571 -532109 -126559 203166 249968 300969 526444
37406 526444 673693 570608 459865 621951 1018085 1436844 1689893 1637067 1362707 1297199
37396 1297199 1747652 2335208 2367361 1776807 1212938 1189202 1639332 2317890 3044217 3447425
37386 3447425 3082806 2045570 998082 383721 39238 -276865 -469989 -433614 -334791
37377 -334791 -342160 -439493 -658322 -1079661 -1461258 -1324902 -613569 160650 596337 782757
37367 782757 829789 542833 -122626 -718048 -780657 -372180 121692 450031 538599 375977
37357 375977 110298 42006 320629 787664 1175053 1284982 1032224 584282 373360 638287
37347 638287 1076768 1318434 1510303 1910192 2168559 1756616 958265 584562 725394 690524
37337 690524 272814 107974 548131 1114119 1392778 1574373 1720326 1425719 714204 387134
37327 387134 868675 1477703 1484730 1169485 1147774 1319482 1246040 1040348 1122402 1468082
37317 1468082 1742746 1856411 1864390 1662488 1231659 826177 567211 284104 31006 175896
37307 175896 679700 988669 998280 1315908 2100908 2524348 2017417 1227461 1007468 1225494
37297 1225494 1344244 1435034 1777498 2119100 2168466 2209794 2450364 2427613 1858992 1353487
37287 1353487 1417738 1514407 1056392 566506 788122 1370489 1581261 1642644 2126842 2635474
37277 2635474 2402658 1737401 1550262 1832889 1902461 1809405 2170993 2838128 3020023 2615081
37267 2615081 2270224 2262348 2373396 2633204 3117692 3295886 2677342 1828574 1679138 2148967
37257 2148967 2507663 2641679 2833432 2801296 2218268 1706236 2027761 2764969 3071183 3158818
37247 3158818 3694691 4369604 4521281 4486901 4817897 4953078 4331569 3916953 4748881 5939047
37237 5939047 6177476 6204958 7446958 9234387 10026576 10394124 11857840 13733292 14391077
37228 14391077 14759392 16966314 20293890 22431120 24001551 27451558 32173925 35826524
37220 35826524 39996235 48767130 61937051 76340583 93847174 119945025 154100762
37213 154100762 192332179 241306218 314111246 401249267 459072664 445965315 367735476
37206 367735476 272489424 201277168 157744381 125892234 98596028 78865074 66064107
37199 66064107 55007901 44686482 37952983 34321129 30297785 25483567 22336765 20896218
37191 20896218 18862329 16076496 14348224 13489306 11665031 9188334 8141901 8540994
37183 8540994 8362226 7168726 6446575 6459770 5883200 4624833 4114652 4570031 4617140
37174 4617140 3901395 3592659 3944885 3709028 2483173 1522909 1614924 2006758 2029823 2090141
37164 2090141 2453743 2570923 2212608 1977234 2156312 2247870 1982095 1738789 1651985 1372195
37154 1372195 969846 1030163 1622686 2164673 2460982 2879845 3377934 3387976 2836765 2294708
37144 2294708 1983831 1588772 1111095 899314 773196 185153 -656073 -922012 -547275
37135 -547275 -336124 -508994 -342516 432234 1071739 1112185 1089571 1406653 1534673 1042678
37125 1042678 523156 701133 1289112 1481896 1112277 674730 564961 810486 1266469
37116 1266469 1720330 2082249 2644547 3727436 4939308 5368699 4733852 3736716 3005494
37107 3005494 2340199 1391501 446452 -4030 -15879 23993 31942 187791 535256 1013648
37097 1013648 1634521 2274492 2531544 2133743 1325930 594344 169149 -23611 -134139
37088 -134139 -297427 -568647 -799440 -758840 -443723 -38532 438259 1096772 1731051 1839853
37078 1839853 1287783 605436 400580 704527 1072330 1132046 912489 782663 1097786 1757012
37068 1757012 2206133 2095625 1739997 1587727 1505649 1121296 638328 584075 829452 677220
37058 677220 9059 -485808 -440923 -340466 -562357 -688349 -277642 345124 651895 698177
37048 698177 753965 652735 167998 -350926 -403834 -145808 -130431 -414296 -510385 -155295
37038 -155295 385842 749320 806798 624952 430683 528460 958228 1377288 1551912 1719908
37028 1719908 2107948 2372670 2024967 1230668 639439 484905 391067 87269 -204800 -213437
37018 -213437 -4883 241758 501198 762172 882130 745376 391720 -83333 -565548 -844250
37008 -844250 -767911 -535191 -528455 -740078 -693852 -170610 284277 -32383 -985767 -1646453
36998 -1646453 -1420216 -773320 -577837 -968259 -1233198 -826480 -93383 212166 -129571
36989 -129571 -651998 -873410 -776172 -586719 -395968 -181400 -30126 -109672 -415365 -674542
36979 -674542 -570922 -58789 583695 1046234 1274511 1359097 1212810 641428 -184067 -660084
36969 -660084 -425981 121499 308747 9624 -358031 -511667 -556016 -606724 -593493 -486760
36959 -486760 -364817 -210696 34329 213588 118202 -87066 -18471 300935 423985 191014
36949 191014 -16606 87087 273934 277955 242744 329471 232124 -465900 -1597633 -2428875
36939 -2428875 -2354132 -1442360 -392769 1184 -440134 -1031404 -913821 -47042 772832
36930 772832 894474 408620 -275355 -911383 -1282689 -1150411 -698988 -579629 -1111131 -1809343
36920 -1809343 -2068474 -1905761 -1644873 -1316552 -882523 -650642 -870620 -1216930 -1265379 -1203646
36910 -1203646 -1424435 -1662917 -1302179 -445022 101595 -12908 -251394 -96327 260754
36901 260754 422333 430062 532481 698059 747988 739376 880330 1176865 1397202 1334052 988558
36890 988558 562603 311354 303740 325459 145081 -152444 -263673 -67968 257099 497137
36880 497137 579926 518575 391370 371110 562764 805621 824713 569963 235026 -3521
36870 -3521 -66298 112319 466170 655141 376461 -159731 -389831 -107839 283590 354900
36860 354900 203663 225219 512614 730745 569843 157307 -81865 37089 185358 -65107
36850 -65107 -621971 -946381 -795162 -548396 -622423 -909635 -1090209 -1164273 -1280056 -1322690
36840 -1322690 -1155669 -1051005 -1334423 -1743008 -1719690 -1285310 -1006687 -1078351 -1071479 -719483
36830 -719483 -326593 -163838 -38292 215590 323717 39678 -383372 -593412 -688469 -961880
36820 -961880 -1347760 -1502347 -1258809 -688225 97229 891666 1346120 1316442 1117271 1110061
36810 1110061 1176051 931250 346090 -223286 -582983 -911894 -1363699 -1753572 -1767812 -1314157
36800 -1314157 -572733 180813 729772 973941 917354 642981 337806 271455 556477 891470
36790 891470 778554 144010 -468673 -539795 -225533 -87818 -313097 -578813 -676883 -821810
36780 -821810 -1140653 -1231557 -632999 417366 1140275 1183738 1014212 1119815 1217606 724016
36770 724016 -188086 -636351 -237832 325332 286796 -140295 -183828 327787 827429 892336
36760 892336 660370 353895 -39936 -470785 -683808 -581868 -372302 -196390 48512 393715
36750 393715 675874 859124 1075315 1188048 789121 -104056 -807766 -796194 -375487 -133038
36740 -133038 -92579 83494 360285 403859 243243 257240 498864 571489 283542 -24093
36730 -24093 20374 320381 486355 278066 -246163 -812150 -1064150 -816267 -280400 100714
36720 100714 119147 -23573 -29171 165748 398887 461483 227505 -245614 -697810 -875092
36710 -875092 -789440 -656026 -577708 -453079 -223161 -40712 -118098 -507409 -1061289 -1508023
36700 -1508023 -1573800 -1196044 -656992 -345420 -318627 -255955 61906 397010 355653 -48255
36690 -48255 -359583 -247843 81986 182248 -39730 -227908 -100173 170647 272154 271177
36680 271177 502985 970017 1217018 957214 518985 402818 597962 662353 382322 13481
36670 13481 -144358 -112300 -92475 -200982 -446691 -780469 -1034922 -965244 -498183 142230
36660 142230 662951 974427 1139906 1155979 944226 537150 124806 -123780 -202410 -203093
36650 -203093 -183933 -136318 -10065 286398 837735 1561610 2120658 2143524 1615447 973254
36640 973254 721352 978032 1448703 1781406 1849602 1718581 1470179 1135193 768966 530848
36630 530848 615418 1049659 1617018 2105850 2580110 3174849 3616749 3311400 2130679 802302
36620 802302 148927 135802 89969 -273662 -568148 -494643 -338856 -474052 -763725 -767977
36610 -767977 -328856 284153 668254 592392 175690 -150018 -57570 233239 184598 -330728
36600 -330728 -861131 -1046637 -1066343 -1194322 -1284417 -1030748 -472009 107599 591043 1037843
36590 1037843 1448181 1803599 2197845 2663068 2994655 2988891 2754419 2624066 2887567 3691717
36580 3691717 4968045 6403184 7838541 9723342 12527782 15439743 16444396 14418261
36572 14418261 10631892 7389667 5573784 4385874 3134564 2095207 1551742 1134226
36564 1134226 543566 112758 158254 381927 364477 151322 -45980 -250520 -422003 -223463
36554 -223463 447215 1057258 1037089 509108 16800 -207052 -298022 -340428 -336906 -431577 -744302
36543 -744302 -1082261 -1169060 -1056335 -974981 -893325 -587029 -79545 350658 587652 763448
36533 763448 897750 774728 292102 -292246 -595534 -479778 -122146 191304 294851 222751
36523 222751 93645 -61031 -279807 -495616 -549963 -463084 -512440 -889250 -1409567 -1731686
36513 -1731686 -1744718 -1563879 -1256070 -805720 -312710 5055 42094 -110681 -326765 -553565
36503 -553565 -747825 -833990 -766397 -546952 -177713 293929 667670 671597 256803 -256683
36493 -256683 -451231 -238372 72710 159917 40971 -45324 -19013 -42739 -226132 -435745
36483 -435745 -474951 -306451 -27183 215543 217814 -140456 -616558 -723773 -336511 78552
36473 78552 93500 -108203 -154639 -187488 -610639 -1313776 -1770536 -1881032 -2059454 -2365015
36463 -2365015 -2204132 -1209442 94401 869933 850800 356338 -201863 -497269 -308771
36454 -308771 250607 722265 793092 599956 363461 31786 -465498 -938541 -1208256 -1351388
36444 -1351388 -1389328 -1089062 -432933 75136 28756 -247152 -168750 243634 492420 397504
36434 397504 205924 23858 -282047 -624957 -681994 -420210 -187715 -179685 -200238 -54580
36424 -54580 164562 276914 208648 -66795 -489183 -774081 -622416 -139561 215217 152920
36414 152920 -195479 -551518 -757814 -774268 -656437 -539836 -444516 -183329 293884 631207
36404 631207 499158 142113 47087 187424 133576 -141740 -207346 -91 -32719 -525259
36394 -525259 -943895 -786440 -320477 -95295 -130858 -84425 85613 149059 116693 214579
36384 214579 397183 326285 -114159 -608942 -809583 -734182 -683087 -854508 -1093709 -1041524
36374 -1041524 -600199 -183338 -268443 -700900 -793409 -263336 289660 120595 -731693 -1579988
36364 -1579988 -1915587 -1720137 -1139308 -318844 443455 794559 688748 411708 202529
36355 202529 74472 9105 51275 142766 94996 -177177 -553696 -874953 -1032488 -891957
36345 -891957 -380114 268753 598903 417127 7212 -285325 -485142 -787236 -1090037 -1053223
36335 -1053223 -617553 -162528 -23108 -77220 -8621 180435 199567 -14513 -116995 170705
36325 170705 614806 721916 357791 -95667 -198112 95228 447083 465509 5072 -716932
36315 -716932 -1265648 -1359038 -1120615 -879866 -762930 -640853 -449512 -310210 -263592 -131345
36305 -131345 202392 565016 737644 764915 796053 730188 313756 -383414 -845532 -622136
36295 -622136 130785 753937 729260 149499 -475903 -804610 -930708 -1068009 -1166527 -1044213
36285 -1044213 -796352 -761959 -1003504 -1087729 -584932 355691 1125239 1282771 918448 460321
36275 460321 277056 438773 719754 809873 589235 190426 -219303 -611925 -988724 -1240490
36265 -1240490 -1281399 -1235380 -1291053 -1402031 -1347095 -1124068 -1062279 -1396915 -1868952 -1954662
36255 -1954662 -1482187 -839029 -490892 -435732 -295273 116681 543060 664067 521815 392710
36245 392710 366800 274576 -14049 -426128 -809903 -1027035 -929534 -475082 88625 372566
36235 372566 258441 -22354 -269412 -527304 -811006 -890522 -581937 -90535 170293 21260
36225 21260 -387483 -819126 -1111937 -1188720 -1090700 -959171 -859335 -705608 -476988 -356766
36215 -356766 -460462 -557139 -337582 82145 211419 -201536 -828416 -1138214 -971746 -636869
36205 -636869 -527876 -759504 -1145228 -1437472 -1533304 -1467866 -1307895 -1134674 -1054826 -1079902
36195 -1079902 -1040407 -810837 -586196 -661042 -909834 -845352 -345443 55295 -105848 -522277
36185 -522277 -563121 -202863 -22013 -344206 -845159 -1082036 -1004732 -799812 -549450 -239132
36175 -239132 91972 365123 524698 539718 453924 412335 487898 542959 457198 389968 529003
36164 529003 666624 410307 -189962 -640775 -694887 -609904 -597131 -483171 -159126 77958
36154 77958 -21603 -222947 -197401 -38886 11872 59338 285321 430293 114422 -446214
36144 -446214 -655997 -476141 -524559 -1097254 -1677517 -1700689 -1301228 -921090 -601646 -152667
36134 -152667 265793 292373 -3091 -153959 8265 147918 18907 -159618 -137228 -95354
36124 -95354 -358153 -845126 -1156409 -1136051 -1034610 -1067988 -1073048 -751454 -132540 366142
36114 366142 350601 -137628 -646880 -749319 -430007 -17667 231067 361852 513428 645406
36104 645406 623737 472520 335540 217590 -15613 -346529 -542502 -503774 -492827 -825297
36094 -825297 -1413261 -1799631 -1647714 -1082225 -548447 -429168 -788103 -1365350 -1764315 -1709912
36084 -1709912 -1217800 -557874 -53578 126056 46386 -86519 -121072 -77742 -73174 -173912
36074 -173912 -382843 -719738 -1191915 -1677573 -1965447 -1962764 -1768235 -1490088 -1096731 -533418
36064 -533418 80082 464294 402636 -48120 -541348 -687064 -417904 -73552 7852 -71818
36054 -71818 61114 484161 873051 1019451 1114237 1327220 1420720 1104794 582533 368586
36044 368586 611883 911423 826448 330882 -264727 -632397 -625200 -338679 -49904 1725
36034 1725 -194645 -495885 -805290 -1087567 -1248711 -1161572 -820880 -378881 -29403 106323
36024 106323 50292 -25307 41747 198669 271054 272682 374852 506216 337699 -141489 -419212
36013 -419212 -165960 208480 154024 -164014 -177540 109968 126622 -307001 -672803 -545214
36003 -545214 -126883 192805 317241 265679 -19694 -430209 -654394 -645049 -755456 -1152493
35993 -1152493 -1458995 -1278057 -757370 -332952 -189207 -249536 -421817 -564655 -474494 -196697
35983 -196697 -103237 -393350 -786466 -984854 -1131118 -1470895 -1863145 -2017956 -1960600 -1851565
35973 -1851565 -1602171 -1131591 -777505 -907698 -1244050 -1123283 -409907 355879 749018
35964 749018 919358 1171281 1507513 1737863 1733990 1475796 1091205 857235 884258 849080
35954 849080 400986 -207921 -339318 153241 730840 952779 967963 1041820 1085628 972841
35944 972841 919960 1153447 1461494 1461020 1142098 814757 647003 563547 506134 505645 541797
35933 541797 555098 546546 493094 278653 -78691 -257195 30357 584445 883406 697392
35923 697392 281686 -63634 -355583 -742453 -1165377 -1368321 -1161627 -591700 63438 410164
35913 410164 187245 -457498 -993346 -956441 -397488 198738 442963 387997 314302 314798 260489
35902 260489 129007 127644 374742 635674 585603 263738 41027 128245 332090 374547
35892 374547 266710 228293 350830 485303 420915 87411 -375414 -693025 -677568 -445583
35882 -445583 -334581 -524830 -834489 -981639 -934761 -852663 -770221 -559752 -200093 123713
35872 123713 261501 294854 409240 669360 993646 1265194 1393623 1334744 1117645 807545
35862 807545 418839 -44139 -433411 -501409 -214769 107652 139007 -58094 -156386 -12965
35852 -12965 217227 364166 384093 233259 -90947 -320497 -65113 644199 1266913 1436190
35842 1436190 1440066 1721862 2172661 2325322 2065296 1685165 1328091 872983 369259 73570
35832 73570 -44842 -348915 -919503 -1363022 -1453279 -1493283 -1717794 -1783283 -1307965 -595867
35822 -595867 -306636 -574626 -935528 -1044602 -1025910 -1117824 -1348587 -1592153 -1651635 -1298008
35812 -1298008 -524044 236247 427777 -42928 -744447 -1213751 -1313237 -1175541 -1044566 -1108961
35802 -1108961 -1249103 -1044465 -307160 518274 832618 644815 446670 415313 253197 -151558
35792 -151558 -461569 -475351 -495882 -827986 -1270199 -1416304 -1206933 -910290 -760175 -849206
35782 -849206 -1194797 -1673337 -2010365 -2019504 -1771617 -1448077 -1162337 -974021 -894495 -827481
35772 -827481 -693215 -615433 -743704 -921133 -859612 -616245 -460186 -266470 361975 1202683
35762 1202683 1315765 260603 -1125959 -1697064 -1347455 -871601 -830202 -1158167 -1634943
35753 -1634943 -2079051 -2171573 -1692946 -953774 -527060 -571065 -814350 -1083184 -1352750 -1400173
35743 -1400173 -999307 -435172 -229868 -339081 -246012 80760 27437 -650797 -1338801 -1441026
35733 -1441026 -1153343 -924291 -691000 -199906 327787 459204 227685 281 -136051
35724 -136051 -328548 -474029 -359297 -207992 -499012 -1205917 -1761122 -1867620 -1809718 -1793524
35714 -1793524 -1538689 -864459 -225713 -193709 -663807 -1045771 -1101017 -1123389 -1303809 -1376421
35704 -1376421 -1065955 -570619 -346351 -543055 -862101 -945373 -771227 -639816 -818276 -1231207
35694 -1231207 -1524280 -1438742 -1058218 -638004 -299690 -36092 76195 -79708 -384848 -507130
35684 -507130 -309720 -28240 85539 74330 48282 -119915 -579581 -1129856 -1402461 -1360113
35674 -1360113 -1278845 -1243779 -1024717 -533404 -56199 142697 173774 270768 406692 396141
35664 396141 232728 91745 68146 89024 41778 -126327 -371491 -533554 -451352 -174419
35654 -174419 60604 125959 105763 33412 -227398 -672997 -968426 -812274 -328813 136757
35644 136757 450075 665416 757474 712080 769782 1205082 1874753 2307322 2257227 1891927
35634 1891927 1442527 989545 624104 475901 454936 238750 -326505 -993073 -1382426 -1334856
35624 -1334856 -948539 -464609 -152955 -99934 -70878 188575 499200 403400 -155393 -666548
35614 -666548 -736841 -590403 -619667 -759631 -697397 -496071 -543346 -902892 -1140797 -918734
35604 -918734 -448683 -166651 -150299 -86793 242574 646768 757461 479821 103403 -34448
35594 -34448 113259 366959 606442 821282 924961 766969 417372 225549 413568 731991
35584 731991 721604 282903 -184824 -231465 170953 635974 778189 590502 421102 575994
35574 575994 970521 1232573 1118412 702565 163504 -416885 -945442 -1215344 -1123185 -880160
35564 -880160 -776395 -778055 -597172 -180616 113924 -57611 -601284 -1129484 -1404081 -1467318
35554 -1467318 -1412422 -1237525 -952926 -657330 -418783 -197139 15038 76016 -135777 -483142
35544 -483142 -660635 -536118 -266433 -45444 116392 285724 406444 331798 14025 -412275
35534 -412275 -706023 -664215 -283534 186637 465763 564126 741656 1072127 1228570 864005
35524 864005 86589 -611450 -827066 -538848 -44738 268985 233176 99606 276546 744104
35514 744104 1000030 792189 556192 737936 1002103 695256 -68622 -464166 -126090 404930
35504 404930 589639 602535 791492 971105 751976 238011 -102073 -95059 4363 -52112
35494 -52112 -247088 -402742 -327739 41286 480484 612878 351626 12322 -154145 -257839
35484 -257839 -407648 -405319 -121559 139556 56737 -179100 -188443 -38680 -59883 -179040 7046
35473 7046 531474 976920 1152332 1334254 1695582 1965675 1875991 1555513 1240110 919127
35463 919127 539782 286054 341808 551065 612338 516836 521829 708182 800705 506439 -92065
35452 -92065 -581524 -640676 -351276 -42044 122037 256486 449824 546363 384268 90351
35442 90351 -73823 -64796 -49224 -124750 -267683 -488361 -796161 -1046152 -1057380 -870600 -685030
35431 -685030 -584004 -534692 -574728 -727056 -802193 -599026 -253140 -47896 70823 388239
35421 388239 840210 1007358 764202 444228 208123 -224937 -935027 -1398141 -1159121 -530634
35411 -530634 -134509 -20927 229431 695121 974819 861713 652644 647074 719926 597573
35401 597573 312109 163447 332702 682102 915159 864194 596831 234588 -258855 -959324
35391 -959324 -1676313 -2028750 -1929363 -1713265 -1591832 -1288251 -560542 163076 165989 -595573
35381 -595573 -1386580 -1609731 -1403081 -1198389 -1101297 -963196 -759984 -590591 -468544 -365495
35371 -365495 -329034 -339923 -194501 217068 616253 602092 188859 -182182 -193791 26084
35361 26084 201055 283531 375528 436141 281671 -157215 -726427 -1185346 -1345594 -1117324
35351 -1117324 -588221 -85765 13910 -337723 -767151 -881233 -704789 -593446 -761723 -1066159
35341 -1066159 -1264450 -1296778 -1203610 -917937 -347627 344542 731571 512736 -141253 -738565
35331 -738565 -963272 -924269 -865342 -761380 -401742 136634 376578 6317 -598713 -717498
35321 -717498 -147022 551322 760662 513991 301856 361004 445022 279761 -34693 -217413
35311 -217413 -244502 -374532 -721302 -991620 -818103 -289825 78441 -18800 -294736 -312792
35301 -312792 -125259 -146267 -456382 -636690 -401799 -23895 119612 130012 371095 825956
35291 825956 1047629 745089 115476 -449446 -730159 -689763 -375489 41333 298616 282424
35281 282424 144715 65758 -8191 -249740 -627155 -855340 -703286 -261696 139531 241967
35271 241967 69184 -134385 -152314 -13092 16369 -318071 -968105 -1551637 -1668966 -1280105
35261 -1280105 -731402 -382592 -264166 -162257 24168 151381 82720 -53974 21998 387091
35251 387091 751021 710317 181656 -442727 -636257 -269541 244935 378213 -3598 -600295
35241 -600295 -1047640 -1202205 -1126375 -959378 -810666 -669249 -443104 -189228 -185207 -531239
35231 -531239 -763666 -258146 862621 1595154 1131470 -133914 -998776 -775125 77629
35222 77629 625057 458191 -98122 -552486 -765579 -890138 -987051 -898354 -522938 -45177
35212 -45177 252740 307137 237035 86910 -162403 -378588 -360822 -156629 -7432 62683
35202 62683 270311 584077 583693 25771 -752714 -1238712 -1286132 -1032487 -592214 -140666
35192 -140666 -739 -254797 -498862 -378106 -143945 -228777 -467703 -294172 366655 961720
35182 961720 1102268 976361 870919 763816 564834 356697 194273 -13992 -252457 -316856
35172 -316856 -138414 75131 141817 88600 -43016 -262440 -407217 -198593 330913 767865
35162 767865 807382 518338 45221 -560914 -1081109 -1149407 -782069 -484393 -553028 -660287
35152 -660287 -435599 -50888 155923 250414 422559 462962 65921 -545005 -837878 -720528
35142 -720528 -585621 -674717 -841866 -897220 -768148 -389352 130652 313911 -205918 -1010975
35132 -1010975 -1240446 -696405 -109362 -148427 -637935 -974519 -891213 -517908 -32941 406424
35122 406424 608108 519278 326428 183144 -17104 -427103 -952413 -1324575 -1339968 -941193
35112 -941193 -259489 321258 393491 -2213 -344478 -251689 74550 222557 157467 163351
35102 163351 367188 617004 740047 660420 342836 -115516 -398810 -261324 97570 196252
35092 196252 -162113 -693993 -1023034 -1035450 -793357 -333762 280323 833797 1067799 930687
35082 930687 650023 517309 586959 603723 297305 -234263 -558170 -419231 -96738 -74282
35072 -74282 -425114 -752014 -743005 -538858 -439122 -455993 -375890 -163991 -47353 -146661 -237905
35061 -237905 -46996 323766 482080 267483 -36529 -123662 -88544 -204330 -425485 -440442
35051 -440442 -192212 17241 29816 73650 307013 464862 278178 -23850 -35838 170129
35041 170129 170556 -93760 -221455 -37733 106953 -69419 -314174 -296903 -214868 -514782
35031 -514782 -1153538 -1565025 -1387475 -887255 -558271 -559088 -700617 -801258 -834270 -783193
35021 -783193 -562829 -152572 301390 602002 666429 513364 170372 -273429 -585463 -581722
35011 -581722 -431107 -520167 -902807 -1153578 -973983 -658335 -607668 -617490 -150784 769420
35001 769420 1505671 1703832 1667341 1642059 1322840 472403 -446648 -786086 -555596 -232845
34991 -232845 33244 455061 967157 1174382 1003147 872376 1037488 1173046 831766 37958
34981 37958 -775969 -1232289 -1258093 -1015895 -701860 -365770 49211 448501 563308 367669
34971 367669 267627 547374 869981 781354 489879 538717 832272 736369 188716 -105612
34961 -105612 179600 462586 284027 94415 404842 807581 618077 45767 -95687 410261
34951 410261 1043745 1449057 1714952 1812876 1501975 886190 444888 376555 417126 386473
34941 386473 409370 513792 513351 391760 334998 313590 139587 5658 377568 1181784 1690944
34930 1690944 1480395 957854 642207 452760 102753 -286898 -443462 -448886 -517920 -545467
34920 -545467 -316985 54363 313800 494595 777331 1103787 1308928 1468225 1736171 1988525
34910 1988525 1992246 1782500 1496987 1001129 128280 -799065 -1174164 -868502 -384995 -181006
34900 -181006 -196050 -145044 57869 333304 643325 962636 1159623 1061457 637224 87131
34890 87131 -269284 -272394 -105936 -71543 -163869 -94798 193550 361212 204992 22369 130782
34879 130782 322493 196042 -211252 -581379 -921047 -1479922 -2135662 -2397981 -2076456 -1492036
34869 -1492036 -962036 -501152 -106872 91185 104194 147841 311470 467224 549741 579270
34859 579270 412830 -74394 -533026 -422376 116606 282066 -223537 -670460 -385508 201860
34849 201860 217091 -350351 -721366 -541152 -288921 -411295 -672633 -623484 -297282 -118121
34839 -118121 -311999 -678986 -909614 -956160 -1021266 -1208795 -1297669 -998710 -392723 109226
34829 109226 275965 264488 229457 47873 -358848 -739023 -861467 -913824 -1194519 -1591411
34819 -1591411 -1754946 -1654467 -1537615 -1406840 -994829 -303705 246538 331282 67477 -253417
34809 -253417 -485094 -583697 -537848 -460824 -492219 -506287 -199762 406143 853625 825332 565141
34798 565141 496273 644671 694434 445872 -30419 -559874 -946336 -1014458 -824715 -752080
34788 -752080 -1084505 -1595424 -1777478 -1479711 -1044729 -792140 -647424 -395287 -68765 105619
34778 105619 35357 -147740 -298552 -420903 -584052 -760351 -834802 -793357 -816685 -1059708
34768 -1059708 -1343090 -1252253 -664505 -20256 138881 -189759 -539235 -633971 -660368 -808731
34758 -808731 -888437 -640113 -209191 -6941 -187707 -525701 -767182 -851123 -787852 -591480
34748 -591480 -407649 -462712 -730461 -819565 -391988 369725 885484 784659 290840 -32530
34738 -32530 132413 572325 835448 742157 507024 361454 233840 -66450 -497072 -837963
34728 -837963 -1021192 -1150057 -1218261 -1100552 -853795 -720233 -745126 -706564 -555583 -579650
34718 -579650 -914522 -1242440 -1286380 -1281800 -1539320 -1789630 -1485321 -660594 19917 88720
34708 88720 -289884 -745032 -1104166 -1275928 -1180677 -989953 -1056660 -1386183 -1504899 -1089623
34698 -1089623 -434864 -43555 -14172 -101526 -153567 -182270 -155652 -13584 183645 335827
34688 335827 458165 600681 721613 781637 827241 840885 670886 264635 -194183 -520831
34678 -520831 -699558 -687950 -351419 178624 415812 149566 -124131 126736 570846 352893
34668 352893 -704817 -1807013 -2203689 -1997209 -1709335 -1483108 -1092519 -513195 -80120
34659 -80120 -59587 -289573 -340622 15499 555757 866914 829084 704317 714064 754701 679008
34648 679008 598451 621265 520423 70289 -427547 -437525 21285 381806 378191 361887 611337
34637 611337 863449 835387 737723 845214 920937 571469 -35040 -314164 -69468 273425
34627 273425 251089 -152497 -623616 -831822 -599880 -22558 534975 748938 650487 464046
34617 464046 225459 -169293 -602388 -778576 -673187 -595960 -708138 -799996 -694781 -550921
34607 -550921 -538759 -497241 -200961 236449 531039 644946 716201 699229 445338 94978
34597 94978 -619 203360 370161 326878 329189 599174 918676 944584 693078 431796 271672
34586 271672 155241 119141 278315 622144 1051649 1503247 1814933 1679872 1089082 633450
34576 633450 871139 1454487 1429761 475074 -694465 -1311014 -1398343 -1360458 -1258822 -954506
34566 -954506 -606573 -517689 -649523 -691729 -494891 -133182 296050 642674 681833 444238
34556 444238 345864 627625 901825 688536 193215 44727 396564 823938 1043449 1174548
34546 1174548 1269008 1133940 744896 378073 200510 104415 6052 -90264 -344634 -922915
34536 -922915 -1528876 -1610754 -1153380 -753731 -771538 -948089 -1036574 -1192767 -1447549 -1405123
34526 -1405123 -882992 -318935 -86738 83461 489174 769707 491489 23628 80723 617007
34516 617007 918475 693415 347205 173273 -12756 -298942 -395938 -193252 -61343 -266545
34506 -266545 -496456 -338349 56274 170916 -151768 -525529 -547047 -254802 12540 69546
34496 69546 56560 159521 293717 217558 -79062 -317230 -320364 -245937 -307058 -469266 -573759
34485 -573759 -556653 -382751 1429 440340 553978 222814 -160685 -243612 -258094 -614550
34475 -614550 -1177774 -1441024 -1285111 -1039974 -848195 -509438 10878 442284 676935 893013
34465 893013 1089397 986894 581516 327819 506229 803668 811604 598466 485517 551253
34455 551253 666929 763978 750861 400688 -323104 -988749 -1096489 -683971 -240983 -74061
34445 -74061 -32545 131609 368413 375936 -44034 -696411 -1061531 -762576 -3283 611688
34435 611688 751678 651891 625869 556777 143402 -513547 -912868 -747986 -252432 107874
34425 107874 112976 -113288 -348417 -483151 -502488 -365998 -23955 430405 762277 871729
34415 871729 963486 1258210 1615162 1687971 1423447 1113976 926298 701284 327135 -13815
34405 -13815 -157148 -226186 -347858 -343662 -2989 494089 735275 597302 372102 407698
34395 407698 791702 1319971 1614562 1358622 597930 -234717 -715020 -764404 -515064 -40788
34385 -40788 581726 1115284 1326277 1228954 982091 672886 402696 398521 734539 1078593
34375 1078593 1060401 804160 730659 892572 926803 675743 391889 201554 -173064 -887616
34365 -887616 -1530646 -1555132 -953688 -209409 265167 374378 205275 -16593 53620 530584
34355 530584 970535 747002 -156858 -1028419 -1226246 -838337 -383158 -129538 10225 106802
34345 106802 108323 78364 197577 459585 653986 756882 1044733 1630334 2154165 2226152
34335 2226152 1982780 1849646 1851603 1572875 841352 50047 -373443 -485755 -558477 -545249
34325 -545249 -179934 468014 883050 651612 -67337 -736518 -1005228 -965094 -882006 -821475
34315 -821475 -644028 -305947 29407 248991 466651 774041 989704 926844 782448 883170
34305 883170 1076873 845159 158471 -252289 199454 1132703 1685420 1579783 1246958 1035136
34295 1035136 821749 467816 184927 215581 429745 491553 299654 78380 88524 358535
34285 358535 663599 711446 396526 -85255 -409071 -423744 -249597 -98671 -74987 -153335
34275 -153335 -271384 -398648 -533483 -638229 -586899 -244883 350915 949166 1291597 1335819
34265 1335819 1234386 1154591 1173185 1266145 1298473 1074307 525073 -139872 -571420 -632496
34255 -632496 -571707 -755683 -1186847 -1390792 -965566 -224510 13280 -554609 -1210075 -1089416
34245 -1089416 -332455 145988 -69419 -467631 -545507 -502944 -672306 -819831 -533461 43360
34235 43360 392802 343610 158702 44198 -17195 -42603 -20882 -24732 -54243 99510 542951
34224 542951 1007311 1205734 1262676 1430332 1593684 1473709 1125524 786523 429121 -30008
34214 -30008 -270657 71542 680623 822320 319497 -329473 -794326 -1221382 -1645419 -1792986
34204 -1792986 -1653114 -1591386 -1651770 -1366452 -566124 206123 461474 431375 573515 879667
34194 879667 1102599 1261305 1453763 1480185 1112583 538888 169728 157574 354739 536907
34184 536907 470420 40965 -479293 -609965 -302608 -30999 -52976 -69857 92380 33987
34174 33987 -500054 -945248 -591929 370074 1086369 1120201 761864 430773 290905 335591
34164 335591 376624 53454 -724407 -1470935 -1646062 -1307664 -856185 -383564 240892 871994
34154 871994 1230412 1378427 1514681 1461225 935654 199537 -175434 -102404 55728 207901
34144 207901 550883 922805 880043 478410 260703 351979 291142 -57257 -175503 207074
34134 207074 573983 407301 -47992 -256075 -162870 -46640 15151 77411 25001 -239250
34124 -239250 -517208 -570071 -472358 -448686 -540950 -641083 -657608 -518219 -262524 -206780 -639833
34113 -639833 -1252195 -1352335 -848648 -471787 -695941 -994026 -646114 181500 744977 764307
34103 764307 546346 307756 4388 -274788 -338297 -324387 -605437 -1196048 -1647583 -1601345
34093 -1601345 -1146635 -603042 -216195 -81059 -131245 -189649 -175235 -185768 -257849 -236477
34083 -236477 -70648 -8035 -243620 -598927 -819750 -946267 -1097381 -1185185 -1198794 -1432642
34073 -1432642 -1966233 -2246669 -1776805 -961137 -603770 -755204 -797835 -563812 -516953 -764113
34063 -764113 -772070 -337066 -25071 -225648 -461892 -163313 437025 749615 736937 785289
34053 785289 979801 1080312 1019918 910478 692013 249680 -215598 -363679 -199044 -1820
34043 -1820 142470 350675 534742 411451 -29187 -417369 -463497 -266405 -84912 -18982
34033 -18982 6379 102002 311562 545281 639352 577986 554645 668345 712882 502445 260263
34022 260263 353030 705318 845623 564151 180638 68647 225738 447684 643139 787017
34012 787017 786227 610823 417198 346952 301901 89944 -279257 -609403 -797419 -953509
34002 -953509 -1213703 -1507019 -1559151 -1154035 -406880 275908 571508 514749 313802 11773
33992 11773 -461080 -966383 -1186928 -1036964 -778054 -618971 -457192 -167595 123445 294795
33982 294795 529840 1024154 1523541 1535360 1009158 461831 318555 412144 317327 -22112
33972 -22112 -243617 -72091 348361 673591 761171 743331 763307 794831 780492 809209 980147
33961 980147 1147853 1049774 737987 609780 835173 1007000 662088 -8096 -342703 -74426
33951 -74426 368622 487997 284872 55126 -64987 -109636 -69031 68969 198100 242078
33941 242078 312732 512313 693741 648675 443011 321373 346515 396053 475144 729472
33931 729472 1106678 1290847 1094372 711453 466685 473600 627746 758323 684766 312976
33921 312976 -183753 -453138 -395756 -335323 -548256 -793771 -627050 -107186 183903 -84808
33911 -84808 -532977 -581240 -165488 344703 759396 1201953 1632203 1658800 1053184 174158
33901 174158 -426680 -668587 -879292 -1155839 -1200376 -869535 -484318 -357905 -325005 -61673
33891 -61673 344453 524501 417211 322812 374465 360725 182739 124036 446012 964017
33881 964017 1269233 1226609 1049064 980071 1070314 1182503 1080458 610566 -70473 -548245
33871 -548245 -566781 -297865 -82870 -59379 -212465 -606742 -1254838 -1828338 -1862287 -1340458
33861 -1340458 -808522 -759154 -1097625 -1376173 -1391761 -1316421 -1286488 -1124170 -605425 106660
33851 106660 494863 232031 -404249 -793282 -628114 -162566 223716 502443 871751 1294368
33841 1294368 1436447 1103007 523794 96524 -23189 37189 123496 182282 162362 -17623
33831 -17623 -306865 -446272 -218188 241439 537122 466198 226753 84418 7105 -179817
33821 -179817 -428148 -564648 -700362 -1156265 -1874240 -2274057 -1955897 -1282208 -943323 -1109505
33811 -1109505 -1347900 -1289162 -1020950 -804806 -718790 -681327 -607330 -436687 -170455 37596
33801 37596 -34450 -417367 -874505 -1135797 -1125529 -949851 -774368 -734322 -849391 -995859
33791 -995859 -1049490 -1041131 -1051068 -983375 -640412 -61620 405946 487048 296541 153371 162991
33780 162991 128773 -127461 -474271 -580980 -304166 129896 403436 482776 543546 567301
33770 567301 315313 -186004 -461572 -169298 372939 599462 479954 480605 805122 1111697
33760 1111697 1046341 677065 278556 381 -117947 -63467 95522 272315 516461 876224
33750 876224 1147010 1105262 972147 1183662 1634998 1687839 1112308 459272 191838 24015
33740 24015 -412345 -778684 -557162 9235 244207 105574 158824 521726 605296 68736
33730 68736 -633950 -939579 -860717 -656998 -302924 285429 827089 947558 710247 482860
33720 482860 374849 179090 -163601 -414081 -425621 -373736 -425541 -403327 -28818 589292
33710 589292 996432 989628 939170 1309719 1975029 2273655 1781898 826747 139683 135732
33700 135732 597425 926095 634485 -258301 -1227429 -1741278 -1771722 -1640378 -1419720 -866222
33690 -866222 -34059 516700 432515 109858 132922 470198 675474 638836 631046 764881
33680 764881 926402 1121737 1363511 1319865 685444 -118980 -273750 310980 825054 692264
33670 692264 250337 40283 39927 65 10408 245043 535505 665027 770329 1014649
33660 1014649 1166292 962170 621924 510922 499033 154712 -559127 -1258539 -1707252 -1947107
33650 -1947107 -1925710 -1475644 -707893 -39360 235412 124464 -264709 -783693 -1154927 -1199086
33640 -1199086 -1135171 -1279755 -1460548 -1160713 -312912 488761 735607 590473 512468 603152
33630 603152 592809 294928 -154877 -429042 -267404 281463 813647 907568 567962 200191
33620 200191 139735 398874 865274 1451713 1953668 2052621 1659009 1070178 625988 363442
33610 363442 147933 -22763 -12858 264545 772318 1350580 1729107 1716685 1472208 1380037
33600 1380037 1519026 1473671 868600 -99398 -888901 -1201696 -1079571 -576868 279143 1196259
33590 1196259 1651674 1395417 737271 189405 -53019 -153876 -280428 -398600 -429153 -450295
33580 -450295 -627851 -969929 -1246440 -1195833 -781167 -225659 163897 208476 -7836 -157524
33570 -157524 68051 609167 1029564 963392 478009 -112885 -619485 -937096 -830150 -164443
33560 -164443 668624 1003939 715990 411027 616853 1119560 1354949 1151412 765648 425501
33550 425501 203409 179696 349502 445339 200798 -247098 -532307 -588149 -656382 -782362
33540 -782362 -690040 -250611 272945 598777 745878 810278 710226 399525 111708 96680
33530 96680 241075 237973 63266 -14967 100494 174230 45884 -69273 104449 467018
33520 467018 688030 700620 740243 871326 818446 438580 49151 -33501 -61928 -515177
33510 -515177 -1243956 -1467781 -793477 182008 575965 231291 -292782 -503564 -369032 -59325
33500 -59325 298806 579850 672672 625166 612767 732668 933026 1092259 1059058 736283
33490 736283 275825 23636 71480 76015 -195487 -393587 -97192 397895 381342 -211240
33480 -211240 -657030 -491494 -108986 -72583 -354587 -610228 -759925 -885098 -886091 -667949
33470 -667949 -411171 -269975 -40926 477734 1028022 1216496 1101713 1015920 968207 709394
33460 709394 284828 17646 -22727 -42967 -21277 300946 848991 1143609 946743 519101
33450 519101 84216 -456850 -1034395 -1167749 -638623 -6392 46940 -378477 -648992 -548725
33440 -548725 -418326 -411776 -215445 351687 952359 1200833 1154392 1044139 803735 231470
33430 231470 -529631 -1046960 -1119544 -947840 -766513 -600711 -462153 -480999 -650231 -683949
33420 -683949 -405319 -109676 -200532 -529235 -483127 194351 1023417 1391490 1229405 857861
33410 857861 447171 -27834 -474232 -713486 -778707 -837945 -834332 -548273 -61058 195037
33400 195037 -9990 -378469 -484731 -284213 -43162 72125 143265 324167 657347 1022156
33390 1022156 1216279 1163762 1034103 1015292 1003410 753073 336075 125677 223465 252801
33380 252801 -61253 -421846 -373727 57030 487260 768115 1066339 1431558 1660307 1614064
33370 1614064 1377321 1072054 776970 647939 831116 1171716 1253520 865279 285589 3401
33360 3401 234363 736601 1022326 789107 268799 94855 652492 1595908 2183077 2040274
33350 2040274 1406053 710508 207775 3443 102759 327877 437164 413518 418341 439184
33340 439184 286439 4225 -73426 173351 446754 548293 733885 1225415 1687187 1637409
33330 1637409 1195029 927956 1011175 1027235 694069 347383 454568 933907 1245168 1035815
33320 1035815 471278 -25968 -181249 -5668 325059 644953 875887 990237 954225 751588
33310 751588 455015 224060 191675 335079 459167 344276 -41835 -489329 -744179 -731103
33300 -731103 -525354 -181976 259060 641844 784054 737004 752761 928068 1102346 1201124
33290 1201124 1404057 1773926 1980104 1700455 1133405 767869 724466 667666 356825 -54041
33280 -54041 -327792 -466582 -615792 -854934 -1165458 -1428687 -1417996 -1000501 -386829 52438
33270 52438 274780 603876 1179028 1662568 1700262 1427964 1242392 1220364 1069945 614212
33260 614212 46844 -344158 -507204 -581432 -633009 -567749 -326863 -95615 -184163 -617937
33250 -617937 -959827 -743810 -71092 453357 428120 59728 -243503 -415451 -647552 -954379
33240 -954379 -1112890 -968381 -571582 -62208 372190 484491 184424 -211991 -206321 296256
33230 296256 793187 710077 39582 -647702 -803074 -441731 -61948 -37869 -179378 -26102
33220 -26102 460599 764879 507489 13874 -82158 360334 907132 1163433 1093680 763546
33210 763546 217181 -264468 -214377 430307 1077356 1117139 614541 102514 -108388 -99161
33200 -99161 3455 144427 166955 -80082 -403563 -375534 101269 617568 787088 702934
33190 702934 693591 845176 991272 1023072 961678 802625 527851 252162 141454 157504
33180 157504 70540 -206200 -445519 -383024 -88298 61839 -200592 -698695 -947856 -664158
33170 -664158 -100994 219973 122598 -31461 145742 542177 746390 659005 593696 755995
33160 755995 946231 918249 758732 690498 702525 640862 534969 540374 606854 492760 137820
33149 137820 -225530 -405789 -501851 -730442 -1144964 -1588076 -1802750 -1574629 -935611 -266604
33139 -266604 -6920 -184069 -407255 -391228 -255513 -181321 -42802 356058 848667 1025642
33129 1025642 746809 280009 -61720 -196013 -178780 -67562 47849 39779 -143698 -429450
33119 -429450 -688833 -786799 -639170 -377532 -379461 -882523 -1553743 -1703862 -1033912 19089
33109 19089 766812 912636 631981 252807 35998 92025 292602 353126 168798 -22284
33099 -22284 46932 324892 580743 736852 810814 651774 84833 -671110 -1059216 -775200
33089 -775200 -81109 550294 875123 883653 656681 408729 436577 766159 999558 761684
33079 761684 184238 -293824 -477298 -469851 -294559 133489 641137 837800 681950 622606
33069 622606 914082 1118107 661209 -320436 -1111994 -1306513 -1137742 -922444 -621896 -140144
33059 -140144 301036 399157 216916 106449 235150 404039 355288 113984 -36753 116734
33049 116734 440885 545406 218052 -278217 -489837 -336993 -172597 -222970 -246095 60359
33039 60359 542792 784019 694709 588175 678009 809073 767402 604225 508437 525793 562006
33028 562006 570271 591625 643198 683561 711010 826034 1119574 1471352 1531413 1038849 181457
33017 181457 -509816 -701739 -549777 -360710 -180472 72984 267333 190799 -42098 -80046
33007 -80046 143514 308698 196595 -48788 -257553 -487609 -729977 -664264 -28992 917867
32997 917867 1603968 1753737 1587412 1467238 1529620 1633282 1533612 1147889 727043 649782
32987 649782 948445 1210404 1109541 846001 822251 1050904 1195010 1088235 853078 529816
32977 529816 -16009 -725667 -1248534 -1392152 -1375626 -1408291 -1283574 -723193 32658 383987
32967 383987 150766 -153363 13620 540682 897257 892771 862356 1065139 1231556 944953
32957 944953 297308 -141574 -1272 501954 926120 1130868 1299354 1578420 1874252 1972335
32947 1972335 1762569 1369669 1088514 1103459 1237702 1110307 607727 52737 -188301 -98524
32937 -98524 122737 391978 702842 886220 717410 271336 -77681 -75937 164575 395223
32927 395223 544493 717961 990473 1284091 1417186 1248493 799554 226228 -342497 -869670
32917 -869670 -1283928 -1420290 -1212709 -858663 -647189 -668300 -802289 -923001 -982193 -964504
32907 -964504 -898344 -853205 -815168 -667081 -420336 -319878 -526712 -832020 -918758 -787546
32897 -787546 -664668 -606514 -510591 -438720 -565441 -800629 -804593 -435484 98603 562989
32887 562989 891986 1053371 1032280 980418 1062339 1128390 896557 496919 414741 773432
32877 773432 1098478 988006 627474 402126 360248 341681 328591 363704 353203 212106
32867 212106 5591 -235912 -581511 -909564 -886693 -464917 -54327 59505 100127 301969
32857 301969 437145 235209 -113795 -340529 -609186 -1101495 -1422957 -1083801 -357372 39610
32847 39610 21818 188854 803217 1397421 1507478 1186445 645848 -23286 -566485 -563678
32837 -563678 -24117 424939 232688 -485942 -1223246 -1611706 -1542179 -1114361 -648495 -435768
32827 -435768 -357314 -77489 336042 427571 79285 -291153 -426716 -579276 -911873 -1108841
32817 -1108841 -930379 -645414 -524850 -401912 -159948 -125479 -440061 -554660 -17245 668730
32807 668730 742890 413713 516349 1122653 1426974 1047087 531255 360166 273495 -52373
32797 -52373 -368221 -354041 -192148 -150953 -60863 276267 527075 239210 -412894 -818942
32787 -818942 -735630 -428326 -109911 280378 741537 1095373 1281237 1400123 1373962 917049
32777 917049 17303 -840083 -1153110 -930025 -545051 -220992 117513 546129 923821 1015352
32767 1015352 713614 117001 -525640 -931359 -936362 -592813 -94753 393157 791328 1007444
32757 1007444 900457 442852 -117472 -391784 -229614 86731 134001 -146761 -345035 -74482
32747 -74482 506375 840637 650629 263693 147578 323212 474813 500171 598176 812523
32737 812523 878984 675806 480084 528068 609054 413385 50862 -151128 -187869 -290405
32727 -290405 -419765 -334259 -127889 -168103 -411874 -323339 310415 955791 1006505 469483
32717 469483 -310580 -1158568 -1880874 -1979789 -1151050 105757 910550 976611 722931 498663
32707 498663 195993 -320933 -846560 -1045131 -770458 -130543 525378 730766 341080 -167784
32697 -167784 -197407 169691 257401 -253073 -873534 -958354 -438523 277814 806429 962004
32687 962004 712610 233128 -144149 -216559 -41358 269551 656064 940163 857905 434561
32677 434561 64666 25911 148763 145986 5150 -157129 -349395 -542931 -520598 -216997
32667 -216997 15186 -142203 -420455 -285246 268416 669529 532121 67746 -337801 -582280
32657 -582280 -712624 -648284 -310867 122567 348267 290219 158873 146363 190974 112157
32647 112157 -84953 -161871 43117 352913 442040 259101 75425 82007 154400 134789 141212
32636 141212 388460 826873 1185053 1320001 1329041 1332625 1312379 1171556 843652 356657
32626 356657 -125964 -384009 -353233 -189846 -43055 110773 288799 330116 127459 -86016
32616 -86016 43112 500624 868357 788059 285851 -337828 -740550 -685179 -196185 381168
32606 381168 654318 554513 308740 95475 -57224 -70340 182180 579302 727987 407171
32596 407171 -115712 -368951 -198914 92176 82174 -337785 -821429 -889173 -480184 -107171
32586 -107171 -297351 -952671 -1492104 -1567729 -1327309 -968069 -442838 202482 552025 222413
32576 222413 -603440 -1327089 -1560433 -1400327 -1144576 -947598 -773330 -549645 -309436 -178097
32566 -178097 -191823 -182773 11537 256314 268135 82725 73864 371361 574981 308670 -187465
32555 -187465 -350282 -22053 459273 801694 1021690 1178202 1215014 1171950 1268305 1616709
32545 1616709 2013244 2119992 1758964 1017846 219427 -217052 -94826 327780 606090
32536 606090 644143 749997 1119094 1540770 1744859 1760206 1717159 1548753 1197859 940684
32526 940684 1101164 1467165 1394368 630084 -270305 -565604 -171832 348213 502112 295617
32516 295617 -17851 -299093 -500165 -505125 -243112 94265 179615 -44200 -244765 -98816
32506 -98816 287057 489043 260629 -218944 -593219 -693523 -610180 -524487 -573123 -798210
32496 -798210 -1090777 -1198277 -927592 -388020 64488 185379 69982 -32040 -36841 -53789
32486 -53789 -164005 -327694 -499197 -657507 -664835 -267649 604276 1606569 2194505 2080825
32476 2080825 1427782 640082 61055 -182690 -190434 -180271 -283101 -406819 -354933 -77069
32466 -77069 264461 472156 485419 382059 285965 272679 296749 226370 26891 -120237 11157
32455 11157 417561 877170 1219744 1447432 1585398 1573768 1364925 1016286 645505 375509
32445 375509 300216 376218 397771 268666 236927 568113 998906 916321 215757 -425692
32435 -425692 -399376 68462 362959 387067 529434 879469 1016442 639569 -9960 -486581
32425 -486581 -613952 -523971 -447004 -516665 -598637 -348243 330921 974783 1034071 596043
32415 596043 237184 203924 237848 242786 510796 1063017 1363195 1079472 645586 608108
32405 608108 825481 812439 511317 163339 -252064 -786920 -985079 -351639 702687 1171844
32395 1171844 805245 413192 627872 1081694 1156181 886366 641501 444676 177849 71119
32385 71119 379274 799652 778072 280078 -223445 -450882 -539635 -637990 -696786 -666097 -541410
32374 -541410 -232365 287948 761635 921399 913170 1062192 1300775 1280687 1010340 863479
32364 863479 921389 857935 601700 550256 903105 1317434 1523036 1754941 2178264 2371701
32354 2371701 1914756 1139867 730000 788109 854790 698141 526421 469001 379116 198285
32344 198285 73354 45664 -638 -47534 19911 56006 -250030 -823294 -1137987 -857076
32334 -857076 -228078 277721 419085 190474 -267525 -616018 -529295 -160584 -80226 -520034
32324 -520034 -964493 -752865 140375 1160400 1777751 1795629 1289328 559020 18823 -132146
32314 -132146 -52518 73341 308269 687267 911017 664319 117864 -232428 -175810 67692
32304 67692 271622 454903 685770 919116 1104894 1244339 1270646 1060797 648077 284102
32294 284102 209822 438867 786924 1035501 1062088 886568 612415 324686 104422 115061
32284 115061 487278 1051172 1395006 1330883 1109552 1023923 1042558 1056058 1200252 1558224
32274 1558224 1744102 1268996 294366 -422258 -403565 82709 496216 594019 417297 75126
32264 75126 -240990 -278812 13092 383374 570187 559177 468951 352292 205656 18258
32254 18258 -258621 -620159 -838487 -613014 6473 560835 676539 440969 179198 72352
32244 72352 147736 430821 879354 1295237 1517498 1626367 1767845 1835582 1537882 819851
32234 819851 77714 -154584 264145 909545 1201236 979088 590637 417011 494589 666099
32224 666099 837118 885068 594965 20005 -329474 -90529 337629 298544 -130780 -284795
32214 -284795 -26314 16501 -491046 -1019364 -1012441 -656776 -378821 -164727 93233 105531
32204 105531 -331708 -786292 -779866 -567852 -632111 -721042 -216343 720953 1240642 1029748
32194 1029748 611724 325533 -141682 -930873 -1511623 -1462811 -1142912 -1069053 -1099746 -790279
32184 -790279 -232263 41979 -144440 -408377 -386413 -140149 72506 159220 219836 345272
32174 345272 496808 600724 727738 1045659 1498668 1721943 1528889 1315780 1579444 2112114
32164 2112114 2188924 1613600 1014432 890839 926634 618628 92476 -206982 -259865 -330561
32154 -330561 -336620 22509 615871 967140 996987 1107037 1429625 1557013 1242667 868470
32144 868470 851159 957065 665965 26782 -327674 -32771 530664 759897 566463 357520
32134 357520 402584 488932 271608 -220131 -593047 -545026 -145093 338911 717442 919956
32124 919956 924005 787390 666861 666682 704760 628449 421101 211228 144639 339621 860402
32113 860402 1565731 2057269 2005911 1545743 1139400 1003461 883982 518727 109041 97679
32103 97679 579985 1203904 1653095 1946581 2145148 2036914 1404496 482288 -193802 -416874
32093 -416874 -474372 -588704 -545029 -140385 277194 135885 -570224 -1202007 -1218685 -692008
32083 -692008 -41921 415797 560585 420973 215869 218600 423830 537490 399998 180324
32073 180324 36242 -120834 -347081 -484853 -530034 -845841 -1603086 -2256464 -2094732 -1230657
32063 -1230657 -528658 -493516 -704698 -527201 20218 405609 359358 189251 354844 918141
32053 918141 1462999 1526622 1104668 670872 632714 877357 1016247 965401 1000766 1251072
32043 1251072 1459093 1361096 1038831 723909 460893 175805 -56374 -43159 251510 613715
$$ [...]
##END NTUPLES=NMR SPECTRUM
##END=
