##TITLE=31Pdec_91-2021
 CDCl3, 24 sc
 23.09.2021
##JCAMPDX= 6.0         $$ Bruker NMR JCAMP-DX V2.0
##DATA TYPE= NMR SPECTRUM
##DATA CLASS= NTUPLES
##ORIGIN= UXNMR, Bruker Analytische Messtechnik GmbH
##OWNER= root
$$ XWIN-NMR		Version 3.5
$$ Thu Sep 23 10:00:52 2021 Russian Standard Time (UT+4h)  she@DPX200
##.OBSERVE FREQUENCY= 81.013821
##.OBSERVE NUCLEUS= ^31P
##.ACQUISITION MODE= SIMULTANEOUS
##.ACQUISITION SCHEME= undefined
##.AVERAGES= 24
##.DIGITISER RES= 16
##SPECTROMETER/DATA SYSTEM= spect
##.PULSE SEQUENCE= zgpg30
##.SOLVENT NAME= CDCl3
##.SHIFT REFERENCE= (INTERNAL, CDCl3, 0, 248.564)
##AUDIT TRAIL= $$ (NUMBER, WHEN, WHO, WHERE, WHAT)
$$ ##TITLE= Audit trail, XWIN-NMR		Version 3.5
$$ ##JCAMPDX= 5.01
$$ ##ORIGIN= Bruker BioSpin GmbH
$$ ##OWNER= she
$$ F:/spectra/data/she/nmr/P31/1/pdata/1/auditp.txt
$$ ##AUDIT TRAIL=  $$ (NUMBER, WHEN, WHO, WHERE, WHAT)
(   1,<2021-09-23 09:58:42.43 +0400>,<she>,<DPX200>,
      <created by zg, POWCHK disabled, PULCHK disabled
       configuration hash MD5:
       00 E9 B6 7A A2 85 ED C7 34 08 36 98 17 FE 4E 26
       data hash MD5: 32K
       F9 11 F2 B5 2E F0 F7 2D 07 4A 70 AE 82 B7 6E 85>)
(   2,<2021-09-23 09:58:47.45 +0400>,<she>,<DPX200>,
      <Start of raw data processing
       efp BC_mod = 2 LB = 1 FT_mod = 6 PKNL = 1 PHC0 = -8205.763 PHC1 = 328.2697 SI = 64K 
       data hash MD5: 64K
       5E 4E 8D 75 06 30 0F 30 6D 0C CC D2 4F B7 EC 75>)
(   3,<2021-09-23 09:59:37.23 +0400>,<she>,<DPX200>,
      <pk PHC0 = 13.02724 PHC1 = 0 
       data hash MD5: 64K
       8C 9F 4C 0E BD 9E 40 C8 EF 7C 2C E8 93 94 1D 69>)
$$ ##END=
$$ 
$$ hash MD5
$$ D3 9F E3 35 ED 68 17 3B E1 3B 62 0D AD 44 9B AF
##$RELAX= 
##$RELAX= 
##$RELAX= 
##$RELAX= 
##$RELAX= 
##$RELAX= 
##$RELAX= 
##$RELAX= 
$$ Bruker specific parameters
$$ --------------------------
##$DU= <F:/spectra>
##$EXPNO= 1
##$NAME= <P31>
##$PROCNO= 1
##$TYPE= <nmr>
##$USER= <she>
##$AMP= (0..31)
100 100 100 100 100 100 100 100 100 100 100 100 100 100 100 100 100 100 
100 100 100 100 100 100 100 100 100 100 100 100 100 100 
##$AQSEQ= 0
##$AQ_mod= 1
##$AUNM= <au_zg>
##$AUTOPOS= <>
##$BF1= 81.014009
##$BF2= 200.13
##$BF3= 200.13
##$BF4= 200.13
##$BF5= 200.13
##$BF6= 200.13
##$BF7= 200.13
##$BF8= 200.13
##$BYTORDA= 1
##$CFDGTYP= 0
##$CFRGTYP= 5
##$CHEMSTR= <none>
##$CNST= (0..31)
1 1 145 1 1 1 1 1 1 1 1 1 1 1 1 1 1 1 1 1 1 1 1 1 1 1 1 1 1 1 1 1 
##$CPDPRG= <waltz16>
##$CPDPRG1= <>
##$CPDPRG2= <waltz16>
##$CPDPRG3= <>
##$CPDPRG4= <mlev>
##$CPDPRG5= <mlev>
##$CPDPRG6= <mlev>
##$CPDPRG7= <mlev>
##$CPDPRG8= <mlev>
##$CPDPRGB= <>
##$CPDPRGT= <>
##$D= (0..31)
0 1 0 0 0 0 0 0 0 0 0 0.03 2e-05 3e-06 0 0 0 0 0 0 0 0 0 0 0 0 0 0 0 0 
0 0 
##$DATE= 1632376721
##$DBL= (0..7)
120 120 120 11 120 120 24 19 
##$DBP= (0..7)
150 150 150 150 150 150 150 150 
##$DBP07= 0
##$DBPNAM0= <>
##$DBPNAM1= <>
##$DBPNAM2= <>
##$DBPNAM3= <>
##$DBPNAM4= <>
##$DBPNAM5= <>
##$DBPNAM6= <>
##$DBPNAM7= <>
##$DBPOAL= (0..7)
0.5 0.5 0.5 0.5 0.5 0.5 0.5 0.5 
##$DBPOFFS= (0..7)
0 0 0 0 0 0 0 0 
$$ [...]
##$SUBNAM2= <"">
##$SUBNAM3= <"">
##$SUBNAM4= <"">
##$SUBNAM5= <"">
##$SUBNAM6= <"">
##$SUBNAM7= <"">
##$SUBNAM8= <"">
##$SUBNAM9= <"">
##$SW= 501.771253377433
##$SWIBOX= (0..15)
0 1 3 0 0 0 0 0 0 0 0 0 0 0 0 0 
##$SW_h= 40650.406504065
##$TD= 32768
##$TD0= 1
##$TE= 0
##$TE2= 300
##$TE3= 300
##$TEG= 300
##$TL= (0..7)
0 120 53 12 22 120 120 120 
##$TP= (0..7)
150 150 150 150 150 150 150 150 
##$TP07= 0
##$TPNAME0= <>
##$TPNAME1= <>
##$TPNAME2= <>
##$TPNAME3= <>
##$TPNAME4= <>
##$TPNAME5= <>
##$TPNAME6= <>
##$TPNAME7= <>
##$TPOAL= (0..7)
0.5 0.5 0.5 0.5 0.5 0.5 0.5 0.5 
##$TPOFFS= (0..7)
0 0 0 0 0 0 0 0 
##$TUNHIN= 0
##$TUNHOUT= 0
##$TUNXOUT= 0
##$USERA1= <user>
##$USERA2= <user>
##$USERA3= <user>
##$USERA4= <user>
##$USERA5= <user>
##$V9= 5
##$VALIST= <valist>
##$VCLIST= <CCCCCCCCCCCCCCC>
##$VD= 0
##$VDLIST= <DDDDDDDDDDDDDDD>
##$VPLIST= <PPPPPPPPPPPPPPP>
##$VTLIST= <TTTTTTTTTTTTTTT>
##$WBST= 1024
##$WBSW= 4
##$XGAIN= (0..3)
0 0 0 0 
##$XL= 0
##$YL= 0
##$YMAX_a= 2812
##$YMIN_a= -2804
##$ZGOPTNS= <>
##$ZL1= 120
##$ZL2= 120
##$ZL3= 120
##$ZL4= 120
##$ABSF1= 0
##$ABSF2= 0
##$ABSG= 0
##$ABSL= 0
##$ALPHA= 0
##$AQORDER= 0
##$ASSFAC= 0
##$ASSFACI= 0
##$ASSFACX= 0
##$ASSWID= 0
##$AUNMP= <proc_1d>
##$AZFE= 0.1
##$AZFW= 0.5
##$BCFW= 0
##$BC_mod= 2
##$BYTORDP= 0
##$COROFFS= 0
##$CY= -3
##$DATMOD= 1
##$DC= 0
##$DFILT= <>
##$DTYPP= 0
##$F1P= 0
##$F2P= 0
##$FCOR= 1
##$FTSIZE= 65536
##$FT_mod= 6
##$GAMMA= 0
##$GB= 0
##$INTBC= 1
##$INTSCL= 5.30512e-09
##$ISEN= 30
##$LB= 1
##$LEV0= 0
##$LPBIN= 0
##$MAXI= 10000
##$MC2= 0
##$MEAN= 0
##$ME_mod= 0
##$MI= 50
##$NCOEF= 0
##$NC_proc= -5
##$NLEV= 6
##$NOISF1= 182.463
##$NOISF2= 159.3651
##$NSP= 0
##$NTH_PI= 0
##$NZP= 0
##$OFFSET= 248.5645
##$PC= 4
##$PHC0= -8192.735
##$PHC1= 328.2697
##$PH_mod= 1
##$PKNL= yes
##$PPARMOD= 0
##$PSCAL= 0
##$PSIGN= 0
##$REVERSE= no
##$SF= 81.014009
##$SI= 65536
##$SIGF1= 159.3651
##$SIGF2= -187.1042
##$SINO= 113.3802
##$SIOLD= 16384
##$SREGLST= <1H.CDCl3>
##$SSB= 0
##$STSI= 65536
##$STSR= 0
##$SW_p= 40650.406504065
##$SYMM= 0
##$S_DEV= 0
##$TDeff= 32768
##$TDoff= 0
##$TI= <>
##$TILT= no
##$TM1= 0
##$TM2= 0
##$TOPLEV= 0
##$USERP1= <user>
##$USERP2= <user>
##$USERP3= <user>
##$USERP4= <user>
##$USERP5= <user>
##$WDW= 1
##$XDIM= 65536
##$YMAX_p= 303600604
##$YMIN_p= -51213741
$$ End of Bruker specific parameters
$$ ---------------------------------
##NTUPLES= NMR SPECTRUM
##VAR_NAME=  FREQUENCY,     SPECTRUM/REAL,   SPECTRUM/IMAG
##SYMBOL=    X,             R,               I
##VAR_TYPE=  INDEPENDENT,   DEPENDENT,       DEPENDENT
##VAR_FORM=  AFFN,          ASDF,            ASDF
##VAR_DIM=   65536,         65536,           65536
##UNITS=     HZ,            ARBITRARY UNITS, ARBITRARY UNITS
##FACTOR=    0.620285442955139, 1,           1
##FIRST=     20137.2065510759, 0,            0
##LAST=      -20513.1999529892, 0,           0
##MIN=       -20513.1999529892, -51213741,   0
##MAX=       20137.2065510759, 303600604,    0
$$ Real data points
##PAGE= N=1
##DATA TABLE= (X++(R..R)), XYDATA
$$ [...]
41950c81442J38029R5817R9291r217j51087j46110m0513k4553j07729j13137L1165
41939f09486J83689J83299K7203j53095k14093j07622P8871K05649K17046J40095
41929d8444k7807k81791m44940k61887K20391N67646M50098P0836j14726J3512
41919A42888J79922J51095m3300k83323m55741l79150M3913N29364N89343J53197
41909F28208k76455k71542p683Q4053p4701k53626l32349l06394p1947L47623
41899e34813N09310M9169n56754l96078N48241J155593O41210l48742o86999l01030
41889G9107j6580j96329l96402k96004j16733n263K23047N04153M11010q0472
41879A09534l88611k40829j07503k91337l16681J58347N32302K04067k57648O7674
$$ plain form
41950 -381442 -243413 -147596 -48305 -57522 -208609 -354719 -395232 -419785 -527514 -640651 -609486
41939 -609486 -425797 -242498 -215295 -368390 -582483 -690105 -611234 -405585 -188539 -48444
41929 -48444 -76251 -358042 -802982 -1064869 -844478 -276832 173266 244102 129376 142888
41919 142888 322810 473905 430605 147282 -308459 -687609 -643696 -114332 475011 628208
41909 628208 351753 80211 72528 156581 81880 -171746 -504095 -810489 -882436 -534813
41899 -534813 -25503 23666 -533088 -929166 -380925 774668 1415878 1067136 380137 79107
41889 79107 62527 -133802 -530204 -826208 -942941 -948204 -725157 -221004 190006 109534
41879 109534 -279077 -519906 -627409 -918746 -1235427 -1077080 -544778 -340711 -598359 -530685
41869e30685Q35542Q33666p9976o77277k39925M33870M26253O4076R5681L15197
41859A476422J9119o27521p53164j96804K21227M222k93312k8615M93261N11996
41849H26831l8127m85277m07044r4729L8765K0386N6911J08331P2894J15934L71827
41838E86702M92565L1463p42966r96071m32788K98749N50578M57618M10695L23214
41828I79759j4973l26559k78665j73448m46874p44619l71527M53707P43392K17315
41818C7508l10216k55858m3764j37497j85997K17194O37456M53428o8980j69769
41808A73505K12126M18556J42051k01630k34021j47215k74487n39425n91593k94172
41798a336305J28490L86520M47893M87306N26571L32816j42507m63821k48637
$$ plain form
41869 -530685 304857 1138523 1058547 381270 141345 575215 1001468 1065544 1161225 1476422
41859 1476422 1495541 868020 114856 -81948 139279 143501 -149811 -178426 314835 826831
41849 826831 788704 303427 -103617 -198346 -159581 -139195 -82284 26047 98941 214875 586702
41838 586702 1079267 1110730 367764 -628307 -1061095 -762346 -211768 245850 656545 979759
41828 979759 964786 638227 359562 186114 -260760 -1005379 -1376906 -923199 -179807 37508
41818 37508 -272708 -528566 -572330 -709827 -895824 -678630 -41174 412254 343274 173505
41808 173505 385631 804187 946238 744608 510587 363372 88885 -450540 -1042133 -1336305
41798 -1336305 -1207815 -821295 -373402 113904 640475 973291 830784 366963 118326
41789A18326J64148J38158k42319k77666J59278L67408K2003k43319L6383L04066
41779E46466j2212m01630j24700M27860L27122l20049n58751j83669M4328j79070
41769d34305k46936J27656L32099l2061m11308k53731J03742J34143J3815J33880
41759e33006L12135K27494J42592L98161N86275J10532o70447p97714j66932L01462
41749h9448R0736k17716l4159K84611J64943j44702l9101L32977K86554k00804
41739D33891l89417j1389K33349j79734o63318l71686M67774Q47258M14902j58747
41729F22883k83609j73353k11113k32289R6366N78965O78801K50709k97411n18837
41719E11112l50397o9021Q410j62467k81590q3097K25404K01517j17283j79876
$$ plain form
41789 118326 282474 420632 178313 -99353 59925 427333 449336 206017 242400 546466
41779 546466 534254 132624 7924 435784 762906 442857 -115894 -299563 -255235 -434305
41769 -434305 -681241 -553585 -221486 -253547 -664855 -918586 -814844 -680701 -666886 -533006
41759 -533006 -220871 6623 149215 547376 1133651 1244183 573736 -223978 -390910 -89448
41749 -89448 1288 -216428 -250587 34024 198967 54265 15164 348141 634695 433891
41739 433891 44474 33085 266434 86700 -576618 -948304 -480530 366728 781630 622883
41729 622883 339274 165921 -45192 -277481 -181115 397850 1076651 1327360 1029949 511112
41719 511112 160715 91694 100104 -62363 -343953 -427050 -201646 -129 -117412 -297288
41709b97288K09095M81279J48346l77825l49274K09397N57498L00773j70807l39113
41699C72081j63915R0860K59438L22984K82341J40034o3254k32350k41513q9593
41689F77113l0058k91696o18791m73439J38873N08924K01301k78039k34175K32527
41679a67460N31567M77151K69613m8144m23429m23777J68630O72298L11334n00162
41669H67621o77257j51513J00639k28989l09751K39620N66970O1365n09658k52127
41659b93080L54618K76371l82141o33849k12954J81249J44402O2579K35747L55549
41649H8491J28315k04573k71441o4716K15650M73492O42807N59120J41549m07325
41639A301369p36760o61754l06232M3135K20470K87961L13171J66716k39163o09047
$$ plain form
41709 -297288 -88193 393086 541432 163607 -185667 23730 581228 882001 711194 372081
41699 372081 208166 299026 558464 881448 1163789 1303823 1240569 1008219 766706 677113
41689 677113 647055 355359 -263432 -736871 -597998 -89074 112227 -165812 -399987 -167460
41679 -167460 364107 841258 1110871 1062727 639298 215521 384151 1056449 1367783 867621
41669 867621 190364 38851 139490 -89499 -399250 -159630 407340 468705 -40953 -293080
41659 -293080 61538 337909 -44232 -678081 -891035 -709786 -565384 -502805 -267058 88491
41649 88491 216806 12233 -259208 -323924 -108274 365218 1008025 1567145 1708694 1301369
41639 1301369 564609 -97145 -403377 -360242 -139772 148189 461360 628076 388913 -220134
41629b20134n21573l9061L31887L45103K36574J51842r3509m53962m50339P4003
41619f39169N20720L58326p3962j35392J43179K73264J68198J11457R0333j39599
41609F77355m35938l87535k8632J74379O2801n4204q287J7036l3781Q0064M28917
41598D92175O85624N23735j8376o03966q16730m39073K16816M77712J46576j53986
41588E10507P5895L68631P1796m55614l74042J85478L08610j50233m00899j88716
41578d8587j51698m24307k40232N27298P91570M5339n63083m7637O88203L32849
41568I09715n72595n22676L90606O28637k28890q72782m77594J20736M0054k71813
41558h56602q7029L15214L46736K23359L99383N39501P5823o12138n87166J97934
$$ plain form
41629 -220134 -741707 -780768 -448881 -103778 132796 284638 191129 -262833 -713172 -639169
41619 -639169 -118449 239877 165915 30523 173702 446966 615164 726621 816954 677355
41609 677355 241417 -146118 -174750 -371 62430 8226 -61 16975 -16806 63258 492175
41598 492175 1177799 1701534 1683158 1079192 262462 -176611 40205 517917 664493 510507
41588 510507 586402 955033 1026829 571215 197173 382651 691261 541028 140129 -48587
41578 -48587 -200285 -624592 -864824 -337526 454044 499383 -63700 -111337 576866 909715
41568 909715 337120 -185556 205050 833687 604797 -267985 -745579 -624843 -584789 -856602
41558 -856602 -943631 -628417 -281681 -58322 341061 880562 956385 344247 -242919 -44985
41548d4985P23536K78505o40629j018855n09497K77149N03457J9317m70118k61952
41538a144072M02965O37469J78108k25234K7748M57358K91301l13562n71776k97224
41528e56919k9434l0017M3758L59612N26056K54429j45289k44220p7196K9867
41518A30647p8375l02733m23083k07435L33497P46003N45076j02388n12511l88568
41508b59870j09957J1959J68157M47785M32532q9583n32661k96222K43536K70530
41498B86206j91918l63609M995K98966J35311m8789J31191K75887r8882o58812
41488b29454o93053j50647L85985N81147N86189M76914R8058m13625n33477p4811
41478C3226M04849K99452j96526l39865J40549O49624M62307l62226r98164p80805
$$ plain form
41548 -44985 678551 957056 316427 -702428 -1211925 -934776 -431319 -412002 -882120 -1144072
41538 -1144072 -741107 -103638 74470 -150764 -123016 334342 625643 312081 -259695 -556919
41528 -556919 -586353 -616370 -572612 -213000 313056 567485 422196 177976 100780 130647
41518 130647 52272 -250461 -673544 -880979 -547482 198521 743597 641209 128698 -259870
41508 -259870 -369827 -357868 -189711 258074 690606 601023 68362 -227860 15676 286206
41498 286206 94288 -269321 -264326 34640 169951 121162 252353 528240 429358 -229454
41488 -229454 -922507 -1073154 -687169 -106022 480167 957081 1055139 641514 108037 33226
41478 33226 438075 737527 541001 201136 341685 991309 1453616 1091390 93226 -687579
41468f87579K1125N16464K76577j45826j0200N24645N91487r7251p39755n43515
41458b93828J50747L82852p4752n19751m08814l247K04251J55847O7415K7468
41448c11812M3571J62733K92175K02735o7849j64934j7057o2769n10717q11082
41438a245006m03159L52787O42606L82081K13607L99023M90925K14091p6576r0307
41428H80072q5565k80689l64146p2890K24233Q3076k34570j46388L04565N08862
41418H16560K11844k05648l82470l71419k83445n5994K18465J90267k09433m84239
41408e55512k10835K85541L45965m4664k08818K05453O61919N23506K7152p0946
41398I58761L04369L54918l79878j197876j109379j95159N14810M12545n1113
$$ plain form
41468 -687579 -666454 -149990 126587 -19239 -29439 495206 1086693 989442 249687 -293828
41458 -293828 -143081 239771 165019 -354732 -763546 -766793 -562542 -406695 -339280 -311812
41448 -311812 -268241 -105508 186667 389402 321553 156619 139562 76793 -433924 -1245006
41438 -1245006 -1648165 -1295378 -652772 -270691 -57084 341939 832864 1046955 970379 880072
41428 880072 794507 513818 149672 76782 301015 384091 149521 3133 307698 816560
41418 816560 1028404 822756 440286 68867 -214578 -270572 -52107 138160 -71273 -555512
41408 -555512 -766347 -480806 -134841 -179505 -388323 -182870 479049 1002555 1029707 958761
41398 958761 1263130 1618048 1238170 40294 -1069085 -1264244 -749434 -336889 -388002
41389c88002j88900L4784K18504J99925J33782J26955J45010J70047J81710N6263
41379F90078k87428o72565p63963l94478K51419P26450O25011j6791o13938n68149
41369a024354K7529M82053L79831L4398p4332N8385J54736J58390J80050J68945
41359E45631K2812j20201n9775R7473P9313j19300k51957k01504o0507R1606K10384
41348B33975J74195n4245k43361j78989l5991j12163k83222j55523K42590L90393
41338b2341K7599m23305m12574L1965L85139K56057k21046n39226l08018L09761
41328i15989O87878M36120p6477j87021J37751K66642j40695o24084o19400k42223
41318a277498J7659P0852J94576L83018K99806o9908k51796K736K68739P7287
$$ plain form
41389 -388002 -576902 -542118 -323614 -123689 10093 137048 282058 452105 633815 690078
41379 690078 402650 -269915 -1033878 -1428356 -1176937 -450487 174524 157733 -456205 -1024354
41369 -1024354 -996825 -514772 -134941 -100543 -174875 -116490 38246 196636 376686 545631
41359 545631 568443 448242 388467 485940 565253 445953 193996 -7508 -68015 23591 233975
41348 233975 408170 353925 110564 -68425 -104416 -216579 -499801 -655324 -412734 -22341
41338 -22341 5258 -418047 -830621 -798656 -413517 -157460 -378506 -917732 -1225750 -915989
41328 -915989 -228111 208009 131532 -55489 82262 348904 208209 -415875 -1035275 -1277498
41318 -1277498 -1259839 -1188987 -994411 -611393 -311587 -381495 -633291 -630555 -361816 -284529
41308b84529l27534l38718P5439L38061J77555j0541Q6902J63624q6562k98705
41298e05008K0352N91255O95422K69669n6743k0742o3232m37430p13093n06365
41288g25915p7093J93809L47479M37470J67358n00747q99089m93474K27645M20881
41278i01676J29600P0702L74889M05527j22440o28392n07667Q1796N33392N00394
41268f3875J03714k71658k81162M9393L09181K32501Q0368J76254L10316R2531
41258G37563l08482l80483j03709O8045M975L112R1218l7270l11474k47548J90610
41247b93443M21587J84698p1024m0017o1349l54677m86036j47760J80273O583
41237f61165k81838m4828N12349O55202K68793r5386j79227k48169l73030k37334
$$ plain form
41308 -284529 -612063 -950781 -875342 -537281 -359726 -370267 -283365 -119741 -206303 -505008
41298 -505008 -484656 106599 802021 1071690 1014947 994205 930973 493543 -219550 -725915
41288 -725915 -803008 -609199 -261720 175750 343108 -157639 -1056728 -1550202 -1322557 -901676
41278 -901676 -772076 -701374 -326485 79042 -43398 -671790 -1179457 -1097661 -564269 -63875
41268 -63875 39839 -231819 -512981 -463588 -154407 78094 158462 334716 645032 737563
41258 737563 429081 48598 -55111 12934 17909 21021 112239 74969 -236505 -484053 -293443
41247 -293443 128144 312842 241818 201801 140452 -214225 -700261 -848021 -667748 -661165
41237 -661165 -943003 -987831 -475482 179720 448513 353127 173900 -74269 -447299 -684633
41227f84633J79850L77223P0967l24836k81246J21915L73627K17364j22112k85034
41217c56915j37874J58324L05588J33405k13337l94647k35677Q5286K49818J44342
41207b61687n3556r4451P8649K73620K51448L841j97371r5647K08616L18606J2686
41196D44754m34559n43803k15401J54822J84941o3058k73918k96174j74535N0998
41186a165933L13241M27148L21099K12644K33225J01452l60890o42191j83045
41177g43250N37102M83417k96648o03107J1776M58243p4006o89154k86381M85569
41167g16439K42524p60833r23295J77649J172377J045719M23040J86815R5427
41158I42984m05840r35094o89579K54308R34734O51342l13396j025125p97635
$$ plain form
41227 -684633 -504783 -127560 -56593 -381429 -662675 -540760 -167133 50231 -71881 -356915
41217 -356915 -494789 -336465 -30877 102528 -110809 -505456 -741133 -655847 -406029 -261687
41207 -261687 -315243 -409694 -331045 -57425 194023 197864 493 -95154 113462 432068 444754
41196 444754 10195 -533608 -749009 -594187 -409246 -472304 -746222 -1042396 -1216931 -1165933
41186 -1165933 -852692 -425544 -104445 108199 341424 442876 81986 -560205 -743250
41177 -743250 -206148 277269 -19379 -622486 -610710 -152467 -226473 -915627 -1202008 -716439
41167 -716439 -473915 -1234748 -2158043 -1980394 -808017 237702 660742 847557 942984
41158 942984 537144 -397950 -1087529 -833221 101513 752855 439459 -585666 -1383301
41149a383301P9377N70322J29225n40665m69553J64072M03237O2963j20067J38320
41139i66070K71992K8549q1913J53732J99604j80460m14791j51345J56399J79650
41129h04653K53503M67714K72545l69761n27434K11088Q38679M47357l42951n05718
41119e9631k22035k14787l25882n1938K28226m6941k99914L12357J157843Q81517
41109A358815l19514q53636k36868K26137l43184j026061o61085M31771J125625
41100b98000J025288N33010J9995l22469k68984J31773L50374L2576l98977l07395
41090D97191J99377M00259j985m68809l91798R1612L51045J60629p7434p7304
41080F82783j53205n85204r26991o06151M1031J88936j00372N1691P40188R27037
$$ plain form
41149 -1383301 -1303924 -733602 -604377 -1145042 -1614595 -1450523 -1047286 -984323 -1104390 -966070
41139 -966070 -694078 -665529 -747442 -593710 -394106 -574566 -989357 -1140702 -984303 -804653
41129 -804653 -551150 -83436 189109 -180652 -708086 -496998 341681 789038 446087 -59631
41119 -59631 -281666 -496453 -822335 -874273 -646047 -692988 -992902 -680545 477298 1358815
41109 1358815 1039301 185665 -51203 174934 -168250 -1194311 -1855396 -1423625 -298000
41100 -298000 727288 1260298 1280293 957824 688840 820613 1170987 1203563 804586 497191
41090 497191 696568 1096827 1094842 626033 234235 325847 676892 837521 760087 682783
41080 682783 529578 -55626 -982617 -1588768 -1547737 -1358801 -1459173 -1407482 -667294 259743
41070B59743J72545m80389j64485L75558J05840m85206k76154M53825M45457l70220
41060C6514o93946N5544Q77185P64103J4667m86822m28890p2585K45614K60229
41050E71613o5051l36604j58804K03414J36808l58449o38149l62207J39332M62638
41040d05459M96559K15720k79333n54537k93542J18872J02537j70173p2830L58427
41030d83759M59734P4690k08069m6938K03795J65564j10579m21256n47175k03764
41020a117757N06591Q23236K78526l89550k22427L99085L55313l12945n08476
41011a88404k1597J66221k83486m87688l2098K60773j07993l64122J44344Q08891
41001a05159Q47126M69232J69220j43333n31931n45727j24468j0924m74431o40860
$$ plain form
41070 259743 432288 -48101 -212586 162972 268812 -216394 -492548 -38723 406734 36514
41060 36514 -657432 -601888 275297 1039400 1054067 567245 138355 65770 311384 571613
41050 571613 506562 169958 11154 214568 351376 -7073 -645222 -1007429 -868097 -405459
41040 -405459 91100 306820 27487 -527050 -820592 -701720 -599183 -769356 -842186 -483759
41030 -483759 -24025 50665 -157404 -204342 -547 165017 54438 -366818 -913993 -1117757
41020 -1117757 -611166 212070 490596 101046 -121381 277704 633017 320072 -188404
41011 -188404 -210001 -43780 -327266 -814954 -847052 -586279 -694272 -1058394 -914050 -105159
41001 -105159 741967 1211199 1380419 1237086 705155 159428 34960 24036 -450395 -1091255
40991a091255M6287P33173N04614j47582k67799M1788J42616P2692J16096l3879
40981A16751n19902n51646L32640J043701M33330p01374p43211J49838L91300
40972d8573l39473o78251n353N68083J93674l53710j41715L80779K94040k67046
40962c97545m94055k18083O3715J37412K69432N59979O77221L07786l99834r02958
40952c96930p53900r9235L91332K84334p2493o9228K71885L79235L4718l32075
40942c62357l15062j7274K65281M20480M10146J61872k00717l07657J5186M12379
40932D82277L44097k64174q66220q44597j75388N42775P53543M90013J34705j36460
40922D60571l54462m03396j47451J81183K45204J71420K57268K42971k96375q95463
$$ plain form
40991 -1091255 -1044968 -311795 192819 45237 -222562 -180774 -38158 34534 150630 116751
40981 116751 -403151 -954797 -622157 421544 854874 153500 -589711 -439873 -48573
40972 -48573 -388046 -1066297 -1071650 -503567 -309893 -663603 -805318 -424539 -130499 -397545
40962 -397545 -891600 -1109683 -1045968 -908556 -639124 -79145 598076 905862 506028 -396930
40952 -396930 -1150830 -1250065 -858733 -574399 -646892 -716120 -444235 -65000 -30282 -362357
40942 -362357 -677419 -694693 -429412 -8932 401214 563086 362369 54712 69898 482277
40932 482277 826374 562200 -304020 -1148617 -1324005 -781230 -27687 462326 597031 460571
40922 460571 106109 -297287 -444738 -263555 -18351 153069 410337 653308 356933 -538530
40912e38530o16067L31771O36057m3222m21371K61763Q73606L08699n44914k81990
40902c4198O26658O90692p8149m00986n8158j8907m02947l01449K62714J83665
40892D68935n73509o49431K77036P03143j37096q27084j57478P54508L73427o14139
40882c81688m92050N79040Q93731K0094o86680m00828J22804J50217P6452L35103
40872B16195M53156l0240o09482n77071j16489J11778L1086P5466L11724L16376
40862A82499r4754n32988n42686j30518L17761M67517L04977Q0256L2581J43855
40852B28500J84223J8557k14592k91630j81366k5983Q7417J83045K34847J27578
40842C50596j37235l34373k57553K104J70041J39291M4292P963J4208N2573J68957
$$ plain form
40912 -538530 -1154597 -822826 -186769 -229991 -651362 -389599 484007 792706 247792 -34198
40902 -34198 592460 1283152 1205003 804017 745859 726952 324005 22556 285270 468935
40892 468935 -104574 -754005 -476969 226174 89078 -738006 -895484 -140976 232451 -381688
40882 -381688 -873738 -294698 599033 619127 -67553 -468381 -345577 -195360 -118908 216195
40872 216195 669351 639111 29629 -547442 -663931 -552153 -521067 -445601 -133877 182499
40862 182499 87745 -445243 -987929 -1118447 -800686 -333169 -28192 52064 84645 228500
40852 228500 412723 431280 216688 -74942 -256308 -282291 -194874 -11829 223018 350596
40842 350596 213361 -121012 -378565 -376461 -206420 -67129 -22837 -14874 -666 51907 220864
40831B20864K98854K69664P9752m5992k4114j00294m54647q24798p96029l38514
40821a715254K00694N37084O35102N55690L76941K10816Q9093q9633l20940l57571
40811A22022n1778L28025M13148K22517K8853r7362k39861k85558p2504J90247
40801E57749J30234j71915k57491j8841J48467K9214q6458L3648J49801J014k14585
40790C00837j65224P7641J75574K1403k01540l33801l47491k28240R542K27559
40780d63740K71092J59310M4819J4148L6987Q4445J78737K91794K69532l4774
40770H52350m99662p11600l87268K00649M71830K63858j575m47M5571j21918k67125
40759a55337j01775R5461r3464m19852k97367J69371K67754j47263l62250N9210
$$ plain form
40831 220864 519718 789382 869134 823142 799028 698734 244087 -580711 -1376740 -1715254
40821 -1715254 -1514560 -977476 -342374 213316 590257 801073 890166 800533 479593 122022
40811 122022 70244 398269 811417 1033934 1062787 965425 725564 440006 367502 557749
40801 557749 687983 516068 258577 239736 388203 417417 330959 364607 514408 515422 300837
40790 300837 135613 213254 388828 410231 208691 -125110 -472601 -700841 -691299 -463740
40780 -463740 -192648 -33338 11481 25629 62616 147061 325798 617592 887124 852350
40770 852350 352688 -358912 -746180 -545531 -73701 190157 188582 188135 233706 111788 -155337
40759 -155337 -257112 -161651 -255115 -674967 -972334 -802963 -535209 -682472 -1044722 -985512
40749i85512N95042O23714L21691J85135J77395l6915l58934l81559p3322J96981
40739B63716K21353R6381q9433k81035k61205J12816N04420L92102j71974n32190
40729B54951k97198J55027K61452K8189j23288m5137M046j23698k10220p0282
40719a66158R9838K6737j82770k07816l6128N3972K7983J72487N04372N69459
40709H61976J40221l01425k35937O1924n3484n23298o05766o488O50671O90214
40699F78608K05292k68086m72153m77317l18257K8016M15902N80215M17671R5058
40689H84949j18262j16215r2994l14451o48221n52295J73305Q60854O99927j16954
40679F59643n71284j88644L92748M15955l4387l95840m34919k69457J8020L41642
$$ plain form
40749 -985512 -390470 233244 554935 740070 917465 880550 521616 140057 66735 263716
40739 263716 485069 581450 492017 210982 -50223 62593 567013 959115 787141 254951
40729 254951 -42247 112780 374232 402421 279133 233996 238042 114344 -95876 -166158
40719 -166158 -66320 -39583 -222353 -430169 -466297 -412325 -384342 -211855 292517 861976
40709 861976 1002197 700772 464835 526759 473275 -50023 -655789 -662277 -11606 678608
40699 678608 883900 615814 143661 -333656 -651913 -623897 -207995 372220 789891 884949
40689 884949 766687 650472 557478 243027 -405194 -957489 -784184 76670 776597 659643
40679 659643 88359 -100285 292463 708418 674031 278191 -156728 -426185 -408165 -66523
40669f6523M60778K64624L248p5140q4834k13433l43837k87865j37536m7825P2344
40658d55999K92581L47061J4308l89366l54588R2745M40233M15285K55885K36291
40648H94436K78077J46398j70608l91199k30137K06311L83496o5837p31689q07142
40638d87894j69055M08326L40746r737m6917J39759J31196l858O0514J82469K986
40627E48535k88262k11243R0363j73m90450o53685j53634M33237M89904J38096
40617i7312j55632k28596j67516m1238L7339m7756j29497Q5593M48119M54002
40607A57506O5458j40466R1210K33317j31112n39870l44638K61914N41706K69722
40597D64747r6094j63496r991J07924N7050j22149k12132L195L58918L73977n9125
$$ plain form
40669 -66523 394255 658879 662127 586987 502153 288720 -55117 -342982 -480518 -528343 -455999
40658 -455999 -163418 183643 197951 -191415 -546003 -453258 -13025 402260 658145 894436
40648 894436 1172513 1318911 1148303 757104 526967 733278 1116774 1050937 319248 -487894
40638 -487894 -656949 -248623 92123 82386 35469 175228 306424 302566 363080 545549 548535
40627 548535 260273 49030 139393 139220 -351230 -1004915 -1158549 -725312 -235408 -97312
40617 -97312 -252944 -481540 -649056 -690294 -652955 -700711 -830208 -744615 -296496 157506
40607 157506 222964 82498 173708 407025 275913 -263957 -608595 -346681 195025 464747
40597 464747 368653 205157 195166 303090 360140 237991 25859 29054 387972 761949 702824
40586G02824m06599k57794M1012k0075k75058k25060Q8127K18059J09610O3513
40576C8559N7138j55785l42184M372O85965Q35726J54693o05234o99439k98861
40566c25050R294O5088P2163J26444J92653K36174J30482k28376n64268m28226
40556g13622P8560L28598J15674m9319J23303J79457k10151n62596l77495K121
40546a085470L3172p7831J24473L74545J49315k35517j9209O39587P25084r8640
40536E29509r19906q14036N5736Q38014R34641L40392m54849p42789k30776N05849
40526D1785O41635J60425k24824j58422J3806R332k3172l9147k49241m99996k47919
40515e75738N09728R72361O14217r8592m94143n76743o20391m76677N9045O06257
$$ plain form
40586 702824 296225 38431 79443 59368 -215690 -440750 -352623 -134564 -24954 38559
40576 38559 95697 -60088 -402272 -397900 288065 1123791 1278484 673250 -26189 -325050
40566 -325050 -315756 -250668 -178505 -52061 140592 376766 507248 278872 -285396 -713622
40556 -713622 -635062 -306464 -190790 -240109 -116806 62651 -147500 -710096 -1087591 -1085470
40546 -1085470 -1052298 -1130129 -1005656 -631111 -481796 -717313 -736522 -96935 628149 529509
40536 529509 -390397 -1204433 -1148697 -310683 623958 964350 509501 -233288 -464064 41785
40526 41785 683420 843845 619021 460599 474405 483737 460565 421418 172177 -327819 -575738
40515 -575738 -66010 906351 1520568 1421976 927833 351090 -269301 -745978 -686933 -80676
40505h0676O00962J23249k35884j96446j6340M378j39321k72936k41696m2801
40495d97511J31325J13345L5726J30105K84288J92179p0211j26485J5603l5600
40485A72764k86680k82050L8823J65043n2472j06336J80754K48123j48878l82123
40475d53032o6597J79401j30239l46927J98369Q59241O05059k92191p10173m08222
40465e65311r8742o8993M9037K66404J75084j14873o6422K35514J77808k08065
40455b18559k51711Q2973O3155m38290n60266J31343Q56432Q06693K82949L4057
40445G88776J25310J03751j71093m39577n08643l84469j22165J89272M18851M67189
40435D67202K47118k68601p62336o48274J38554P73234N39273j48239m04785j76182
$$ plain form
40505 -80676 520286 643535 407651 211205 194865 199243 59922 -213014 -454710 -497511
40495 -497511 -366186 -252841 -217115 -87010 197278 389457 319246 192761 208364 172764
40485 172764 -113916 -395966 -357143 -192100 -244572 -350908 -170154 77969 -70909 -453032
40475 -453032 -519629 -340228 -470467 -817394 -619025 240216 845275 553084 -157089 -565311
40465 -565311 -664053 -733046 -684009 -417605 -242521 -357394 -423816 -188302 -10494 -218559
40455 -218559 -470270 -387297 -324142 -762432 -1322698 -1191355 -334923 471770 754719 788776
40445 788776 914086 1017837 846744 407167 -101476 -485945 -608110 -418838 13 467202
40435 467202 714320 445719 -316617 -964891 -826337 -53103 486170 337931 -66854 -243036
40425b43036j7583M1880L35014N39321Q1802n65599l79090L99919M58328l49079
40415C01877o14513K15862P58644j2567r49474n62447N49996O96546k68553r31744
40405h16373n76310N3939K19673J41279K66219N14548N65866L39131p26k07053
40395E00193j57152r0935l71634q08242p15772K0935N77889L85917Q076J42199
40385e08526M34264J97812k41895k5427P08606Q94938J42801p01444p53125j16602
40375C1402M53834L86454k82756r06788p41456J51607P82246M75266j78189k59611
40365h7991O4832q143m18185l38635K96839N60670M7672m60909k75253J84424
40355d34679K08711q8499j15944K24731N15306M88757K54010J7843j01348j01085
$$ plain form
40425 -243036 -260619 -218739 116275 655596 737398 171799 -207291 192628 650956 301877
40415 301877 -312636 -96774 661870 649303 -300171 -862618 -312622 383924 115371 -816373
40405 -816373 -1392683 -1338744 -1119071 -977792 -711573 -197025 368841 707972 707246 500193
40395 500193 343041 252106 -119528 -927770 -1643542 -1622607 -1044718 -658801 -650725 -508526
40385 -508526 -74262 123550 -118345 -143772 564834 1459772 1602573 901129 148004 31402
40375 31402 485236 871690 588934 -317854 -1059310 -907703 -125457 349809 171620 -87991
40365 -87991 -23159 -31302 -449487 -788122 -491283 69387 117059 -343850 -619103 -434679
40355 -434679 -225968 -314467 -430411 -205680 309626 798383 1052393 1070236 968888 867803
40345H67803j04261k07059k83664j59410N9802J45167J61758L02925L66970m0799
40335A109232p27189r51152m50153J53757K72068J28120K10163M19841L07593
40326D72280j16325l55257j44916K23898L39941J49303p7362j14330m4411j34898
40316A97923m21314n36773j67269M05317N55572J43452k83446k54828K3338P8505
40306b59523j31424k63223j39781Q2098K17033K45757K26181K10660K31099K31185
40296F50062R4078j24040j39187J48024L34058k2493o45735p10689N1155Q33246
40286D68479P20527j04496o28476l73501R1451J16142j49284j96889j1909N2633
40276a5323k4506N1820K75904L02110M7351j65996j44362m7725J724P9955J30865
$$ plain form
40345 867803 763542 556483 272819 113409 173211 318378 480136 783061 1150031 1109232
40335 1109232 382043 -569109 -1019262 -865505 -593437 -465317 -255154 164687 472280
40326 472280 355955 698 -144218 79680 419621 568924 491562 377232 332821 197923
40316 197923 -223391 -760164 -927433 -522116 33456 176908 -106538 -361366 -338028 -259523
40306 -259523 -390947 -654170 -793951 -711853 -494820 -249063 -22882 187778 418877 650062
40296 650062 744140 620100 480913 628937 962995 940502 294767 -415922 -364767 468479
40286 468479 1189006 1084510 456034 82533 173984 290126 140842 -56047 -67956 -15323
40276 -15323 -39829 11991 287895 590005 637356 471360 326998 279273 280997 360952 491817
40265D91817l8307k82542j55612L43454N69271J11522n60250p14938k61883L35526
40255a61942P01631P07812L13924k97271o55042m93192j38685n7203k12861k40772
40245e33601n0959J34224J93231J86005J39303O6732P4744J71955J38138j42327
40235C77445m03944l39048l1781J99411J94887j0951k73092k77994J98941P52927
40225C86801N93181l15024r41661n44184K67805M97305K08572J28121K69139M6531
40215E96586m44986m20104K53656P39315M93819m3461l09864l52860l70788k67118
40205a25805m7306l678j32061p45M18564M67294j55564p14867m58424K05285L17849
40194b29458j71612l97060N2539N49865M09733j63191m68714k78225J1756N4866
$$ plain form
40265 491817 453510 170968 15356 358810 928081 1039603 479353 -235585 -497468 -161942
40255 -161942 539689 1247501 1561425 1264154 609112 115920 -22765 -79968 -292829 -533601
40245 -533601 -584560 -450336 -257105 -71100 68203 134935 209679 381634 519772 377445
40235 377445 -26499 -365547 -397328 -197917 -3030 -13981 -287073 -565067 -366126 386801
40225 386801 979982 664958 -276703 -820887 -553082 -55777 152795 280916 550055 596586
40215 596586 151600 -268504 -14848 724467 1218286 1174825 864961 512101 141313 -125805
40205 -125805 -173111 -176789 -308850 -309595 108969 576263 420699 -294168 -752592 -547307 -229458
40194 -229458 -401070 -798130 -745591 -195726 214007 50816 -417898 -696123 -684367 -629501
40184f29501j0245J16253M04981N47901L96156J12577j07287k28638k40217q8121
40174B73859J20895J10115j75411m08056l40797j79313j93781k14028P5780N04826
40164d25911N53786J02954l83728m86036k95247j52928j77021j74210P9250N06358
40154h52733O95805L66469j31238j40270L40869N08077j01832q28719p96497j60469
40144a100538K53946K28074K32669L98941L18589o6965k38372J1513K05947J3481
40134B57285k07442p2909J76695J35104q5555r2355J33340K35687K2759k87235
40124B15374l33191q707L73241L50599j38200o02178n94332k62877p131J55508
40114h51894M12463N82218L45146o6764j08510J52085Q3254m25057o82736k65201
$$ plain form
40184 -629501 -639746 -523493 -118512 429389 825545 938122 830835 602197 361980 273859
40174 273859 394754 504869 329458 -78598 -419395 -598708 -792489 -1006517 -930737 -425911
40164 -425911 127875 230829 -152899 -638935 -934182 -1087110 -1264131 -1438341 -1359091 -852733
40154 -852733 -156928 209541 78303 -61967 278902 786979 685147 -143572 -940069 -1100538
40144 -1100538 -846592 -618518 -385849 13092 331681 264716 26344 37857 243804 257285
40134 257285 49843 -23066 153629 288733 203178 110823 244163 479850 502609 215374
40124 215374 -117817 -126524 246717 597316 459116 -143062 -737394 -1000271 -1007402 -851894
40114 -851894 -439431 142787 487933 421169 312659 464744 547998 122941 -559795 -824996
40104h24996L42974N29259L57245J73257k4056l11339l87438K9673O04548O97022
40094A186149J73639m59736o74160m10625r995J77627J31667J31404L24847M58718
40084A029535K54362j20050l03129l01465l46986l52117q3056K20690P9233l65053
40074b88036m31391N4932N14026N44623L72132K02140p8081l34310j85390J40198
40064E10843r9642q00582q16745K32633J064460N84293l68973l69843L01778K29177
40054D67399p07309j104046k82406P45809R38751N62088K82217J2084n42733r74975
40044f03121p09630j6115L12216Q7764j23472R0149M85178O19676M04890R3224
40034F40759l8160Q6939K87903K80986j618k90861l07073j33916q4518k41966
$$ plain form
40104 -824996 -482022 47237 404482 577739 553683 242344 -145094 -115421 489127 1186149
40094 1186149 1359788 900052 225892 -184733 -194728 -17101 114566 245970 570817 1029535
40084 1029535 1283897 1163847 860718 559253 212267 -139850 -222906 -2216 77017 -288036
40074 -288036 -719427 -664495 -150469 394154 766286 968426 890345 556035 370645 510843
40064 510843 411201 -389381 -1206126 -973493 90967 675260 306287 -63556 238222 467399
40054 467399 -239910 -1343956 -1626362 -880553 58198 620286 902503 914587 371854 -603121
40044 -603121 -1312751 -1328866 -1016650 -928886 -1052358 -962209 -477031 142645 547535 640759
40034 640759 602599 689538 977441 1258427 1256809 965948 658875 524959 440441 198475
40024A98475l65883k82493j19515l7526L9490K11142K99327P5196k78128k89971
40014e49886J40599N40341M71071O2693k63159l50942l43914l58646l87254l76859
40004a415956j99240K66801Q14455R33007M40505j70198l51278j94873j32557
39995i334k44336l33932l99007m77853l01573K71934P25384M99511o0691j67827
39985d97724J75203L06624J42506K14748M57891J70642n63788o93544N9908N34157
39975C06623l3597o78754k58259O78006Q28930K10333j23112K9600j18377o95449
39965A45944q27050j65772M71677M32836J71111K97484N25487K57546l41595n82946
39955C84722k76962J10857K21613J89076K20446K17442K1879k03588j41095J56312
$$ plain form
40024 198475 -167408 -449901 -569416 -606942 -567452 -356310 -56983 18213 -259915 -549886
40014 -549886 -409287 131054 602125 664818 401659 50717 -293197 -651843 -1039097 -1415956
40004 -1415956 -1615196 -1348395 -533940 399067 839572 669374 318096 123223 -9334
39995 -9334 -253670 -587602 -986609 -1464462 -1766035 -1494101 -768717 -269206 -329897 -497724
39985 -497724 -322521 -15897 126609 341357 799248 969890 406102 -287442 -227534 306623
39975 306623 273026 -405728 -663987 14019 842949 1053282 930170 959770 841393 145944
39965 145944 -681106 -846878 -375201 57635 228746 526230 1051717 1309263 967668 384722
39955 384722 107760 218617 440230 629306 849752 1067194 1089073 885485 744390 900702
39945I00702K06546k42217p18060n53703J67464O41573M01842j15133k73449p0802
39935C44763O4705m3556k27834l08881j73981K31703O63918O18868m294n72321
39925E93090m94054n7667J8970l51074o01356m29230j19234O2631K28566M98586
39915f50772P15991O81451L68400j33332n99586o64879k18747K55628J96745k14050
39905b63151k73711J73308M95323K67182j21383j77716n6659j24156k33503m2947
39895c57413K35337Q0101m30642o20019k23749J95923J07748k16996j88701K02615
39885a215796M63505L84515K39388K27855K02921M6657j00324j41042j91345k73331
39875c56997j91551Q6713K89577L02383L61109M96239K72894m47932r54854n51339
$$ plain form
39945 900702 1107248 865031 146971 -406732 -239268 402305 804147 689014 415565 344763
39935 344763 409468 365912 138078 -170803 -344784 -113081 550837 1169705 1165411 593090
39925 593090 99036 41369 60339 -290735 -892091 -1321321 -1440555 -1377924 -1149358 -650772
39915 -650772 65219 746670 1115070 981738 382152 -282727 -501474 -245846 -49101 -263151
39905 -263151 -536862 -363554 131769 398951 277568 99852 43193 -80963 -314466 -357413
39895 -357413 -122076 -41975 -472617 -1092636 -1316385 -1120462 -1012714 -1229710 -1418411 -1215796
39885 -1215796 -752291 -367776 -128388 99467 302388 349045 248721 107679 -83666 -356997
39875 -356997 -548548 -461835 -172258 130125 491234 987473 1260367 812435 -142419 -693758
39865f93758L40156O73814K04658l28704l58280o2483K07560L18909J29803l59444
39855G2231n74295N0642R28659P66082n10702j328579n88092P48978J053650K44846
39845H63420m26001l07068N8027J08558J4564J09378L27542M37680L56373Q9256
39835A631729k86692n32430m40743j20876J41386K08460O7289k86693o46041n60211
39825h24822P5497O50820N45001m369k70757j06224p616j70671j94885R2926J92104
39814b2996k72162p75886n15271L68299Q04416K05998o34404n31931M49559J020207
39804I5829M46980m12503l72423L77852O72250J56383l39435k39221p629j69794
39794B08289m36392l27543J6605K05605K42927K85238K24424j2917j70579q1319
$$ plain form
39865 -693758 -353602 320212 524870 196166 -162114 -224597 -17037 301872 431675 72231
39855 72231 -502064 -451422 477237 1243319 732617 -595962 -1184054 -435076 618574 863420
39845 863420 437419 130351 188378 296936 311500 420878 748420 1186100 1542473 1631729
39835 1631729 1345037 812607 371864 250988 392374 600834 668123 381430 -264611 -824822
39825 -824822 -749325 -98505 446496 442127 171370 65146 57530 -113141 -308026 -215100 -22996
39814 -22996 -295158 -1071044 -1586315 -1218016 -413600 -207602 -842006 -1373937 -924378 95829
39804 95829 542809 130306 -242117 135735 807985 964368 624933 385712 378083 208289
39794 208289 -228103 -555646 -539041 -333436 -90509 194729 419153 406236 235657 154338
39784A54338M5690Q8281K31685L92951R7645o08281q55189j85270N97722N56349
39774E15921k5820k43598K7180K28263J74947R2191m8675l30918l62171J47307
39764A74627N98044K55983m88441o37672j39830J64235Q192m9504J48554Q0749
39754A14937l00905k80397L73523Q62154N48436j26901m20399k84852j05769l1885
39744C47942m9457k47626n72227o79780l73729J16219M86824O50036N54415J49530
39734C82147l27953m64554k16998L8642P6147J2933p5612k17518k02406K18889
39724g76283P23005O60933O0726k95743j2465L92685L86641J53848M0557p4702
39714A259202l52085m88289k13025J32059P3152k51023l52414j61733k8233r8951
$$ plain form
39784 154338 200028 288309 519994 912945 1010590 402309 -452880 -638150 -40428 515921
39774 515921 490101 246503 273683 501946 676893 769084 720409 389491 27320 174627
39764 174627 772671 1028654 540213 -97459 -237289 -73054 -64862 -114366 34188 114937
39754 114937 -185968 -466365 -92842 769312 1317748 1190847 770448 485596 379827 347942
39744 347942 298485 50859 -521368 -1201148 -1574877 -1458658 -971834 -321798 232617 382147
39734 382147 54194 -410360 -627358 -588716 -512569 -499636 -575248 -792766 -995172 -776283
39724 -776283 -53278 607655 668381 372638 360173 752858 1139499 1293347 1333904 1259202
39714 1259202 907117 418828 205803 337862 411014 159991 -192423 -354156 -382389 -481340
39704d81340j48222J8789L09297M63910K69502k29971o26987m77694J32170O16041
39694a54505O19728L90149K31617K3257l76785o42424m07480M4367P6264l61979
39684e57791o10095k18547M32544O56800L16156j21388k27464l1173J88675K65359
39674I3076J96453K9600j30729j29993K6097Q4103q4531j56295K06991O59886
39664G94658M68874l61631q72844m27828L48353M61756m6346l03347J0879K74887
39654C47411k8168n63892o93071k91131K49342N25140M11578O5553j90249j35250
39644c02737J01959J91004K2404j73093j56588K8805J70416J85337K04071L30764
39634F02342L89043R8337m06981n27815O126N66369L86495k89490n31187j36749
$$ plain form
39704 -481340 -629562 -610773 -301476 162434 431936 201965 -425022 -902716 -770546 -154505
39694 -154505 465223 855372 1086989 1110246 733461 91037 -316443 -272076 -195812 -557791
39684 -557791 -1167886 -1386433 -953889 -297089 19067 -102321 -329785 -360958 -172283 93076
39674 93076 289529 319129 188400 58407 84504 168607 84076 -72219 134772 794658
39664 794658 1263532 901901 29057 -398771 -50418 411338 364992 61645 72524 347411
39654 347411 319243 -244649 -937720 -1228851 -979509 -454369 -42791 22762 -167487 -302737
39644 -302737 -200778 -9774 12630 -160463 -317051 -288246 -117830 67507 271578 602342
39634 602342 991385 1089722 682741 154926 161052 727421 1113916 824426 293239 156490
39624A56490J47465n2484j88933O6339J54265k68232n09974J7390O46485M28297
39614E97108l65796p44259m95402j46868J40088N38596P46521L38713k67838k87394
39604E3469J40029K00062j72965k57769R1173K09352j14451k49954J32128N08593
39594E39667M13363O2669k06135l62694l39445l453L52056K26398k38699l81430
39584F2297r6447K9170k10733l04713J2627L03900K35447Q0946J08258J40386
39574C61138J4537j12642j24788q2992N0744K75084K47358j97439m53667M2607
39564A9940O66718L95062m48194n87132R2893L71660j52365l99576J67658N23219
39554F49883n8369o42347k64884L86738K28028l53827l00411K40512K91526k01627
$$ plain form
39624 156490 303955 251471 62538 128877 283142 14910 -495064 -477674 168811 597108
39614 597108 231312 -512947 -1008349 -1155217 -1015129 -476533 269988 608701 340863 53469
39604 53469 193498 393560 220595 -37174 53999 263351 148900 -101054 31074 539667
39594 539667 953030 1015699 809564 446870 107425 103972 456028 682426 443727 62297
39584 62297 -34150 -4980 -215713 -520426 -507799 -203899 31548 112494 220752 361138
39574 361138 375675 263033 138245 55253 105997 381081 628439 431000 -22667 19940
39564 19940 686658 1081720 633526 46394 139287 510947 358582 -40994 126664 649883
39554 649883 591514 -50833 -315717 71021 299049 -54778 -355189 -114677 176849 -24778
39544b4778l85047k2139K38335O0752j62762j34655k0081Q0410L02500N64574
39534D97109N28343J32030k57679l19475j42816q8635l83589p74370o57961J38654
39524a328389Q47686O09572k29497m76727J48226N91022J57467m02924j75153
39515b58717M64623N59719P8946k43002j52384o0236j99864l56797l31315j23409
39505f22436J94672L91487J44401m24861o65114k66696K18791K05914n0849J1460
39495h63231K99090L13051N9443L910K60653M45751L09540L9686q0836k312J02999
39484H87744K5467k28909l59282j72299R803k32761o47595n55099Q9268N53674
39474f29989L98103n516k13197k57384k28734l4070J88023J38772K5435L23401
$$ plain form
39544 -24778 -409825 -431964 -193629 -132877 -295639 -430294 -450375 -369965 -67465 497109
39534 497109 1025452 1157482 899803 580328 437512 348877 -34712 -809082 -1467043 -1328389
39524 -1328389 -480703 128869 -100628 -577355 -429129 161893 319360 -83564 -258717
39515 -258717 205906 765625 844571 601569 449185 388949 189085 -167712 -499027 -622436
39505 -622436 -427764 -36277 108124 -316737 -981851 -1248547 -1029756 -823842 -874691 -863231
39495 -863231 -564141 -251090 -191647 -187737 72916 518667 828207 867893 787057 784745 887744
39484 887744 913211 684302 325020 152721 162524 -70237 -717832 -1272931 -1183663 -629989
39474 -629989 -231886 -237402 -450599 -707983 -936717 -970787 -782764 -643992 -618557 -295156
39464b95156P32596M16595m70748p29386l5954M18920p3213m90499J26236R06002
39454E05393N36597n56713r31148l75601O3544p1114k05270j0883J34152K4728
39444h86315l4180J26422L04108L62456L36248K07990M0408O7866K43144J30417
39434H98564l15860m66151l2670L45212J72168m4057K09427M28438K4957n04471
39424G15557m20392l7502m8002k32911m8773J71610r8880l50634R7312O14686
39414C62071K10933n59909l90754M44261M52247m81241q33150M287Q18854O91278
39404G18877K33800P6304k11319q44086r74268j32294P23114O27976M0177j51767
39394A06514p6146k74823m96120k28318J96684J54329r4068J28397O04420M95102
$$ plain form
39464 -295156 437440 854035 383287 -346099 -382053 36867 -36346 -526845 -400609 505393
39454 505393 1041990 485277 -445871 -821472 -757928 -829042 -1034312 -1045195 -911043 -886315
39444 -886315 -920495 -794073 -489965 -127509 208739 416729 457137 525003 768147 898564
39434 898564 582704 116553 83883 429095 601263 557206 766633 1195071 1220028 715557
39424 715557 295165 257663 209661 -23250 -72023 99587 707 -349927 -252615 362071
39414 362071 573004 13095 -377659 66602 518849 37608 -795542 -791255 27599 718877
39404 718877 952677 1028981 817662 -26424 -1000692 -1132986 -409872 218104 258281 106514
39394 106514 30368 -244455 -740575 -968893 -772209 -617880 -711948 -583551 20869 515971
39384E15971k12525o02082k64231J21879n4921l92845j93424M06344O45372K82678
39374B52216q3146N3760L53741J80823l80129n89210j26165M44393M96639J61423
39364G64345m5036m3449j63042m82303o71486m73679k0531L37716L41085L1846
39354d24534k32923j30380K10994L84334K93872J81599P1052k36837n29405k82377
39344f94605L61763N37463j3591m20958o4976M14599K50470j82371j89020n2737
39334e3963l54226o44640j29432P41590P73716m9897n17262r2868M27022L67314
39324D67354P8665K3146j020k34477l71827j04995L17957M61112K22193k00185
39314F57923m87139l35447J66682M14668L9983m31895l15210J15097O8840l96069
$$ plain form
39384 515971 303446 -298636 -562867 -440988 -495909 -888754 -1082178 -675834 -30462 252216
39374 252216 169070 222830 576571 757394 377265 -211945 -338110 106283 602922 764345
39364 764345 719309 675860 512818 30515 -640971 -1114650 -1135181 -797465 -456380 -424534
39354 -424534 -657457 -787837 -576843 -192509 101363 282962 354014 117177 -412228 -694605
39344 -694605 -332842 204621 191030 -229928 -294904 119695 370165 187794 -1226 -53963
39334 -53963 -408189 -1052829 -1182261 -440671 333045 283148 -234114 -326982 100040 467354
39324 467354 546019 569165 568145 333668 -38159 -143154 174803 635915 858108 657923
39314 657923 170784 -164663 2019 416687 456670 24775 -290435 -175338 -106498 -502567
39304e02567m53190P7851M46491K59746M5738K17874L88284J39731k74202m40819
39294i5063l77965k27050P6580M65739N84576L03620m7526k04429k68074k91002
39284h0594q9608K87291M23647J65877p8409K5798K42763K28284R4521J29709
39274A349279K43485J03691k94583n42610l37883R9076K47761q0704m65897l87142
39264f5527R4105M61400M90520M16113L34340N0904l05953k39384J94458J84518
39254A615494n62392j106863o02539L31268N09317n2028l22668R0791N62475O10896
39244A073751M29312K07384j66403n70384n86882j83257J36085K6008l09178m96918
39234d40482l80389k7821L15468L81256K41922K70557M97371M57288K3342k12516
$$ plain form
39304 -502567 -955757 -877906 -431415 -171669 -125931 91943 480227 619958 345756 -95063
39294 -95063 -473028 -700078 -623498 -157759 426817 730437 682911 478482 210408 -80594
39284 -80594 -170202 117089 540736 706613 628204 654002 896765 1125049 1219570 1349279
39274 1349279 1592764 1696455 1401872 859262 521379 620455 868216 787512 321615 -65527
39264 -65527 28578 489978 980498 1396611 1730951 1781855 1475902 1236518 1430976 1615494
39254 1615494 1053102 -53761 -656300 -325032 184285 132257 -190411 -99620 462855 1073751
39244 1073751 1503063 1710447 1544044 973660 386778 203521 339606 365614 56436 -440482
39234 -440482 -820871 -848692 -533224 -151968 89954 360511 857882 1315170 1338512 1125996
39224A125996Q3152K88033j75274p66744o39681l942K88788J09395n713M3987
39214C47997q7151l01743j61996K18007K89973J1290j48018m6660L1003r304n2648
39203I0750j71824l81781l03201K30204O12356K79932l33042m74999k40287j45263
39193h37155m8363M43527R10415O12916k14826o51123m47860j06996J23472L16978
39183A00985K43177k71043o50264k86838L64904M45919N6034j26844j25573l41540
39173e91083m24914J54551P89593M73685l96876m94529K87417P09047K44144k51774
39163D99261j35353J45640P8616j76119l59767m52617k94500K35873O65628M43614
39153F50276j05746k53078n7595j09375l66964l14755j0934P7662l001N7763P0571
$$ plain form
39224 1125996 1209148 1497181 1321907 555163 -84518 -88460 200328 309723 304010 347997
39214 347997 260846 -40897 -202893 15114 305087 316377 168359 121699 152702 143398 90750
39203 90750 -81074 -462855 -766056 -535852 76504 356436 23394 -451605 -691892 -837155
39193 -837155 -885518 -441991 468424 1081340 866514 215391 -232469 -339465 -215993 100985
39183 100985 344162 73119 -577145 -863983 -499079 -53160 2874 -123970 -249543 -591083
39173 -591083 -1015997 -861446 -71853 401832 4956 -489573 -202156 506891 751035 499261
39163 499261 363908 509548 588164 412045 52278 -400339 -694839 -458966 206662 650276
39153 650276 544530 291452 233857 124482 -242482 -557237 -568171 -490509 -493510 -435747 -365176
39142c65176j65845j71907L35782N85438n936n59547j31991N14618K17972l96705
39132a43297M793R39004Q30055k37720p34597l54423k13197n12312k68660N37628
39122a52726P03635o3197o84284n99850l39413j05847M43581R56956O79705j4285
39112H24275q7949K91687J11375m83091m18819K58186M71853P9992q7832J08093
39102A067770K07196M29521J012339R73976l93265j652402j156590J06242J78724
39093G73511m41012k2982Q19995K47829r46383m18023J267380J288387m51723
39084B116979j150585j02306L54855n87985r05984J28962O02494j68913l50700
39075f3183O17279P76784m79402j034363L0980P58920L1429n38696Q1924N44084
$$ plain form
39142 -365176 -531021 -702928 -367146 218292 212356 -347191 -479182 35436 253408 -143297
39132 -143297 -138504 800500 1630555 1392835 658238 303815 90618 -421694 -690354 -152726
39122 -152726 550909 487712 -196572 -796422 -1135835 -1241682 -798101 158855 838560 824275
39112 824275 736326 1028013 1139388 656297 237478 495664 967517 1047509 959677 1067770
39102 1067770 1274966 1704487 2716826 3690802 3297537 1645135 488545 594787 773511
39093 773511 332499 309517 1129512 1377341 430958 12935 1280315 2568702 2116979
39084 2116979 966394 864088 1218943 630958 -275026 -146064 456430 287517 -63183
39075 -63183 554096 1330880 851478 -182885 -151905 607015 638444 99748 181672 725756
39065G25756P0036r8843M54085L23151o73524q06392J52443L35744m71313k69214
39055b58071J042174J060454n41990j100926J68825P85072k03079n85007M04113
39046G71565N52884o75833p99508O95858J005236n73229j033484O05624J324471
39037A873584p2947p14064N37098P99269q87374j319826N52847J242065n64638
39028A446014j301947N07360J287484m34594r65010J049972J503128j035201j903670
39019A53536P87091K120615k64293j487275R13821J896636r45128j984966J438821
39010B628858L032992m54090k310937J259289L239830m08879j977672K857575
39002G866966N250341L26220j472503N751395R535778K437899l16472J1151416
$$ plain form
39065 725756 795792 696949 1151034 1474185 800661 -5731 146712 482456 11143 -258071
39055 -258071 784103 1844557 1302567 201641 370466 1155538 952459 367452 771565
39046 771565 1324449 648616 -150892 544966 1550202 976973 -56511 549113 1873584
39037 1873584 1800637 1086573 1623671 2422940 1535566 215740 768587 2010652 1446014
39028 1446014 144067 651427 1938911 1504317 539307 1589279 3092407 2057206 153536
39019 153536 940627 3061242 2796949 1309674 2223495 4120131 3175003 1190037 2628858
39010 2628858 5661850 5207760 2896823 4156112 7395942 6987063 5009391 7866966
39002 7866966 13117307 13443527 11971024 17722419 27258197 29696096 29379624 40531040
38994D0531040J7746683O811540Q723117N2827669J00059855P6900700j7402786
38987B86197818r4054224q6896525l1960125l236952j2890611j9991568p729796
38980B9438017J187685m973155r534529l018206J657036l084933o213249j009064
38972D449602K957553o58019l783384n54911K311834k67520k414159K32379K171472
38963D444847n84508k799970n21345J534985m30038k203669k34013J651231J16051
38954I73571j398411J00058J334190m25293j866212j74501J560316M67006p94872
38945b24148L52323J357638j64017j571606k84606J296367M37834r80117m36100
38936b16432N96401M4192p01245O5934Q36367K9931q28359k84683J48465p34180
$$ plain form
38994 40531040 58277723 65089263 73812380 126640049 226699904 303600604 286197818
38987 286197818 192143594 105247069 73286944 70049992 57159381 37167813 29438017
38980 29438017 30625702 25652547 16118018 13099812 14756848 11671915 5458666 4449602
38972 4449602 7407155 6749136 2965752 2410841 4722675 4455155 2040996 2273375 4444847
38963 4444847 3860339 1060369 539024 2074009 1643971 -559698 -793711 857520 973571
38954 973571 -424840 -324782 1009408 584115 -1282097 -1456598 103718 570724 -224148
38945 -224148 128175 1485813 1321796 -249810 -534416 761951 1199785 219668 -216432
38936 -216432 379969 424161 -277084 -211150 625217 655148 -173211 -457894 -309429 -1043609
38926a043609j138974K30119J401032O93010k93825L7484L56848n38570j072887
38917a369372k7627Q78263K38941l42113N24435J191799J16961j127882p39295
38908f55890J77651K1482l90690R4055N09997r0530m99243K54060Q00096L1956
38898B52944o52001n123O47408o896p10617q3079P24001K76640m49276p5802N58940
38887D77139J99516l61033N6635P18506N19807N1385J37725J71610k31702K1297
38877A760885J200167J427197k50172j734851j123214J60976j4402q69173m93026
38868F4387N81512N30297m16322o06571O8424L86981J35890k167r3670n05812
38858A42949o80634j38089K98260o3395l29747L09847Q42606K10933n85084k03085
$$ plain form
38926 -1043609 -2182583 -1952464 -551432 141578 -152247 -114763 242085 -296485 -1369372
38917 -1369372 -1396999 -518736 -279795 -621908 -97473 1094326 1211287 83405 -655890
38908 -655890 -478239 -456757 -847447 -753392 -243395 -333925 -833168 -579108 220988 252944
38898 252944 -399057 -404180 243228 236332 -474285 -557364 166637 443277 -5999 -81801 477139
38887 477139 676655 315622 372257 1090763 1610570 1661955 1799680 1971290 1739588 1760885
38877 1760885 2961052 4388249 4138077 2403226 1280012 1440988 1426586 557413 64387
38868 64387 645899 1176196 759874 153303 221727 608708 744598 742431 648761 142949
38858 142949 -537685 -675774 -377514 -440909 -770656 -460809 381797 592730 7646 -195439
38848a95439N62147K13936p03350o06252K95916M73492k45342o18601k10726K23720
38838h10499K80631K30360J17142j30508j27285K93829M67426o13l57986J2053
38828b5450M36940K02863j42605O9320L30541M7109k39084J2237J90297k02408
38818F79760m29737J6076K32584l89482p70164l5655P09297K81973l92412L0749
38808f7011Q23277N29132l94014n10972J4004J6813l41223q4780M47693K02036
38798F34955m35818k41258N44789O00332j38937n09536k07560R304o8998k8532
38788A58741k4010l84795m91838K53716R13749L08046p65238o33854M20804O43029
38778C98350j88614n44602P5745M42933l8870m08898r8366J19134k30952m10482
$$ plain form
38848 -195439 366708 580644 -122706 -728958 -433042 40450 -204892 -823493 -1034219 -810499
38838 -810499 -529868 -299508 -182366 -312874 -440159 -146330 321096 320483 -37503 -25450
38828 -25450 411490 614353 471748 541068 871609 918718 679634 691871 882168 679760
38818 679760 250023 266099 498683 109201 -660963 -696618 12679 294652 -97760 -67011
38808 -67011 756266 1285398 891384 380412 394416 411229 70006 -14774 432919 634955
38798 634955 199137 -42121 502668 1103000 964063 454527 246967 256271 187273 158741
38788 158741 134731 -250064 -741902 -488186 425563 733609 -31629 -665483 -244679 398350
38778 398350 209736 -334866 -259121 183812 144942 -263956 -362322 -243188 -474140 -884622
38768h84622R2361O24175N50674K00641M9134j2941j18713n0062J92784K28679
38758H72110n6041l75526n94693p32192n65542M358M47307K85243o8971l3515
38748h17462P3596k64464n50140l5170P74009P90769J77581J2499L71665L07318
38738H40201l37780o50089k72733J19099J24986R2488J48649l630k27753q6844
38728b53406J51446j31747o01871l53786M29889O35262Q6147k32791K6226Q7629
38718a57002l39130m81498R668L93077J79764j26445j28651j53578k92399n8725
38708a154919M85935N01794j65585n08888K1155O06936M77527Q5428Q5506K10848
38698F45737K4529j77679r6642j57982o04253p31548l7746O56884L70491l82700
$$ plain form
38768 -884622 -792261 -168086 382588 583229 632363 619422 500709 450647 643431 872110
38758 872110 816069 440543 -154150 -886342 -1451884 -1447526 -1000219 -714976 -783947 -817462
38748 -817462 -743866 -1008330 -1558470 -1593640 -819631 -28862 148719 161218 532883 840201
38738 840201 502421 -147668 -420401 -301302 -176316 -83828 64821 61191 -166562 -253406
38728 -253406 -101960 -233707 -835578 -1189364 -759475 -124213 -38066 -270857 -244631 -157002
38718 -157002 -496132 -977630 -967962 -574885 -395121 -521566 -650217 -803795 -1096194 -1154919
38708 -1154919 -668984 -167190 -332775 -841663 -820508 -213572 263955 349383 434889 645737
38698 645737 670266 492587 395945 237963 -366290 -1097838 -1135584 -478700 -108209 -490909
38688d90909l34788N09997Q73105J82052o21031n25825J99969N75497K33584l31547
38678B70104n60591m01828j06776J89004M74087N99880L33879k23661n44693k44307
38668b14902L99760P48298N22170K624l77086m12732j99819k3445r0786k68535
38658H5547k58572p1711M870l2910J29666M59773M83767J15240j14814q766p6443
38647G15647m52796l79599M37207Q95487N4497j138643j056563J57662Q37483
38638G0382L07310l49618j66788M31032O11396K94894j22532l84703l54530m0770
38628B96073J61922j06471m68260k43797M17674O61270K11835l16518m61535l98114
38618b45921k96407p4547R6865p6144k76821J00351P81538P80807n9072p37427
$$ plain form
38688 -490909 -825697 -315700 557405 739457 118426 -407399 -207430 368067 601651 270104
38678 270104 -290487 -692315 -799091 -610087 -136000 463880 797759 574098 29405 -214902
38668 -214902 184858 933156 1455326 1457950 1080864 668132 468313 444868 354082 85547
38658 85547 -173025 -244736 -239866 -272776 -143110 316663 800430 915670 800856 792090 715647
38647 715647 262851 -116748 320459 1215946 1270443 131800 -924763 -767101 70382
38638 70382 377692 28074 -138714 292318 903714 1198608 1076076 691373 336843 296073
38628 296073 457995 351524 -116736 -360533 57141 718411 930246 613728 152193 -245921
38618 -245921 -542328 -616875 -520010 -596154 -872975 -772624 8914 789721 730649 -6778
38608f778o12902k03198o6672N9435M42148O45760L34859k0174M5864J65414j50681
38597F33075n58821m04769K02626N43996K77442k74532o43439o04297k15082K22715
38587h21086L88734K88591J78695J30289J0764j15350l8786J17724J4213k54594
38577a00806k09021K06373M68064K73007j04274l90903o14136o59136k19331N47593
38567h02570R47710O33027J6272m05203n67031n07323j67410K43627L02638J1348
38557b94915k04048k40502l62216m21696O9709Q85632J077268L88828k82754k90287
38547C25019j02007k00715j62456L64577P00114J53695o88687p39821m876N55377
38537B00220M13442j20415n86570p00867k77080M60536P78699L18255k65818k24213
$$ plain form
38608 -6778 -619680 -822878 -889550 -830115 -387967 257793 592652 572478 618342 783756 633075
38597 633075 74254 -330515 -127889 416107 693549 419017 -224422 -828719 -1043801 -821086
38587 -821086 -432352 -143761 34934 165223 175987 60637 21851 139575 153788 -100806
38577 -100806 -309827 -103454 364610 637617 533343 142440 -471696 -1130832 -1350163 -802570
38567 -802570 145140 778167 794439 389236 -177795 -685118 -852528 -608901 -306263 -294915
38557 -294915 -498963 -739465 -1101681 -1523377 -1453668 -568036 509232 898060 615306 325019
38547 325019 223012 22297 -140159 224418 924532 1078227 389540 -350281 -355157 200220
38537 200220 613662 493247 -93323 -794190 -1071270 -610734 167965 486220 220402 -3811
38527c811J44926P4269l48337l88136M0425K93572J62302J38690M05149M59928
38517I78977K6810m09570l46227K0825J97104R9154k669p66p9556l77410o90193
38506e83521n95866M2673P47282Q66248M04877M0041J49249L05327N2676l38406
38496A090580l97197k60459l07077l64031l8140M10894L61983j04279k83711k4409
38486H4154L1225m18782p66319m39933K33275N86842N44512M76906M62137K31473
38476A025490k49857n87163m34334L6749K79392Q635l81931k63493L06442N04632
38466B44562q6323o69459k62190P44529R74976M7005q43000o71255L6766K42904
38456b41485o371L2596L45043K12869m09522o56560r1479N95566O05884Q3814
$$ plain form
38527 -3811 141115 215384 -132953 -521089 -480664 -187092 -24790 113900 519049 978977
38517 978977 1005787 596217 249990 270815 467919 567073 564404 563638 484082 106672 -583521
38506 -583521 -1179387 -1136714 -389432 476816 881693 921734 1070983 1376310 1428986 1090580
38496 1090580 693383 432924 125847 -238184 -276324 134570 496553 392274 108563 84154
38486 84154 115379 -303403 -1069722 -1509655 -1276380 -689538 -145026 331880 794017 1025490
38476 1025490 775633 188470 -245864 -209115 70277 78912 -303019 -566512 -260070 244562
38466 244562 158239 -511220 -773410 -28881 946095 993100 150100 -521155 -484389 -241485
38456 -241485 -247856 -215260 129783 342652 -66870 -723430 -814909 -219343 386541 470355
38446D70355k77433j78287J63997M43960M27430K0236m60693m30805J65275N75186
38436I19221K25714l93767m57040r2829j28965o49641p61133l5174P02323N68379
38426a02912o6784k00247K78887N13498M1785n40407m95046M9737L87467K16461
38416H2439q1480p1883J78155K99147J61510j2657l8503j5684q4400j61491j30958
38405A24195j13031k44584l26842p7242L24785L93835Q3214j06156R0313K88912
38395D37399R0246l06733m61345l08174n8441K07004M64007N20490K51931j29708
38385G06676l57222m29413l69533j1968N66222P71401K17277n36632o03965J3986
38375c3171M80284L33537k7448j43211j17620k05532l10902k26355k6392O8442
$$ plain form
38446 470355 192922 14635 178632 622592 1050022 1070258 609565 178760 344035 919221
38436 919221 1144935 751168 294128 201299 72334 -577307 -1338440 -1373614 -671291 -102912
38426 -102912 -169696 -369943 -91056 422442 464227 -76180 -571226 -521489 -134022 82439
38416 82439 959 -70924 107231 406378 567888 555231 516728 501044 416644 255153 124195
38405 124195 11164 -233420 -560262 -637504 -312719 81116 164330 58174 148487 437399
38395 437399 527645 220912 -240433 -548607 -607048 -400044 63963 584453 836384 706676
38385 706676 349454 -79959 -449492 -461460 104762 876163 1093440 556808 -47157 -33171
38375 -33171 447113 780650 753202 609991 492371 286839 -24063 -250418 -276810 -208368
38365b08368j20j37560k19659j09681K15013M80063L32751j51026m54191k56695
38355e09473J59171L08253R8747j61832k06388m9067J50821K85984L29705K66568
38345F72489Q6083j42779k73105k36154j30959n4560M8898J96618J87611p5002
38335B79140k43106K7178L89776J99840l96432n31844K4928M30095R2982m13364
38325a40807l87668j26563j92645k88401J19304O22604M75906j6241M3741N17956
38315F27186L92706m08266p28173k4517P15319M74076l68261p77130m86714j1980
38305e95754K23613J74482m2925j99013p1127K08530K45411j9867k13408j36078
38295d26136J8553J40787L16726L62588o1274o82322p12413j7225N55992M11356
$$ plain form
38365 -208368 -208488 -346048 -565707 -675388 -460375 19688 352439 201413 -252778 -509473
38355 -509473 -350302 -42049 56698 -105134 -311522 -360589 -209768 76216 405921 672489
38345 672489 758572 615793 342688 106534 -24425 -78985 -30087 166531 354142 279140
38335 279140 36034 63212 452988 652828 256396 -275448 -250520 179575 272557 -140807
38325 -140807 -528475 -655038 -847683 -1136084 -1016780 -394176 81730 65489 109230 627186
38315 627186 1019892 611626 -116547 -141064 574255 1048331 680070 -97060 -583774 -595754
38305 -595754 -372141 -197659 -240584 -439597 -510724 -302194 -56783 -76650 -290058 -426136
38295 -426136 -407583 -266796 49930 412518 351244 -331078 -1043491 -1060716 -504724 -93368
38285i3368K5666M0227K34652M1569m65416p60920o55045l24379R9098M79148
38275a378768N65533L75862L14044N11692N12142M2268m36552m71997l45019m12285
38265g23080l15084L21866Q98839N73601k87156m91895J63870N73564N1181o31151
38255A34555m66375L05688O50842K26743l12428l57905o6148P0920o0265j71595
38245d5968p4103P7147O2912o8752r5261L5706J32542M6223j18963j41267O1499
38234a28285L40077M13746J02799m22977o91180l98743J95524N29945L59140n8239
38224B41807l19334k21213J58217M83723L82880r1228l83015j48868J80950K5250
38214C09169l90370l48990J89986M97000K13316j77189k17970r4053p9238m6463
$$ plain form
38285 -93368 -67702 -27475 207177 248746 -216670 -977590 -1632635 -1957014 -1857916 -1378768
38275 -1378768 -813235 -437373 -123329 388363 900505 942773 506221 34224 -310795 -723080
38265 -723080 -1038164 -716298 182541 756142 468986 -22909 140961 714525 765706 134555
38255 134555 -331820 -26132 624710 851453 539025 181120 114972 185892 125627 -45968
38245 -45968 -120071 -42924 19988 -48764 -144025 -108319 24223 70446 -48517 -189784 -128285
38234 -128285 211792 625538 728337 305360 -385820 -784563 -589039 -59094 300046 241807
38224 241807 -77527 -298740 -140523 343200 726080 634852 251837 102969 283919 309169
38214 309169 -81201 -430191 -240205 256795 470111 292922 74952 -19101 -98339 -144802
38204a44802R9727J07744j11906k13239k3778J23270K7705n071J68496J42745
38194A70891k57863m77362j25805K52169M1483l71302k36820K86439M23406O4937
38184b29827j69773k4451J21144N6296J4481Q1279M2064q4634l402K69893L68783
38173D41853K17548J40711K31984J76568j59795m82073n53436m69733l40155j55506
38163i52034n0447j92675l27770J748O42443Q42293L21521k64819k77121N8608
38153a98253J92989J32476K00465K96867O3013l85227n26325k23436J00365J41425
38143b05641Q3713J58313K69818K58578J72481N8904j79242m69292m55843m8633
38133c56844K37617l3060m39586k27722M83165P51625K05354l81978k87706R0138
$$ plain form
38204 -144802 -45075 62669 -49237 -262476 -286254 -162984 -135279 -140350 28146 170891
38194 170891 -86972 -564334 -690139 -437970 -396487 -767789 -1004609 -718170 -294764 -229827
38184 -229827 -399600 -424051 -302907 -246611 -232130 -150851 -108787 -193421 -196823 73070 441853
38173 441853 659401 800112 1032096 1208664 1048869 566796 13360 -456373 -796528 -952034
38163 -952034 -1002481 -1195156 -1522926 -1521178 -878735 -36442 285079 20260 -256861 -198253
38153 -198253 -5264 127212 327677 624544 687557 302330 -223995 -447431 -347066 -205641
38143 -205641 -121928 36385 306203 564781 737262 796166 616924 147632 -308211 -356844
38133 -356844 -119227 -152287 -591873 -819595 -336430 415195 620549 238571 -49135 41003
38123D1003j2040m45730m50920N9395M03547K75944J34733K88991L69949M7759
38113G12631l39627l11858J3373J35099j11191l86427k96328J57987N07331K46864
38103C27854m64712p44724o2186Q31913P43620k46704p80784j40722P57587P81298
38093A002440J42707j99867m6095N9165m4491J2724K40511J38922m14991q25437
38083F5588n87427M5486M67278M43229J75363r5136k66484k70507n8666K37835
38073A56559K84513j35393p51612r44758m08769M44116R14387P33249J77213l34572
38063A34933m91666j76900L24368M20917m4337m16529j33990L17549J26714m41321
38053c80262l85206L55829P24504K34208l38424l41960j78209k73878k42463J76996
$$ plain form
38123 41003 28963 -416767 -867687 -808292 -404745 -128801 5932 294923 664872 712631
38113 712631 373004 61146 74519 209618 98427 -288000 -584328 -426341 80990 327854
38103 327854 -136858 -881582 -943768 -111855 631765 385061 -395723 -536445 221142 1002440
38093 1002440 1145147 945280 899185 958350 913859 926583 1167094 1306016 891025 65588
38083 65588 -521839 -476353 -9075 434154 609517 514381 247897 -22610 -81276 156559
38073 156559 441072 305679 -445933 -1390691 -1799460 -1355344 -440957 292292 469505 134933
38063 134933 -356733 -533633 -209265 211652 167315 -249214 -383204 -65655 61059 -380262
38053 -380262 -765468 -409639 314865 549073 210649 -131311 -309520 -583398 -825861 -648865
38043f48865L72604o6089m53679j51845K73542J18730q2581M51814J081379N78213
38033A473223p33376j237707m03048N50703N65578K6589k61266k51998k55093
38024e26395k02163P6664L81360M16452J89132j22365l72604m03120j43609J84818
38014e21830K94405K05954O1815k26961o60532p36669l9711Q98347J077530L65690
38004G18038l55417m23016q0979J57528J66446N5337q4051j22566j2840K1248
37994C9728j65110k46185O8492L66040J03854l49803j76347M56947M94345k98136
37984B93825q12734k43986O89080Q00908K3939p31172q29992m30417k9428N8965
37974a211012o5181J2694M63238P74874L46375m91050p16019k7886P04705O82832
$$ plain form
38043 -648865 -276261 -342350 -796029 -947874 -674332 -555602 -638183 -186369 895010 1473223
38033 1473223 739847 -497860 -900908 -350205 215373 241962 -19304 -271302 -526395
38024 -526395 -728558 -651894 -270534 145918 335050 212685 -159919 -563039 -706648 -521830
38014 -521830 -227425 -21471 40344 -186617 -847149 -1583818 -1623529 -725182 352348 718038
38004 718038 362621 -60395 -141374 16154 182600 237937 153886 31320 18480 39728
37994 39728 -125382 -371567 -303075 62965 166819 -182984 -359331 97616 591961 293825
37984 293825 -518909 -762895 -73815 727093 751032 19860 -810132 -1240549 -1269977 -1211012
37974 -1211012 -1276193 -1263499 -800261 -25387 320988 -170062 -886081 -913967 -209262 473570
37964D73570J48528k68683m74150o37503n83864j07038M65351O06629K93687m9226
37954a32699j25913L0505K26488K27517o8496m02961l78452k5776K11227J50300
37944b88260O3793P9061l9332k94140k67507J45653M32153K85869J15315K39687
37934D72292K18363l55723r34092o94242J82788P31485N52830J88999J57726K99174
37924H19600K29368p3225l38446l45981p0601K93086M07141Q9424m36713p26366
37914a52713n32611J8241N54180O98738L71450o9722j98681p9553j40356m28230
37904D0743m52116J7344M81873M25182P0665m0389R7747O2488k23817l67540j28794
37893a6614K38190L17342k7411n19469o61624k23814L59825L82228j92883n92058
$$ plain form
37964 473570 622098 353415 -120735 -758238 -1342102 -1449140 -983789 -377160 -83473 -132699
37954 -132699 -258612 -228107 -1619 225898 157402 -245559 -624011 -649787 -438560 -288260
37944 -288260 -224467 -145406 -184738 -478878 -746385 -600732 -168579 117290 232605 472292
37934 472292 690655 334932 -599160 -1293402 -1110614 -379129 173701 362700 520426 819600
37924 819600 1048968 975743 637297 291316 220715 513801 920942 1010366 573653 -152713
37914 -152713 -685324 -667083 -112903 585835 957285 887563 688882 609329 468973 40743
37904 40743 -411373 -394029 87844 513026 583691 543302 641049 703537 479720 112180 -16614
37893 -16614 221576 538918 511507 -7962 -669586 -893400 -533575 -151347 -344230 -936288
37883i36288k99379K30635L49914J91813K39850L48012J4549n72980o52870q3953
37873a170697L89585K59422p8860p9706J48188J94838M1052m2381J0438N3680
37863b74441L1102j0216n8455p6399L2351K21104K58199N8850j59528k35177l14840
37852e27450n00870n18409j03874M56063O07998K98014K5557R9027K69749K46897
37842C52702J53549J89084J88431p4467l68084k76981Q2874J55846j59296k56760
37832a3102K41568P81690O09318r7930m57713j68193R7173k37256p66141p14875
37822g25461p0668M21235K81953j64191l55419k05299k4314K8666R7272K67465
37812d48761L54672J96679k0825K2504K74983K91983j52319o43331n63812J12354
$$ plain form
37883 -936288 -1235667 -1005032 -655118 -463305 -223455 124557 139106 -433874 -1086744 -1170697
37873 -1170697 -781112 -521690 -600550 -680256 -532068 -337230 -296178 -338559 -328121 -274441
37863 -274441 -243339 -253555 -312010 -388409 -356058 -134954 123245 182095 22567 -212610 -527450
37852 -527450 -1028320 -1546729 -1650603 -1194540 -586542 -288528 -262971 -163944 105805 352702
37842 352702 506251 695335 883766 809299 441215 164234 247108 402954 243658 -13102
37832 -13102 228466 1010156 1619474 1521544 1063831 895638 992811 755555 -10586 -725461
37822 -725461 -796129 -374894 -92941 -257132 -612551 -817850 -842164 -813498 -716226 -448761
37812 -448761 -94089 102590 81765 104269 379252 671235 518916 -124415 -688227 -575873
37802e75873P19063O56410P1550l50735j98433K23472L08174r7494n17679m63950
37792b25495l7746K68063K35554R5463P0480R6886Q0648Q1122P9550r8074m04837
37781B41614m53097p5074K93815J72698k48214l73370n0040K77864K28818p5756
37771f0742k61624j33295J58166K31572j36436o17917n78838P9705O65879O00232
37761e3298J87392L2661Q8953p9858l96180l99372j22905l6798j54843k5052L29115
37750f30185L19512j48149l65971O7194N73226M86744k289k82849j82600P3564
37740i1803L07284L48735j921n31615n71194J23394Q46051P99193J19728m55979
37730H91873n94772m75422k16981J57666L78556J82364j74630k18692k052J9697
$$ plain form
37802 -575873 143190 799600 871150 520415 321982 545454 853628 756134 238455 -225495
37792 -225495 -263241 4822 240376 335839 406319 503205 583853 664975 744525 646451 241614
37781 241614 -211483 -286557 7258 179956 -68258 -441628 -491668 -213804 15014 -60742
37771 -60742 -322366 -455661 -297495 -65923 -202359 -820276 -1399114 -1319409 -653530 -53298
37761 -53298 134094 166755 255708 175850 -220330 -619702 -742607 -779405 -934248 -959300 -630185
37750 -630185 -310673 -458822 -824793 -757599 -184373 302371 300082 17233 -165367 -91803
37740 -91803 215481 564216 562295 30680 -540514 -417120 428931 1228124 1347852 891873
37730 891873 297101 -178321 -395302 -237636 140920 323284 148654 -70038 -72090 -52393
37720e2393j85712j40107L08530O47630M40981n6349l39060l59958m24251n84133
37710g44822n52421k10709J49279K44331K18999L74267N84471L75353k93969p22049
37700e77270l05040N65536R35503N18594n1698k24692j77284k45218k99620j06173
37690C2638J29286P3330j47025j53486M9063J01382j21842l50537l31064q5378
37680h03633K20284L98698K84476p9256l56483k95869j19027k02953m19838k15271
37670a588872N38876J164661R45936N5575o29525n87521j89252o9407k57016k52788
37660h69333J27482M15659J80406k84546l41061P5875L70699J54837k29584k62196
37650f61762J3765J37915m6214j95994k7072K49701K47665n247q6756J87431M51666
$$ plain form
37720 -52393 -238105 -378212 -69682 577948 1018929 962580 623520 263562 -160689 -744822
37710 -744822 -1297243 -1507952 -1358673 -1114342 -895343 -521076 63395 438748 144779 -577270
37700 -577270 -882310 -316774 618729 1137323 1085625 860933 683649 438431 138811 32638
37690 32638 161924 235254 88229 -65257 -16194 85188 -36654 -387191 -718255 -803633
37680 -803633 -583349 -184651 99825 20569 -335914 -631783 -750810 -953763 -1373601 -1588872
37670 -1588872 -1049996 114665 1060601 1116176 486651 -100870 -290122 -359529 -616545 -869333
37660 -869333 -741851 -326192 -145786 -430332 -771393 -695518 -324819 -169982 -399566 -661762
37650 -661762 -647997 -510082 -556296 -752290 -779362 -529661 -281996 -287243 -373999 -186568 265098
37639B65098L16278l4169j30544K1672m1377m26418o14539k31986L76003O54277
37629A54295N18980K00284j80825m82347l98386P5014L88426J51796k46439k45438
37619f4640M3089J72135J36419J44918K5757l69975n62292j22288M02130K36641
37609D1894k68725j87463L34595L17275k39204k74321L94357O02846j69090q06999
37599b54835l54357M82436N82771J03665j12947L7891J43927K28074M68770N24561
37589A849956P9096m18440m16218j82209k29364l28932j1387L92348K00431m10601
37579E24680o02726j57274K73434J58923l27778o84474n42871J06447P60076P50765
37569B59202J15462l12691q0651K02941r0319n46894m44838M0826K47040J66133
$$ plain form
37639 265098 581376 547207 416663 438335 396958 -29460 -643999 -875985 -499982 154295
37629 154295 673275 873559 692734 210387 -187999 -112985 275441 427237 180798 -64640
37619 -64640 -21551 150584 287003 431921 457678 87703 -474589 -596877 -194747 41894
37609 41894 -226831 -414294 -79699 237576 -1628 -275949 118408 721254 552164 -254835
37599 -254835 -609192 -126756 456015 559680 446733 484624 628551 856625 1325395 1849956
37589 1849956 1929052 1510612 1094394 912185 682821 353889 342502 734850 935281 524680
37579 524680 -78046 -235320 38114 197037 -130741 -815215 -1358086 -1251639 -491563 259202
37569 259202 374664 61973 -18678 184263 93944 -452950 -897788 -856962 -609922 -443789
37559d43789K50851M37249L00383o2234j81046n1625k4265q1112K196L3583k58324
37548g8133n29435k84347K16727L39096J01507j2219J8923r8147j84608R0610
37538d20026L63403O0526m76134m12020J77275M16568P9302j70422l258J67679
37528b17107Q8717n367m5317k00324k90842l5845K07651n2547l68102N2398Q06236
37517f0449P17329j95531o45801j64185K74301Q2759m1119L39463M63212j78289
37507E91690p77279n54361k4700N3892l9397K28260N17112L21263q251K5370P1544
37496D05143l22155o63919k93156L77721M72189L5168k14321j15853o8015j38821
37486e26019j12177j17407l27255l38504K56836R61406R18734J53267n41410p09959
$$ plain form
37559 -443789 -192938 244311 544694 482460 301414 249789 225524 144412 146608 180191 -78133
37548 -78133 -607568 -891915 -675188 -336092 -234585 -246804 -227881 -326028 -510636 -420026
37538 -420026 -56623 3903 -472231 -884251 -706976 -290408 -211106 -381528 -384786 -217107
37528 -217107 -128390 -133757 -179074 -379398 -670240 -706085 -498434 -550981 -919083 -866685 -60449
37517 -60449 656880 461349 -184452 -348637 -74336 8423 -32696 306767 769979 591690
37507 591690 -185589 -739950 -764650 -710758 -750155 -521895 -4783 316480 308229 333599 405143
37496 405143 82988 -580931 -874087 -496366 -24177 10991 -203330 -319183 -387198 -526019
37486 -526019 -638196 -755603 -1082858 -1421362 -1164526 -203120 715614 868881 327471 -382488
37476c82488m65200N8820O42206P06126K6067n85872k87362M03713L24175m55692
37466a5507p29232j17174L87570J02396l56842k67022P6973O6959k04216k85603
37456a341698j15390J38132M65408P62297O81591J90105j96449j56939n4342k44034
37446A28681m12245j47281K82748L43463R1654r947J00434Q9948q5375j03382
37436B78698J32955L29371K55304k8568l79722o40201n61527q7166L40161K29147
37426a31548k02103k43298K47687N70292K03966m25275n85298k27436J36284K56413
37416d00316L18940M22014L93669J69811m1516p5894k6349o7590k55693n09990
37406g2914o24001l64890K14385O52610N43117M0942l68773m77797l87533j20472
$$ plain form
37476 -382488 -847688 -788868 -146662 559464 585531 -341 -287703 116010 440185 -15507
37466 -15507 -744739 -861913 -474343 -371947 -728789 -995811 -918838 -851879 -1056095 -1341698
37456 -1341698 -1457088 -1318956 -853548 -91251 590340 780445 583996 427057 372715 128681
37446 128681 -283564 -430845 -148097 195366 287020 277073 377507 467455 382080 278698
37436 278698 411653 741024 996328 967760 588038 -52163 -613690 -700856 -360695 -131548
37426 -131548 -333651 -576949 -329262 241030 444996 19721 -565577 -793013 -656729 -400316
37416 -400316 -81376 340638 734307 904118 862602 786708 760359 692769 437076 -72914
37406 -72914 -696915 -1061805 -847420 -194810 348307 389249 20476 -457321 -844854 -965326
37396i65326K99449N08776J82504k65024p8160O25011Q21298N8204q15817q53330
37386d82415k37396K45315L19682J73179j29983m74600m27598J28251N52527L65785
37376C2747R1933L47946O58961K49281m54606m01209K54319L11621m51288q49869
37366b10164k09057O12281O41548J03392k96709m11087l40447K5139N13996N22508
37356I51400m1086m44889l12692k25365n19506m90842L36738J095723Q11344j9164
37346A141661k60995P3735J32320j73768k08800L6652j2970k55497l7374M44433
37336H79397K38567o52834j010289k72184N69205N50475R2750J2941J63578q096
37326E63510l01066j83619J28639K6904l64832l83815M644J67263p1865j61253
$$ plain form
37396 -965326 -665877 -157101 25403 -239621 -317781 307230 1128528 1186732 370915 -482415
37386 -482415 -719811 -474496 -154814 18365 -111618 -586218 -1013816 -885565 -333038 32747
37376 32747 124680 472626 1131587 1380868 926262 525053 779372 1090993 639705 -210164
37366 -210164 -419221 193060 834608 938000 641291 230204 -110243 -85104 428892 951400
37356 951400 910314 465425 152733 -72632 -592138 -1082980 -746242 349481 1160825 1141661
37346 1141661 880666 954401 1086721 912953 704153 740805 727835 472338 434964 879397
37336 879397 1117964 465130 -545159 -817343 -248138 302337 395087 408028 571606 563510
37326 563510 262444 78825 207464 234368 -130464 -514279 -509635 -342372 -414237 -575490
37316e75490J55038L66734R3528k33053o3595L93252N24769K17496j28959k91175
37306D58545l85713m18214k03677J87964L70780J98606k632K2050L4086k59677
37296B118o12148m92987J46660P37260P57074K81470j82808k32670Q8547L49568
37286H42084J49336m08635p43640m56970J49353M33882J98624j59886k29969k1080
37276b46901J95787K27276Q0442q5023j15048p1131j65681l60022k79975J97661
37266f22615N70011L51260j58089k89170l203J68071N9993Q414N9112j21575m13644
37255c91435k17419M23850N83670j43356q51571o59015p4496r4514n09607k68083
37245b201976O90231J177751N40930l35582l28982L46930N76434m223n45419k45073
$$ plain form
37316 -575490 -420452 -53718 39810 -193243 -256838 136414 661183 878679 749720 458545
37306 458545 72832 -345382 -549059 -361095 9685 208291 205659 227709 261795 2118
37296 2118 -610030 -1103017 -956357 -219097 537977 819447 636639 403969 492516 842084
37286 842084 991420 582785 -160855 -617825 -468472 -34590 164034 4148 -225821 -246901
37276 -246901 -51114 176162 256604 171581 56533 -14598 -180279 -540301 -820276 -622615
37266 -622615 -52604 298656 140567 -148603 -151806 16265 76258 84672 143784 22209 -391435
37255 -391435 -608854 -185004 398666 255310 -596261 -1255276 -1329772 -1424286 -1933893 -2201976
37245 -2201976 -1511745 -333994 206936 -128646 -457628 -110698 465736 461513 -83906 -328979
37235c28979N22054P37972J25770n60864o79706n09907n25145m38714K36493J000333
37225d20693P94362l16225r79763m61708L20312L02911j35981j7238N58708O96109
37215C40794K37251j29402j14099j14970k87030k98857r5901k3568q4321P8939
37205d91164L43600J48802m18654n11766J41635O87052M42314o8920n4254K59020
37195D77665R3117n59834r29629n99661O5004N57258P05488N31496J48789j62263
37185C27430j83783p0263q4088j08216J43386M95092M33217o0543l53800q0473
37175D57959K77408J01815m39457o60159l37056Q0408J93402J11377R9297J65587
37165E0581J76613R3668o9230k77667l39488l7725M25524M74328o4384n75278
$$ plain form
37235 -328979 193075 931047 1056817 495953 -183753 -693660 -1218805 -1657519 -1421026 -420693
37225 -420693 373669 57444 -922319 -1384027 -1063715 -760804 -896785 -914023 -355315 340794
37215 340794 578045 448643 334544 219574 -67456 -366313 -462214 -485782 -570103 -491164
37205 -491164 -147564 1238 -417416 -929182 -787547 -100495 341819 272899 218645 477665
37195 477665 570782 10948 -918681 -1518342 -1453338 -896080 -190592 340904 489693 327430
37185 327430 143647 73384 -10704 -118920 24466 519558 952775 892232 538432 457959
37175 457959 735367 837182 397725 -262434 -599490 -519082 -325680 -214303 -115006 50581
37165 50581 227194 320862 251632 -26035 -365523 -403248 22276 496604 432220 -143058
37155a43058m42458Q3226L00486Q6808r5215n5097k9450j7368K56952N99697L85401
37144I29924l69941p82234l96796O9070r5897m10868m9389O88375P84519J13806
37134D80569m03985k41714J13918J28331o5267j92495l17770m33335k24763L20490
37124h36021O18984K89724j87927j34922L20579M46872j9714n17253m25471J55312
37114b89837N43183K65985l99466p20974l40653L25524O37628M82842J97379o1105
37104F40506l86034o36016m59289Q1837M60998M51799L94410M64329L01306k39364
37094A074482n97966l50828J2533j28571m29201j43015N16405N89510j00211o45660
37084b02522m59639l1312N6962o929J27035K64206J62037R5971K91041L50706
$$ plain form
37155 -143058 -585516 -502290 -201804 -114996 -210211 -265308 -294758 -312126 -55174 544523 929924
37144 929924 559983 -222251 -619047 -549977 -645874 -1056742 -1106131 -417756 366763 480569
37134 480569 76584 -165130 -51212 77119 11852 -180643 -498413 -931748 -1156511 -836021
37124 -836021 -217037 72687 -115240 -250162 70417 517289 497575 -19678 -445149 -289837
37114 -289837 253346 519331 119865 -601109 -941762 -616238 21390 504232 701611 640506
37104 640506 254472 -381544 -840833 -758996 -297998 153801 548211 1012540 1313846 1074482
37094 1074482 476516 125688 138221 9650 -419551 -562566 -46161 543349 443138 -202522
37084 -202522 -662161 -693473 -636511 -643440 -516405 -252199 -90162 5809 296850 647556
37074F47556n5977m43068k14715K98554L47021l2589k17271j40606k40575m09945
37064d61615r3354N26750N75865m1806l37081J72304O35993K61552m27458n08740
37054C02410n3777K47564K27577J49467l493l02488l92405o6889J20255l15198
37044h6977p89455m55634L58653N90724R2870k66927p3261J66553P7367q7575
37034d73662j43561k29071k23233J87974P33432P50976K78429R895O0293j68096
37024G83376p04171p58426j06918M31621L69022K49699M23432L12680l52773p34987
37014h7445k57086K81386K5608m49664j82872M62731M74809l2913j34845K15939
37004C15648K38273j31646j48751K84665M00276l5965l36115j76980j10619l91871
$$ plain form
37074 647556 591579 148511 -66204 232350 579371 546782 329511 188905 -51670 -461615
37064 -461615 -554969 -28219 547646 505840 168759 341063 977056 1238608 811150 302410
37054 302410 248633 496197 723774 873241 869748 567260 174855 107966 228221 -86977
37044 -86977 -876432 -1332066 -973413 -382689 -289819 -556746 -630007 -463454 -386087 -473662
37034 -473662 -617223 -846294 -1069527 -881553 -148121 602855 881284 891179 951472 783376
37024 783376 79205 -679221 -786139 -354518 14504 264203 687635 1000315 647542 -87445
37014 -87445 -344531 -63145 -37537 -487201 -670073 -207342 267467 234554 99709 315648
37004 315648 553921 422275 273524 558189 958465 922500 586385 409405 298786 -93085
36994i3085m04013J65984N58466J08777n74699m79319K53245N59871N7613m71551
36984c18711l25619J19995Q8133l63039m02515K93631R29044O24718l15191p69362
36974d38916l12446L16535L80024Q2511j9501N3907p2879l79455n13553l79760
36964a283533j42755J79017O22544R09283O57561m7324o61392p60143l79867J21183
36954g85426L43122J42377j71639j35146K50026M91071L06549o3800l86445p18408
36944g27719r34509o27254J34033O02690L98367R5983K30405M33289K43313K9280
36934a22122K33956L82215j22588p80396p15704j73885p3304l81984k51432L77468
36924a627776O52147L35125J38735L38500L20751j41236l58016L3171L56664J9777
$$ plain form
36994 -93085 -497098 -331114 227352 336129 -238570 -717889 -464644 95227 152840 -318711
36984 -318711 -644330 -524335 -436202 -799241 -1201756 -908125 20919 645637 330446 -438916
36974 -438916 -751362 -434827 -54803 27708 8207 62114 -10765 -390220 -903773 -1283533
36964 -1283533 -1426288 -1247271 -624727 284556 942117 894793 233401 -526742 -906609 -785426
36954 -785426 -442304 -299927 -471566 -606712 -356686 134385 440934 377134 -9311 -727719
36944 -727719 -1662228 -2289482 -2155449 -1552759 -1154392 -1058409 -828004 -394715 -151402 -122122
36934 -122122 111834 494049 371461 -408935 -1124639 -1298524 -1371828 -1753812 -2005244 -1627776
36924 -1627776 -975629 -640504 -501769 -163269 157482 16246 -341770 -308599 48065 67842
36914F7842n44616o52575l25077Q0529M81546P67754N66926j09336n80042m11888
36904f58937o6276r0188k37260k6424L37804L38699Q5505J14762M24271M33568
36894F55524o7542n45477m83981q7818N5601k03034m11726j91954J92997J93744
36884h93666k13732m62562k12031K21157M73662O64759Q91810P23451j15757r29758
36874A47333p76932J28760O10898J54347n04008n70942j74687J75665L99335O33658
36864B23427P11316L78290j91088n04448l29260M8291J53708j27405l80220j89969
36854b07358K10597K17999j57448k08380K74477M84872j15298p39737m05098M76514
36844a68860P13048J41169l37751k90390j29696o2808J45314L41442Q0135l73782
$$ plain form
36914 67842 -476774 -1129349 -1454426 -1373897 -892351 -124597 442329 332993 -247049 -658937
36904 -658937 -725213 -815401 -1052661 -1079085 -741281 -402582 -317077 -202315 221956 655524
36894 655524 587982 42505 -441476 -529294 -473693 -676727 -1088453 -1280407 -1087410 -893666
36884 -893666 -1107398 -1569960 -1781991 -1560834 -1087172 -422413 469397 1192848 1077091 147333
36874 147333 -629599 -500839 110059 264406 -239602 -810544 -985231 -809566 -410231 223427
36864 223427 934743 1313033 1121945 617497 288237 336528 490236 362831 -17389 -207358
36854 -207358 3239 221238 63790 -144590 129887 614759 499461 -240276 -645374 -168860
36844 -168860 544188 685357 347606 57216 -72480 -135288 10026 351468 431603 57821
36834E7821k89712J83806J35031m67321n43383L09924J061112Q25391P1831l78042
36824I66458n24460o57096n59110k1911N31342O23520L85782J45294q6353l11656
36814D91810l36168k06706k41415l62862j09941M53532O48722K63072j20035j30441
36804C49568n8689n9914R8679K45045j37396p52099o11051K86706P13125J63471
36794B37445l56243j60971k835m41437o04443K10923J039288P52600n4951j57036
36784D62340K74282K44528k15016k90627P1498K52038J40300K3092k00856n82754
36774A78825n48956Q7235L31016m62878j129051l46985J018798J087666n7794
36765A57876n73653J70725Q57783N89462O0831m1286r5387m16032n22509j69937
$$ plain form
36834 57821 -231891 -48085 86946 -380375 -923758 -613834 447278 1272669 1344500 966458
36824 966458 441998 -215098 -774208 -796119 -264777 358743 744525 889819 803466 491810
36814 491810 155642 -51064 -292479 -655341 -765282 -311750 336972 600044 480009 349568
36804 349568 290879 230965 329644 574689 437293 -314806 -925857 -639151 73974 237445
36794 237445 -118798 -279769 -282604 -724041 -1328484 -1117561 -78273 674327 619376 462340
36784 462340 736622 981150 766134 475507 547005 799043 939343 962435 761579 178825
36774 178825 -370131 -282896 48120 -414758 -1543809 -1890794 -871996 215670 157876
36765 157876 -415777 -245052 612731 1202193 1263024 1221738 1126351 710319 187810 17873
36755A7873J01064L925P196L21635M43099J64114J2099K07874J83698l47806p68595
36744C46176n42938k6191K14814J69134M2423j56624l12260j49988J98943K48461
36734C1950J434n336K91859K91873j67852m28349j26760K05886J45822P9375L15572
36723F35474L64100j58427o50689m09326J91545L07991n074J2269M64052N94724
36713A346639M1494n32454m11979J21308K20994k84530o34458k24587M92794O01058
36703G36279o412n02408k97840K63551N78265N28643K21428l57640r28019q25296
36693e89449l300N18628M2287o03920k89767N45525N64786k47579n51227J23791
36683d90225O41713J59489n99065o32492j28646J33199J9702q0018j2788J54768
$$ plain form
36755 17873 118937 122862 130058 451693 894792 1058906 1071005 1278879 1462577 1114771 346176
36744 346176 -196762 -222953 -8139 160995 203418 46794 -265466 -415454 -216511 31950
36734 31950 33384 28048 319907 611780 443928 15579 -111181 94705 240527 319902 635474
36723 635474 999574 841147 190458 -218868 -27323 280668 275594 287863 751915 1346639
36713 1346639 1388133 855679 443700 565008 786002 501472 -132986 -357573 135221 736279
36703 736279 729867 227459 -70381 193170 771435 1300078 1521506 1163866 235847 -589449
36693 -589449 -592749 -74121 -31834 -635754 -925521 -379996 184790 -62789 -614016 -490225
36683 -490225 151488 310977 -288088 -920580 -1049226 -916027 -896325 -976343 -989131 -834363
36673h34363M33528O82018N36740p50l66580j98114J64241K51777N3138k47472
36663D74163n69256o97009l37958K87833N33752K95200J92533M49862M17136k52972
36653G93284p74982l51065N23643P60918K43246k22451k56910k91540o06187p94839
36643i76883m27056K81788P39028O53672K69077L1755J04233J99751m0907n31419
36633C03039p77869m64160J92242O96263O96479J85257m66202p15044l77024J12772
36623f14247K62749J77774K33827L29818Q4603l59970m75404k60225k19284l77976
36613a218335k02561L17026M60827J7060k24906K26088O48140K30374n95017p89493
36603a130797j93323M44611N98691L81263M7976k33663k51337M8410L16612K08090
$$ plain form
36673 -834363 -400835 281183 817923 817173 450593 252479 416720 668497 721635 474163
36663 474163 -95093 -792102 -1130060 -842227 -308475 -13275 179258 629120 1046256 793284
36653 793284 18302 -332763 190880 951798 1195044 972593 715683 424143 -182044 -976883
36643 -976883 -1403939 -1122151 -383123 270549 539626 571381 675614 875365 834458 303039
36633 303039 -474830 -938990 -746748 -50485 645994 831251 365049 -349995 -727019 -614247
36623 -614247 -351498 -173724 60103 389921 474524 114554 -360850 -621075 -840359 -1218335
36613 -1218335 -1420896 -1103870 -643043 -625983 -850889 -624801 23339 253713 -341304 -1130797
36603 -1130797 -1324120 -879509 -280818 100445 148421 -85242 -336579 -288169 28443 236533
36593B36533j06728k26064j14543j1297N2743K10505L79524L27509K8734l31708
36583D45208n82500n91893k93985J09941K62802J59910J80139L98029L52813j54249
36573B86215n54362l05404K49333M00463J05077j17790o0553M7698J24449K99723
36563D74849M49828K55924k20357m99768l12321R4873L25758K23195j07695l97614
36553B86672l65028j3860K80658K12072l3670n0942J92529L27978J15025k54752
36543F96682m07098j94263J55206K65894N1993j53946r6126n2291l72626o88944
36533g95519k72233P15421J135053M31361m87362n50394l8119K9705m70804p19663
36523a022554l21512K46897N53626O81327O47607K04427m81122o85774j19302
$$ plain form
36593 236533 129805 -96259 -210802 -222099 -169356 41149 420673 748182 776916 445208
36583 445208 -137292 -729185 -1023170 -913229 -650427 -490517 -310378 87651 440464 286215
36573 286215 -268147 -573551 -324218 76245 181322 63532 2979 50677 175126 474849
36563 474849 924677 1180601 960244 460476 148155 243028 568786 791981 684286 286672
36553 286672 -78356 -92216 188442 400514 366844 315902 508431 836409 951434 696682
36543 696682 289584 95321 250527 516421 568414 414468 318342 266051 -106575 -795519
36533 -795519 -1067752 -352331 782722 1214083 726721 176327 138208 167913 -302891 -1022554
36523 -1022554 -1344066 -1097169 -543543 137784 785391 989818 508696 -177078 -296380
36514b96380N06541L99816k31590n44384k20120K85599N09901M42311K00386k21926
36504H30154o80413p85464m16459l2528o5188k25472N2745N83228N38779k43929
36494d44547q04699l70755M92288P17655K57754p4706n474o1943m37734n59662
36484a291823o2077N85202P82839N28892J30883k39461m12726k10972J23593M4103
36474b1547m49739o47766j53676N05172O69980L90530Q2955q4055n7048K50854
36464D85660N42930K21914o06295r18395k04811N96978M16286l47651n32562l5187
36454c81133K17589j08753l33484k3864L55122L16727N7076m2497J2052O0253
36444A29088R8123R7174q1709l82621m98638k73430J21202M65824O49673N46297
$$ plain form
36514 -296380 210161 609977 378387 -165997 -386117 -100518 409383 851694 1052080 830154
36504 830154 149741 -635723 -1052182 -1084710 -1149898 -1375370 -1322625 -739397 -200618 -444547
36494 -444547 -1249246 -1620001 -1127713 -410058 -152304 -227010 -232484 -294427 -732161 -1291823
36484 -1291823 -1353900 -768698 14141 543033 673916 434455 21729 -189243 -65650 -21547
36474 -21547 -471286 -1119052 -1272728 -767556 -97576 292954 375909 291854 234806 485660
36464 485660 1028590 1250504 644209 -274186 -478997 117981 534267 186616 -345946 -381133
36454 -381133 -163544 -272297 -605781 -629645 -274523 42204 99280 56783 68835 129088
36444 129088 227211 324385 242676 -139945 -638583 -912013 -790811 -324987 324686 870983
36434H70983J04857l89120n11650k42226J1096n942j07051m9536J02548J46146
36424f9895M9196n8800q3623m6180r813K9450J52712L54875M25579J74792k43215
36413F75078m77409m42276l18636j13943L19210P56859O61160m478n61584n29424
36403c5443k24267r9232o3231Q3188J16736j09853j61445K90403P08042L95938
36393I00836l46667o00067j76452K07279P3953k33531k15038J19658L95992L29932
36383D55895j1775k14148N8568M82412L37679l76221p06394j33195M98724K17229
36373F08774n34053o01020R4577O23241O16299N31485M53098p0963q43969r25416
36363d7947j04152O11016M50727r3009k15513N3840K15922J38870j4319j72883
$$ plain form
36434 870983 975840 586720 75070 -167156 -156060 -162002 -269053 -318589 -216041 -69895
36424 -69895 -20699 -79499 -163122 -209302 -219115 -189665 -36953 317922 743501 918293 675078
36413 675078 197669 -244607 -563243 -677186 -357976 398883 1060043 1055565 493981 -35443
36403 -35443 -259710 -358942 -422173 -338985 -222249 -332102 -493547 -203144 504898 900836
36393 900836 554169 -45898 -222350 -15071 58882 -174649 -389687 -270029 125963 455895
36383 455895 444120 229972 288540 770952 1108631 732410 26016 -107179 391545 608774
36373 608774 74721 -526299 -431722 191519 807818 1339303 1792401 1721438 877469 -47947
36363 -47947 -152099 458917 909644 816635 601122 654962 870884 1009754 995435 822552
36353H22552k50332j22450J0849k09071n70988m23308K21722N21604J06936l09502
36343b01988j28838K09331J57775M6013K76216L33442l13076r34181m51443O98062
36333c08687R87280J04943n43243j9617P29722M14917o18517j007744m22002J55817
36323e27131P8764j29719J29820N10057L82887o8491j70137J15299J60127k46257
36313B35219n26321k45021K11389K68103r49j36955o4204p4383k16273k05738
36303g55133P2619L69701M25086K45284L362j36724r6511N9983J58300Q2578j47584
36292B80961m59576p06982o12946p1941M89428N08230J16256K3454M14005O18629
36282E99518J94212l73596n02562l53145k67105o3981L99020O26687K68828r7744
$$ plain form
36353 822552 572220 449770 460619 251548 -319440 -742748 -521026 578 107514 -201988
36343 -201988 -330826 -121495 36280 82293 358509 691951 378875 -555306 -1006749 -308687
36333 -308687 678593 783536 240293 220676 950398 1365315 746798 -260946 -682948 -527131
36323 -527131 -448367 -578086 -448266 61791 444678 376187 206050 321349 481476 235219
36313 235219 -291102 -536123 -324734 -56631 -57580 -194535 -258739 -333122 -549395 -755133
36303 -755133 -682514 -312813 112273 357557 360919 224195 127684 187667 345967 428545 280961
36292 280961 -178615 -885597 -1498543 -1570484 -1081056 -572826 -456570 -433116 -19111 599518
36282 599518 793730 420134 -82428 -435573 -702678 -766659 -367639 259048 527876 430132
36272D30132J25863M48606J03615n47782n83281q3065J20778l3062J12343N08291
36262F02438M02009k19523n19822k60226o9705j35446M4283M03363K05396m79813
36252b7046o17272L5079M36586P7406j86363J83479L78614j65959n66396k4218
36242d76090O77494M86040j85295l63345j96019l14663l65571K77633R78604O26430
36232A145218m37165q43958l32533N6874j54133l04583K431K87800K58953K86073
36222c5023M88790M09633n2894l41741k11309j06912k46340k10252J66396L55250
36212B15598N8469k12438j9440K40070O3550k56008j50140K20537K02767k98992
36202F3973o54239m00570J66284M18560J42713k77363l33203L7173L99134L57534
$$ plain form
36272 430132 555995 1004601 1108216 560434 -22847 -105912 14866 -18196 94147 602438
36262 602438 1004447 784924 265102 4876 -64829 -200275 -155992 247371 452767 -27046
36252 -27046 -644318 -609239 -172653 -95247 -281610 -98131 280483 114524 -451872 -476090
36242 -476090 201404 687444 502149 138804 -57215 -371878 -737449 -459816 518788 1145218
36232 1145218 708053 -135905 -468438 -411564 -565697 -870280 -867849 -580049 -321096 -35023
36222 -35023 453767 863400 810506 468765 257456 150544 -95796 -306048 -139652 215598
36212 215598 274067 61629 42189 282259 345809 89801 -60339 160198 362965 63973
36202 63973 -590266 -990836 -824552 -405992 -263279 -540642 -873845 -836672 -437538 -80004
36192h0004J8808k14563j76409l1316P2805J60094K50932K93766K85546K49219
36182H28878J22746j12100k65901j76519k9695j17584l27159k56778J33096M07045
36172B06029L32275K68496N92953J009980Q32354p6431r72537j014191k30637
36163I48291N12313N16705k2095m31141m35388k80736j57371l539R9073j18242
36153F27870n60035o69065j97426L44134L87058R6682K7629K69374M18170K46828
36143I91219m4466j97025j75292j00675j17227k51747k91615N011M71738O14209
36133I04130K83295j05752k25531k54583l61037k84919J33044M75787L20273j05182
36123G79525l43311l99347m80059m49560j42443J57383J68487J59720M05265N30118
$$ plain form
36192 -80004 -61196 -275759 -452168 -483484 -410679 -250585 347 294113 579659 828878
36182 828878 951624 839524 573623 397104 367409 249825 -77334 -334112 -201016 206029
36172 206029 538304 806800 1399753 2409733 3242087 3165656 2193119 1178928 948291
36163 948291 1460604 1977309 1955214 1524073 1088685 807949 650578 647039 746112 627870
36153 627870 67835 -601230 -798656 -454522 -67464 29218 56847 326221 744391 991219
36143 991219 946753 749728 574436 473761 356534 104787 -186828 -181817 289921 904130
36133 904130 1187425 1081673 856142 601559 240522 -44397 88647 564434 884707 779525
36123 779525 436214 36867 -443192 -892752 -1035195 -877812 -709325 -549605 -144340 385778
36113C85778J47799k92462j72796J84645P8448k49914j8343N72780N15013k76299
36103H74649p15438k88749K03652Q0610k00032m0761K81521K73011O0496q1860
36093D47099k96793o07033n36504P2686N38065L11837j53583k07311l0128q4977
36083e46642j41738K30700O56664M39701j98783l58616J24562M31672N0463m82740
36073B05243m20856J75794O01869L95804j84723m93734k38225J48892O5440l54523
36063i9019l45497L11045P99673L97773m46517p80383m62335q0061J27795M13097
36053a64429P01814N18050j58352o99010o99559m37254k56974q2001K01097L89915
36043f86703L26634K11394K41683K62639P6501j58426j32242J67408M23131L15992
$$ plain form
36113 385778 533577 241115 68319 252964 331412 81498 63155 635935 1150948 874649
36103 874649 159211 -129538 74114 154724 -45308 -86069 195452 468463 528959 447099
36093 447099 150306 -456727 -993231 -920545 -382480 -70643 -224226 -431537 -461665 -546642
36083 -546642 -688380 -457680 198984 638685 439902 81286 205848 637520 687983 205243
36073 205243 -215613 -39819 562050 957854 773131 279397 41172 190064 255504 -99019
36063 -99019 -444516 -133471 666202 1063975 617458 -162925 -625260 -705321 -577526 -164429
36053 -164429 537385 1055435 897083 198073 -501486 -938740 -1195714 -1277715 -1076618 -686703
36043 -686703 -360069 -148675 93008 355647 432148 273722 141480 308888 732019 1048011
36033A048011j86539p35743q13811k79152L32906L86185L184j01265K81254M85773
36023D20803L091o52406o30404K9268M80948K79266j18654j60682M6670R9234
36013b02866L642O4629K49909J87234j54676k72602J22099N51477L92216k04626
36003G36436n44073m07752k09694j19756J99773P12771O80569j83528r12901m98038
$$ plain form
36033 1048011 861472 125729 -688082 -967234 -634328 -248143 -244959 -346224 -64970 420803
36023 420803 423894 -228512 -858916 -829648 -348700 -69434 -188088 -348770 -302100 -202866
36013 -202866 -199224 -134595 115314 302548 147872 -124730 -2631 548846 941062 736436
36003 736436 192363 -215389 -425083 -544839 -345066 367705 1048274 864746 -48155 -546193
$$ [...]
##END NTUPLES=NMR SPECTRUM
##END=
