##TITLE=31Pdec_90-2025
CDCl3, 64 sc
 7.8.2025
##JCAMPDX= 6.0         $$ Bruker NMR JCAMP-DX V2.0
##DATA TYPE= NMR SPECTRUM
##DATA CLASS= NTUPLES
##ORIGIN= UXNMR, Bruker Analytische Messtechnik GmbH
##OWNER= root
$$ XWIN-NMR		Version 3.5
$$ Thu Aug  7 15:35:31 2025 Russian Standard Time (UT+4h)  she@DPX200
##.OBSERVE FREQUENCY= 81.013821
##.OBSERVE NUCLEUS= ^31P
##.ACQUISITION MODE= SIMULTANEOUS
##.ACQUISITION SCHEME= undefined
##.AVERAGES= 64
##.DIGITISER RES= 17
##SPECTROMETER/DATA SYSTEM= spect
##.PULSE SEQUENCE= zgpg30
##.SOLVENT NAME= CDCl3
##.SHIFT REFERENCE= (INTERNAL, CDCl3, 0, 198.062)
##AUDIT TRAIL= $$ (NUMBER, WHEN, WHO, WHERE, WHAT)
$$ ##TITLE= Audit trail, XWIN-NMR		Version 3.5
$$ ##JCAMPDX= 5.01
$$ ##ORIGIN= Bruker BioSpin GmbH
$$ ##OWNER= she
$$ F:/spectra/data/she/nmr/P31/2/pdata/1/auditp.txt
$$ ##AUDIT TRAIL=  $$ (NUMBER, WHEN, WHO, WHERE, WHAT)
(   1,<2025-08-07 15:03:38.65 +0400>,<she>,<DPX200>,
      <continue with go, POWCHK disabled, PULCHK disabled
       configuration hash MD5:
       00 E9 B6 7A A2 85 ED C7 34 08 36 98 17 FE 4E 26
       data hash MD5: 32K
       80 C6 31 4D 6E E3 7D C7 BC EB 81 0F EA 03 F0 AB>)
(   2,<2025-08-07 15:34:13.92 +0400>,<she>,<DPX200>,
      <Start of raw data processing
       efp BC_mod = 2 LB = 1.5 FT_mod = 6 PKNL = 1 PHC0 = 1786.834 PHC1 = -44.50122 SI = 64K 
       data hash MD5: 64K
       61 E7 9B 8A 9A F5 57 90 4A A2 46 48 1B F3 20 44>)
(   3,<2025-08-07 15:34:51.10 +0400>,<she>,<DPX200>,
      <pk PHC0 = 342.3752 PHC1 = -1090.999 
       data hash MD5: 64K
       AE CD 86 63 B5 01 E0 6D 77 76 2C 09 EE 91 90 E3>)
(   4,<2025-08-07 15:34:57.29 +0400>,<she>,<DPX200>,
      <abs ABSG = 5 
       data hash MD5: 64K
       DB 10 03 89 22 D6 2F A9 AC AE 66 DF DD E7 CF 79>)
$$ ##END=
$$ 
$$ hash MD5
$$ 30 90 5D 7B FA 33 FE B3 88 94 EC 8E 52 A8 06 AF
##$RELAX= 
##$RELAX= 
##$RELAX= 
##$RELAX= 
##$RELAX= 
##$RELAX= 
##$RELAX= 
##$RELAX= 
$$ Bruker specific parameters
$$ --------------------------
##$DU= <F:/spectra>
##$EXPNO= 2
##$NAME= <P31>
##$PROCNO= 1
##$TYPE= <nmr>
##$USER= <she>
##$AMP= (0..31)
100 100 100 100 100 100 100 100 100 100 100 100 100 100 100 100 100 100 
100 100 100 100 100 100 100 100 100 100 100 100 100 100 
##$AQSEQ= 0
##$AQ_mod= 1
##$AUNM= <au_zg>
##$AUTOPOS= <>
##$BF1= 81.014009
##$BF2= 200.13
##$BF3= 200.13
##$BF4= 200.13
##$BF5= 200.13
##$BF6= 200.13
##$BF7= 200.13
##$BF8= 200.13
##$BYTORDA= 1
##$CFDGTYP= 0
##$CFRGTYP= 5
##$CHEMSTR= <none>
##$CNST= (0..31)
1 1 145 1 1 1 1 1 1 1 1 1 1 1 1 1 1 1 1 1 1 1 1 1 1 1 1 1 1 1 1 1 
##$CPDPRG= <waltz16>
##$CPDPRG1= <>
##$CPDPRG2= <waltz16>
##$CPDPRG3= <>
##$CPDPRG4= <mlev>
##$CPDPRG5= <mlev>
##$CPDPRG6= <mlev>
##$CPDPRG7= <mlev>
##$CPDPRG8= <mlev>
##$CPDPRGB= <>
##$CPDPRGT= <>
##$D= (0..31)
0 1 0 0 0 0 0 0 0 0.06 0 0.03 2e-05 3e-06 0 0 0.0002 0 0 0 0 0 0 0 0 0 
0 0 0 0 0 0 
##$DATE= 1754564518
##$DBL= (0..7)
120 120 120 11 120 120 24 19 
##$DBP= (0..7)
150 150 150 150 150 150 150 150 
##$DBP07= 0
##$DBPNAM0= <>
##$DBPNAM1= <>
$$ [...]
##$SUBNAM3= <"">
##$SUBNAM4= <"">
##$SUBNAM5= <"">
##$SUBNAM6= <"">
##$SUBNAM7= <"">
##$SUBNAM8= <"">
##$SUBNAM9= <"">
##$SW= 400.765351723535
##$SWIBOX= (0..15)
0 1 3 0 0 0 0 0 0 0 0 0 0 0 0 0 
##$SW_h= 32467.5324675325
##$TD= 32768
##$TD0= 1
##$TE= 0
##$TE2= 300
##$TE3= 300
##$TEG= 300
##$TL= (0..7)
0 120 53 12 22 120 120 120 
##$TP= (0..7)
150 150 150 150 150 150 150 150 
##$TP07= 0
##$TPNAME0= <>
##$TPNAME1= <>
##$TPNAME2= <>
##$TPNAME3= <>
##$TPNAME4= <>
##$TPNAME5= <>
##$TPNAME6= <>
##$TPNAME7= <>
##$TPOAL= (0..7)
0.5 0.5 0.5 0.5 0.5 0.5 0.5 0.5 
##$TPOFFS= (0..7)
0 0 0 0 0 0 0 0 
##$TUNHIN= 0
##$TUNHOUT= 0
##$TUNXOUT= 0
##$USERA1= <user>
##$USERA2= <user>
##$USERA3= <user>
##$USERA4= <user>
##$USERA5= <user>
##$V9= 5
##$VALIST= <valist>
##$VCLIST= <CCCCCCCCCCCCCCC>
##$VD= 0
##$VDLIST= <DDDDDDDDDDDDDDD>
##$VPLIST= <PPPPPPPPPPPPPPP>
##$VTLIST= <TTTTTTTTTTTTTTT>
##$WBST= 1024
##$WBSW= 4
##$XGAIN= (0..3)
0 0 0 0 
##$XL= 0
##$YL= 0
##$YMAX_a= 10562
##$YMIN_a= -17080
##$ZGOPTNS= <>
##$ZL1= 120
##$ZL2= 120
##$ZL3= 120
##$ZL4= 120
##$ABSF1= 198.0616
##$ABSF2= -202.7028
##$ABSG= 5
##$ABSL= 3
##$ALPHA= 0
##$AQORDER= 0
##$ASSFAC= 0
##$ASSFACI= 0
##$ASSFACX= 0
##$ASSWID= 0
##$AUNMP= <proc_1d>
##$AZFE= 0.1
##$AZFW= 0.5
##$BCFW= 0
##$BC_mod= 2
##$BYTORDP= 0
##$COROFFS= 0
##$CY= -3
##$DATMOD= 1
##$DC= 0
##$DFILT= <>
##$DTYPP= 0
##$F1P= 0
##$F2P= 0
##$FCOR= 1
##$FTSIZE= 65536
##$FT_mod= 6
##$GAMMA= 0
##$GB= 0
##$INTBC= 1
##$INTSCL= 9.790993e-09
##$ISEN= 30
##$LB= 1.5
##$LEV0= 0
##$LPBIN= 0
##$MAXI= 10000
##$MC2= 0
##$MEAN= 0
##$ME_mod= 0
##$MI= 50
##$NCOEF= 0
##$NC_proc= -8
##$NLEV= 6
##$NOISF1= 182.463
##$NOISF2= 159.3651
##$NSP= 0
##$NTH_PI= 0
##$NZP= 0
##$OFFSET= 198.0616
##$PC= 4
##$PHC0= 2129.209
##$PHC1= -1135.5
##$PH_mod= 1
##$PKNL= yes
##$PPARMOD= 0
##$PSCAL= 0
##$PSIGN= 0
##$REVERSE= no
##$SF= 81.0140089999434
##$SI= 65536
##$SIGF1= 159.3651
##$SIGF2= -187.1042
##$SINO= 113.3802
##$SIOLD= 16384
##$SREGLST= <1H.CDCl3>
##$SSB= 0
##$STSI= 65536
##$STSR= 0
##$SW_p= 32467.5324675325
##$SYMM= 0
##$S_DEV= 0
##$TDeff= 32768
##$TDoff= 0
##$TI= <>
##$TILT= no
##$TM1= 0
##$TM2= 0
##$TOPLEV= 0
##$USERP1= <user>
##$USERP2= <user>
##$USERP3= <user>
##$USERP4= <user>
##$USERP5= <user>
##$WDW= 1
##$XDIM= 65536
##$YMAX_p= 359739199
##$YMIN_p= -69508703
$$ End of Bruker specific parameters
$$ ---------------------------------
##NTUPLES= NMR SPECTRUM
##VAR_NAME=  FREQUENCY,     SPECTRUM/REAL,   SPECTRUM/IMAG
##SYMBOL=    X,             R,               I
##VAR_TYPE=  INDEPENDENT,   DEPENDENT,       DEPENDENT
##VAR_FORM=  AFFN,          ASDF,            ASDF
##VAR_DIM=   65536,         65536,           65536
##UNITS=     HZ,            ARBITRARY UNITS, ARBITRARY UNITS
##FACTOR=    0.49542278885378, 1,            1
##FIRST=     16045.7642231865, 0,            0
##LAST=      -16421.768244346, 0,            0
##MIN=       -16421.768244346, -69508703,    0
##MAX=       16045.7642231865, 359739199,    0
$$ Real data points
##PAGE= N=1
##DATA TABLE= (X++(R..R)), XYDATA
$$ [...]
##PAGE= N=2
##DATA TABLE= (X++(I..I)), XYDATA
7427h671195k552178K333408M147331L437372L185509L573169K030842j998513
7419E485745n487996n487478k099449K411081N355539M596183L99857l453793
7411A719689l080927N83071K917856J916872J31986k10238j20972m29221M00508
7402C828624K467774K330493j730832n556908m478000l93117J247540j79509m11481
7393b875416J958896L249284J171412j378618j083916J082980K330441K194207
7385F649270J649590M77319j754022l678407l632903k172122j063859p28980n39851
7376d793965o24586j241668j129321J127348M275985N286574L395131J104479
7368G399977M00759Q0335j656817l684458l424814j178486j72151j613747k324134
$$ y = [-8671195, -11223373, -8889965, -4742634, -1305262, 1880247, 5453416, 7484258, 5485745, -2251, -5489729, -7589178, -5178097, 177442, 4773625, 5173482, 1719689, -1361238, -778167, 2139689, 4056561, 4188547, 3978309, 3857337, 3428116, 3828624, 6296398, 8626891, 6896059, 1339151, -3138849, -3531966, -2284426, -2463935, -2875416, -916520, 2332764, 3504176, 2125558, 1041642, 2124622, 4455063, 6649270, 8298860, 8776179, 7022157, 3343750, -289153, -2461275, -3525134, -4254114, -4793965, -5418551, -6660219, -7789540, -6662192, -2386207, 2900367, 6295498, 7399977, 7800736, 7881071, 6224254, 2539796, -885018, -2063504, -2235655, -3849402, -6173536]
7359f173536P05281N186625N858535J385405m057354o348007n468734l057584
7351a1969369N67750M554176N759358K549915j476289j576036J344107K224131
7343A977743l50790k644623k538201k494884l774806k960817J919566O081086
7335d785726L995995j921892m352832j555091J156971N53294j30546J991722L976203
7326a071902K365645k83050N80043L440447K582151k513611n595102k980976Q44502
7317b631853K91116k811749k593587J204885K652374j122932n339356m381403
7309a4732505O35094M205567L839723J708364K74169k10684n2756R47806K256203
7300a129019K537276J633082R32558J106800J033151k07056j578079j393303L29242
$$ y = [-6173536, -5468255, -281630, 5576905, 6962310, 2904956, -3443051, -8911785, -11969369, -11401619, -6847443, -1088085, 1461830, -14459, -1590495, -246388, 1977743, 1626953, -1017670, -3555871, -6050755, -9825561, -12786378, -10866812, -4785726, -789731, -2711623, -7064455, -8619546, -7462575, -6909281, -7039827, -5048105, -1071902, 1293743, 1010693, 1590736, 5031183, 7613334, 5099723, -495379, -3476355, -2631853, -2340737, -5152486, -7746073, -6541188, -3888814, -5011746, -10351102, -14732505, -14097411, -9891844, -6052121, -4343757, -4069588, -4280272, -4333028, -3385222, -1129019, 1408257, 3041339, 3973897, 5080697, 6113848, 5906792, 4328713, 2935410, 3264652]
7291C264652J648167O80488k357584m970759m715102k098822j65289l25506j53565
7282i193320K739578O116563N567812J092131k440334k087408m96182j070938
7274B27902k700213k048119R75882L059695K001685r50999l020492k659664p14415
7265e828738L21376j045208k935512j899998K202927N242740M067459M36460k194914
7256a633408l360132m197182l543692N16883N888385P386643L253324k342715
7248A968106m511582l010735j140605j179622k528384l400062k871902j264134
7240a7938920Q26772L346698O151795P767545O116735J209428m038153o623637
7232c181737o123181l884715j145581R79306J487361J037800J733555L708564
$$ y = [3264652, 4912819, 5593307, 3235723, -1735036, -6450138, -8548960, -8714249, -9039755, -9193320, -6453742, -337179, 5230633, 6322764, 3882430, 1795022, 1298840, 227902, -2472311, -4520430, -3544548, -484853, 1516832, 565833, -2454659, -5114323, -5828738, -5507362, -6552570, -9488082, -11388080, -9185153, -3942413, 125046, 561506, -1633408, -4993540, -9190722, -12734414, -12217531, -6329146, 1057497, 4310821, 1968106, -2543476, -5554211, -6694816, -7874438, -10402822, -13802884, -16674786, -17938920, -17112148, -13765450, -7613655, 153890, 6270625, 7480053, 3441900, -3181737, -9304918, -13189633, -14335214, -13355908, -11868547, -10830747, -9097192, -5388628]
7224e388628M083308J394939j475984j671692r88056k309912l919204k384179
7216a2659408N98197K45978k873635k875831J973154O037391M806473J032399
7208c715282o40972k03299K15405J008558K987830M003148K089100n38389q03775
7199D402324R4667r29349l189529l424991j527132o16931j691710k211092l80104
7190i473847K418975M022025L805614K300433N14987l88115m20291j096770k699530
7181a016519k683402N68538L964267L288976l79947k001023j05953J509685M05009
7172C549631p81725P39944L169041L213353J119392n19137j040553j712160k691357
7163E046429k944771k556611k438158k076078k24423K086020J963690j073421
$$ y = [-5388628, -1305320, 89619, -1386365, -3058057, -4046113, -6356025, -10275229, -12659408, -12061211, -11815233, -14688868, -17564699, -15591545, -9554154, -4747681, -3715282, -4356254, -4559553, -4344148, -3335590, -347760, 3655388, 5744488, 5206099, 4402324, 4496991, 3567642, 378113, -3046878, -4574010, -5190941, -6882651, -9093743, -9473847, -7054872, -3032847, 772767, 3073200, 3588187, 3200072, 2779781, 1683011, -1016519, -3699921, -3131383, 832884, 4121860, 3741913, 1740890, 1634937, 3144622, 3549631, 2767906, 3507850, 6676891, 9890244, 11009636, 10490499, 9449946, 7737786, 5046429, 2101658, -454953, -2893111, -4969189, -5193612, -3107592, -1143902, -2217323]
7155b217323l627265k687406M77122K514931K586285K360993K299489R61128j642186
7146A025768k944324j444030R36263J843253J665035J569390O49598j856339l361672
7137a917058j067129K566064K140082k562414n485386k735063K238697M113281
7129b708926K512557N77154p3194J22581O72469P59669p86789k832036j947468
7120c703983K229414M722019J763706l265442m557709k077466m18764j271349
7112f579574j952215n85513J768504L703078M299041K197937k238867m978875
7104d366484k867980J018355J386462j019715q14844K837406M726635K075174
7096B975009j567001k604602k049761j726120q58435J004984K035804J592299
$$ y = [-2217323, -5844588, -8531994, -8054872, -5539941, -2953656, -592663, 1706826, 2667954, 1025768, -1918556, -3362586, -2426323, -583070, 1081965, 2651355, 3300953, 1444614, -1917058, -2984187, -418123, 1721959, -840455, -6325841, -9060904, -6822207, -2708926, -196369, 380785, 307591, 430172, 1102641, 1862310, 1075521, -1756515, -3703983, -1474569, 3247450, 5011156, 1745714, -2811995, -4889461, -5308225, -6579574, -8531789, -9117302, -7348798, -3645720, 653321, 2851258, 612391, -4366484, -7234464, -6216109, -4829647, -5849362, -6664206, -3826800, 899835, 2975009, 1408008, -1196594, -3246355, -4972475, -5830910, -4825926, -2790122, -1197823]
7088a197823J776586L406457M270114L271872K255013J869305N8708l240692m569390
7079G900150k583850n31121m47293Q6186K270966K586654r08079l897014k344973
7070B131626Q86799J293099K38941J216289K514675N26792k538691j657539J945137
7061F557128K137538k144021n259803l781184p61444J55861n40270j016195j090409
7052e742799q60548j8484M12826q87391k182763j09976M746548P400765M698705
7043G456883j100273n722182o823943m112641J054446N298607N490903K356413
7035C898213n46201j524447j721496j797461j181520n87810j433102k454332q92743
7026h240899K396330L221803M75957j920850j046244J017067J225267J53435K17167
$$ y = [-1197823, 578763, 3985220, 8255334, 11527206, 13782219, 15651524, 15710232, 12469540, 7900150, 5316300, 4785179, 4337886, 4424072, 6695038, 9281692, 8373613, 4476599, 2131626, 3018425, 4311524, 4550465, 5766754, 8281429, 8808221, 6269530, 4611991, 6557128, 8694666, 6550645, 1290842, -2490342, -3251786, -3095925, -3636195, -4652390, -5742799, -6603347, -6621831, -6209005, -7096396, -9279159, -9389135, -4642587, 2758178, 7456883, 6356610, 634428, -6189515, -10302156, -9247710, -3949103, 1541800, 3898213, 3352012, 1827565, 106069, -1691392, -2872912, -3460722, -4893824, -7348156, -8240899, -5844569, -2622766, -2146809, -4067659, -5113903, -4096836, -2871569, -2718134, -2500967]
7017b500967J964937M073044M876106K805445k142522o568104o375739k286651
7009f154451O59339J16266q52894M57145K072650J252764r14270j808275j348984
7000f520710r20484n41630L43653J250862J863915K771603L417228J939977j264482
6991B339932k844738j377844J65759q49211k699692k656055j277264m26415J34116
6982i491412J124990J452334N58833L31766J637263J955498k19110j920421n96451
6973e166710Q92469j015903l773745k242852K872794N896853M503336J705963
6965C672205R6456n82381l33063J328210K263587n01297n248224o660337l272562
6956i237406Q08036K449981K883038L311076K265314m68327j876006m15470J179669
$$ y = [-2500967, -536030, 3537014, 8413120, 11218565, 9076043, 2507939, -3867800, -6154451, -5495112, -5378846, -6231740, -5774595, -3701945, -2449181, -3363451, -5171726, -6520710, -7441194, -7982824, -7639171, -6388309, -4524394, -1752791, 1664437, 3604414, 2339932, -504806, -1882650, -1716891, -2566102, -5265794, -7921849, -9199113, -9625528, -9491412, -8366422, -6914088, -6355255, -6023489, -4386226, -2430728, -2649838, -4570259, -5166710, -4274241, -5290144, -9063889, -11306741, -8433947, -2537094, 1966242, 3672205, 3768661, 3186280, 2853217, 4181427, 6445014, 5943717, 695493, -5964844, -9237406, -8429370, -5979389, -3096351, 214725, 2480039, 2011712, 135706, -279764, 899905]
6947H99905N61690l62983P42103K236660J420397o95765j162907J29471Q62761
6938D631332K62881m60988q40837j462123k017184j582093o15352m36899p87032
6929c308295j0009K076159L339929K045282q24395k739342k533223j480955j486232
6920d921081k565957k723295p04110J809729J990027k52214j680822L18954M348420
6911d380349O520072M774284Q06069k061168k201722p69503J25833k38283j050722
6902A524511j669256k283718k738804k176749o24765M64340L49912L23451J579054
6893e252024L134397L393410K383446Q02327j490755m013606m581372k304358
6885g928535J71801M83186O16314L256869N942743L983091j631419m867262l356334
$$ y = [899905, 1461595, 1098612, 1840715, 4077375, 5497772, 4802007, 3639100, 3768571, 4631332, 4894213, 4433225, 3592388, 2130265, 113081, -1469012, -2084364, -2521263, -3308295, -3318304, -1242145, 2097784, 4143066, 3318671, 579329, -1953894, -3434849, -4921081, -7487038, -10210333, -10914443, -9104714, -7114687, -7366901, -9047723, -8728769, -4380349, 2139723, 6914007, 7720076, 5658908, 3457186, 2687683, 2813516, 2575233, 1524511, -144745, -2428463, -5167267, -7344016, -7968781, -7504441, -7154529, -6831078, -5252024, -2117627, 1275783, 3659229, 4461556, 2970801, -1042805, -5624177, -7928535, -7756734, -7273548, -6657234, -3400365, 2542378, 6525469, 4894050, 26788, -3329546]
6876c329546p40879M60751K090027M485659L812549j114131m891068l018631J184132
6867a061137K139401N85835R56453L130812K987060k78501l218149m050149m302240
6858c110615m530519l239814o43448P81286L54116J30571J038877J602292J294223
6849f323031J596435K576072J874190j228546l746158k989816k65656J433235
6841g073275J495683J404886J847424K208877K210700K297244K552514K334044
6833I278097J066913r41303k364459j775665O21347K451060J388981k129509n367264
6824B228198o240580m775892k068281O80734K234912K080398J273236J141257
6816c446018J217399J20592j583206j565895O69613K501407J629208q68988k259660
$$ y = [-3329546, -4070425, -3609674, -1519647, 2966012, 6778561, 5664430, 773362, -2245269, -1061137, 1078264, 1664099, 2620552, 5751364, 8738424, 8459923, 5241774, 1191625, -3110615, -7641134, -10880948, -11524396, -10743110, -10388994, -10258423, -9219546, -7617254, -6323031, -4726596, -2150524, -276334, -1504880, -5251038, -8240854, -8506510, -7073275, -5577592, -4172706, -2325282, -116405, 2094295, 4391539, 6944053, 9278097, 10345010, 9403707, 7039248, 5263583, 5884930, 8335990, 9724971, 7595462, 2228198, -4012382, -8788274, -10856555, -10175821, -7940909, -5860511, -4587275, -3446018, -2228619, -2108027, -3691233, -5257128, -4587515, -2086108, -456900, -1325888, -3585548]
6807c585548j640220k52171P75337J454460K073517K589184K873034K668415J344077
6798H300085j347633l978360l900554j17061M513007N414417J467518l190768
6790G160651m053544j881616j019916k577092k800812O97866M662634M664269
6782D852440J189763j839348k697565k633009k378938j482287m94812n11134q23892
6773f818782l0163J004707M48275p55620j5068K234751K798993R04725p19953
6764i48135n00495N7640j74622m30254q02695k383453l622007j200090L783926
6755f220185N470980J649165k437835k118476k62103j611355m403825l472176
6747a3405810J055315M201592L856756K425714J490026J73865j230875r89509
$$ y = [-3585548, -5225768, -5477939, -4702602, -3248142, -1174625, 1414559, 4287593, 6956008, 8300085, 6952452, 2974092, -926462, -1043523, 3469484, 8883901, 10351419, 7160651, 3107107, 1225491, 205575, -2371517, -5172329, -4474463, 188171, 4852440, 6042203, 4202855, 1505290, -1127719, -3506657, -4988944, -5483756, -5994890, -6818782, -6848945, -5844238, -5395963, -6151583, -6166651, -3931900, -1132907, -228182, -948135, -1448630, -1390990, -1565612, -1995866, -2798561, -5182014, -8804021, -10004111, -6220185, -749205, 899960, -1537875, -3656351, -3918454, -5529809, -9933634, -13405810, -12350495, -8148903, -4292147, -1866433, -376407, -202542, -1433417, -2422926]
6739b422926K57071j81701k304289l117101j712557n54945q26609o13665R41611
6730a0535111J687203N57356L369J902971L962363K886469q79479l931704l939243
6721h285806j100833K857462N395861M362014L37561l226256l662272j910337
6713e232606n68692l62016R5651J968347M849644P043914O454545K216772l728262
6704A2737297p651788p396811m019040j5921K690655K943177O48942k247896k945823
6695e257208r83385J282585K060106J990752J828631P51305j466379k922215k214891
6686d930699o11360M08887J609986L515761L678839o0173m849619n276519n78548
6677g093445L950194L527154p11398l841455k801310J045889L797416K864385
$$ y = [-2422926, -2165855, -2347556, -4651845, -7768946, -9481503, -10036448, -10863057, -11476722, -10535111, -8847908, -8290552, -8287183, -6384212, -2421849, 464620, -414859, -4346563, -8285806, -9386639, -6529177, -1133316, 3228698, 3566259, 340003, -3322269, -5232606, -5801298, -6163314, -6067663, -4099316, 750328, 7794242, 14248787, 16465559, 12737297, 5085509, -2311302, -6330342, -6346263, -3655608, -712431, -63489, -2311385, -5257208, -6240593, -4958008, -2897902, -907150, 921481, 1672786, 206407, -2715808, -4930699, -5542059, -5133172, -3523186, -7425, 3671414, 3611241, -1238378, -6514897, -7093445, -3143251, 383903, -327495, -4168950, -6970260, -5924371, -2126955, 737430]
6669G37430m12051k207161q60937J176426J419668J416808L741525O322023M236117
6660A5569848k448232p194829n367530k64587K140417J317219J047834K222077
6652G022217J733752j373622l364444j411688J632526J093431k738717n018064
6644b424609l084694M39583K026444J773045J622852J298669q90864l967626m409414
6635g616614j107696K558006L104930J301157K88848J022797J847494J666430
6627C065352J196619J248667J581428J519373M83051j747303m122370m448793
6619a223976k002347P85940J185986l8980m4138J459935J900931K65994j297199
6610I92146j154091m82422m37873K04327K351879L691577J340871l529465o356557
$$ y = [737430, 325379, -1881782, -2742719, -1566293, -146625, 1270183, 5011708, 11333731, 15569848, 13121616, 5926787, 559257, 294670, 2435087, 3752306, 4800140, 7022217, 8755969, 7382347, 4017903, 2606215, 4238741, 5332172, 2593455, -2424609, -5509303, -5069720, -3043276, -1270231, 352621, 1651290, 760426, -3207200, -7616614, -8724310, -6166304, -3061374, -1760217, -1471369, -448572, 1398922, 3065352, 4261971, 5510638, 7092066, 8611439, 9094490, 7347187, 3224817, -1223976, -3226323, -2440383, -1254397, -1293377, -1337515, 122420, 2023351, 2289345, 992146, -161945, -644367, -1082240, -877913, 1473966, 5165543, 6506414, 2976949, -3379608]
6601c379608m506571r6809K781855K327571J9350j786168k341567k322131j734441
6592a1038519M92466L960077N430006K313661l057354n361749k717847J414250
6584h565009L220157K548568J037708n60831j399688Q2561L249357M271824J021927
6575D906574l088050l402079m99711J201374J66172r12405k31312O49750K57559
6566i52128k43992N31585J618366J203225o82980k224817j841470L58005K526293
6557B92087K592862N76368j163608r01964K81508O37453N09471P86599J98940
6548C809716k626224n379294m179070N35741L971607L364421P97364j102805k405565
6539c214109l385878k635453N5254K086204J791846J093213J973976K953114J809912
$$ y = [-3379608, -7886179, -7982988, -5201133, -2873562, -2854212, -4640380, -6981947, -9304078, -11038519, -10546053, -6585976, -1155970, 1157691, -1899663, -7261412, -9979259, -8565009, -5344852, -2796284, -1758576, -2319407, -3719095, -3636534, -387177, 3884647, 4906574, 1818524, -1583555, -2083266, -881892, -715720, -1628125, -1859437, -1209687, -952128, -1196120, -664535, 953831, 2157056, 1474076, -750741, -2592211, -2234206, 292087, 2884949, 3461317, 2297709, 1395745, 1677253, 2314706, 2824177, 3610776, 3809716, 1183492, -4195802, -8374872, -7839131, -3867524, -503103, 294261, -808544, -3214109, -6599987, -9235440, -9180186, -7093982, -5302136, -4208923, -2234947, 718167, 2528079]
6530B528079n48341j881798k184718k420587j708999P68282K688178J266243j901754
6521c395415k514023K31777K726608K333726K61758j365714k052006j749823j63256
6512e686368J621697J444150o39556j606373N68284M062086N652055M322640J188447
6503A0927062k422169n214582n694717l526542m00289J806195L033671M064323
6495B572952M440781K907408m07384l566127m627464l207959n69000J225002Q18311
6486d13480r28995j558869j37031R93536q51378m418072n329845j767276K726669
6477a1684741L659805J314907j89268J084384K545469J348078j507532k998854
6469f427752k212533n36007J044226K354972K449323M72538j802098j231654K043270
$$ y = [2528079, 1979738, 97940, -2086778, -4507365, -6216364, -5448082, -2759904, -1493661, -3395415, -5909438, -5677661, -2951053, -617327, -355569, -1721283, -3773289, -5523112, -5686368, -4064671, -2620521, -3260077, -4866450, -4298166, -236080, 5415975, 9738615, 10927062, 8504893, 3290311, -2404406, -5930948, -6331237, -4525042, -1491371, 2572952, 7013733, 9921141, 9513757, 5947630, 1320166, -1887793, -2456793, -1231791, -413480, -1342475, -2901344, -3038375, -2044839, -2896217, -7314289, -12644134, -14411410, -11684741, -8024936, -6710029, -6899297, -5814913, -3269444, -1921366, -3428898, -6427752, -8640285, -9176292, -8132066, -5777094, -3327771, -2855233, -4657331, -5888985, -3845715]
6460c845715L888654J538224k675387m707534l814024k029877m60815J205974
6452a0900500K515936K303551P50985o36787r60675k99551J230648L083304L692253
6443G79164K217280J71899p41372j525250m023276o874646o602410k872347O39665
6434a8831293J473940J393774K752520M610223M515830K212534n22379k406166
6426d801017l138951k393436k04553K074750K706380J408604n27831j667503j388431
6417g931988J07570K052221L532857L965611L154054J308281n00673o57154J114179
6408F144958K825871K593734J225206O27922L73656j591454m982265o804090n469574
6399e056036k624161j71659J763294K934654K003873q54951k881719k120353J61959
$$ y = [-3845715, 42939, 1581163, -1094224, -5801758, -9615782, -11645659, -12106474, -10900500, -8384564, -6081013, -5330028, -5966815, -6927490, -7227041, -5996393, -2913089, 779164, 2996444, 3168343, 2426971, 901721, -3121555, -9996201, -16598611, -19470958, -18831293, -17357353, -15963579, -13211059, -8600836, -4085006, -1872472, -2394851, -4801017, -7939968, -10333404, -10537957, -8463207, -5756827, -4348223, -4876054, -6543557, -7931988, -7824418, -5772197, -2239340, 1726271, 4880325, 6188606, 5687933, 5030779, 6144958, 8970829, 11564563, 12789769, 13417691, 13791347, 12199893, 7217628, 413538, -5056036, -7680197, -7851856, -6088562, -3153908, -1150035, -2004986, -4886705, -7007058, -6845099]
6390f845099J915516K777987K517313p9926m290159o094702k953530J957288L553866
6381g541446J459790m39724J06327J715709K671712K841760K259314O47435j340091
6372B380786k573702l104836l478253k994117r08606J317511J558483K95321l24326
6363g831739j54419p88496k009537j857554l23392M52288R0149N68038K132050
6354i722612K303206M02061n25566J512612L838390K963597l07957k514723k529177
6345d580169j956827j605482m92320J716039L506153L234675R71128j473409j953419
6336b633631l2006K050072J596662q68231j776130O85020L773181L765716P40563
6327G301216k145920k859393j782264J63584K151248K648510O17472k208914k570824
$$ y = [-6845099, -4929583, -2151596, 365717, 285791, -4004368, -10099070, -13052600, -11095312, -7541446, -6081656, -6521380, -6415053, -4699344, -2027632, 814128, 3073442, 3720877, 2380786, -192916, -3297752, -6776005, -9770122, -10678728, -9361217, -7802734, -7507413, -7831739, -7986158, -8774654, -10784191, -12641745, -12965137, -12512849, -12422700, -11854662, -9722612, -7419406, -7017345, -7542911, -6030299, -2191909, 771688, 463731, -2050992, -4580169, -6536996, -8142478, -8634798, -6918759, -3412606, -177931, 793197, -680212, -2633631, -2665637, -615565, 981097, 112866, -1663264, -978244, 2794937, 6560653, 7301216, 5155296, 2295903, 513639, 677223, 2828471, 5476981, 6094453, 3885539, 1314715]
6318A314715L9220K236374R67587k517762m205252k086511J728422L455010J517653
6309B449456j947504l236413r74230K092467J857885k244945n945505m751715
6301a2700504N36453M435942L356282n0833p20370J744282K618113q70532n033333
6292f684500m505274M93137M765272N142269L522316K748467K794327K313494
6284A0589508J255032Q4628j627255l929966n302292m560145k732034j355641
6276g578165j52803J781574L655855L916278K631765R26532j074211l456018m522100
6267c871293k485758R90651K027918l8393j337959J099629N098913O406803M035995
6258A1926506L25131k804208m903215n040513j979016K931872N562403L417926
$$ y = [1314715, 1353935, 3590309, 4557896, 2040134, -2165118, -4251629, -2523207, 931803, 2449456, 501952, -2734461, -3708691, -1616224, 241661, -2003284, -7948789, -12700504, -12164051, -7728109, -4371827, -4422660, -5143030, -3398748, -780635, -1651167, -6684500, -11189774, -10696637, -5931365, -789096, 2733220, 5481687, 8276014, 10589508, 11844540, 11929168, 10301913, 6371947, 1069655, -3490490, -6222524, -7578165, -7730968, -5949394, -2293539, 1622739, 4254504, 5181036, 4106825, 650807, -3871293, -6357051, -5366400, -3338482, -3376875, -4714834, -3615205, 1483708, 7890511, 11926506, 12251637, 9447429, 4544214, -496299, -2475315, 456557, 6018960, 9436886]
6250I436886j098044l537814k741872j514218k217126l692045l284979m50514
6242i099726K838833M391568L353179K04733l364052m908468l088855O71650L423314
6233e577824L671134K180629J14349k011412l356456k689197k81600J583243J222946
6224e144188l25409q83289Q7313J382532J929970J619328Q33365Q1022m00796
6215h20152j171160k739556l840936k406751P02127J319972k387909o028047m152304
6206b1524716J841715N069480K443208j642564k127033K81571J979389K388690
6198a1290260L328758M454340L470970N69119j008121M24650K605821K692136
6190E247413Q22360j076995k282092l291591l915196l193824r68483J788252M031787
$$ y = [9436886, 8338842, 4801028, 2059156, 544938, -1672188, -5364233, -8649212, -9099726, -6260893, -1869325, 1483854, 1688587, -1675465, -6583933, -9672788, -9001138, -5577824, -1906690, 273939, 388288, -1623124, -4979580, -7668777, -7950377, -6367134, -5144188, -5469597, -6352886, -6265573, -4883041, -2953071, -1333743, -500378, -419356, -820152, -1991312, -4730868, -8571804, -10978555, -10276428, -8956456, -11344365, -17372412, -21524716, -19683001, -14613521, -12170313, -13812877, -15939910, -15658339, -13678950, -11290260, -7961502, -3507162, -36192, 532927, -475194, -50544, 2555277, 5247413, 6069773, 4992778, 2710686, -580905, -4496101, -7689925, -8658408, -6870156, -2838369]
6181b838369M977814L800558N07590k869760l594273j344245J250089J866617
6173A756021R99705L17981j2073p67676j546013j275999l27940N7923K08183J407996
6163H18108K719988J436489k146498l510745J37137N129273N743432J794922j820867
6154A0301239k438543k313268l449443l956252j754855J302306K128118J234957
6146A054259J499068L064194L014694L41087k034510j510694L86239L93758j843022
6137D365073l673362l249440j354016M50256J558795J815334R95517k91917m99655
6128A16585Q93150K222056J693749p9624j012916n77099k12624o63205p49104
6119A630968L33560J004575p69808m061336n248040k307070K227099L827340J402655
$$ y = [-2838369, 2139445, 5940003, 6447593, 3577833, -16440, -1360685, -110596, 1756021, 2755726, 3073707, 3061634, 2293958, 747945, -528054, -855994, -798071, -589888, 818108, 3538096, 4974585, 2828087, -682658, -545521, 4583752, 10327184, 12122106, 10301239, 7862696, 5549428, 2099985, -1856267, -3611122, -2308816, -180698, 1054259, 2553327, 5617521, 8632215, 8973302, 6938792, 5428098, 5814337, 6208095, 4365073, 691711, -2557729, -3911745, -3461489, -1902694, -87360, 908157, 616240, 116585, 1009735, 3231791, 4925540, 4845916, 3833000, 3255901, 3043277, 2380072, 1630968, 1964528, 2969103, 2199295, -1862041, -7110081, -9417151, -7190052, -3362712, -1960057]
6110a960057j189601l810L640037M643696R58198l546595m275125j628644Q03932
6101b557969J892996L338121N113637M535249O86769l607057n684816o068586
6093b351656n925695m343216n43191L336630M389370K595208J54341j528776k085018
6084f302003q67380K035038M410027M019640J531200o18246j426429j445729r24139
6075D11979j82795o05507k506869l175154k44527L863085M484902J297464j488509
6066A854069j540465q79374j234477j199879K58836J249485K63046j031630q27832
6057c088221l99291j553308l009721k271401L08782K118042K099838J566833J689005
6048b539442K189738K330464J732998M57496q21925j287003j185420j475529j802615
$$ y = [-1960057, -3149658, -3153468, 486569, 5130265, 6088463, 2541868, -1733257, -3361901, -2557969, -664973, 2673148, 7786785, 12322034, 13008803, 9401746, 3716930, -2351656, -8277351, -12620567, -13163758, -9827128, -5437758, -2842550, -2688209, -4216985, -6302003, -7169383, -5134345, -724318, 3295322, 4826522, 4208276, 2781847, 1336118, 411979, 229184, -376323, -2883192, -6058346, -6302873, -2439788, 2045114, 3342578, 1854069, 313604, -565770, -1800247, -3000126, -2741290, -1491805, -1228759, -2260389, -3088221, -3487512, -5040820, -8050541, -10321942, -10013160, -7895118, -5795280, -4228447, -2539442, -349704, 1980760, 3713758, 4171254, 3349329, 2062326, 876906, -598623, -2401238]
6039b401238o47141J639875K303604L77581r87527J017442L997172L253487j431430
6030G121825n321030m931541j663546J128129J898003Q99335j186209l256951
6022e311985l965144l065989j678997o48305K94546J371500K117669K464647L020735
6013e401323L423691J963123j623377m154828k139341L035893N357236J040303
6005A501377o232001q978698m544793K097967M757555L012167J078483J449636
5997e858307K534694K282280J169311O01389M79368k12495j624647k964729l372725
5988f965861k309845j15934J473808Q07052j180969j604870M62205K519732K220185
5979d694497O46582M09059J846988K947033K273337M54192q28367l91371J324171
$$ y = [-2401238, -3048379, -1408504, 895100, 1272681, 285154, 1302596, 5299768, 8553255, 7121825, 1800795, -3130746, -4794292, -3666163, -1768160, -868825, -2055034, -5311985, -9277129, -12343118, -14022115, -14670420, -14375874, -13004374, -10886705, -8422058, -5401323, -1977632, -14509, -1637886, -5792714, -7932055, -4896162, 461074, 1501377, -4730624, -13709322, -18254115, -16156148, -11398593, -8386426, -7307943, -5858307, -3323613, -1041333, 127978, 729367, 1208735, 996240, -628407, -3593136, -6965861, -9275706, -9391640, -7917832, -7110780, -8291749, -9896619, -9434414, -6914682, -4694497, -4047915, -3638856, -1791868, 1155165, 3428502, 3882694, 3054327, 2662956, 3987127]
5970C987127K146467J85707l589260o070815n657837l517741j007319J680139
5962a1843532L602875K858110j48477k120833j459915m69979q79506p09560J338789
5953i832028K149085p25607l451816r79797M392028N767591K088279p51622L31071
5944a012816J350421j149194m107948l108893O90497K713729J485732m40631o22177
5935d201280Q00017J938867R82759j952888m228908l374164n19462R18508j4083
5926i650634j107926j154239j311408j551019L39720M447806P026015N450328
5918B488643J906129j87598n71103n39606J61587J900656K943767J644085q95658
5909H850902k740087l764120m218990l084025l71886J449893J143648J154558
$$ y = [3987127, 6133594, 6319301, 2730041, -3340774, -8998611, -12516352, -13523671, -11843532, -8240657, -5382547, -5531024, -7651857, -9111772, -9581751, -10461257, -11170817, -9832028, -7682943, -8408550, -11860366, -12840163, -8448135, -2680544, -592265, -1343887, -1012816, 337605, -811589, -4919537, -8028430, -7337933, -4624204, -3138472, -3579103, -4201280, -3401263, -1462396, -479637, -2432525, -6661433, -10035597, -10555059, -9636551, -9650634, -10758560, -11912799, -13224207, -14775226, -14435506, -9987700, -2961685, 2488643, 4394772, 4207174, 3636071, 3096465, 3258052, 5158708, 8102475, 9746560, 8850902, 6110815, 2346695, -1872295, -4956320, -5328206, -3878313, -2734665, -1580107]
5901a580107L222064M430770J668634k497877l126806l08582J594935Q11599p49277
5892C465353k228351m162289m576086p49276M546255M747340p87390m606981j527312
5883e878737M092702N123109J242973k602705l752846l012139q78951K287201
5875c379393L825069J570991j469766j86625M617296O122345Q45167o195570q097946
5866b348432m492013l35252J147407O92108m21598k038384l260057k347478M06904
5857a2996795K309851K122269J950096L460828M352509J361467m321397p639026
5849i400198n611576k53268M456131O010927L703309j359296n486644m681119
5841a2621734L52175L887017K135326j620655j603491K516788N676840M636785
$$ y = [-1580107, 1641957, 6072727, 7741361, 5243484, 2116678, 1808096, 3403031, 4214630, 3465353, 1237002, -2925287, -7501373, -8250649, -3704394, 1042946, 255556, -4351425, -5878737, -1786035, 3337074, 4580047, 1977342, -1775504, -4787643, -5666594, -3379393, 445676, 2016667, 546901, 360276, 4977572, 11099917, 11945084, 5749514, -2348432, -6840445, -7175697, -6028290, -5336182, -5757780, -7796164, -11056221, -13403699, -12996795, -10686944, -8564675, -6614579, -3153751, 1198758, 2560225, -1761172, -9400198, -15011774, -15265042, -10808911, -4797984, -1094675, -2453971, -7940615, -12621734, -12269559, -8382542, -6247216, -7867871, -9471362, -6954574, -1277734, 3359051]
5833C359051J566315L0978M29864O83839m76549k271462l045456j953698J37023
5824a540095J472999J492120J341781J717139J579762L02794o16287p5327P5743
5815E750629k069523m316124k834982J630812M020353J862430j883926l761934
5807a602265l707952k608268q566L341575M254194J553664j095675k31841J936494
5798A831360R78849k602267m057824j630384J224980J398519J17757o3771O45129
5789b157652K71718j451391k581926j538312Q94130K222297Q87646j637449k121610
5780g212549L77564K885088K411094K90278J30346K007922K036900j512150m942840
5771c528347m060924N2677K925401K792722J688412J087867q7160k414731l944302
$$ y = [3359051, 4925366, 4956344, 5386208, 6070047, 5593498, 3322036, 276580, -1677118, -1540095, -67096, 1425024, 2766805, 4483944, 6063706, 6366500, 5750213, 5674886, 5750629, 3681106, -635018, -3470000, -1839188, 2181165, 4043595, 2159669, -1602265, -5310217, -7918485, -7927051, -4585476, -331282, 1222382, 126707, -105134, 1831360, 2810209, 207942, -3849882, -5480266, -4255286, -2856767, -2739010, -2802781, -2157652, -1885934, -3337325, -5919251, -7457563, -6563433, -4341136, -3453490, -5090939, -7212549, -6834985, -3949897, -1538803, -1248525, -1118179, 889743, 2926643, 1414493, -3528347, -7589271, -7536594, -4611193, -1818471, -130059, 957808, 870648, -1544083, -5488385]
5762e488385k999643r71048k04947m80141N8322J254664R26256j427821l488408
5753a2821151l445604k113154n18159K200720O326791Q900131O606462P95472
5745E931508l261498k464770J002777L095321K305270j15969k387048l382424
5737G23167k808859j353172j05420N49613P79944K47683j405850l048969k812220
5728i234083p11910J190445J624247J283251Q55978J29803l35095Q22761L066666
5719a307937L808395K267969P57817N44688l67899k942488l988646r61319K891460
5710G02040K650674q16363k331374l58969J528158J039657J4268N8005P437o94214
5700A799319j87799K260625M357046M367390L491170K854802J362853j434090
$$ y = [-5488385, -8488028, -9459076, -9664023, -10144164, -10085842, -8831178, -7904922, -9332743, -12821151, -16266755, -18379909, -18898068, -16697348, -10370557, -1470426, 5136036, 5931508, 2670010, 205240, 1208017, 4303338, 6608608, 6492639, 4105591, 723167, -2085692, -3438864, -3544284, -2994671, -2214727, -1967044, -3372894, -6421863, -9234083, -9945993, -8755548, -7131301, -5848050, -4992072, -4862269, -5197364, -4374603, -1307937, 2500458, 4768427, 5526244, 6070932, 5703033, 2760545, -1228101, -2189420, 702040, 3352714, 2536351, 204977, -153992, 1374166, 2413823, 2428091, 2486096, 2493533, 1799319, 1611520, 3872145, 8229191, 12596581, 16087751, 18942553, 20305406, 18871316]
5692A8871316l565824m011301m582993n890113m923515n3238M810019N184466
5684E838817K458116P92309J3924k853445o475271o076096j632257J150762l11324
5675g094465j568561J034095L943860K153489k578369m418075k091929L80428
5667a0239527O70819Q03412K366266L514858K457727P11287P18988K251224L143111
5658F398165K291947K82359j922406l396251l215669j545872k07251p11113k105838
5649d131929k202736o75292O76944P99775O99507J235313J377001J14700j165850
5640c272567k95418K063148K668507J93942k504083k079869O78019J973398K96107
5631b78816j706146j242968P47422J261967m58409k206528k025327k92301J603875
$$ y = [18871316, 15305492, 11294191, 6711198, 821085, -4102430, -4155668, 654351, 5838817, 8296933, 9089242, 9103166, 6249721, -225550, -6301646, -7933903, -6783141, -7094465, -8663026, -7628931, -3685071, -1531582, -4109951, -8528026, -10619955, -10239527, -9568708, -8765296, -6399030, -2884172, -426445, 284842, 1003830, 3255054, 6398165, 8690112, 8972471, 7050065, 3653814, 438145, -1107727, -1314978, -2026091, -4131929, -6334665, -7009957, -6333013, -5533238, -4833731, -3598418, -2221417, -2106717, -3272567, -3567985, -1504837, 1163670, 1357612, -1146471, -3226340, -2548321, -574923, -278816, -1984962, -3227930, -2480508, -1218541, -1676950, -3883478, -5908805, -6201106, -4597231]
5622d597231K924267L234070K004334j77862j163297L88694K786844L051496O30460
5613I081775k162137l302757k958635k062114q57122L94839Q69803L34238m54668
5604a116778j307782k964106m836919m388431o81951L116993L335637Q03195m98443
5595h538585R03960K722207L124910K900764K870092K325942J161156O73989R50832
5586I095267K67016j416416j439370R54634K113686q88872n182625n793787k577977
5577d868444L70305R25372N04854K51157m8954O26795L730251P056584N858574
5568A4406494k99865n569571m896920j35286L072660J978259j787475n036273
5560A732023n151158j486050L214104M629224J951090q61905o15555R78399R57725
$$ y = [-4597231, -1672964, 1561106, 3565440, 3387578, 2224281, 2612975, 5399819, 8451315, 9081775, 6919638, 3616881, 658246, -1403868, -2260990, -1866151, -996348, -662110, -1116778, -2424560, -5388666, -10225585, -14614016, -15295967, -12178974, -8843337, -8040142, -8538585, -7634625, -4912418, -1787508, 1113256, 3983348, 6309290, 7470446, 8144435, 9095267, 9362283, 7945867, 6506497, 7461131, 9574817, 8685945, 3503320, -2290467, -4868444, -4498139, -3572767, -3067913, -2816756, -2865710, -2238915, 1491336, 8547920, 14406494, 14106629, 8537058, 3640138, 3504852, 6577512, 8555771, 6768296, 1732023, -3419135, -4905185, -1691081, 2938143, 4889233, 4027328, 3411773, 4390172, 5347897]
5551E347897p9731j00111R5177j165470k181313k67270K792162K619539p84409
5542F276471k958931k185400j559663k625609k260241J409424M571849L012263
5534C680163j413428l644835k578593j266600j202846n48337J863224M118173
5526i93079L814861J078321j846828k946674k109621j109201j610276k717669
5518h440166j661767K037272M631422K383896l225608o876693n634843j546330
5510a8332817J932664L671131M311105M021272K303858o40541l286385l559431
5502i579144n42662L968007O142354L639266j529216m725797l361690R35441M466521
5493e86920M657403J550081k321400l593153j214990J871349J720261j716139
$$ y = [5347897, 5268166, 5168055, 5263232, 4097762, 1916449, 1649179, 4441341, 7060880, 6276471, 3317540, 1132140, -427523, -3053132, -5313373, -3903949, 667900, 3680163, 2266735, -1378100, -3956693, -5223293, -6426139, -6974476, -5111252, -993079, 2821782, 3900103, 2053275, -893399, -3003020, -4112221, -5722497, -8440166, -10101933, -8064661, -3433239, -1049343, -4274951, -11151644, -16786487, -18332817, -16400153, -12729022, -8417917, -4396645, -2092787, -2733328, -6019713, -9579144, -10121806, -6153799, -11445, 3627821, 2098605, -2627192, -5988882, -5053441, -586920, 4070483, 5620564, 3299164, -293989, -1508979, 362370, 2082631, 366492]
5485C66492m344797l084003M76707K497218J480942p86960j866358r53987R59966
5476e254780K340154K700179L022151L866395L470392k69114n511708o870330
5468b506661k078573L813299L927996j638951n834197l766041J418032L377395
5460c287701Q32248j710711n50570K684434L732824J022351l067766n393584m980087
5451a0718562k815997j89194J919746K667144J888276P19402N55348J220866J267000
5442c485971L79969J17694J370581K433500J202679j531029k944228k075813p13270
5433e245888r9235Q64458K928733M208388K747296l0588j072628l29296p84121
5424C187119l544750n723026m490980r68305J752939K711955L045285L142391
$$ y = [366492, -3978305, -7062308, -6585601, -4088383, -2607441, -3394401, -5260759, -6214746, -5254780, -2914626, -214447, 2807704, 6674099, 10144491, 9875377, 4363669, -2506661, -4585234, -771935, 3156061, 1517110, -4317087, -8083128, -6665096, -3287701, -2455453, -4166164, -4716734, -2032300, 1700524, 2722875, -344891, -5738475, -10718562, -13534559, -13723753, -11804007, -9136863, -7248587, -6529185, -5973837, -4752971, -3485971, -3106002, -2988308, -1617727, 815773, 2018452, 487423, -2456805, -4532618, -5245888, -5345123, -4480665, -1551932, 2656456, 5403752, 5373164, 4300536, 3971240, 3187119, -357631, -6080657, -10571637, -11539942, -9787003, -7075048, -4029763, -887372]
5416h87372K431855J531740J987822L505791L607840Q41383l225735n922103o101375
5407b230154m329277j794945K67028J164864J357837J626110J599180M60584r30415
5398b809188o23932J279152K288819J221974k6629L26569J321064J538374J731954
5389F248157K868126L492980J777626j202254k917121k979067k726390k449094
5381B112963j801056j729010k882517l293439j155010J222974M29569j868056
5373h963582p89040L583044N404283J798772l093250n119198n669388o636253
5365a9484612n113068J403198Q274701Q683520L558769J37071J033515J238633
5357b68273k695886o596054n172599k09285K223806M61075j374777j42008K309076
$$ y = [-887372, 1544483, 3076223, 5064045, 8569836, 12177676, 13019059, 9793324, 3871221, -2230154, -6559431, -8354376, -8087348, -6922484, -5564647, -3938537, -2339357, -1878773, -2809188, -3433120, -2153968, 134851, 1356825, 1330196, 1656765, 2977829, 4516203, 6248157, 9116283, 12609263, 14386889, 13184635, 10267514, 7288447, 4562057, 2112963, 311907, -1417103, -4299620, -7593059, -8748069, -7525095, -7095526, -8963582, -9752622, -6169578, -765295, 1033477, -2059773, -7178971, -12848359, -19484612, -24597680, -23194482, -14919781, -6236261, -2677492, -2540421, -1506906, -268273, -2964159, -9560213, -14732812, -14942097, -12718291, -12257216, -13631993, -13774001, -11464925]
5348a1464925K945718K113584J994877K503600J772265J58747L97885K836529
5340C258280L699356L94782m009492m915645k939524k276947l291904k001141
5332a2082235K412065N185405L473807J054171J726836K627361n53048n072203
5324a227841m451454J105065M405128J893663j726022j535448M69273j80984k890627
5315d139247l317084k31504L012399L375196J343623r73585k536056l315137l025123
5306i806518j095934K241846N359572O146307L924136L83091j884136j813350
5298C455014m55957N97268O33575j91952j306155j922759j540037n46952J28042
5289a149913J00038j44609q117N35555J018671R82259M87117J56071L48632M21793
$$ y = [-11464925, -8519207, -6405623, -4410746, -1907146, -134881, 23866, 421751, 3258280, 6957636, 7352418, 3342926, -1572719, -4512243, -6789190, -10081094, -12082235, -9670170, -4484765, -1010958, 43213, 1770049, 4397410, 3844362, -1227841, -5679295, -4574230, -169102, 1724561, -1461, -1536909, -1067636, -1248620, -4139247, -7456331, -7687835, -4675436, -1300240, 43383, -930202, -3466258, -6781395, -9806518, -10902452, -8660606, -3301034, 2845273, 6769409, 7152500, 5268364, 3455014, 2999057, 3596325, 4229900, 4037948, 2731793, 809034, -731003, -1277955, -1149913, -1049875, -1194484, -1202601, -667046, 351625, 1333884, 1821001, 1977072, 2325704, 2747497]
5279B747497m12021j633947k069226j920654k280236k325427L66150N389141Q182143
5270F043420N609992O76688j443390m58211m17676k973342n142286m134531r77088
5261c216424J630298K363549J203275j292214l492004l350643o70115K524061
5253d300217M290835M182310K463945k30855k380723k652288j781199j683558
5245b091750k656315l214758k515777r72777J183084L677882M964616L846386
5237B220591J907223J342616Q80639k354510o959878p722594l011618K620786
5229a1076745M881993M637504M291583L485605J373506m50314p29818j282532
5221E130782l493755m772576k274265K005824L712502K088379j62648j477050
$$ y = [2747497, 2335476, 701529, -1367697, -3288351, -5568587, -7894014, -7527864, -2138723, 6043420, 11653412, 12330100, 10886710, 10428499, 10010823, 7037481, 1895195, -2239336, -3216424, -1586126, 777423, 1980698, 688484, -2803520, -6154163, -6824278, -4300217, -9382, 4172928, 6636873, 6406018, 4025295, 1373007, -408192, -2091750, -4748065, -7962823, -10478600, -11451377, -10268293, -6590411, -1625795, 2220591, 4127814, 5470430, 6351069, 3996559, -2963319, -10685913, -13697531, -11076745, -6194752, -1557248, 2734335, 6219940, 7593446, 7143132, 6413314, 5130782, 1637027, -3135549, -5409814, -3403990, 308512, 2396891, 2234243, 757193]
5213G57193k225837k194280j063125m53583j737146k701313m94672K737310J924239
5204e451214k838338n224301j462897M184740N571839K823315O47301P38851K60782
5195g49922k461103m839791m001273r52331J397005K485232L649135M400290K532496
5186A459738j574030m068535k740781j61999O53776R12604K905911M727458L012894
5177E127036l98797l53090K915724L100473k396912p796512p155528k314806J133092
5168h139320J570119Q12412m91757k196571k201289N82972K956409J587352j566238
5159g085911k387592j013941l51282k85458J197312K770918J614026n75879J75867
5150e941940K307245K43423n476732p050451r58281O122590O821178K730263q2852
$$ y = [757193, -1468644, -3662924, -4726049, -5179632, -6916778, -9618091, -10112763, -7375453, -5451214, -8289552, -13513853, -14976750, -10792010, -5220171, -2396856, -1749555, -1010704, -749922, -3211025, -8050816, -12052089, -13004420, -11607415, -9122183, -5473048, -1072758, 1459738, -114292, -4182827, -6923608, -7085607, -6431831, -5519227, -2613316, 2114142, 5127036, 4728239, 4375149, 7290873, 10391346, 7994434, 197922, -6957606, -9272412, -8139320, -6569201, -5756789, -6248546, -8445117, -10646406, -10063434, -7107025, -5519673, -7085911, -9473503, -10487444, -10838726, -11124184, -9926872, -7155954, -5541928, -6117807, -5941940, -3634695, -3391272, -8868004, -15918455, -16876736, -10754146, -3932968, -1202705, -1285557]
5141a285557l04283n12581o80446J178358L550746K585979j387717l516009j288969
5132a660479K393457M104268M096651L859520K608857j070596n734486p894634
5124G02558o004244j904161J554013K940547K394429Q10288o35439j115292q54139
5115b111440o36559m93421K04615J216663J425540R52697J525626L429435L901292
5106I414448P65288l648322m933518k285021J001230K268984J807828O11548r56000
5097D046465j926984j151134O58006J991845L330932N480732N888620J428570
5089A9747052n238738p763461n195777k643557j734795J788318Q139869R864361
5081A6963272L539059k958392k059360J865431J116273j718904M63673M712530
$$ y = [-1285557, -1589840, -2102421, -2782867, -1604509, 1946237, 4532216, 3144499, -371510, -1660479, 732978, 4837246, 8933897, 12793417, 15402274, 14331678, 8597192, 702558, -5301686, -7205847, -5651834, -2711287, -316858, 493430, -142009, -1257301, -2111440, -2747999, -3241420, -3036805, -1820142, -394602, 558095, 2083721, 5513156, 9414448, 10179736, 6531414, 1597896, -687125, 314105, 2583089, 4390917, 5002465, 4046465, 2119481, 968347, 1626353, 3618198, 6949130, 12429862, 18318482, 19747052, 14508314, 6744853, 1549076, -1094481, -2829276, -1040958, 7098911, 16963272, 20502331, 17543939, 15484579, 17350010, 18466283, 16747379, 17211052, 21923582]
5073B1923582J745792p558986j1997392p201303j315754r39382k144273J77131
5065g310585L330511K827291J94708r80630j367866k964191m173819k631006L11931
5056a2763656J861623J892231J821086J960359K260031L111054L775630K722535
5048F640893N30216n63695m48986r51755j845507j245403K01610L54395L73885
5039C045653K720323M819323J805141m146540n312493o48411K086923r74188l900971
5030e05240j789138J174828n7764k812976k568537p65179l79722K94845K964965
5021d443918L990124M15579l594048k998624l9879L66096r58314l13063J576498
5012e999549J810167J360425K443448L155778R16104j984515k163857j022601
$$ y = [21923582, 23669374, 16110388, 4112996, -3088307, -4404061, -5343443, -7487716, -7310585, -3980074, -1152783, -958075, -1938705, -3306571, -6270762, -10444581, -13075587, -12763656, -10902033, -9009802, -7188716, -5228357, -2968326, 142728, 3918358, 6640893, 7171109, 6607414, 6158428, 5206673, 3361166, 2115763, 2317373, 2671768, 3045653, 5765976, 10585299, 12390440, 8243900, 2931407, 2282996, 4369919, 3395731, -505240, -2294378, -1119550, -1177314, -3990290, -6558827, -7324006, -7703728, -7408883, -4443918, -453794, -38215, -3632263, -6630887, -6670766, -6304670, -7262984, -7576047, -5999549, -4189382, -2828957, -385509, 2770269, 3686373, 1701858, -461999, -1484600]
5004a484600j114269o32062K356000M418605K243823n51357O94552L041534R90950
4995I963176l503205m373343j716621k73412k87672J456546L661560K363096r19435
4986F370690j474668k29276j510656l579124r40080M656631N445107K57282l664858
4977E331048k583822p56955j259570j244417R73890K110555L01406j486793j165668
4968B19674n38616n00585P07125K575625J780545j510045k717377j90671K197297
4959B022972J602239j18433r19210j363936j349698P33315M040686N262364L611156
4950A3521455J293813j093070m466558o785519m637008M55260L182220K160718
4942C631311P89831O54883K50978o694J965332M771968N026724L470677L097545
$$ y = [-1484600, -2598869, -3230931, -874931, 3543674, 5787497, 5236140, 5930692, 8972226, 9963176, 6459971, 2086628, 370007, 96595, -191077, 1265469, 4927029, 7290125, 6370690, 4896022, 4666746, 3156090, -423034, -1363114, 3293517, 8738624, 8995906, 5331048, 2747226, 1990271, 730701, -513716, 460174, 2570729, 2872135, 1385342, 219674, -318942, -819527, -112402, 2463223, 4243768, 2733723, 16346, -174325, 2022972, 3625211, 3506778, 2587568, 1223632, -126066, 607249, 4647935, 9910299, 13521455, 14815268, 13722198, 9255640, 2470121, -2166887, -1711627, 1470593, 3631311, 4421142, 5076025, 5327003, 5320309, 7285641, 12057609, 17084333, 20555010, 23652555]
4933B3652555K440111j786807o691361o302461j767971L52268q22582m53582J715182
4924A0335352J154230j602160j474285P20580o68186m387947l318076K106678
4916B866186L900361J131421J413876N891449O537562J450746j210803J464688
4908B3445486K002877k557612m721585r58909J817915K1811k47780L346702L745931
4899B5894836j248575l447143L11006J879233k311083m359157o67146J562915
4891A7614886K61794L122521R378104P026056l679835o267188K965962O923486
4883C7345786j8825j78485J2291527J6474687M469403P02640J6038163K2583375
4875A09708271R281309J7179724O5405331Q4104649o87999j35762471j83305501
$$ y = [23652555, 26092666, 24305859, 17614498, 11312037, 9544066, 9896334, 9073752, 8620170, 10335352, 11489582, 9887422, 8413137, 9133717, 8465531, 4077584, 759508, 2866186, 6766547, 7897968, 9311844, 15203293, 21740855, 23191601, 21980798, 23445486, 25448363, 22890751, 18169166, 17210257, 19028172, 19049983, 18802203, 22148905, 25894836, 24646261, 21199118, 21510124, 23389357, 21078274, 16719117, 16051971, 17614886, 17876680, 20999201, 30377305, 37403361, 33723526, 27456338, 30422300, 37345786, 37326961, 37148476, 49440003, 65914690, 70384093, 71086733, 87124896, 109708271, 118989580, 136169304, 201574635, 285679284, 284991285, 149228814, -34076687]
4868c4076687j00923712N569475L3146056M444770l707238J7132245K1822961
4861e6592130K924163m939787P241935J2954088K948319k467133N015883R351536
4853b3563126L225187r96095J883782J525322m673523n776462M86288K714560
4845b5174067k494291m792084k12311K396067o44808j590343K425437L680489
4837b6405911o94953k999874L80470K694095N0178j991845K25121K315739J491220
4828b4935760J478656L691629L528233o29539l778884k957336j290003r43296
4820b5836300N2231K148871L010389K875075L877434M246675J050284k373928
4812a0949269o14127L576419L119768p04193m53741L520867L494641j089234k330771
$$ y = [-34076687, -135000399, -129430924, -96284868, -91840098, -95547336, -78415091, -56592130, -53667967, -58607754, -51365819, -38411731, -35463412, -37930545, -32914662, -23563126, -20337939, -21334034, -19450252, -17924930, -22598453, -28374915, -27888627, -25174067, -27668358, -32460442, -32672753, -30276686, -30921494, -32511837, -30086400, -26405911, -27100864, -30100738, -29720268, -27026173, -26975995, -28967840, -28742719, -26426980, -24935760, -23457104, -19765475, -16237242, -16866781, -20645665, -23603001, -24893004, -25836300, -25784069, -23635198, -20624809, -17749734, -13872300, -9625625, -8575341, -10949269, -11563396, -7986977, -4867209, -5571402, -6025143, -2504276, 990365, -98869, -2429640]
4803b429640J347888K135392k550259n101276j559984J630536j32314j836131
4795h495788P65770L207717J158305j785836j507569n16587j667318k206994J44569
4786a0903731K128299J294249P43485K665438L824897K035045K97781K42404j268832
4777A059035m738194n162975j259268Q39138j525918j798654M051951Q869668
4769C34783N477073j373345l213792j181558j481298l335311j838945J311555
4761e300838L65177l683744m507114j252906Q59521r390l57835J376056K836658
4752i674415L139552L774474M069416J740250j940527l105362j542270p84621
4744d323503j877923k105209k66596J438865J404781N37857k51029j097528j636999
$$ y = [-2429640, -1081752, 1053640, -1496619, -6597895, -8157879, -6527343, -6659657, -8495788, -7730018, -4522301, -3363996, -5149832, -6657401, -7173988, -8841306, -11048300, -10903731, -8775432, -7481183, -6737698, -4072260, -247363, 1787682, 2085463, 2327867, 1059035, -3679159, -8842134, -10101402, -9262264, -10788182, -12586836, -8534885, 334783, 5811856, 4438511, 1224719, 43161, -1438137, -4773448, -6612393, -5300838, -4935661, -8619405, -13126519, -14379425, -13519904, -13529294, -13887129, -12511073, -9674415, -6534863, -2760389, 1309027, 3049277, 1108750, -1996612, -3538882, -4323503, -6201426, -8306635, -8573231, -7134366, -5729585, -5191728, -5442757, -6540285, -8177284]
4735h177284j386767j301171k160746k317110R468L319840M756642M119297K919225
4726b18606J128044j670764l586172k687749n82987n5798o01633j0076J289143
4717f996598J480916J260005K072069K013473j620765o616591p592036l245355
4709a9244882K406937N652797N894427L576885k19589k529753j282776R07923
4701d838031j9338l056055l493542m67201J970669J613602Q38767J650838K664966
4692c135325K297884R45694r38503l066784l245662M25514M809564M309857p41149
4683A661090l735968j599449Q37762q14034l445420k181558J296039J537055k196209
4674h640692n313995m517935r38022K550488L799677J939222j564015l066564
$$ y = [-8177284, -9564051, -10865222, -13025968, -15343078, -15333610, -12013770, -7257128, -3137831, -218606, 909438, -761326, -4347498, -7035247, -7618234, -7674032, -8275665, -8285741, -6996598, -5515682, -4255677, -2183608, -170135, -1790900, -8407491, -15999527, -19244882, -16837945, -11185148, -5290721, -1713836, -1933425, -4463178, -5745954, -4838031, -4857369, -7913424, -11406966, -11874167, -9903498, -8289896, -7451129, -5800291, -3135325, -837441, 108253, -830250, -3897034, -7142696, -6717182, -1907618, 2402239, 1661090, -2074878, -3674327, -2836565, -3650599, -7096019, -9277577, -7981538, -6444483, -8640692, -13954687, -18472622, -19410644, -16860156, -13060479, -11121257, -12685272, -15751836]
4666a5751836n88796L264470M629097L520793K836874L232739K483582q8352j992951
4657A545620j343324M55587J162369P74987N28126L20538q85378k658235k971437
4648c071147q98703J756901K374031N37312j767336k880818l269212m008586m502608
4639a5730166l175428l15816J384737O4508k423031k237502J687863N755693N614788
4630i374354J593518j314391L97545M152224M746020J476318j110914M2015K285134
4621B893115J678417j060113k078069l78662J111344J99777j887096k975842k625420
4612e122549j471186J33416J681011K071563Q11742r38966j319362L10075K518465
4603a325791K928413P03537k043289k438056p09446o0582j817237l110692j367265
$$ y = [-15751836, -16340632, -13076162, -8447065, -4926272, -2089398, 1143341, 3626923, 3538571, 1545620, 202296, 657883, 1820252, 2595239, 3123365, 3443903, 2558525, -99710, -3071147, -3969850, -2212949, 161082, 698394, -1068942, -3949760, -7218972, -11227558, -15730166, -18905594, -19221410, -17836673, -17772165, -20195196, -22432698, -20744835, -14989142, -9374354, -7780836, -9095227, -8697682, -4545458, 200562, 1676880, 565966, 607981, 2893115, 4571532, 3511419, 1433350, 1054688, 2166032, 2365809, 478713, -2497129, -5122549, -6593735, -6460319, -4779308, -2707745, -1896003, -2834969, -4154331, -3844256, -1325791, 1602622, 2306159, 262870, -2175186, -2884632, -2945214, -4762451, -7873143, -9240408]
4594i240408J312809J363135n48480r44456M74009P77412m64036k94890J861878
4585e703027K436298k28607k540490j419045N39507l66343k330110r31240L049757
4576g493300M077298K21803l814873l560926o91670M83865l57124J63533L305380
4567g666014O009187N124618J567375j103376j060792L37441J025811O30015P9720
4558D943985K0387L74432P76532O73477m75802k267239l036356j477716J471216
4549A002916L209556K128332p62530k917061k727732j042915k16238j167048j661635
4540d154355J041969N553966O568122J416890n398517o962901k412009K418404
4532a928431K861517O33350j46148Q01361M85465j826132k939606m00124L417550
$$ y = [-9240408, -7927599, -6564464, -7112944, -8057400, -7583391, -6805979, -7270015, -7564905, -5703027, -3266729, -3495336, -6035826, -7454871, -6915364, -7281707, -9611817, -10543057, -7493300, -3416002, -3194199, -7009072, -10569998, -11261668, -10777803, -11134927, -10971394, -7666014, -1656827, 3467791, 5035166, 3931790, 2870998, 3208439, 4234250, 4864265, 4943985, 4964372, 5338804, 6115336, 6788813, 6313011, 4045772, 1009416, -468300, 1002916, 4212472, 6340804, 5578274, 2661213, -66519, -1109434, -1325672, -2492720, -4154355, -3112386, 2441580, 9009702, 10426592, 5028075, -1934826, -4346835, -1928431, 933086, 1566436, 1420288, 2221649, 2707114, 880982, -2058624, -2458748, 958802]
4523I58802L958339O35123k023234l63165L209836L395538o00045m006755l169205
4514A995234O7751K083636K331717J999198P06514k000957l855883k417106O77364
4505A587468J673523J58850j042901p27269j63821M18848J899303K851253P06526
4496G361780l119468m123519j885411j195548l995834n548092k033154K887829
4488a1651417L742575J685831J802120M370280M677067Q91538l174971l795422
4480a452399j639567O50463J817918J713510L94683j142417j355670m37747n30672
4471a981898k592085m506670l620948l28705K122010J346195j389862k560959
4463a3512922n42360K342020K751532O57100r68715o30087o6929q09428j611642
$$ y = [958802, 4917141, 5552264, 3529030, 3165865, 6375701, 9771239, 9171194, 5164439, 1995234, 2062985, 4146621, 6478338, 8477536, 9184050, 7183093, 3327210, 910104, 1587468, 3260991, 3419841, 2376940, 1649671, 1485850, 1904698, 3804001, 6655254, 7361780, 4242312, 118793, -1766618, -2962166, -6958000, -12506092, -14539246, -11651417, -7908842, -6223011, -4420891, -50611, 4626456, 5517994, 2343023, -1452399, -3091966, -2441503, -623585, 1089925, 1484608, 342191, -1013479, -1451226, -1981898, -4573983, -9080653, -12701601, -13030306, -10908296, -9562101, -10951963, -13512922, -14055282, -11713262, -8961730, -8304630, -9273345, -9903432, -9970361, -10779789, -12391431]
4454a2391431j023413j70626n69971j016824N09896L055852L758399K064259J12292
4445e671567p07486q86757p16375J70404J050500N49005p93729q44379P55014
4436g095370J923723J448214N97266O64553J210251J685548K476261L134763J942516
4427G987725j097861k995442j617103R39847J249691m67744j061477M53639J495934
4418D887209P0115k236347k710373j291831k90337j077851k499558k549955p13779
4409h412707J622981K726611K292079J627272J904945K443079J499531j007422
4401D696369k705184j749651K67176J82208k147675l348554j383080J386120J788205
4392c014066N78568P83771K389599K197411p89855l361141k871612r96989n67671
$$ y = [-12391431, -13414844, -13585470, -14155441, -15172265, -14662369, -11606517, -7848118, -5783859, -5671567, -6379053, -7265810, -7982185, -7811781, -6761281, -6212276, -7006005, -7850384, -7095370, -5171647, -3723433, -3126167, -2461614, -1251363, 434185, 2910446, 6045209, 7987725, 6889864, 3894422, 2277319, 3217166, 4466857, 3999113, 2937636, 3391275, 4887209, 4957324, 2720977, 10604, -1281227, -1571564, -2649415, -5148973, -7698928, -8412707, -6789726, -4063115, -1771036, -143764, 1761181, 4204260, 5703791, 4696369, 1991185, 241534, 508710, 690918, -1456757, -4805311, -6188391, -4802271, -3014066, -2435498, -1651727, 737872, 2935283, 2145428, -1215713, -4087325, -5084314, -5651985]
4383e651985j163636o95144M36327J25601j336355j439328J95449R80524k43550
4374h792097j030617P74685L446720L986364K574796J698399J735423M87929k564916
4365B316686m385894k312894J927738M138860K731524p9649j828882k366944k368588
4356b228043j375506J078894L544993L740829J398709j362154k602937k439826
4348b45041k221103k752745l595612l561230j912800M57270J450553J50560j706582
4339a3936730j788560k96223M63308m01938r78565O65771L569557M783867K807906
4330e111607m96863j609999P71334L703989K971738j526015n069119l968961j32867
4321a0468370K258555K536914K835115L256616K000245k53594o52968P43276P16896
$$ y = [-5651985, -6815621, -7510765, -7074438, -6948837, -8285192, -9724520, -9529071, -8548547, -8792097, -9822714, -9048029, -5601309, -1614945, 959851, 2658250, 4393673, 4881602, 2316686, -2069208, -4382102, -2454364, 1684496, 4416020, 4336371, 2507489, 140545, -2228043, -3603549, -2524655, 1020338, 4761167, 6159876, 4797722, 2194785, -245041, -2466144, -5218889, -8814501, -12375731, -14288531, -13831261, -12380708, -12230148, -13936730, -15725290, -16021513, -15558205, -15960143, -16938708, -16272937, -12703380, -7919513, -5111607, -5608470, -7218469, -6447135, -2743146, 228592, -1297423, -6366542, -10335503, -10468370, -8209815, -5672901, -2837786, 418830, 2419075, 2165481, 1512513, 2255789, 2972685]
4312B972685j292930j757440Q19335K892485J484830j370923k708892l149510
4304b110360l949900l412414l82060K016288P86956j511292o54139K180891K487944
4295d548086o0671j704993j303453j328606k256753j514317J177246K503447J062711
4286g973475k32333R97112L093681L478715K100008K71066j050808p63163J513227
4277A434030L187733R28566l685804m849448q46633K567861K53433m607430n165813
4268a0783505p21336L020990K539684M99740M98561J879276J856200K42273o48377
4259a616494M3160L50535j382895l714724l860407j464590J098591K081120K050477
4250f415227J712039K89302k421128m259376l093055J72589K904168L910805L429590
$$ y = [2972685, 1679755, -77685, 741650, 3634135, 5118965, 3748042, 1039150, -2110360, -6060260, -9472674, -9854734, -7838446, -7051490, -8562782, -9216921, -7036030, -4548086, -4608757, -6313750, -7617203, -8945809, -11202562, -12716879, -11539633, -9036186, -7973475, -8205808, -7208696, -4115015, -636300, 1463708, 1734774, 683966, -79197, 1434030, 4621763, 5550329, 1864525, -2984923, -3831556, -1263695, -1010262, -5617692, -10783505, -11504841, -8483851, -5944167, -5444427, -4945866, -3066590, -1210390, -968117, -1616494, -1573334, -1222799, -2605694, -6320418, -10180825, -11645415, -10546824, -8465704, -6415227, -4703188, -4413886, -6835014, -11094390, -14187445, -14014856, -11110688, -7199883, -3770293]
4241c770293J477837j278036k382894l39642K393317K209935n57900k525417k512392
4232g285485k308171k508701j507468R87481L058874L780487L923059L054779
4224A194855l10237m865895o643933m304336q91136Q81444J577295K018481J194793
4215a0148669q49792j588777J72141K012833J641544J67028m49124m65372p51623
4206a0259811p41178j28332j16218r62756q19505J040665K517635K182952J615147
4197e671401K071784J879567k44258k205193j873717p90471j266090k018668k38168
4188a0356615L484061N605544M264870R79366j650694k201482j211548p65792
4180a852290k101122l375862k038243O53435J049274n91537J5781L553168M800667
$$ y = [-3770293, -2292456, -3570492, -5953386, -6293028, -3899711, -1689776, -2247676, -4773093, -7285485, -9593656, -12102357, -13609825, -12622344, -9563470, -5782983, -1859924, 1194855, 884618, -3981277, -10625210, -14929546, -15820682, -14939238, -13361943, -11343462, -10148669, -10998461, -12587238, -12415097, -10402264, -8760720, -8593692, -9042816, -9508188, -10259811, -11000989, -11129321, -11245539, -12208295, -13027800, -11987135, -9469500, -7286548, -5671401, -3599617, -1720050, -1964308, -4169501, -6043218, -6833689, -8099779, -10118447, -10356615, -6872554, -1267010, 2997860, 3977226, 2326532, 125050, -1086498, -1852290, -3953412, -7329274, -9367517, -8714082, -7664808, -8256345, -8240564, -4687396, 113271]
4171A13271Q96408l354764k557165J406797L294506K449486J712138J399872l95357
4162D965192l394781n389933n416583l605405j61751K987838K848610Q4783j189658
4153h271688n75717k294997o051836n182025J111746L249083l361045q833795
4145c0210274n658129m189618j5131323k5119742j1516487K0467274L8564630
4138c2793669K6087817K808463n654365k85588K686335j16293J07639M703961
4130b455700N973428J899419j529003j650848j693683k598218j733058M74604
4122c313059P20664o14207j36465J926393K363260J401327J966826L340827K100836
4113I756402j116851k221988q05076l86577j518473r54682J689331K565574J94131
$$ y = [113271, 1009679, -2345085, -4902250, -3495453, -200947, 2248539, 3960677, 5360549, 4965192, 1570411, -3819522, -9236105, -12841510, -13003261, -10015423, -7166813, -7082030, -8271688, -8847405, -11142402, -17194238, -22376263, -21264517, -18015434, -21376479, -30210274, -35868403, -40058021, -55189344, -80309086, -91825573, -71358299, -32793669, -6705852, -3897389, -9551754, -9837342, -7151007, -7267300, -7159661, -2455700, 3517728, 5417147, 3888144, 2237296, 543613, -2054605, -3787663, -3313059, -2592395, -3206602, -3343067, -1416674, 946586, 2347913, 4314739, 7655566, 9756402, 8639551, 6417563, 5612487, 5225910, 3707437, 2752755, 4442086, 7007660, 7201791]
4104G201791k033460j668053p86546j851818l910163m744136l701313j066996
4096a2560694K593658N521357N700870L324743L04131k281359l899263k986386
4088d282943Q50331M052140K686975j619547l612674k047646p27917j628172k022301
4079h351754K21049L129957M367551M469223M223712K492420r03923l271148k682680
4070C694407j098087j372594l169938m151023l535115k301786j173530l43363
4062a3451029k02579p04960p87532L07359J823127K523945K206028J445124N75545
4053f264972m06505j393990j966906j436639N19026K816225L491574K186213R24215
4044a531759J146908J500722M26194p89981k11256J012706M09002j384638j668525
$$ y = [7201791, 5168331, 3500278, 2713732, 861914, -3048249, -7792385, -11493698, -12560694, -9967036, -4445679, 1255191, 4579934, 4884065, 2602706, -1296557, -4282943, -3432612, 619528, 3306503, 1686956, -1925718, -3973364, -4701281, -6329453, -8351754, -8130705, -5000748, -633197, 3836026, 8059738, 10552158, 9648235, 6377087, 3694407, 2596320, 1223726, -1946212, -6097235, -9632350, -11934136, -13107666, -13451029, -13653608, -14358568, -15146100, -14838741, -13015614, -10491669, -8285641, -6840517, -6264972, -6671477, -8065467, -10032373, -11469012, -10949986, -8133761, -4642187, -2455974, -1531759, -384851, 1115871, 1542065, 752084, 540828, 1553534, 1962536, 577898, -1090627]
4035a090627n67578p89003k453905k429275L04595K567816J723279q08645k299270
4026e842613k109411r90954L39548P78930m19790j637129m22022K328265L022140
4017d953036R87366l62865P76700J841641P45507n94239j60370M93338m96006
4008a721964j676199j097969K11002P20755J381361K869935K980798N46178j074147
3999C139750J129587M065414K696671j980606m514765l387300k184585k644492
3991c680326k252652K99298K463682K461322K204596L371633M177275K591309
3983A1636137k2138j053605m47637j03890r71442k602585m314903n147642l801840
3974f829545k30581L456798M912958L808208J472919p72279k166869k430497k089218
$$ y = [-1090627, -1658205, -2447208, -4901113, -7330388, -7025793, -4457977, -2734698, -3543343, -5842613, -7952024, -8942978, -8603430, -7824500, -8244290, -9881419, -10303441, -7975176, -4953036, -3965670, -4328535, -3551835, -1710194, -964687, -1558926, -1719296, -1225958, -1721964, -3398163, -4496132, -4285130, -3564375, -2183014, 686921, 3667719, 4213897, 3139750, 4269337, 8334751, 11031422, 9050816, 4536051, 1148751, -1035834, -3680326, -5932978, -5633680, -3169998, -708676, 1495920, 4867553, 9044828, 11636137, 11613999, 10560394, 10112757, 10008867, 9037425, 6434840, 2119937, -3027705, -6829545, -7060126, -3603328, 1309630, 5117838, 6590757, 5818478, 3651609, 1221112, -868106]
3965h68106k113266k485053j953864P3353K286992K930115J727139l61189k408041
3956c171920l638663l190670j065851J129007J692938R60317P20747J489782J756128
3947c318185N17539q08705l69384J062800R63035r78577j991521m06185J407387
3938c921796M77521j859393j583365J809422M134096K423593j079685k571060
3930b170667j762112r92712j156113j165634m67852L19123P99802J004352P55082
3921d836731L60481J047247L021932M135974K446920p93259k739881k649448j850799
3912a857564j031570m7567L75471n17360j503120r39097J98750k69935j834918
3903g426910k113652j142374j016812j295703P57860M513249N325474J541323
$$ y = [-868106, -2981372, -5466425, -7420289, -7346936, -5059944, -2129829, -402690, -763879, -3171920, -6810583, -10001253, -11067104, -9938097, -8245159, -7284842, -6564095, -5074313, -3318185, -2800646, -3609351, -3978735, -2915935, -1952900, -2931477, -4922998, -5329183, -3921796, -3444275, -5303668, -6887033, -5077611, -943515, 1480078, 400393, -2170667, -3932779, -4925491, -6081604, -7247238, -7715090, -7395967, -6596165, -5591813, -4836731, -4476250, -3429003, -407071, 3728903, 6175823, 5382564, 2642683, -6765, -1857564, -2889134, -2936701, -2561230, -3078590, -4581710, -5520807, -5322057, -5591992, -7426910, -9540562, -10682936, -11699748, -12995451, -12237591, -7724342, -2398868, -857545]
3895h57545k275980j942833M75894Q40155n24964o55542L86370M01384m0120J557667
3885b635514M420073M724871J381923k289756l368083k455533j243142j80861
3877a646022L33550n74127k169804k062941K66334K236645K004468J147409J545135
3868A080647J860161j24448l164162l727960j162049J204195O11549j762996k956101
3859h141164j999853k53693R23868J320491J066152J48828q57265o06876J466633
3850f932879L674190L314652j7735l212139k892567L81492K597987J325129j258845
3841c020715j516328O59191J945640M62916j590136j107296J616516L338320K086992
3832B875100o48063k159003j706186p41547o56879j252590j394993m83182J048683
$$ y = [-857545, -3133525, -5076358, -4600464, -3760309, -4285273, -4940815, -4554445, -4153061, -4193181, -2635514, 1784559, 6509430, 7891353, 5601597, 2233514, -222019, -1465161, -1646022, -1312472, -1886599, -4056403, -6119344, -5853010, -3616365, -1611897, -464488, 1080647, 2940808, 2816360, -347802, -4075762, -5237811, -4033616, -3422067, -5185063, -8141164, -10141017, -10394710, -9470842, -8150351, -7084199, -6935371, -7792636, -8399512, -6932879, -3258689, 55963, 38228, -3173911, -6066478, -5684986, -3086999, -1761870, -3020715, -4537043, -3877852, -1932212, -1469296, -3059432, -4166728, -2550212, 788108, 2875100, 2227037, 68034, -1638152, -2379699, -3036578, -4289168, -5684161, -6167343, -5118660]
3823e118660K303828K538508J339534j127005l606854m050409j480102K296117
3815f905043L957621K359266o258l04350Q10143M48429j829887l014685j073189
3806e557953J844537K299646J38220j861204k001514j143525m90959l7456N50342
3797f259866J284751K437424M130660M998820L080388j197190m628939m911236
3789a065188l257689k142673j880370j107150M14138J503840J704472J817805
3781d012815K168623J911025N26653j156684k001975j847216j348632j145777
3773f906798j446102j888155j667566l93999J082624J432447O34907J91861J125234
3764g835547K543339K904385K108705J368760J229408Q33662m92103j823279j659910
$$ y = [-5118660, -2814832, -276324, 1063210, -63795, -3670649, -7721058, -9201160, -6905043, -2947422, -588156, -594414, -898764, -88621, 359808, -1470079, -4484764, -5557953, -3713416, -1413770, -1275550, -3136754, -5138268, -6281793, -6772752, -6810208, -6259866, -4975115, -2537691, 1592969, 6591789, 9672177, 8474987, 3846048, -1065188, -4322877, -6465550, -8345920, -9453070, -9038932, -7535092, -5830620, -4012815, -1844192, 66833, 593486, -563198, -2565173, -4412389, -5761021, -6906798, -8352900, -10241055, -11908621, -12302620, -11219996, -9787549, -9152642, -8960781, -7835547, -5292208, -2387823, -279118, 1089642, 2319050, 3152712, 2660609, 837330, -822580]
3755h22580l4960J354199J313509N96918N29288Q04768j43068k453438l779932
3746b635296j948866J872214L996564K481740n44371j654757m17459N20421m66515
3737A203675j651056q02003J117545J174112j102281k888548k134647k04723O90668
3728d597258O45822Q83422J155372O04124m3885K49099K80100j647545l846872
3719f317621k630281J931022N167448M117286J453324J056830K490368K574578
3711I842954L62169k403081m348471n114518m002450q97006K059404K460346R67364
3702a073289J26364K94794m08819k216045k916201j570245j19436j42478m82492
3693h507847M38475J957529K442472J735634Q22821K01182j02097J68525R72778
$$ y = [-822580, -857540, 496659, 1810168, 2407086, 2936374, 3741142, 3598074, 1144636, -2635296, -4584162, -2711948, 1284616, 3766356, 3221985, 1567228, 1149769, 1670190, 1203675, -447381, -1249384, -131839, 1042273, -60008, -2948556, -5083203, -5287926, -4597258, -3951436, -3068014, -1912642, -1308518, -1352403, -1103304, -823204, -2470749, -6317621, -8947902, -7016880, -1849432, 2267854, 3721178, 4778008, 7268376, 9842954, 10205123, 7802042, 3453571, -1660947, -5663397, -6560403, -4500999, -2040653, -1073289, -946925, -652131, -1060950, -3276995, -6193196, -7763441, -7882877, -8025355, -8507847, -8069372, -6111843, -3669371, -1933737, -1110916, -909734, -1011831, -843306, 129472]
3684A29472J476292J042207J08203n99060j024203j431236j849754k228067k291226
3675f667372j212427J226998L103090J980734j271530k530764L20634M181549
3667h69088M706455J889813o40753q18165m818n141p55162j437248j884659k032164
3657a850930j373282R1897J232424R63625l69999j405794j386474r10687r53498
3648e962718j424489j215066J23913J451157J551918R44239Q80042J045585J66074
3639b439345j173286p59306J529912K871722J771884N25517J192766J675492q76675
3630D318681m559000m772514j262571J214798k7909j889723o90147K205148K756761
3621b706476K35410k126719j688918Q46007L099121L505400J933056o31428k435283
$$ y = [129472, 1605764, 2647971, 2756174, 2157114, 1132911, -298325, -2148079, -4376146, -6667372, -7879799, -6652801, -3549711, -1568977, -2840507, -5371271, -5050637, -869088, 3837367, 5727180, 5086427, 4268262, 4263444, 4258303, 3503141, 2065893, 181234, -1850930, -3224212, -3132315, -1899891, -936266, -1306265, -2712059, -4098533, -5009220, -5962718, -7387207, -8602273, -8478360, -7027203, -5475285, -4531046, -3651004, -2605419, -2439345, -3612631, -4371937, -2842025, 29697, 1801581, 2327098, 3519864, 5195356, 4318681, -240319, -5012833, -6275404, -5060606, -5088515, -6978238, -7668385, -5463237, -2706476, -2471066, -4597785, -6286703, -5440696, -2341575, 1163825, 3096881, 2465453, 30170]
3612C0170j991194M85610K960066L324989J271610j613625l414341l354421j875932
3603d177068J39321J723740J852157K30575j743803j945529o4086J805802J862012
3594c16879P81330J38940j87976j349727k940953l029715q25687K138504L686609
3585a905554K913881O29053j193736r04146Q74260J587384K17170r03920L99410
3576A713802K303987J494604j477651k864380j554790m40074j307807k164140
3568d296449j112048N20680R28280P68158J122057J082004k23711j412460j114135
3559c737624m82724r85949j604824q90414J0960n81378j275333N36643L965071
3550e045572N143884K514306j186795k565251j044595J530776K939687K055002
$$ y = [30170, -1961024, -1475414, 1484652, 4809641, 6081251, 4467626, 1053285, -2301136, -4177068, -4037747, -2314007, -461850, -231275, -1975078, -3920607, -3984693, -2178891, -316879, 464451, 603391, 415415, -934312, -3875265, -6904980, -7730667, -5592163, -1905554, 1008327, 1637380, 443644, -460502, 413758, 2001142, 2218312, 1314392, 1713802, 4017789, 5512393, 4034742, 1170362, -384428, -824502, -2132309, -4296449, -5408497, -4887817, -3959537, -3191379, -2069322, -987318, -1211029, -2623489, -3737624, -4220348, -5206297, -6811121, -7701535, -7690575, -8271953, -9547286, -9010643, -5045572, 98312, 2612618, 1425823, -1139428, -2184023, -653247, 2286440, 4341442]
3542D341442k75908j835597j530571o41138o01356r20714q25287j150641k294885
3533e734655k130688Q56007L745315K392970k080130m135784j532210J788296
3525f830879J735004n31096j195383P74567K963954K874601L95066k321819k833606
3516d969591j019141N45102M3706o91484J008855L888823M045072P38491k631518
3507I58315l707931l628540l486900k249446J99488J524237N20465q07140o85417
3498a1362869o8761K22584J533511M160989N437656L874121K025154K019675J484525
3489I326585k084829n779079m943179n34154K149421J058489j083457k237400
3481d127603l077756l446769j698508J372498K314146L02924j121041N61364L075103
$$ y = [4341442, 4065534, 2229937, 699366, 58228, -543128, -1463842, -2289129, -3439770, -5734655, -7865343, -7009336, -3264021, -871051, -2951181, -7086965, -8619175, -6830879, -5095875, -5626971, -6822354, -6047787, -3083833, -209232, 185834, -2135985, -4969591, -5988732, -5443630, -5399924, -6091408, -5082553, -1193730, 2851342, 3589833, 958315, -2749616, -6378156, -9865056, -12114502, -11915014, -10390777, -9870312, -10677452, -11362869, -11431630, -11209046, -9675535, -5514546, -76890, 3797231, 5822385, 7842060, 9326585, 7241756, 1462677, -3480502, -4014656, -1865235, -806746, -1890203, -4127603, -7205359, -10652128, -12350636, -10978138, -8663992, -8361068, -9482109, -8920745, -5845642]
3472e845642L142537J260385K12669P85817J371514O92767r20897k213016j808794
3463c322660O72188L388572L369547q4566m087573n197527k900844N80904K880138
3454d701821L109189J916790P89329O68054Q75341J89438j001020r67598O52216
3445A529918J993912J514559J1385p85125m86140k4172k60151j316486k510492
3436c32792k549259p60797J571702K276526R95223m90279q57084n20791J6800
3427f50751J001628J775674N69571k541065m487315k952985L61818K273732K347457
3418b302236K155342J718284j45497k498769k749891q30048L24439m40390l25175
3409e093941K728528N697509L949877k029016o568572n654086j251461J956266
$$ y = [-5845642, -2703105, -1442720, -1230051, -444234, 927280, 1620047, 699150, -1513866, -3322660, -2650472, 738100, 4107647, 4023081, -64492, -5262019, -8162863, -7581959, -4701821, -1592632, 324158, 1113487, 1781541, 2656882, 2846320, 1845300, 877702, 1529918, 3523830, 5038389, 5049774, 4264649, 3778509, 3754337, 3494186, 2177700, -332792, -2882051, -3642848, -2071146, 205380, 1200603, 710324, -146760, -667551, -650751, 350877, 2126551, 2696122, 155057, -4332258, -7285243, -6923425, -4649693, -2302236, -146894, 1571390, 1425893, -1072876, -3822767, -4652815, -4328376, -4768766, -5093941, -2365413, 3332096, 7281973, 5252957, -1315615, -6969701, -8221162, -6264896]
3401f264896J927490K7061j774878k475359j629592O37985L145199M460627M288802
3392B342439L250451J762302K43175l09919L51634M59455j508083l749250l185353
3383c43149n47216K15871j537148j461037K625377O125674M056663j337894m200517
3374C596624l750614l646818m161397j668184L649807O172443L100233j221176
3366B070918k179212j225396j709470k661395j294977J276966J664993j38552
3358d196125j119550l02704N31196O84857J381001K732311L137049K098532R95627
3349E942194O53929M12467j22374m80183o81835j212782j502435m38794J327901
3340C898088J564501n00301k891467l219652j147888J691802L159064K039766
$$ y = [-6264896, -4337406, -4310345, -6085223, -8560582, -10190174, -9552189, -6406990, -1946363, 2342439, 5592890, 7355192, 7598367, 7288448, 7640082, 8099537, 6591454, 2842204, -343149, -890365, -674494, -2211642, -3672679, -1047302, 5078372, 9135035, 7797141, 3596624, -153990, -3800808, -7962205, -9630389, -5980582, 191861, 3292094, 2070918, -108294, -1333690, -3043160, -5704555, -6999532, -5722566, -4057573, -4196125, -5315675, -5618379, -5087183, -4402326, -3021325, -289014, 2848035, 4946567, 5942194, 6596123, 7008590, 6886216, 6406033, 5724198, 4511416, 3008981, 2570187, 3898088, 5462589, 4962288, 2070821, -1148831, -2296719, -604917, 2554147, 4593913]
3332D593913p47787k464846j309062J294194K388826J131440p28270j677041j983682
3323D97685k360502k697716k447420j180253J121068L280071L131252J36544k913829
3314c433100k966910r65508m00070j719740j435848K229577N938076N572493J791491
3305D610461j210031j190909L43464J268723J382879J457685J478151Q01631n73865
3296H368189j668369j502491k07246J026754J189085M36440l69246p97447j087152
3287E388517j504451j995747k312581k053431r39910M24178O29106q47620k482865
3278e694804k302624l91662J237809J128913k93426j726129k207275j360703M40669
3269a1169232J950099J988680P47080m65861p56621l29156J93738M75288O38063
$$ y = [4593913, 3846126, 1381280, 72218, 1366412, 3755238, 4886678, 4158408, 2481367, 497685, -1862817, -4560533, -7007953, -8188206, -7067138, -3787067, -655815, -519271, -3433100, -6400010, -7365518, -7765588, -9485328, -10921176, -8691599, -2753523, 2818970, 4610461, 3400430, 2209521, 2552985, 3821708, 5204587, 6662272, 8140423, 8942054, 8368189, 6699820, 5197329, 4990083, 6016837, 7205922, 7642362, 7273116, 6475669, 5388517, 3884066, 1888319, -424262, -2477693, -3417603, -2993425, -2364319, -3211939, -5694804, -7997428, -8389090, -7151281, -6022368, -6315794, -8041923, -10249198, -11609901, -11169232, -9219133, -7230453, -6483373, -6949234, -7705855, -8035011, -7841273, -7365985, -6727922]
3260f727922J165379K217738K780668J503843j006040k103753m49265J954631
3252f64721K542697J553274P23390J02767j280661k622341k131019k17084Q63161
3243a130537M20726j41364l6582J95596M01393N90353m95772l481942n544649
3234i222778l327473J365901L122440P82805r15991R97645L268924K176946o64849
3225b416430j705176j019731o58975l84206R08309J808628N33523j269725q23346
3216e027129J034479J327482J28676K61768K297596L676725K852065R33348r25882
3207F559128k636148l488843k457513n98886k65958j380096j253450J131327L280533
3198a109906K669478r7283k616245l334208k022354O06983K820191K932909J358605
$$ y = [-6727922, -5562543, -3344805, -564137, 939706, -66334, -2170087, -2619352, -664721, 1877976, 3431250, 4154640, 4257407, 2976746, 354405, -1776614, -1993698, -1130537, -709811, -851175, -887757, -692161, -290768, 299585, -196187, -3678129, -9222778, -12550251, -11184350, -8061910, -7279105, -8195096, -7197451, -3928527, -1751581, -2416430, -4121606, -5141337, -5800312, -6184518, -5276209, -3467581, -2934058, -4203783, -5027129, -3992650, -2665168, -2536492, -2274724, 22872, 3699597, 6551662, 7485010, 6559128, 3922980, 434137, -2023376, -2622262, -2888220, -4268316, -5521766, -4390439, -1109906, 1559572, 1462289, -1153956, -4488164, -6510518, -5903535, -3083344, -150435, 1208170]
3189A208170L36959R74737J834897J114477r66892k640912k548795p71247J316315
3180a42291K025017R77221k84848j71699P60643O30909j044980k822672l403293
3171c475993k849068j742560m98182M05027P35359J089381K039921K864923K384568
3162I53376R04237l8342J54326M60636k48470j987695l718141l844348j420206
3153h784627K110238L541377J753839m27222j70379J142424M12481j819963k205456
3144d447288k76836P54700n82465j716540n03873J415229J624383N24754j54537
3135c362473k58025n72877r61074r04664n79419m9538J151856K479134K145790
3126i11290j41109j870247q13198J853190L092476J689900r50091k795382k789795
$$ y = [1208170, 1545129, 2519866, 4354763, 5469240, 4502348, 1861436, -687359, -1458606, -142291, 1882726, 2859947, 2575099, 2403400, 3164043, 3794952, 2749972, -72700, -3475993, -6325061, -8067621, -8565803, -8160776, -7425417, -6336036, -4296115, -1431192, 953376, 1857613, 1819271, 1973597, 2434233, 2185763, 198068, -3520073, -7364421, -8784627, -6674389, -3133012, -1379173, -1806395, -1976774, -834350, -421869, -2241832, -4447288, -4724124, -3969424, -4551889, -6268429, -6772302, -5357073, -3732690, -3207936, -3362473, -3620498, -4193375, -5154449, -6059113, -6638532, -6688070, -5536214, -3057080, -911290, -1052399, -2922646, -3735844, -1882654, 1209822, 2899722, 1949631, -845751, -3635546]
3117c635546j204323O52522J562225J559158J281013N01499j183725k553845j850846
3108d871868K68374J302017O72498K09303M60837k67282k235290l039293j619935
3099i120639k08895l65342l58454J200181K411268J584752N65816J310445J999824
3090i81044K56381k245054k362348o14907L60885O13012J743022K586951R02903
3081B59801j607319j111610J738007K188080j044246l591800k228061O65220J446358
3072c285570K54044o69798p70282r40780j557402k525870l578752l487133j047679
3063a7609222K273613L127743P90160j622216j596118j82322Q75804J962970L413641
3054h565947L327281M91639k497987k224680N70176K027322P06972p79062O5862
$$ y = [-3635546, -4839869, -4187347, -2625122, -1065964, 215049, 716548, -467177, -3021022, -4871868, -4603494, -3301477, -2628979, -2419676, -1958839, -2226121, -4461411, -7500704, -9120639, -9329534, -9694876, -10053330, -8853149, -6441881, -4857129, -4291313, -2980868, -981044, -724663, -2969717, -5332065, -5946972, -5586087, -4973075, -3230053, -643102, 259801, -1347518, -2459128, -721121, 1466959, 422713, -3169087, -5397148, -4731928, -3285570, -3031526, -3701324, -4471606, -5412386, -6969788, -9495658, -13074410, -16561543, -17609222, -15335609, -12207866, -11417706, -13039922, -14636040, -14818362, -13942558, -11979588, -8565947, -5238666, -4747027, -7245014, -9469694, -8899518, -6872196, -6165224, -6944286, -6878424]
3045f878424K249223L105296J982296P08696O75231O85218j308467m595408n557434
3036h933773k307474J993987K717070q8987j911177j46521K763406L412971J805076
3027f95422J47218l99975n6382O70738Q70721l31698j948944j614861Q14943K331934
3017b11728J030843j109762j777260k105759l956990n528185l439425J721701
3009a5376565N570868N527309L119163N95763j642216l461605l574393j243755
3001a0485431K021848L655948K344967r93064l744976l408487m2132L322286L869518
2992c459523K152058P43797M95009J01140r57481j379727l52708J038596J415048
2983b03791P15629l12190j020567r08573R5062J165385J432862J221816J254621
$$ y = [-6878424, -4629201, -1523905, 458391, 1167087, 1842318, 2527536, 1219069, -3376339, -8933773, -11241247, -9247260, -6530190, -6619177, -8530354, -8676875, -5913469, -2500498, -695422, -548204, -948179, -1004561, -333823, 536898, 205200, -1743744, -3358605, -2543662, -211728, 819115, -290647, -2067907, -4173666, -8130656, -13658841, -17098266, -15376565, -9805697, -4278388, -1159225, -563462, -2205678, -5667283, -9241676, -10485431, -8463583, -4807635, -2462668, -3455732, -7200708, -10609195, -10651327, -7329041, -3459523, -1307465, -563668, -68659, 32481, -925000, -2304727, -2657435, -1618839, -203791, 511838, 199648, -820919, -1729492, -1634430, -469045, 963817, 2185633, 3440254]
2974C440254J013601l69576j836558j253655J134438K410445J006802j090865
2966D454886j375794j41950P91025J037392J349112J424735K05179j903278l013896
2957B827411k270863r53614n35128p26714k93273Q20888J292208M35757n72685
2948B3987k23219J206235K157404K078106J675507Q70353j378340m305713m700714
2939b596394j061780L305004L903832P12168k412579l132542k392750j225173
2931d900214O94757K789815L133028J344823p13205j970759l036922l256292m28957
2922f343926M777668P650545N335951R97849r46041j042272k525709m924575m486053
2913a506563m49037L231210K980323n50129m207464n433009l357241P99474L981470
$$ y = [3440254, 4453855, 4084279, 2247721, 994066, 2128504, 4538949, 5545751, 4454886, 3079092, 2937142, 3728167, 4765559, 6114671, 7539406, 7744585, 5841307, 2827411, 556548, -397066, -932194, -1658908, -1952181, -1131293, 160915, 596672, 23987, -199232, 1007003, 3164407, 5242513, 6918020, 7788373, 6410033, 2104320, -2596394, -3658174, -353170, 3550662, 4262830, 1850251, -1282291, -3675041, -4900214, -4205457, -1415642, 1717386, 3062209, 2349004, 378245, -2658677, -5914969, -6343926, -1566258, 6084287, 11420238, 12418087, 11472046, 10429774, 7904065, 2979490, -1506563, -1955600, 1275610, 4255933, 3705804, -501660, -5934669, -9291910, -8492436, -4510966]
2904d510966L946238J898997P50728J064580R38072l74922j373150j022674o8317
2895A248586O68153R66502J33531k104941l639418k090891Q48358R76058j659184
2886d653246j964030K183153N654539L402499j718804l242632o45211Q94580p64063
2877h53215j971527K9780K800249L120354J724037R32680N04848j078811l015747
2868B192648k965123p34157J352333J649423P95430L5633l84401p57903j075306
2859A08577j157487r15517k35155P77324J366888P06455r02089k124221k152014
2850d527239j442209n74894O96307K472768L597285K827615Q80246j49015L33614
2841D114478N74356p58041k374903k291744q82410j91039p50418j186045r62638
$$ y = [-4510966, -564728, 1334269, 2084997, 3149577, 4087649, 3712727, 2339577, 1316903, 1248586, 1916739, 2883241, 3016772, 911831, -2727587, -4818478, -3970120, -2994062, -4653246, -6617276, -4434123, 1220416, 4622915, 2904111, -338521, -983732, -89152, -853215, -2824742, -2794962, 5287, 3125641, 4849678, 5782358, 6287206, 5208395, 2192648, -772475, -1506632, -154299, 1495124, 2290554, 2326187, 1941786, 1183883, 108577, -1048910, -1964427, -2199582, -1422258, -55370, 651085, -251004, -2375225, -4527239, -5969448, -6544342, -5848035, -3375267, 222018, 3049633, 3929879, 3780864, 4114478, 4688834, 3930793, 1555890, -735854, -1618264, -1809303, -2559721, -3745766, -4708404]
2832d708404j163568j796497o89140L197291P045213P045921L252794n68465j738093
2823I877052j289181j502895k669271l295710k492619j085311n74621j445549
2815d478105k447568j675258J229245M148956M428857J741139j542866k786893
2807a382493j351948J377025L436620L698258K482710R37797l98752k034926m127359
2798B636932n424592m612966k189986J63712J645686K489118K559909J493991
2790a238196O8213l92273p1830k96742j001609p48780K97775l5666k262590l663286
2780i344984k114567P04762K039505K008196K315791K736220J906256M72904J79868
2771I03951M70077n64852k102788j274393J591107K434924l11336k778802j379210
$$ y = [-4708404, -5871972, -7668469, -8357609, -5160318, 1884895, 8930816, 12183610, 11615145, 9877052, 8587871, 7084976, 4415705, 1119995, -1372624, -2457935, -3032556, -4478105, -6925673, -8600931, -7371686, -3222730, 1206127, 2947266, 1404400, -1382493, -2734441, -1357416, 2079204, 5777462, 8260172, 9197969, 8799217, 6764291, 2636932, -2787660, -7400626, -9590612, -9426900, -7781214, -5292096, -2732187, -1238196, -1169983, -1562256, -1634086, -1930828, -2932437, -3681217, -3383442, -3419108, -5681698, -9344984, -11459551, -10754789, -8715284, -6707088, -4391297, -1655077, 251179, 724083, 903951, 1374028, 809176, -1293612, -2568005, -976898, 1458026, 1146690, -1632112, -3011322]
2762c011322J820042K654697J163044M00151O86318m38157k904217l295988l36809
2753c262241K635540K479450M97408l03063K77757M30287j63869m48626n25073
2744A617570j252136j818303m81368K170832L250294J460670j154596k088616
2736A704347j125259N12627J824420J854193j67117l070391l900419j562764J177151
2727b753212J245566o26024j622567j350782j629678k453564j651236J019411
2719i822086K745849J855147L13411L98430J347653J322054N59180K03180k20178
2710a297360j440954j940820L7427K676518K222718j305920l371739j108258K508851
2701c019537K685170q11723l592794k251265J932776M934602M320798J266591
$$ y = [-3011322, -1191280, 1463417, 2626461, 3026612, 3712930, 3274773, 370556, -2925432, -3262241, -626701, 1852749, 2350157, 2047094, 2324851, 2755138, 2591269, 2142643, 1617570, 365434, -1452869, -1934237, 236595, 3486889, 4947559, 3792963, 1704347, 579088, 1091715, 2916135, 4770328, 4603211, 1532820, -2367599, -3930363, -2753212, -1507646, -2133670, -3756237, -5107019, -6736697, -9190261, -10841497, -9822086, -7076237, -5221090, -4907679, -4509249, -3161596, -1839542, -1280362, -1077182, -1297360, -2738314, -4679134, -4641707, -1965189, 257529, -1048391, -4420130, -5528388, -3019537, -334367, -1146090, -4738884, -6990149, -5057373, -122771, 4198027, 5464618]
2693E464618j124911j085328L61264J205868J073821J106274J583647J241417
2685I826670n99377k665279l374499k696003j411373K99204K221248L054714J696453
2676F351758q89020k678706l178279l365724l287705j807777P95706K103356P17092
2667e239299j390829j348688P41222K181002J500688P1878k64340M75172J157664
2658b115530J345706J327002J076214L30448n29151p00201k32926k79870j568937
2649a347245l031092k623886K93103L763060M857505K592742j049756l169487
2641B84944k712945r40700M21138P82153N36278J62522j15102k08271q9893K62662
2631a617214Q11267J124986N05568q85704j496105j58068J890933K363367J234505
$$ y = [5464618, 4339707, 3254379, 3615643, 4821511, 5895332, 7001606, 8585253, 9826670, 9227293, 6562014, 3187515, 491512, -919861, -620657, 1600591, 4655305, 6351758, 5462738, 2784032, -394247, -3759971, -7047676, -8855453, -8059747, -5956391, -5239299, -6630128, -7978816, -7237594, -5056592, -3555904, -3484026, -3748366, -3273194, -2115530, -769824, 557178, 1633392, 1963840, 1434689, 734488, 501562, 221692, -1347245, -4378337, -7002223, -6709120, -2946060, 1911445, 4504187, 3454431, 284944, -2428001, -3368701, -2947563, -2165410, -1629132, -1466610, -1581712, -1789983, -1879876, -1617214, -805947, 319039, 824607, -61097, -1557202, -1715270, 175663, 2539030, 3773535]
2622C773535O09723R62655K36156k120665l324774j824727o49891k564435m439288
2613i341711j459369M434953O238821K223570j596329j038417M17375j219069
2605a340176l169076r79676L292133M160983J505626j7094Q29201N64173j956678
2596B889416l184844j041750J579703J572558j69391j450983k154724k632301
2588d592316j837752M28190J944960J187017j07510K19954J256360P17512j392725
2579b176310l055085l032334j581803N06299K035030J803775L46338j5697J806525
2570c363262L981998M276451K605997q063k842950m453194k957187N45056J656873
2561e58281j367987m110410k091708K066377K304280j586255l785935j442235
$$ y = [3773535, 4383258, 5345913, 5582069, 3461404, 136630, -1688097, -2337988, -4902423, -9341711, -10801080, -6366127, -127306, 2096264, 499935, -538482, -121107, -1340176, -4509252, -5488928, -2196795, 1964188, 3469814, 3452720, 4281921, 4846094, 2889416, -295428, -1337178, 242525, 1815083, 1645692, 194709, -1960015, -4592316, -6430068, -6001878, -4056918, -2869901, -2977411, -2757457, -1501097, -783585, -2176310, -5231395, -8263729, -9845532, -9339233, -7304203, -5500428, -5154090, -5169787, -3363262, 618736, 4895187, 7501184, 7493121, 4650171, 196977, -2760210, -2215154, -558281, -1926268, -6036678, -8128386, -6062009, -3757729, -5343984, -9129919, -10572154]
2553a0572154J654856J676921P6658j16135P01587N46188j57686K63086J348480
2544d578199J334414L13599j09291K95282K40459n83206j027138o02591k08736
2535d925407l22062l8910J284101K569024K281639O54610m63385m5098Q55277
2526A849789Q87350N47188J186127K240473J428287j600510l760398k359996Q89865
2517A308175J873787n12383l192413l181757r37778J081620J476314O80399j36051
2508a540087j17730O93722J412794J316508O65093R3881j73517J42281J427457
2499C920402K562428R51455l592558o617135m059854J429076L339758M13575j862275
2490c515128Q858K437601J196314j683934j815200J21671P0334k135416k624299
$$ y = [-10572154, -8917298, -7240377, -7163719, -7279854, -6578267, -6032079, -6189765, -5926679, -4578199, -3243785, -2930186, -3039477, -2744195, -2503736, -3086942, -4114080, -4716671, -4925407, -5247469, -5286379, -4002278, -1433254, 848385, 1502995, 1039610, 994512, 1849789, 2737139, 3284327, 4470454, 6710927, 8139214, 6538704, 2778306, 418310, 1308175, 3181962, 2669579, -522834, -3704591, -4642369, -3560749, -2084435, -1404036, -1540087, -1657817, -964095, 448699, 1765207, 2430300, 2524181, 2350664, 2492945, 3920402, 6482830, 7434285, 3841727, -2775408, -6835262, -5406186, -2066428, -1652853, -3515128, -3506270, -1068669, 127645, -1556289, -3371489, -3249818, -3179484, -5314900, -7939199]
2481g939199k00628J872894J482771N34597P87667Q38712n47876j408982L03529
2472d276515K890970L178302J207296k14795J04363O27440K84079J10617R18478
2463D830235J452297K98804j642234k190231q64303O47278R76777O10299L75270
2454D494192l35884k481880n009882n266959k359925J082817J647451q29112l122168
2445a2181350k570729p2798J484955J023434L19691J205567K935782L312524J783017
2436b759907j2857q03981j172596j728161j352700J146681M507058N925753M262898
2427H012188Q91364k272761l991529l442354r07140J274881P84017j257981j390307
2418b299622R73455K250952J07084k609285j813488J981735M676551M152724J921565
$$ y = [-7939199, -8139827, -6266933, -4784162, -4249565, -3461898, -2623186, -3171062, -4580044, -4276515, -1385545, 1792757, 3000053, 2785258, 2889621, 3517061, 3801140, 3911757, 4830235, 6282532, 6581336, 4939102, 2748871, 1884568, 2531846, 3508623, 4118922, 4494192, 4158308, 1676428, -3333454, -8600413, -10960338, -9877521, -8230070, -9059182, -12181350, -14752079, -14824877, -13339922, -12316488, -11996797, -10791230, -7855448, -4542924, -2759907, -2772764, -3576745, -4749341, -6477502, -7830202, -6683521, -2176463, 3749290, 8012188, 8903552, 6630791, 2639262, -803092, -1710232, -435351, 348666, -909315, -2299622, -1326167, 924785, 1031869, -1577416, -3390904, -1409169, 3267382, 7420106, 9341671]
2409I341671n4992j277562j596858q71954q0347o09939k057656k522975j284649
2400a015261N10113J769309K174063J143300j562516m018181l481549k33183K358121
2391b355784K383899J382339P31610q01837l785160n339230k940018R38714J769283
2382h016184m08591j305950P29206K354385R89822r90717l91241J495947J245383
2373d297940p84264r56705J488660K871990R17606j337402n9805L306928L880104
2364E029172L81168l112253k893373q1672K003550K430281K418238K150197N79760
2355H905068j968197l551118l412628k951285l036031k286864L73545K860155
2347e067355J993043j732523l800618j159532L586775N198893K235057j528202
$$ y = [9341671, 9286679, 8009117, 6412259, 5540305, 5459958, 4850019, 2792363, 269388, -1015261, -505148, 1264161, 3438224, 4581524, 3019008, -999173, -4480722, -4713905, -2355784, 28115, 1410454, 2142064, 1340227, -2444933, -7784163, -10724181, -9785467, -8016184, -8424775, -9730725, -9001519, -6647134, -5657312, -6648029, -7039270, -5543323, -4297940, -5082204, -6038909, -4550249, -1678259, -760653, -2098055, -2157860, 1149068, 5029172, 5410340, 2298087, -595286, -676958, 1326592, 3756873, 6175111, 8325308, 8905068, 6936871, 3385753, -26875, -2978160, -6014191, -8301055, -7927510, -5067355, -3074312, -4806835, -8607453, -9766985, -6180210, -981317, 1253740, -274462]
2339b74462k172483j45588J243093K86376j686848k528681j383580J099493L358524
2330b204156L858695K488633P85704q0468q03798k182765k967351j609717N56447
2321b158776O52326j277348k096316l93133J563310J658263O38391l76230j795599
2312c585112l018709j486473K802311N109096K181312k043681j646952K314020
2304F25812L502043J24301k885748k199823p86919j999484l887460k830306O17244
2295i720340L103334L372726K478189Q69534j445328k904925j674033J358195
2287d562648L275587K761714J156297N3080m08987q08578j393726j933311j803908
2278c664480m77857J406509K142659J007124o02922j133696r98266j317281j516429
$$ y = [-274462, -2446945, -2592533, -1349440, -1063064, -2749912, -5278593, -6662173, -5562680, -2204156, 1654539, 4143172, 4928876, 4848408, 4044610, 1861845, -1105506, -2715223, -2158776, -1506450, -2783798, -4880114, -5273247, -3709937, -2051674, -1413283, -1789513, -3585112, -6603821, -8090294, -5287983, -178887, 2002425, -41256, -1688208, 625812, 4127855, 4252156, 1366408, -833415, -1620334, -3619818, -7507278, -10337584, -9720340, -6617006, -3244280, -766091, 103443, -1341885, -4246810, -5920843, -4562648, -1287061, 1474653, 2630950, 2684030, 2275043, 1466465, 72739, -1860572, -3664480, -4142337, -2735828, -593169, 413955, -188967, -1322663, -2320929, -3638210, -5154639]
$$ [...]
##END NTUPLES=NMR SPECTRUM
##END=
