##TITLE=31Pdec_89-2025
CDCl3, 24 sc
 5.8.2025
##JCAMPDX= 6.0         $$ Bruker NMR JCAMP-DX V2.0
##DATA TYPE= NMR SPECTRUM
##DATA CLASS= NTUPLES
##ORIGIN= UXNMR, Bruker Analytische Messtechnik GmbH
##OWNER= root
$$ XWIN-NMR		Version 3.5
$$ Tue Aug  5 13:56:22 2025 Russian Standard Time (UT+4h)  she@DPX200
##.OBSERVE FREQUENCY= 81.013821
##.OBSERVE NUCLEUS= ^31P
##.ACQUISITION MODE= SIMULTANEOUS
##.ACQUISITION SCHEME= undefined
##.AVERAGES= 24
##.DIGITISER RES= 17
##SPECTROMETER/DATA SYSTEM= spect
##.PULSE SEQUENCE= zgpg30
##.SOLVENT NAME= CDCl3
##.SHIFT REFERENCE= (INTERNAL, CDCl3, 0, 198.062)
##AUDIT TRAIL= $$ (NUMBER, WHEN, WHO, WHERE, WHAT)
$$ ##TITLE= Audit trail, XWIN-NMR		Version 3.5
$$ ##JCAMPDX= 5.01
$$ ##ORIGIN= Bruker BioSpin GmbH
$$ ##OWNER= she
$$ F:/spectra/data/she/nmr/P31/2/pdata/1/auditp.txt
$$ ##AUDIT TRAIL=  $$ (NUMBER, WHEN, WHO, WHERE, WHAT)
(   1,<2025-08-05 13:55:04.34 +0400>,<she>,<DPX200>,
      <created by zg, POWCHK disabled, PULCHK disabled
       configuration hash MD5:
       00 E9 B6 7A A2 85 ED C7 34 08 36 98 17 FE 4E 26
       data hash MD5: 32K
       42 5D F4 EE C8 DB CB 56 F2 81 72 7B 00 13 9B 28>)
(   2,<2025-08-05 13:55:06.62 +0400>,<she>,<DPX200>,
      <Start of raw data processing
       efp BC_mod = 2 LB = 1.5 FT_mod = 6 PKNL = 1 PHC0 = 1125.146 PHC1 = 870.499 SI = 64K 
       data hash MD5: 64K
       9C 93 B0 FA FC 89 F5 B8 90 2B E3 7D CB 04 63 EA>)
(   3,<2025-08-05 13:55:32.00 +0400>,<she>,<DPX200>,
      <pk PHC0 = 331.5047 PHC1 = -915.0002 
       data hash MD5: 64K
       B9 09 0E 49 3C 30 D1 13 A1 AA 57 E6 43 45 58 F5>)
(   4,<2025-08-05 13:55:35.96 +0400>,<she>,<DPX200>,
      <abs ABSG = 5 
       data hash MD5: 64K
       00 99 C7 D2 46 CB 20 BB C4 6F 00 43 F2 87 FC 9C>)
$$ ##END=
$$ 
$$ hash MD5
$$ 40 4D E0 55 9F 39 E7 7E 46 78 5B 98 B7 0D A4 47
##$RELAX= 
##$RELAX= 
##$RELAX= 
##$RELAX= 
##$RELAX= 
##$RELAX= 
##$RELAX= 
##$RELAX= 
$$ Bruker specific parameters
$$ --------------------------
##$DU= <F:/spectra>
##$EXPNO= 2
##$NAME= <P31>
##$PROCNO= 1
##$TYPE= <nmr>
##$USER= <she>
##$AMP= (0..31)
100 100 100 100 100 100 100 100 100 100 100 100 100 100 100 100 100 100 
100 100 100 100 100 100 100 100 100 100 100 100 100 100 
##$AQSEQ= 0
##$AQ_mod= 1
##$AUNM= <au_zg>
##$AUTOPOS= <>
##$BF1= 81.014009
##$BF2= 200.13
##$BF3= 200.13
##$BF4= 200.13
##$BF5= 200.13
##$BF6= 200.13
##$BF7= 200.13
##$BF8= 200.13
##$BYTORDA= 1
##$CFDGTYP= 0
##$CFRGTYP= 5
##$CHEMSTR= <none>
##$CNST= (0..31)
1 1 145 1 1 1 1 1 1 1 1 1 1 1 1 1 1 1 1 1 1 1 1 1 1 1 1 1 1 1 1 1 
##$CPDPRG= <waltz16>
##$CPDPRG1= <>
##$CPDPRG2= <waltz16>
##$CPDPRG3= <>
##$CPDPRG4= <mlev>
##$CPDPRG5= <mlev>
##$CPDPRG6= <mlev>
##$CPDPRG7= <mlev>
##$CPDPRG8= <mlev>
##$CPDPRGB= <>
##$CPDPRGT= <>
##$D= (0..31)
0 1 0 0 0 0 0 0 0 0.06 0 0.03 2e-05 3e-06 0 0 0.0002 0 0 0 0 0 0 0 0 0 
0 0 0 0 0 0 
##$DATE= 1754387703
##$DBL= (0..7)
120 120 120 11 120 120 24 19 
##$DBP= (0..7)
150 150 150 150 150 150 150 150 
##$DBP07= 0
##$DBPNAM0= <>
##$DBPNAM1= <>
$$ [...]
##$SUBNAM3= <"">
##$SUBNAM4= <"">
##$SUBNAM5= <"">
##$SUBNAM6= <"">
##$SUBNAM7= <"">
##$SUBNAM8= <"">
##$SUBNAM9= <"">
##$SW= 400.765351723535
##$SWIBOX= (0..15)
0 1 3 0 0 0 0 0 0 0 0 0 0 0 0 0 
##$SW_h= 32467.5324675325
##$TD= 32768
##$TD0= 1
##$TE= 0
##$TE2= 300
##$TE3= 300
##$TEG= 300
##$TL= (0..7)
0 120 53 12 22 120 120 120 
##$TP= (0..7)
150 150 150 150 150 150 150 150 
##$TP07= 0
##$TPNAME0= <>
##$TPNAME1= <>
##$TPNAME2= <>
##$TPNAME3= <>
##$TPNAME4= <>
##$TPNAME5= <>
##$TPNAME6= <>
##$TPNAME7= <>
##$TPOAL= (0..7)
0.5 0.5 0.5 0.5 0.5 0.5 0.5 0.5 
##$TPOFFS= (0..7)
0 0 0 0 0 0 0 0 
##$TUNHIN= 0
##$TUNHOUT= 0
##$TUNXOUT= 0
##$USERA1= <user>
##$USERA2= <user>
##$USERA3= <user>
##$USERA4= <user>
##$USERA5= <user>
##$V9= 5
##$VALIST= <valist>
##$VCLIST= <CCCCCCCCCCCCCCC>
##$VD= 0
##$VDLIST= <DDDDDDDDDDDDDDD>
##$VPLIST= <PPPPPPPPPPPPPPP>
##$VTLIST= <TTTTTTTTTTTTTTT>
##$WBST= 1024
##$WBSW= 4
##$XGAIN= (0..3)
0 0 0 0 
##$XL= 0
##$YL= 0
##$YMAX_a= 4291
##$YMIN_a= -8259
##$ZGOPTNS= <>
##$ZL1= 120
##$ZL2= 120
##$ZL3= 120
##$ZL4= 120
##$ABSF1= 198.0616
##$ABSF2= -202.7028
##$ABSG= 5
##$ABSL= 3
##$ALPHA= 0
##$AQORDER= 0
##$ASSFAC= 0
##$ASSFACI= 0
##$ASSFACX= 0
##$ASSWID= 0
##$AUNMP= <proc_1d>
##$AZFE= 0.1
##$AZFW= 0.5
##$BCFW= 0
##$BC_mod= 2
##$BYTORDP= 0
##$COROFFS= 0
##$CY= -3
##$DATMOD= 1
##$DC= 0
##$DFILT= <>
##$DTYPP= 0
##$F1P= 0
##$F2P= 0
##$FCOR= 1
##$FTSIZE= 65536
##$FT_mod= 6
##$GAMMA= 0
##$GB= 0
##$INTBC= 1
##$INTSCL= 9.790993e-09
##$ISEN= 30
##$LB= 1.5
##$LEV0= 0
##$LPBIN= 0
##$MAXI= 10000
##$MC2= 0
##$MEAN= 0
##$ME_mod= 0
##$MI= 50
##$NCOEF= 0
##$NC_proc= -7
##$NLEV= 6
##$NOISF1= 182.463
##$NOISF2= 159.3651
##$NSP= 0
##$NTH_PI= 0
##$NZP= 0
##$OFFSET= 198.0616
##$PC= 4
##$PHC0= 1456.651
##$PHC1= -44.50116
##$PH_mod= 1
##$PKNL= yes
##$PPARMOD= 0
##$PSCAL= 0
##$PSIGN= 0
##$REVERSE= no
##$SF= 81.0140089999434
##$SI= 65536
##$SIGF1= 159.3651
##$SIGF2= -187.1042
##$SINO= 113.3802
##$SIOLD= 16384
##$SREGLST= <1H.CDCl3>
##$SSB= 0
##$STSI= 65536
##$STSR= 0
##$SW_p= 32467.5324675325
##$SYMM= 0
##$S_DEV= 0
##$TDeff= 32768
##$TDoff= 0
##$TI= <>
##$TILT= no
##$TM1= 0
##$TM2= 0
##$TOPLEV= 0
##$USERP1= <user>
##$USERP2= <user>
##$USERP3= <user>
##$USERP4= <user>
##$USERP5= <user>
##$WDW= 1
##$XDIM= 65536
##$YMAX_p= 567487405
##$YMIN_p= -13146117
$$ End of Bruker specific parameters
$$ ---------------------------------
##NTUPLES= NMR SPECTRUM
##VAR_NAME=  FREQUENCY,     SPECTRUM/REAL,   SPECTRUM/IMAG
##SYMBOL=    X,             R,               I
##VAR_TYPE=  INDEPENDENT,   DEPENDENT,       DEPENDENT
##VAR_FORM=  AFFN,          ASDF,            ASDF
##VAR_DIM=   65536,         65536,           65536
##UNITS=     HZ,            ARBITRARY UNITS, ARBITRARY UNITS
##FACTOR=    0.49542278885378, 1,            1
##FIRST=     16045.7642231865, 0,            0
##LAST=      -16421.768244346, 0,            0
##MIN=       -16421.768244346, -13146117,    0
##MAX=       16045.7642231865, 567487405,    0
$$ Real data points
##PAGE= N=1
##DATA TABLE= (X++(R..R)), XYDATA
$$ [...]
40026F07484J61923N7700o625j12558j24151r2651j83184k91021j07603M64024
40016C73338J150068J471698J024801j37262j306492j637646j025122j78824K57014
40007h427K76026J23101j17510k93784r1258M31659O66128K62028k77941l06381
39997F63641J0428P316m36094p54537n26142N7089N55658P31567N97966L01897
39987A208789j560k81771n68181p26408n62757k27954j29115k89334k75895O019
39977a848167N0998l22465m52487J37925Q03540O85925P0923j23513J33252P7838
39967g86231l74752m42074Q8717L64149j77247q79387q39328q6554P30254J225464
39957a176989J339244J074409O92838O72043R30780N98182p92339k276904k401036
$$ y = [607484, 769407, 827107, 820482, 707924, 583773, 491122, 307938, 16917, -90686, 373338, 1523406, 2995104, 4019905, 3882643, 2576151, 938505, -86617, -265441, -8427, 267599, 390700, 273190, -20594, -111852, 319807, 985935, 1247963, 970022, 663641, 674069, 681385, 245291, -509246, -1035388, -978299, -422641, 308926, 906892, 1208789, 1207229, 925458, 357277, -369131, -931888, -1159842, -1288957, -1578291, -1854186, -1848167, -1797169, -2119634, -2572121, -2434196, -1630656, -944731, -873808, -997321, -864069, -786231, -1160983, -1603057, -1514340, -1150191, -1327438, -2206825, -3046153, -3132707, -2402453, -1176989, 162255, 1236664, 1929502, 2601545, 3532325, 4130507, 3338168, 1061264, -1339772]
39948a339772j031445M84412R68770N79212J92023K04321L04231J16393l09928
39939A68217o09541m87075m083L99455K33181m94523j051711o09298O96730J614955
39929a43693J130996j85623q07215k32685M66087L84282J17424N74437J264895
39920B568905R80520k06392r66728p15615k79275l30686m44417j99518j8694j90203
39910A97897j32414M67669P36900p1528j117646j081155j93177K06525j35953
39901a122882j17631O99390J247163O66072l16989n21486K717L14427Q3719j67242
39891G67258j24779j29086m52968p83450p07459l11345K6578K00726L82919N61729
39881e69877M73135R1214j67032K223K90820K21141r8415j81571n9138k86554
$$ y = [-1339772, -2371217, -1886805, -918035, -338823, -146800, 57521, 361752, 478145, 168217, -441324, -928399, -932482, -533027, -299846, -794369, -1846080, -2455378, -1758648, -143693, 987303, 801680, -5535, -238220, 227867, 612149, 729573, 1304010, 2568905, 3549425, 3343033, 2376305, 1660690, 1381415, 1050729, 606312, 406794, 388100, 197897, 65483, 533152, 1270052, 1198524, 80878, -1000277, -1193454, -986929, -1122882, -1240513, -541123, 706040, 1372112, 1055123, 533637, 536354, 850781, 934500, 767258, 642479, 513393, 60425, -723025, -1430484, -1741829, -1715251, -1514525, -1131606, -569877, -96742, -5528, -172560, -170337, 120483, 341624, 243209, 61638, 2500, -284054]
39871b84054q81744r82524m2584J212098J658522J181815N05307j1196n16303
39862A839337p96695l18143O80236J103673M61104l89345n30154l12625o02540
39853A134848j208858j089116k9774Q75584P14076n6675l99433j21189J39216
39844d1321N4146J5931L67436Q26190R15528N64362K1620m91997p78800o56133
39834G96962l10478l27308q88549j234580n76864O21288J084958M98897n7458
39825c93132K28948P12421M25129l26608m63793J45620N13581O5223o03432p59607
39815d55650n55720n60946p77460o57222Q1109J028408J454815R61864j32962
39806C86236r66157q34353J12070R34900P79724k77748j242370j118594L5648
$$ y = [-284054, -1165798, -2148322, -2190906, -978808, 679714, 1861529, 2366836, 2355640, 1839337, 1042642, 724499, 1404735, 2508408, 2969512, 2580167, 2050013, 1737388, 1134848, -74010, -1163126, -1192900, -317316, 396760, 340085, -59348, -180537, -41321, 12825, 28756, 396192, 1222382, 2137910, 2702272, 2723892, 2231895, 1453095, 796962, 486484, 159176, -729373, -1963953, -2540817, -1919529, -834571, -335674, -393132, -164184, 548237, 973366, 646758, 182965, 328585, 842166, 907389, 303957, -455650, -1011370, -1572316, -2349776, -3006998, -2925889, -1897481, -442666, 519198, 386236, -579921, -1414274, -1302204, -367304, 412420, 134672, -1107698, -2226292, -2190644]
39797b190644J024666P84588k57827o05588L21155J291581R44986k49839o93304
39788C69774J142N70726J28176n83252m93698K08656N62440K25262m02489r27389
39778c40652j052182l86769R08280J612698O60579j153827j765402m29086J229644
39769g16717J292571r6652j209702j046772k37670K51203L68176N73180Q14048
39760h335N55900k84483r79434p95873Q5111P46739N98904q670l38363j79111
39750f07615O8960R7438O7708J80867K54358L9240k82073l20144r9354j3376j52029
39739g66020j65837M4627M3383l59105n25054J75712J221031J404367M64798n07242
39729A030660n27362J03591M73302L05040l2291k99111m93533m68414j48118J5586
$$ y = [-2190644, -1165978, -381390, -639217, -1244805, -923650, 367931, 1312917, 1063078, 369774, 370916, 941642, 1069818, 486566, -7132, 201524, 763964, 989226, 586737, -340652, -1392834, -1779603, -871323, 741375, 1401954, 248127, -1517275, -1946361, -716717, 575854, 479202, -730500, -1777272, -2014942, -1763739, -1395563, -822383, -8335, 547565, 263082, -716352, -1512225, -1427114, -680375, -81471, -90141, -428504, -607615, -538655, -441217, -373509, -192642, 61716, 100956, -181117, -501261, -600615, -613991, -766020, -931857, -887230, -843847, -1202952, -1728006, -1552294, -331263, 1073104, 1537902, 1030660, 503298, 606889, 1080191, 1385231, 1352940, 1053829, 560296, 91882, -56236, -40650]
39719d0650m67485j191191j154694j58432Q07420Q78597L82344J42616K80898
39710e20577L38603K31922L42628P34465R61635P87956N36186M74157L23135k45127
39700C964983r58809j274822j190614j183517j311422r56889K17973J511963J903651
39691G22497J320355O21017L59971K04078k30453n85534l04453L86291O28372
39682C122141J8359q98844j293671r17504k18572K11902J94231k814j24630k79343
39672a88745o28373q87258o06260K3785K54934q2402j94193M30263J022021N60188
39662b96040o38053j281698q75152j86294N2454j7150l3145o2186k21338k83968
39652c842570n0526L33095O82345R76102J097726Q57771M14637J56806N6694k70006
$$ y = [-40650, -508135, -1699326, -2854020, -3012452, -2205032, -1326435, -944091, -801475, -520577, -181974, 49948, 392576, 1127041, 2088676, 2876632, 3412818, 3886975, 4210110, 3964983, 3006174, 1731352, 540738, -642779, -1954201, -2911090, -2693117, -1181154, 722497, 2042852, 2663869, 3023840, 3227918, 2997465, 2411931, 2107478, 2493769, 3122141, 3140500, 2241656, 947985, 30481, -188091, 23811, 218042, 215228, 90598, -188745, -817118, -1704376, -2310636, -2286851, -2031917, -2114319, -2308512, -1878249, -856228, -296040, -934093, -2215791, -3090943, -3277237, -3224783, -3241933, -3275078, -3337264, -3558602, -3842570, -3893096, -3560001, -2877656, -1901554, -803828, 53943, 468580, 625386, 682080, 412074]
39642D12074p60756q73630n37809l41595m77361l49450L24321Q78810P66755M47818
39632e10823M89064N35957N9464n07742l83351K60155N99763M50141K77008J86088
39622A455724r7515m07562l11801l5160j90549n89163l82273M77440R90221O19455
39612A528817K8652j09007n6975j98830j92523K78788O42159K44047m59485m88696
39602A216947J33220M08278q8801o16270m77094l1992J0089k49261j64907K46144
39592C86353J67162p31895j507025r95209O22658J921969J871714Q17058k53093
39583B299692q17427r23091p25249l90986j20176J34610O30904J169195R73356
39574B230828j87047j252138j070177j9299N14407J26345k19056R1554L52081
$$ y = [412074, -348682, -1222312, -1760121, -2101716, -2579077, -2928527, -2604206, -1725396, -958641, -510823, -21759, 514198, 573662, 65920, -317431, -57276, 542487, 992628, 1269636, 1455724, 1358209, 950647, 638846, 603686, 413137, -176026, -558299, -80859, 909362, 1528817, 1557469, 1448462, 1391487, 1192657, 1000134, 1278922, 1921081, 2165128, 1705643, 1216947, 1350167, 1758445, 1669644, 1053374, 576280, 544288, 554377, 305116, 140209, 386353, 553515, -178380, -1685405, -2680614, -2057956, -135987, 1735727, 2552785, 2299692, 1482265, 559174, -166075, -557061, -677237, -542627, 88277, 1257472, 2230828, 2043781, 791643, -278534, -297833, 216574, 342919, 123863, 215417, 567498]
39565E67498j81477r53536q71993P2284P53504L72070o05233j046043m10467O83335
39555a620058J120069N25675l07611m31440P1296L52587N3085l69550n37728o09279
39545a752954o37878k27026P62655J719331J929835J325403K86921q13271j550481
39536A042535j448826m98006O65219J393112J499753R93786k2993r57512j012619
39527A654449l00188J26314j48450k34321M18046P81124j28259j282987r28498
39518d2770O24276J298405L68364n36939n6311R23516Q52374j90971r63959r65747
39508A310238o80762m47227k35070k74236q08077j265431o89684Q10389J868769
39499d11091J476816J83544p14157p04429k94393j7524J75840M83347P11538N25986
$$ y = [567498, 386021, -567515, -1439508, -1367224, -613720, -241650, -846883, -1892926, -2303393, -1620058, -499989, 25686, -281925, -713365, -642069, -289482, -236397, -605947, -1143675, -1752954, -2390832, -2617858, -1855203, -135872, 1793963, 3119366, 3406287, 2593016, 1042535, -406291, -904297, -239078, 1154034, 2653787, 3647573, 3624580, 2667068, 1654449, 1354261, 1480575, 1332125, 1097804, 1515850, 2296974, 2168715, 885728, -42770, 581506, 1879911, 2248275, 1711336, 1655025, 2578541, 3430915, 3239944, 2275985, 1310238, 629476, 182249, -52821, -327057, -1135134, -2400565, -3090249, -2279860, -411091, 1065725, 1249269, 535112, -169317, -463710, -481234, -305394, 177953, 889491, 1415477]
39489A415477M7972k01946q298K39333J52328m7441J19081N96223Q03031M34674
39479C550434j67043n47727o71110p39887p87811o70652k96243K51691O76016
39470E97668N90884k1479n24718k38598O27015J156460R34910M54044J33132k87560
39460C421758r44522j252626q32026l44335m83028o97823o1076R72433J022723
39451H01478m1760p96221m19763J89239M3683m29905l85022j4038N3311L2939
39441i66059M97117J107966J016377K69807k47148j49749J20272J89454O4079
39432A902116l18684r07121j050897k58194O63500M39578o53135r59524P3855
39423a068506J024301O94478k05373m85637l31586n14826p29974j55904Q72680
$$ y = [1415477, 1463449, 1261503, 1253205, 1492538, 1644866, 1597425, 1716506, 2312729, 3115760, 3550434, 3383391, 2835664, 2164554, 1424667, 636856, -33796, -330039, -78348, 597668, 1188552, 1167073, 642355, 403757, 1030772, 2187232, 3122142, 3576186, 3709318, 3421758, 2477236, 1224610, 392584, 48249, -434779, -1132602, -1193678, -221245, 801478, 759718, -36503, -456266, -267027, -223344, -653249, -1038271, -1052309, -998998, -966059, -468942, 639024, 1655401, 1925208, 1678060, 1528311, 1648583, 1838037, 1902116, 1583432, 676311, -374586, -632780, 30720, 470298, -182837, -1142361, -1068506, -44205, 650273, 444900, -40737, -372323, -887149, -1617123, -1773027, -900347]
39414i00347J155779L97324m71960o49543j69211O18114J328449J404823O09840
39405C323268l69784o14929j77922J78666K24132L06291L46732j10145q36454
39396B269855r92569m08363J70544K38835n026l83780q47143p92766M27499K035676
39386A712762K217412N44018j234139j492137o49416j0121J27552J93653K06733
39377A616317O9543K05822P58062Q51329j61819j342267j323357l67848N4233
39368C60015n31916j151496j062214o29556l71669k14666J8298K12768L12554
39359c057882M23851M63450K95369J97154N38130J038071J036208M65698j20585
39350A279464m20740n51245m45140O9266N84029L83342m62556j059849q99660
$$ y = [-900347, 255432, 652756, 180796, -468747, -637958, -19844, 1308605, 2713428, 3323268, 2953484, 2338555, 2160633, 2339299, 2563431, 2869722, 3216454, 3106309, 2269855, 1277286, 868923, 1039467, 1278302, 1273276, 889496, 42353, -750413, -322914, 1712762, 3930174, 4474192, 3240053, 1747916, 1098500, 1088379, 1215931, 1409584, 1616317, 1685860, 1891682, 2649744, 3501073, 3339254, 1996987, 673630, 305782, 360015, -171901, -1323397, -2385611, -3015167, -3386836, -3601502, -3583204, -3370436, -3057882, -2634031, -2170581, -1875212, -1678058, -1139928, -101857, 934351, 1400049, 1279464, 858724, 307479, -137661, -68395, 515634, 898976, 436420, -623429, -1523089]
39341a523089l76094J9714K64255M05490L52292K60417M45957P58528P21736L89000
39331A718206K86114L99393J15014o07543r34351m11275L33984N91010M80649
39322A971201L95313K88774P6398P4582M64290Q56842Q64098N65497N8567p56235
39312D859327j533443j455507m48630L67868J62556m38660m84256k28707m67618
39303C32930r41750o82772K88655Q68698N46943Q4821K48237P57024Q91292M67621
39293B861699k18381r16387j418057j343950m56119P87724J345435N65329r33441
39284B73852j674665r10011M53651R75268M95727Q8887K86781M03169p6563n44789
39274b28693l86368n5601j19388q0856O89850J507264J200057L7155n59978j45664
$$ y = [-1523089, -1899183, -1879469, -1615214, -1209724, -857432, -597015, -151058, 607470, 1329206, 1718206, 2004320, 2403713, 2518727, 1911184, 976833, 565558, 899542, 1490552, 1971201, 2366514, 2655288, 2731686, 2806268, 3270558, 4127400, 4991498, 5556995, 5615562, 4859327, 3325884, 1870377, 1421747, 1789615, 1952171, 1513511, 1029255, 800548, 332930, -608820, -1291592, -1002937, -134239, 412704, 497525, 745762, 1502786, 2394078, 2861699, 2643318, 1726931, 308874, -1035076, -1491195, -703471, 641964, 1207293, 273852, -1400813, -2310824, -1857173, -881905, -386178, -297291, -10510, 392659, 316096, -228693, -615061, -670662, -790050, -870906, -181056, 1326208, 2526265, 2563420, 2003442, 1857778]
39264A857778K56188q5645o46481p88091o85625n87933j76389O54400J176392
39255I74594P53869j29038m50258O8967Q05584J103433Q46247L26555j19833m15505
39245C764615p71360j257047j437894q55805J64632P37130N11862m960l13486
39236E37687m63463n74708n00539k34152m93L01126R87971J620302J090220o80356
39226B083595k030106j492455K03958J120304O44888j03245j83208J00649J80548
39217E24928J36629J65279j642n25441q61032l81012O33298J149039N31679p37326
39207F34399j541472j249146l30741K07215Q850k74251J6821N92427P32796M38586
39197g64516L37033N38515M35149j77877n97529k47298M58349Q07698P73508O87961
$$ y = [1857778, 2113966, 2028321, 1381840, 593749, -91876, -679809, -856198, -201798, 974594, 1728463, 1599425, 1149167, 1218134, 2023718, 3127151, 3973398, 4299953, 4180120, 3764615, 2993255, 1736208, 298314, -557491, -392859, 344271, 856133, 851173, 537687, 74224, -500484, -1001023, -1235175, -1235668, -934542, 53429, 1673731, 2763951, 2083595, 53489, -1438966, -1235008, -114704, 530184, 426939, 243731, 344380, 524928, 661557, 826836, 825194, 299753, -561279, -942291, -308993, 840046, 1371725, 634399, -907073, -2156219, -2486960, -2279745, -2270895, -2545146, -2528325, -1935898, -1203102, -764516, -427483, 111032, 546181, 368304, -229225, -476523, -18174, 789524, 1563032, 2250993]
39187B250993M51206j56500p13254n94841o9919n9605o94658r82981k67499P32835
39177a04223R03438K39849k86935j05521L74559N30655L07084M2370j12902l06085
39167A482289o01653p22748l18886M91798J014235O47548l60028j115253j093292
39158e75990o17601k14145P6566M25956O61478N10890J93873J98559N07385N83161
39148A750132J98649k19170k53570q3691j28836l94778m93938k18135J48973J43159
39138D48795l07443o98555m86376J87672N99914M00432N3767O791q9904p12661
39128e97568j412447j304810m64644J29485J13145J95326P97323J203364O38237
39119g02589n47901j376516j349963n72445N98982J479035J307401K53032m42106
$$ y = [2250993, 2702199, 2545699, 1832445, 1237604, 1167685, 1108080, 413422, -569559, -837058, -104223, 799215, 1039064, 752129, 646608, 1021167, 1551822, 1858906, 1901276, 1788374, 1482289, 880636, 157888, -160998, 330800, 1345035, 1992583, 1632555, 517302, -575990, -1193591, -1407736, -1331170, -905214, -243736, 267154, 461027, 659586, 1166971, 1750132, 1948781, 1729611, 1476041, 1392350, 1263514, 868736, 374798, 156663, 305636, 448795, 141352, -557203, -1043579, -855907, -255993, 144439, 198206, 204997, 115093, -597568, -2010015, -3314825, -3779469, -3649984, -3536839, -3341513, -2544190, -1340826, -702589, -1250490, -2627006, -3976969, -4549414, -3950432, -2471397, -1163996, -910964, -1353070]
39110a353070l4264O30561M11587l86843o22316j69349O7402k09882k92138K21084
39100a737228Q09532R62334Q00219N40687J76476r9954L6430L31417J20160n48047
39090A392026p98309k73006K64568J30023k64933j84480K80777M84539K00759
39081A231964k54309n52456n36874j69637L11268M58899J48827k45607m06201
39072a4126l89592k23842K37312P64526P14133J0924m52854j8669O74834N71156
39062A873802k56545p65410m65331K8199o625n09067q90333p07686L4426Q93371
39052g71199J219797O97458k60751q75937p91909l34064l3100r7368l37328m37874
39042b022275k77991j4816J96279M74225R60966J362239J149816K97143o07855
$$ y = [-1353070, -1387334, -756773, -345186, -732029, -1354345, -1523694, -1456292, -1666174, -1958312, -1737228, -927696, 34638, 834857, 1375544, 1552020, 1452066, 1488496, 1819913, 1940073, 1392026, 593717, 320711, 585279, 715302, 450369, 265889, 546666, 1031205, 1231964, 977655, 425199, -111675, -281312, 29956, 488855, 637682, 392075, -14126, -403718, -627560, -390248, 374278, 1088411, 1099335, 646481, 627812, 1302646, 1873802, 1617257, 851847, 386516, 414715, 408090, -100977, -991310, -1698996, -1664570, -771199, 448598, 1146056, 885305, 9368, -782541, -1116605, -1149705, -1247073, -1584401, -2022275, -2300266, -2315082, -2118803, -1644578, -683612, 678627, 1828443, 2125586, 1517731]
39033A517731j094906j191490r62797l04691N15702P93295L56208O847L90619
39024B6518R68278Q36640J05133l94985m42529n29489p85342p62726l50261j2657
39014a341420O1361K52483O94318R01847N66418P3049j79699l78672p25241q13537
39004h89093k46654M73830M52746k53991n48986J96588J128518R19884m83300
38995G49542j731110j709876p39712J32349N01202O97541Q46060O33398P0084
38986e50522k53478K4233N08903O51387M20479Q1258k32869m12260l11257j20116
38976a94242k76465o74726o15715J1146K91284k67599o82421O1952J194694J144772
38966g320j0652o12354K2984O51191J74485o93015o54256K61558R51465P83604
$$ y = [1517731, 422825, -768665, -1731462, -2036153, -1520451, -727156, -370948, -364101, 26518, 994796, 1831436, 1936569, 1541584, 1099055, 569566, -215776, -978502, -1328763, -1341420, -1280059, -1027576, -333258, 568589, 1135007, 1208056, 1028357, 649685, -75556, -889093, -1135747, -661917, -209171, -463162, -1012148, -815560, 312958, 1232842, 749542, -981568, -2691444, -3431156, -3298807, -2797605, -2100064, -1254004, -620606, -550522, -804000, -779767, -270864, 380523, 801002, 882260, 649391, 237131, -74126, -194242, -470707, -1145433, -1761148, -1750002, -1458718, -1726317, -2408738, -2346786, -1152092, -7320, -17972, -630326, -607342, 43849, 218334, -474681, -1128937, -867379, 84086, 867690]
38956H67690N4513o80360j006911o93336J6421L69138o7136p12482o35536K34277
38946b253722J067102J239976R73080P74458O78335L14742m15107j021466r32942
38937D24456k45505K94398J89502j89839j92783J27939J05768n03848j091438
38928a081350r45937o6385R35034J453873J298028P19433J50555k12788m95977
38919A754486p00118n07015J16545N34068K74756j16191J10161N52232K09633
38910B228557p30180r92069l12762J5478o77262j149176k17105J160649J202909
38901E29039m5652r22878o32332Q634K38211K80259L50956R4250m46129m25088
38891i70730M86838J248052P58882n54669j322635j021546l44191J9677J11668
$$ y = [867690, 922203, 241843, -765068, -1458404, -1441983, -1072845, -1139981, -1852463, -2487999, -2253722, -1186620, 53356, 1026436, 1800894, 2479229, 2793971, 2378864, 1357398, 424456, 178951, 473349, 662851, 473012, 280229, 408168, 513936, 10088, -1081350, -2027287, -2093672, -1158638, 295235, 1593263, 2312696, 2463251, 2250463, 1754486, 1054368, 547353, 663898, 1197966, 1472722, 1356531, 1466692, 2018924, 2228557, 1498377, 506308, 193546, 209024, -468238, -1617414, -1834519, -673870, 529039, 483387, -439491, -1071823, -1063189, -824978, -544719, -193763, -99513, -545642, -970730, -483892, 764160, 1523042, 968373, -354262, -1375808, -1719999, -1700322, -1588654]
38882a588654J64068J19240p826J23377O34840J017351P36614K7221l96708l02100
38872E27423r7654n0239Q4806M68184P38490N14864m7458n53803q63237r23175
38862b01799n34888K07074O29554K71892l45076m45330j96633l13139o66890l83247
38852a978482O04453J226763Q59903K09203R2301K76353K01457M1947K19301M68385
38842B221584K53901k86031n94851n85992n67042n50548l33852o5056q6492l53675
38832i48054n53384o31932o95791n82508o3088O63416J133199J142038P67063
38823B30959J28779n02489o94140l70081k6029l8741j38440M8286L97024O40236
38813c24636P77400O99374R7072p14790p21418K95734J074933O39517j69237j15442
$$ y = [-1588654, -1424586, -1305346, -1313172, -1189795, -554955, 462396, 1199010, 1226231, 829523, 527423, 429769, 379530, 464336, 932520, 1671010, 2185874, 2138416, 1584613, 721376, -201799, -736687, -529613, 99941, 371833, 26757, -418573, -615206, -928345, -1595235, -1978482, -1374029, -147266, 712637, 921840, 1014141, 1290494, 1491951, 1533898, 1753199, 2221584, 2475485, 2189454, 1594603, 1008611, 441569, -108979, -442831, -507887, -594379, -948054, -1501438, -2133370, -2829161, -3411669, -3474757, -2811341, -1678142, -536104, 230959, 359738, -142751, -836891, -1206972, -1233001, -1271742, -1410182, -1361896, -964872, -324636, 452764, 1152138, 1249210, 534420, -186998, 108736, 1183669, 1823186, 1653949, 1538507]
38803A538507L88380J67448n51974o36041j70632j67070m67481l6095P64000M76976
38793A306018o52680o50093P91246J410785L6520j300973o13049Q36493P42021
38784A906288n03019p73973J64441N94803q3424o54401m18776p1716l0754K09241
38774C38710O70960N39001k86792p53257l09721L01410M29649M29345N83385L17486
38764B260176p16062j711897j685439p24657L34644Q83864P43395O5566n18784
38755a069194l23054M36841Q09367N25896L34140N24694K78742p66907j449679
38746f99154p07507O12171R06092J87106j31833M66234R96421P28381J91967N8694
38736B608572J29521k9002k82133l34504l33139n32363p76621p44379m12711j2871
$$ y = [1538507, 1926887, 2094335, 1542361, 906320, 735688, 568618, 101137, 65042, 829042, 1306018, 653338, 3245, 794491, 2205276, 2241796, 940823, 327774, 1164267, 1906288, 1403269, 629296, 793737, 1388540, 1305116, 650715, 231939, 160223, 129469, 338710, 1009670, 1548671, 1261879, 508622, 198901, 500311, 929960, 1359305, 1942690, 2260176, 1544114, -167783, -1853222, -2577879, -2243235, -1359371, -615976, -550410, -1069194, -1392248, -955407, -146040, 379856, 713996, 1238690, 1517432, 750525, -699154, -1406661, -794490, 111602, 298708, 166875, 633109, 1629530, 2357911, 2549878, 2608572, 2738093, 2709091, 2426958, 2092454, 1759315, 1226952, 450331, -294048, -706759, -719630]
38726g19630J99575K9926m08009n03308K13738J148675J100465o0715r60321m99244
38716d58848O41731J010285L35674m14805n86229m60628l93502k64534O91J00937
38706d89228j20931l49409k84457n3322J06365K04011L08418L44583L01872L28575
38696B96477M05845K54667j80728m70754k37049K87227N64114M46365K28710J01606
38686A696480r6930n38216j056113j271420r89771l99727J28947L98389M61539
38677a666822L89286J77565l7534J7440K99687L33861p0917l47998Q619M95361
38667d01452L00029k54189n6307R16093J309299M51737n22372m41611J01778j06360
38657A296645q01977p51016P3286L96011k46812p60899k52996O66380R33206M58926
$$ y = [-719630, -520055, -490129, -898138, -1401446, -1187708, -39033, 1061432, 1000717, 40396, -458848, 182883, 1193168, 1528842, 1114037, 527808, 67180, -326322, -590856, -590165, -489228, -610159, -959568, -1244025, -1297347, -1190982, -986971, -678553, -333970, -32098, 296477, 702322, 956989, 776261, 305507, 68458, 355685, 919799, 1366164, 1594874, 1696480, 1599550, 1061334, 5221, -1266199, -2255970, -2655697, -2526750, -2128361, -1666822, -1277536, -1099971, -1137505, -1120065, -820378, -486517, -557434, -905432, -896813, -401452, -101423, -355612, -411919, 504174, 1813473, 2265210, 1742838, 1301227, 1403005, 1296645, 494668, -256348, -183062, 212949, -33863, -794762, -1047758, -381378, 551828, 1010754]
38647A010754j40105n28921p03893n85415k10305K2546j35072k86748P3851P22749
38637g60559R05716L42171l73655m59581J99067R94742J303597J098479P61658
38628D011635M10301k38189j217720j949212j864405j091728j84396M85220P00769
38619i37725K97026l30555j77568J050307K058067J487110l7813o81966m3343
38610B683540M77195N2460m57618k51581J41742J35467J76087N41992L83668p79107
38600C103845j745839j266866q2975K08292l75283n08678J17454M99455K03733
38591A53138r4042m3300p7514k14318J57195R07596R46392p2668j028739r79414
38581c45674m73120m64146q16730p42648q6871O16772R22655O85460n0586q10128
$$ y = [1010754, 870649, 341728, -362165, -947580, -1157885, -1135339, -1270411, -1557159, -1483308, -760559, 145157, 487328, 113673, -345908, -146841, 847901, 2151498, 3249977, 4011635, 4421936, 4183747, 2966027, 1016815, -847590, -1939318, -2123714, -1638494, -937725, -640699, -971254, -1148822, -98515, 1959552, 3446662, 3408849, 2726883, 2683540, 3160735, 3213195, 2755577, 2503996, 2645738, 2781205, 2957292, 3499284, 3882952, 3103845, 1358006, 91140, 8165, 216457, -158826, -667504, -550050, -50595, 153138, 59096, 15796, -61718, -276036, -118841, 788755, 1735147, 1662479, 633740, -345674, -818794, -1282940, -2099670, -2842318, -2929189, -2312417, -1389762, -704302, -754888, -1565016]
38571a565016q18078J5804O81753K93484o39282q68348r8009P15031P11381J27998
38561a443282j97373J21507O75284P76898K13068m81981n68996M3474O73850O89697
38551E02146K11085j80294j80731N4468K82845L94645K99106j16217p83517j303209
38541h19673j151830k08765Q95151J218532N49607k01508k5957R11133J494359
38532B661049J087357J68262n18658q04653q44900o37069k32642P663j42171l53894
38522C90344k02416J83906L43150J63759o1391j30211p9511Q0130L78229O23207
38512A689196M73628j21417p52630r19145m99456J39454M52376J92604l71328
38503B83282p67212q06347o12477k61677K67611P65184Q36527M63892J34111J42301
$$ y = [-1565016, -2383094, -2367290, -1685537, -1392053, -2031335, -2899683, -2997692, -2282661, -1571280, -1443282, -1640655, -1519148, -843864, -66966, 146102, -335879, -904875, -861401, -187551, 502146, 713231, 532937, 352206, 406674, 689519, 1084164, 1383270, 1267053, 483536, -819673, -1971503, -2180268, -1285117, -66585, 483022, 281514, 255557, 1166690, 2661049, 3748406, 3916668, 3398010, 2593357, 1748457, 1111388, 878746, 886409, 744238, 390344, 187928, 371834, 714984, 878743, 817352, 687141, 607630, 687760, 1065989, 1689196, 2162824, 2041407, 1288777, 369632, -129824, 9630, 462006, 654610, 283282, -483930, -1290277, -1902754, -2164431, -1896820, -1131636, -295109, 168783, 302894, 445195]
38493D45195J25715l60674j100116j454587j155583m75397K12304O40388N82842
38484b539913P5168l33004l5956Q10112J318081Q82392j30633q62865q83824m46204
38474b146646k2361J75505K66820M60465P65310R15659O44383N8453l76528l40852
38464D00208o3001k7988k91899l58915Q6125N86825M60197j67443m26079M9588
38454B47618N32985K73991l75482n36207j15932K31024K20767J18381j09566p80565
38444b92986j493544j264011r4022O83542L09640j90940L44465J292376J244694
38435E39214K90372k06233J41560K66710m26144j108094r67177l79312k2178J38011
38425a733271K83475J10204m49651o92809j96581L29604J72821j29958K09652
$$ y = [445195, 570910, 210236, -889880, -2344467, -3500050, -3975447, -3763143, -3122755, -2539913, -2464745, -2797749, -2833705, -2023593, -705512, 176880, 46247, -816618, -1700442, -2146646, -2169007, -1993502, -1726682, -1266217, -500907, 414752, 1059135, 1117588, 741060, 400208, 337207, 309219, 17320, -341595, -255470, 331355, 791552, 624109, 198030, 247618, 780603, 1054594, 679112, 142905, 26973, 257997, 478764, 597145, 487579, -292986, -1786530, -3050541, -3144563, -2461021, -2151381, -2342321, -1997856, -705480, 539214, 829586, 623353, 764913, 1031623, 605479, -502615, -1469792, -1849104, -1871282, -1733271, -1449796, -1339592, -1789243, -2482052, -2678633, -2349029, -2176208, -2306166, -2096514]
38416b096514O28732L0972j149906j321145k11435O58887L96102K860M26757Q64507
38406a770183K96498m86558m9281J194519J455932L55764n19692j02142P11645
38397A086502O98576M2283m20449o10523q71625j013490p11076l00719k04257
38388b304778j7673Q10790J727993J605190M41320n04534m17325J32571K07325
38379A680879k78882o94826n20185K36246J059863J235214N02480n39289j053541
38370A627959r18363o14673l68365q8559j4635n14446j151679r18497K83605J276829
38360a400824J154246L81489j46049l18495m08629k16525M70300J049086P02994
38351A267593l55327j067682r08052l73457p5051J6176K24382N12990M69711j39615
$$ y = [-2096514, -1467782, -1436810, -2586716, -3907861, -4119296, -3460409, -3064307, -3061447, -2634690, -1770183, -1473685, -1960243, -2009524, -815005, 640927, 996691, 476999, 374857, 1086502, 1785078, 1827361, 1406912, 796389, -75236, -1088726, -1799802, -2100521, -2304778, -2322451, -1511661, 216332, 1821522, 2262842, 1758308, 1340983, 1473554, 1680879, 1401997, 707171, 186986, 423232, 1483095, 2718309, 3220789, 2681500, 1627959, 709596, 94923, -273442, -362001, -376636, -891082, -2042761, -2961258, -2677653, -1400824, -246578, 134911, -11138, -329633, -738262, -954787, -484487, 564599, 1267593, 912266, -155416, -1063468, -1436925, -1511976, -1495800, -1271418, -758428, -288717, -428332]
38341d28332r24107j113439m40214L67537M12855j28814k59134K84395O01167
38332a628086J24592l96706j11183N76003P88950O46105Q02180R91465L50345
38323B143665r07827j453642p34326K00328K17642m28752p04482k25999N04593
38314a388800R14032R00096P19453O32094N91401K56576n04437j219860j276733
38305c76178p17967j50294J08211K83808N13803N20032J15451m13822o75373n94192
38295a386521k98288J05070M75628O41768O08415N52639N43237M81302L31948
38286B055198J74343L9381n8294j1245J60332J12695l92603r52546q77013q1213
38276A69035P85737J104125Q01314J65095m34790o72305n17615l15320k72164
$$ y = [-428332, -1352439, -2465878, -2906092, -2538555, -2125700, -2254514, -2513648, -2229253, -1628086, -1503494, -1900200, -2011383, -1435380, -646430, -325, 801855, 1793320, 2143665, 1235838, -217804, -952130, -751802, -534160, -962912, -1667394, -1893393, -1388800, -474768, 425328, 1144781, 1776875, 2368276, 2624852, 2120415, 900555, -376178, -1094145, -1244439, -1136228, -852420, -338617, 181415, 296866, -116956, -792329, -1386521, -1684809, -1579739, -1104111, -462343, 146072, 698711, 1241948, 1723250, 2055198, 2229541, 2268922, 2210628, 2199383, 2359715, 2472410, 2079807, 1127261, 250248, 169035, 954772, 2058897, 2860211, 3025306, 2590516, 1918211, 1400596, 1085276, 813112]
38267H13112r2607M09935O82118J44839p06759q28790j82215K26218n9047l49334
38257E7470r9694K37949J42307r6919l3256J56937J83052K58580N46439N90851
38247A943716K8636o25536o51206k03314J402k12322l93226k81078l8883K29156
38237b02655N90582R27464R40920N34578j14675p87150j255728j262978p81390
38228a411032j73158J55861J23840j33606m36305m59576J14586J045434J542723
38219C68767J193651N01364J29078L3393j97273n71636q27685r79235j110043
38210a459619r12332j25925P26686P79805L1309n36948k25859M87049N97765j54617
38200g92686r50384q10265K60436J192736J041946R4075n37447l01026L07882
$$ y = [813112, 720505, 1130440, 1812558, 1957397, 1250638, 421848, 239633, 465851, 406804, 57470, -42224, 195725, 338032, 241113, 207857, 364794, 547846, 806426, 1352865, 1943716, 1972352, 1346816, 695610, 492296, 493698, 281376, -111850, -392928, -431811, -202655, 387927, 1315391, 2256311, 2790889, 2676214, 1889064, 633336, -629642, -1411032, -1584190, -1428329, -1304489, -1438095, -1874400, -2333976, -2219390, -1173956, 368767, 1562418, 2063782, 2192860, 2226253, 2028980, 1457344, 629659, -349576, -1459619, -2371951, -2497876, -1771190, -991385, -960076, -1497024, -1722883, -1235834, -638069, -792686, -1743070, -2553335, -2292899, -1100163, -58217, 35858, -501589, -802615, -494733]
38191d94733O31753N78138L06537j41119n89167o89153m29696j29653K40955R53561
38181B37423J533270R58479o36402j609780r78956J61370L92927K3250O9274K50331
38171D01186k91942j009475o26123N41710R09374K22542j31942L72547N60255
38162I48132k43150j007731q12326k33913j220K31694P18492O66580k79877q63924
38152h77243N738J289948J218262m2409p52530k56594L37583J20706m18250m65392
38142A59819p4725J47019j15396o54939r61886o32650J26546N98532M89976L35922
38132e81782M93844L76318m90442j257200p57937O42665J494166J375800J157264
38123B452696J122549M56123r11808j539859n52644P66172P19405l67157q72797
$$ y = [-494733, 137020, 715158, 1021695, 880576, 291409, -397744, -827440, -957093, -716138, 237423, 1770693, 2729172, 2092770, 482990, -495966, -334596, 58331, 81581, 150855, 401186, 109244, -900231, -1526354, -984644, -75270, 147272, 15330, 387877, 948132, 704982, -302749, -1115075, -1348988, -1350208, -1118514, -400022, 266558, -13319, -877243, -871505, 418443, 1636705, 1594296, 841766, 585172, 922755, 1043461, 625211, 159819, 85094, 232113, 116717, -538222, -1500108, -2132758, -2006212, -1407680, -917704, -581782, -87938, 288380, -202062, -1459262, -2217199, -1574534, -80368, 1295432, 2452696, 3575245, 4031368, 3119560, 1579701, 1027057, 1793229, 2512634, 2145477, 1272680]
38114A272680m59295l05164q63079j042841j47404P62927M43851m98619m21752
38105a258696Q33114J559787O07342r31461j234764k68780L01887m07910j274604
38096b074085r07543K57971N66642m69088j422081q38113Q85704K044361J659615
38087b96617L95208m68700m50559o2787R2250L0761J12086L22715K03958m19615
38077e41300r80378p93743j1677M90101K47509j91021m6900O25547J042530P29901
38067E70569O4199k82741j39706R8108N1681j91358k27533J53607O84741Q73638
38057A655205N24182n0650l62750k51367p718j8470l23545n43261k74287M14185
38047G61524R43608P91703O1153o55939r44216q77117o74825m08971k05368l40825
$$ y = [1272680, 813385, 508221, -354858, -1397699, -1545103, -782176, -338325, -836944, -1258696, -425582, 1134205, 1741547, 810086, -424678, -693458, -391571, -799481, -2074085, -2981628, -2723657, -2157015, -2626103, -4048184, -4886297, -4000593, -1956232, -296617, 98591, -370109, -820668, -883455, -791205, -760444, -648358, -325643, -121685, -541300, -1521678, -2315421, -2327098, -1836997, -1589488, -1780509, -1827409, -1201862, -159332, 570569, 634768, 352027, 212321, 310429, 362110, 170752, -56781, 96826, 781567, 1655205, 2179387, 2128737, 1765987, 1514620, 1506902, 1488432, 1164887, 621626, 347339, 761524, 1705132, 2496835, 2557988, 1902049, 957833, 80716, -594109, -1003080, -1208448, -1549273]
38037a549273p70899q90423k96435M34095M16985j67722k48394M02417O18485
38028b051164l22922j227395m89433J410158K289119J195755l64391o05240K77677
38019A12164Q31574M77509j25451l78889l33318j02867L47230P28210N41237j29812
38009A967587n96825n57253m69754o54123o75807j26011N19558N09136J277j11017
37999a93232M28916P50175L6908j277864j944522j302708J46644J439768J955629
37990C9714J527131L30220r93260j508827q27320L39728R05861O18470J00900
37981E32617j94770m19763o35081m52521K31101P69269O01306R8448k6185K20173
37971G24594L03801J31237O6619J24548n8860m14522l62915K56099Q29272Q24253
$$ y = [-1549273, -2320172, -3210595, -3507030, -3072935, -2655950, -2823672, -3072066, -2669649, -2051164, -2374086, -3601481, -4090914, -2680756, -391637, 804118, 439727, -165513, 112164, 943738, 1421247, 1295796, 916907, 583589, 480722, 827952, 1556162, 2097399, 1967587, 1370762, 813509, 343755, -310368, -986175, -1112186, -592628, -83492, -82215, -193232, 235684, 985859, 1022767, -255097, -2199619, -3502327, -3355683, -1915915, 39714, 1566845, 1897065, 903805, -605022, -1432342, -1092614, -186753, 431717, 532617, 337847, -81916, -716997, -1169518, -938417, -169148, 432158, 530606, 504421, 724594, 1028395, 1159632, 1226251, 1350799, 1291939, 877417, 514502, 770601, 1599873, 2424126]
37961B424126M48489J38567j19030n49109j013742j116778p43567j81760K36300
37952d76504M08232M13127L25926J25268j87277m10385k87634Q4253K71875J16801
37942C83682j7194R8596Q9372l47232p32164m63957J52558L62744K01211L14802
37932D2418O71389N43874j33156n31506l19528j38759k80271r0124O41157Q80469
37922A285963p6306j210741j138082j40740M21829K48028K74585Q81420J248525
37913A794481P27135j92343o66376n30712k04494p6357k45329n18092n50190k71664
37903g33941r9167l69340p30345n85272o708L47052J73117j59394k28584j0453
37893b403035K91441M58423L60439J96346M06451R27330R29936l4258j025938
$$ y = [2424126, 2872615, 3011182, 2892152, 2343043, 1329301, 212523, -531044, -712804, -476504, -68272, 344855, 670781, 796049, 608772, 198387, -89247, -4994, 266881, 383682, 366488, 465084, 554456, 207224, -524940, -988897, -836339, -473595, -272384, 42418, 713807, 1257681, 1124525, 593019, 273491, 134732, -145539, -235663, 405494, 1285963, 1209657, -1084, -1139166, -1279906, -858077, -610049, -335464, 545956, 1794481, 2521616, 2329273, 1662897, 1132185, 927691, 851334, 606005, 87913, -462277, -733941, -833108, -1202448, -1932793, -2518065, -2524773, -2177721, -2004604, -2163998, -2392582, -2403035, -2111594, -1653171, -1292732, -1096386, -689935, 237395, 1167331, 1133073, 107135]
37884A07135p93324L76857R87547M97267n1123J66218N46133K65300l43035m67015
37874A291960j32230M9285n9594j59323k49186m97996o16247j71542N51784P62006
37864G68917K82075j92231j02653K64131L18603k0307l68538m53911l16824m3081
37854A36181L89414R00922J125622O85035k81216j068683j129370p12950m54207
37845d09252m08553l3733P29495R98831J01626j229096j547295n13495O76789
37836a634683Q39855J52966l91384l48602o1985J64040M18683O78427N95944Q3872
37826D97133l67843l48361j45060k52373n32670m07225K54520R77602J326237
37817A001960J154414L47547r31238j757536j174376L25995J050254L45795m31533
$$ y = [107135, -686189, -309332, 678215, 1175482, 1124359, 1290577, 1836710, 2102010, 1758975, 1291960, 1159730, 1209015, 1149421, 990098, 740912, 242916, -373331, -544873, 6911, 768917, 1050992, 858761, 756108, 1020239, 1338842, 1318535, 949997, 496086, 179262, 136181, 525595, 1426517, 2552139, 3237174, 2955958, 1887275, 757905, 44955, -409252, -817805, -851538, -122043, 876788, 978414, -250682, -1797977, -2311472, -1634683, -794828, -641862, -1033246, -1381848, -1443833, -1279793, -861110, -182683, 413261, 497133, 129290, -219071, -364131, -616504, -1149174, -1556399, -1301879, -324277, 1001960, 2156374, 2503921, 1572683, -184853, -1359229, -1033234, 17020, 362815, -68718]
37808f8718J0785Q82333N85259p44593j501438j071845m10315j37580K70091R75451
37798a210570J060619J46724n96842j56728O50807M74316l67855m22454N10958
37789H8975J012266J95803j029361j324744o19019J83365N60817P16828Q34485
37780F19415O88402J21998n18053p22370m59631j84010j61899r7659L22864P65670
37770C74727N86994k05907q43968p78371l05016P306N2838L6339M233n5281L8976
37759a087130L76886O65413O29291M51578L77500J66195m72092j080318q37545
37750h10222J78747Q11698K50258q54201j167037l29449O47944O79230r4756n72570
37740a260358j23877O40631P33526J12181l55361j86559P6203k15459q08112r64002
$$ y = [-68718, -57933, 824400, 1409659, 665066, -836372, -1908217, -2318532, -2456112, -2186021, -1210570, -149951, -3227, -600069, -756797, -105990, 368326, 471, -421983, 88975, 1101241, 1297044, 267683, -1057061, -1676080, -1492715, -931898, -215070, 619415, 1307817, 1429815, 911762, 189392, -270239, -454249, -616148, -713807, -390943, 374727, 961721, 755814, -88154, -866525, -1171541, -1164235, -1111397, -1075058, -1070825, -1126106, -1087130, -710244, -44831, 584460, 1036038, 1413538, 1579733, 1107641, 27323, -810222, -631475, 180223, 430481, -423720, -1590757, -1920206, -1272262, -593032, -687788, -1260358, -1384235, -743604, -10078, 102103, -253258, -439817, -363614, -579073, -1387185, -2351187]
37730b351187n36642l5165K25429M40883P76476J029813R56261N57580m1345o74352
37720C47751j043329r04427m42616j45429k07363l42904k48565O3102M45361P81300
37710a697119Q87765O38247K94445K96124N55190M27646l35134j073790j056591
37701a063217m22550J81693N33069Q08371R23542O27091J47329o842P2764k25828
37691A575422r16805j185398o24130P9165K25792J56443M80913Q78716O36034
37682A306152j3153j86909J35834O3878o23319j003836n28615N9345n0547n11575
37672a352745n88210l52764k18336L1460O83469J095341M83002n58234o12852
37663a389869M58288J234514P95570j16662m48676k57994j14275M777L64495O63992
$$ y = [-2351187, -2887829, -2922994, -2697565, -2256682, -1480206, -450393, 505868, 1063448, 1022103, 347751, -695578, -1600005, -2042621, -2188050, -2395413, -2738317, -2986882, -2923780, -2478419, -1697119, -809354, -171107, 123338, 419462, 974652, 1402298, 1067164, -6626, -1063217, -1485767, -1304074, -771005, 37366, 960908, 1587999, 1735328, 1728486, 1801250, 1575422, 658617, -526781, -1150911, -1071746, -845954, -689511, -208598, 670118, 1306152, 1292999, 1106090, 1241924, 1305802, 682483, -321353, -849968, -790623, -841170, -1352745, -1940955, -2293719, -2512055, -2480595, -1797126, -701785, -218783, -777017, -1389869, -931581, 302933, 1098503, 981841, 533165, 275171, 160896, 165673, 530168, 1194160]
37653A194160M65703L7741m4670J30855J4806l86234m39072J48862Q92772J149822
37643C164745P36522r9198r08451j222077r12745m55717m91513j050979j493990
37634b733403j264270m43789M61006J001182J017047O81899M11559N04312P82743
37625D18286P72107K74123m22024q93653q98882l54112O06974J404279J273967
37616B181065J51635r77209j109646m99204l18921r75548j430249o27224R32371
37607b672930J751464J242382K89692j10612L0548K08259K94471L60597K00349
37598A594220l00656o76286m38655R4172J91559j95012l91052l5145M64950N96211
37588I04306L49351O5224O8301M54496Q62092N85463n57738j608329j404078j37147
$$ y = [1194160, 1659863, 1697604, 1652934, 1783789, 1798595, 1412361, 973289, 1122151, 2014923, 3164745, 3901267, 3802069, 2893618, 1671541, 758796, 303079, -188434, -1239413, -2733403, -3997673, -4441462, -3980456, -2979274, -1962227, -1280328, -868769, -364457, 418286, 1190393, 1464516, 1042492, 148839, -750043, -1104155, -497181, 907098, 2181065, 2332700, 1355491, 245845, -253359, -572280, -1547828, -2978077, -3605301, -2672930, -921466, 320916, 610608, 499996, 530544, 738803, 1033274, 1393871, 1594220, 1293564, 617278, 178623, 272795, 464354, 269342, -121710, -156855, 308095, 904306, 1253657, 1318881, 1387182, 1841678, 2703770, 3289233, 2731495, 1123166, -280912, -418059]
37578d18059P70128M86144k79196m30490J01442N55365M36893p3312n14523n67363
37568F7029k54315P1552J07700J8319J90299N83533P27310M06480p4408l79804
37558A463695m82989m61705l53996k44330j36185J58776O00296O55280N6704m81391
37548G74155j38181O45237O53937l28149j261573j352314p46595K47894J412983
37539i2606K021921J346456P055n31734p4649J61456k15833j82843N00003N04559
37529C443785o23566j221129j56827J084449P48452l53582m32597J90168m2945
37520B636208q86543o85781N66716J043998N1370j010574j005675m85002k55450
37511c0733j63738J03585L36655M45930O94437R24621N66283l33591j042171j215932
$$ y = [-418059, 352069, 838213, 559017, 128527, 229969, 785334, 1222227, 1148915, 634392, 67029, -187286, -115734, -8034, 10285, 200584, 784117, 1511427, 1917907, 1843499, 1463695, 980706, 519001, 165005, -79325, -215510, -56734, 543562, 1198842, 1255546, 774155, 635974, 1281211, 1935148, 1606999, 345426, -1006888, -1753483, -1505589, -92606, 1929315, 3275771, 3282826, 2751092, 2676443, 2837899, 2622066, 2439223, 2939226, 3443785, 2820219, 1599090, 1442263, 2526712, 3275164, 2921582, 2488985, 2679153, 2636208, 1749665, 1063884, 1630600, 2674598, 2725968, 1715394, 709719, 224717, -30733, -194471, -90886, 245769, 691699, 1386136, 2310757, 2877040, 2543449, 1501278, 285346]
37501B85346j091628o47105L21510J302122J416235P05549l0633n72173j202907
37492D86316j480953o36617P63976J215980N95212L90253J163179J524125M39995
37483D461466j026892j379681q18432n15963p09847p19463k62885K96052O68535
37474g110Q19646O93696L40385O7353M7156J8710l21905q53373j119139p39510
37464a054091J85529R29860P85155J39736K14140J168282J478359K39988j027328
37455C059630n28008P87653N44917j193223j924269o81661N93372L58722k78427
37446G38706J90937J213576J398671O59437k18920q70515j043666k72104J003120
37437B799242J222611j92296j675870j627006n74545l5273k80705n50068n85260
$$ y = [285346, -806282, -1453387, -1131877, 170245, 1586480, 2292029, 2261396, 1689223, 486316, -994637, -1631254, -867278, 348702, 943914, 1334167, 2497346, 4021471, 4461466, 3434574, 2054893, 1236461, 720498, 10651, -708812, -971697, -675645, -7110, 812536, 1506232, 1846617, 1913970, 1961126, 1979836, 1657931, 804558, -314581, -1054091, -868562, 61298, 846453, 986189, 1200329, 2368611, 3846970, 4086958, 3059630, 2531622, 3319275, 3864192, 2670969, 746700, 65039, 658411, 1017133, 738706, 929643, 2143219, 3541890, 4201327, 3982407, 3111892, 2068226, 1796122, 2799242, 4021853, 3829557, 2153687, 526681, -47864, -83137, -363842, -913910, -1499170]
37428a499170o13428m61687J02847O35299N76244J03124k71764l86588k07550
37419b022673L23664Q02710O53128K31217M52245J011507N48564q87772j386646
37410b74056r6505J283780J150393K79818j968j02293p90602j185250k37177J030162
37400A056302R27482k05435p60277m69754k37194j32319L62708P16435N2608r13806
37390C96750o57550O75085J422746Q91515j7968n08720o15652l96197J08977K85958
37380A584944l10892r28475o49183J8148K83m58950l69170J01855M5746k72369
37370a238063K50814J488279K064709J360630Q0542r93725j457525q93803M97948
37361A159806J338422O63194m47431m23498K96097J70645p15869r84986n57426
$$ y = [-1499170, -2112598, -2574285, -2471438, -1836139, -1259895, -1156771, -1428535, -1815123, -2022673, -1699009, -896299, -243171, -11954, 440291, 1451798, 2000362, 1112590, -274056, -370561, 913219, 2063612, 2343430, 2341462, 2239169, 1448567, 263317, 26140, 1056302, 1983784, 1778349, 1018072, 548318, 311124, 178805, 541513, 1257948, 1310556, 396750, -260800, 414285, 1837031, 2728546, 2710578, 2201858, 1586206, 1190009, 1298986, 1584944, 1274052, 345577, -303606, -285458, -285175, -744125, -1113295, -1011440, -965694, -1238063, -987249, 501030, 2565739, 3926369, 4006911, 3013186, 1555661, 661858, 1159806, 2498228, 3161422, 2713991, 2290493, 2586590, 2757235, 2041366, 1056380, 498954]
37352D98954o18771j186761j011429N4012P57512O61245N95398P69102M71955
37343I91217j57119p7580O95377R89571N06599P0983j95625r09962j579626r42727
37333f08892O02752J145737K12795o19106m66643k52764n59176o35859k39091
37324a420247k74650q38745p15672L73846J075590P57484N06948R25407J014545
37315A404506K50477k62825J65963N00370j40118r92226j135905q56076n45797
37306a611631J14923R54989R60238O4224l70538K41541P43983L87364J22929O79711
37296B287733J105320M29699p30286j304320j116879l16817R76188J787747Q83702
37287D002087r89832j447559Q0098J361170Q62628o4057J21724N70043j6760q52203
$$ y = [498954, -119817, -1306578, -2318007, -2263995, -1506483, -845238, -249840, 519262, 991217, 834098, 756518, 1451895, 2441466, 2948065, 3019048, 2823423, 1913461, 333835, -608892, -6140, 1139597, 1352392, 733286, 266643, 13879, -545297, -1181156, -1420247, -1694897, -2533642, -3249314, -2875468, -1799878, -1042394, -535446, 389961, 1404506, 1654983, 1392158, 1558121, 2058491, 1918373, 926147, -209758, -1065834, -1611631, -1496708, -541719, 418519, 482743, 112205, 353746, 1097729, 1485093, 1608022, 2287733, 3393053, 3822752, 3092466, 1788146, 671267, 354450, 1330638, 3118385, 4002087, 3012255, 1564696, 1644794, 3005964, 3868592, 3804535, 3926259, 4496302, 4479542, 3627339]
37277C627339n84687J57279j36245j233157j556159n89856O30411J044889N40851
37268A900665k44460n12547j29165O1875n35412j079688n18885N34584P88830
37259B65797M98608O64121P28364l67868j473209o09126J337660J649907K82992
37250B977246k85150L84739K56501q92102r75959J59208L51734m84301j26017
37241A365899J255654J077497l61817K7731J974554J763279o28262r02340J538476
37232G110671K137857j66784o16545K245143L361617O67933p61506J664644L247275
37223A8890305J662777J801680N363587O213425K794116L430965J1113245J6145474
37215F7415574J4166129J6500447K9265663L9698440M2320292N8653599R9829780
$$ y = [3627339, 3042652, 3199931, 3063686, 1830529, 274370, -315486, 314925, 1359814, 1900665, 1656205, 1143658, 1014493, 1076368, 540956, -538732, -1057617, -523033, 265797, 764405, 1428526, 2156890, 1789022, 315813, -293313, 1044347, 2694254, 2977246, 2692096, 3076835, 3333336, 2441234, 1465275, 1624483, 1976217, 1491916, 1365899, 2621553, 3699050, 3337233, 3364964, 5339518, 7102797, 6474535, 5572195, 7110671, 9248528, 9081744, 8465199, 10710342, 14071959, 14739892, 13978386, 15643030, 18890305, 20553082, 22354762, 27718349, 33931774, 36725890, 40156855, 51270100, 67415574, 81581703, 98082150, 127347813, 167046253, 209366545, 268020144, 367849924]
37208C67849924J24177798P5459683l4109866j20985660j25652169p6424860l8382058
37201A71932792l1708397l1039374k1023644j2917688j3516300j2765294n786959
37194D3175136j723505n055477p569692m326289j515226l237403m345464j554438
37186A3847642M00530j355414k400360r0137J415581m68352j997877p78280j31405
37177H441928j893176k484359q5243J442696k58098j661577j08136J394480J37258
37168D925773j398714o55603M03772k43593o83394O18265J305803k32490j305830
37159B733989J51138J451627r1334k326560k165380o17023M273M04051J840635
37150A385416K562822Q35757j231742q91002O27977N36295o88912p15980K88385
$$ y = [367849924, 492027722, 567487405, 533377539, 412391879, 286739710, 210314850, 171932792, 140224395, 109185021, 88161377, 75243689, 61727389, 48962095, 43175136, 41451631, 36396154, 28826462, 24500173, 22984947, 19747544, 15402080, 13847642, 14248172, 12892758, 10492398, 10402261, 11817842, 11349490, 9351613, 8573333, 8441928, 6548752, 4064393, 3979150, 5421846, 5163748, 3502171, 3394035, 4788515, 4925773, 3527059, 2871456, 3275228, 3031635, 2348241, 2966506, 4272309, 4039819, 2733989, 2885127, 4336754, 4245420, 1918860, -246520, -863543, -859270, -455219, 1385416, 3948238, 4783995, 3552253, 2661251, 3289228, 3825523, 3136611, 2420631, 2709016]
37141B709016M48825j61610j21286K93793j72022j020076q37423N0914K96594
37132A486725m4108o7056K1424l74199o34795k7904P13986P22233N92263R15453
37122C304022P65932m53228j305290n55938N06179K35652m56106J60523J344493
37113C546239J022159p14252j837160j536611q25415m10575m9255K36858Q7794
37104d80218k40782j96379J59578N44710J005558J224396M83353p19376n94951
37095A185889J173015K414772J772648R92486J863494K864469J535363j335132
37087A2467004k831718k225662j290191r79190o25428j26758k53117p83384o52841
37078B698715K9103J55846l23822n15478m64058q53695j141626k52944J049387
$$ y = [2709016, 3157841, 2996231, 2874945, 3168738, 2996716, 1976640, 1139217, 1190131, 1486725, 1442617, 1375561, 1396985, 1022786, 387991, 360087, 1074073, 1796306, 2388569, 3304022, 4069954, 3616726, 2311436, 1755498, 2261677, 2497329, 2041223, 2201746, 3546239, 4568398, 3854146, 2016986, 480375, -345040, -755615, -804870, -568012, -480218, -721000, -917379, -757801, -213091, 792467, 2016863, 2500216, 1780840, 1185889, 2358904, 4773676, 6546324, 7538810, 9402304, 12266773, 13802136, 12467004, 9635286, 7409624, 6119433, 5140243, 4514815, 4388057, 4134940, 3351556, 2698715, 2727818, 2883664, 2559842, 2044364, 1580306, 726611, -415015, -667959, 381428]
37069C81428Q94706n35743j020989J77164J183625N75494n90131p53664m4159
37060B67731N46602P42712P45647N10137N9621k99975n28046q07748q52499k86814
37050I7368L00066j144o76026k69166J092350J409518j99913j844625j383766
37041a475338N91958J690924R18768m52043r81146p38199n49318m64989K06290
37032a253093J486970K205314J456453Q7151k79709L99560M90908p12515j727423
37023B153616j136951J86757M55215m28456j162069j210419j028993o19636L85880
37014b405056J379276J206527L4525o93462l19588L46346N29854L65406J03559
37005E47387k85947n02832q3475O23824P51359K87729M3718K19332K38241N4051
$$ y = [381428, 1276134, 740391, -280598, -103434, 1080191, 1655685, 1065554, 311890, 267731, 814333, 1557045, 2302692, 2812829, 2872450, 2572475, 2044429, 1236681, 384182, 97368, 397434, 396290, -279736, -548902, 543448, 1952966, 1753053, -91572, -1475338, -883380, 807544, 1726312, 1274269, 293123, -445076, -994394, -1459383, -1253093, 233877, 2439191, 3895644, 3982795, 3703086, 4102646, 4593554, 3881039, 2153616, 1016665, 1203422, 1658637, 1230181, 68112, -1142307, -2171300, -2790936, -2405056, -1025780, 180747, 215272, -478190, -797778, -451432, 78422, 443828, 547387, 261440, -241392, -324867, 298957, 1050316, 1338045, 1381763, 1601095, 1839336, 1893387]
36995A893387K73403Q27532Q87970L20050j40713l43262q54040j403638r18299
36986E42390L98782Q16931k78075j244958p93758m7497n18768j461471j089435
36977c675859M81870J435205R78111J08127k59710l29514l77918n3726P76673
36968i16741J474963J470437R90277N13397M8117n82930j127581j069992k94931
36959E05016P34995J436656J551941J178924N68755j7606l60665l55230q1482
36950E161304K60667N12362O14730N74789M97786N49686O60192M15803l28709
36941H918610q55648k91848R82580J465337M84225p92192r59430k62135L4477
36932H723976l92068p05298m51421k08420n52996j215716j508197j057125k7932
$$ y = [1893387, 2166790, 2994322, 3882292, 4202342, 4061629, 3718367, 2864327, 1460689, 542390, 941172, 1758103, 1480028, 235070, -558688, -606185, -1124953, -2586424, -3675859, -3193989, -1758784, -780673, -672546, -932256, -1261770, -1639688, -1693414, -916741, 558222, 2028659, 3018936, 3532333, 3580450, 2997520, 1869939, 799947, 505016, 1240011, 2676667, 4228608, 5407532, 5976287, 5958681, 5598016, 5242786, 5161304, 5421971, 5934333, 6549063, 7123852, 7621638, 8171324, 8831516, 9247319, 8918610, 8062962, 7771114, 8753694, 10219031, 10703256, 9911064, 8951634, 8689499, 8723976, 8331908, 7626610, 7175189, 6966769, 6413773, 5198057, 3689860, 2632735, 2604803]
36923B604803R32782J038329J31017r79300j380447j050484n39313o3926M03220
36914A096681N36744M1025n67294m58613K88340P82548O07482K40078J91135M37395
36904C195521P05700P16806K52674m60026p07574k53130Q1051m24539j143252
36895A963231j005288j75628L13600K10292P0655j7106l74400o68326l55656M7412
36885H786k78142o52954K75042J914235K064803K81179j242750r42841N725k2906
36875A410177n90679m62671J26495J59471k52627k42414K35533N66336O38163
36866A587784O70528M57044j29871m60646m0971M79301K36362m55512o95428m50572
36856A198019l08450k18336L40744J160043J357690O16463m37260j038351q77462
$$ y = [2604803, 3537585, 4575914, 4706931, 3727631, 2347184, 1296700, 757387, 693461, 1096681, 1633425, 1674450, 1107156, 648543, 936883, 1719431, 2326913, 2566991, 2758126, 3195521, 3901221, 4618027, 4870701, 4410675, 3703101, 3449971, 3531022, 3106483, 1963231, 957943, 782315, 1095915, 1306207, 1376862, 1359756, 985356, 317030, -38626, 8786, -269356, -922310, -647268, 1266967, 3331770, 3612949, 2370199, 1427358, 1433083, 1410177, 819498, 356827, 483322, 642793, 390166, 147752, 383285, 949621, 1587784, 2258312, 2715356, 2585485, 2124839, 2083868, 2563169, 2799531, 2344019, 1648591, 1198019, 889569, 671233, 1011977, 2172020, 3529710, 4146173, 3708913, 2670562, 1793100]
36847A793100j13303O52939P19393J09259l45497j91286J121k59734m38691K0677
36837A947978N06711J60011n78139n58719K49505P33245L33109l24553n35653
36828A933495l24963m4775O7071j48367o16655q47362m65831J83502N05823M92626
36818G34564M78293L81083m0108m41324k99753Q2125q0522p20861q84651j84011
36808i75165O04274P00827L18530Q0309N7649q8623l72504m05770P688N11514
36798D38729N29794n6983o29823m26593M86295J124275P36627k03302n70663l4065
36788A394291N53021L17241m70881p45429n3789Q08429Q28139J10002m08858m45724
36778A886442o36133j058029o93260P66523J720714P20190j094137j429981k38047
$$ y = [1793100, 1679797, 2332736, 3052129, 3161388, 2815891, 2624605, 2625726, 2365992, 1927301, 1947978, 2454689, 2614700, 2036561, 1477842, 1727347, 2460592, 2793701, 2469148, 1933495, 1608532, 1563757, 1630828, 1482461, 865806, 18444, -447387, -263885, 241938, 734564, 1212857, 1593940, 1553832, 1112508, 812755, 894880, 814358, 93497, -791154, -975165, -370891, 329936, 648466, 728775, 786424, 697801, 325297, -80473, -72785, 438729, 968523, 911540, 281717, -144876, 341419, 1465694, 2202321, 1999019, 1428356, 1394291, 1947312, 2264553, 1793672, 1048243, 994454, 1802883, 2631022, 2741024, 2332166, 1886442, 1250309, 192280, -500980, 265543, 1986257, 2706447, 1612310, 182329, -55718]
36769e5718M31436j58969n44073L7656L46993k93496n53170L46754Q60498k08465
36759B09446j228911k37245J646066J877859M98303k34495L66366P19640O888
36750C623917o57423m87572k66110o59114j056074q10481k68460L3596J04954
36741d42767Q8256Q8482M53863J153940J098381m97682k262321j967763J93737
36732b093874J549596O42344r05880j058608j44381K49794j93021n24128k54685
36723b732843K18009N27360P05576P94043P09569M36883J12561K8616M16013Q91277
36713B107064N48998o89821j378481l39599J299274J376857k20066j495104j380279
36704a71157q58152o85333j53838R69766J312053Q9501j217400r51871K89834
$$ y = [-55718, 375718, 216749, -327324, -289668, 57325, -236171, -789341, -442587, 417911, 209446, -1019465, -1256710, 389356, 2267215, 2765518, 2531023, 2897389, 3617029, 3623917, 2966494, 2478922, 2212812, 1553698, 497624, -312857, -581317, -547721, -442767, -354511, -266029, 187834, 1341774, 2440155, 1942473, -319848, -2287611, -2093874, -544278, 98066, -807814, -1866422, -2010803, -1761009, -1954030, -2478158, -2732843, -2514834, -1987474, -1281898, -487855, 221714, 658597, 771158, 799774, 1215787, 2107064, 2656062, 1966241, 587760, 248161, 1547435, 2924292, 2704226, 1209122, -171157, -1029309, -1714642, -1868480, -898714, 413339, 502840, -714560, -1666431, -1376597]
36695a376597R07332P83662P81890P37765r2521j139306j021703J88683R25787
36686F94992M52855k75541l34115q7852k74632q16329j045374n18974O37424J718671
36676A51125J787637O33562o77327q75829n1501N78085L86712l7520p0863P9836
36666A903917M3234J6453K91417O02901N13624R4073k76543n02149o76811o50978
36656A359138k69561P9689j73684p93024q28703n1616M35876k55704j212073p77486
36646b487148R48490J968376J070283n76341j205754p40392k83601k17023o5001
36637a588111K87193N06840O18703P47010M18317o46103j425056p34567P69420
36628a046354J320132O81573L04125P33110Q32627J00425k64345M20272Q76871
$$ y = [-1376597, -469265, 314397, 1096287, 1834052, 1741531, 602225, -419478, -230795, 694992, 1147847, 872306, 538191, 450339, 175707, -640622, -1685996, -2204970, -1567546, 151125, 1938762, 2572324, 1894997, 1019168, 967667, 1545752, 1932464, 1894944, 1824081, 1903917, 1947151, 1963604, 2255021, 2857922, 3371546, 3465619, 3189076, 2686927, 2010116, 1359138, 1089577, 1169266, 995582, 202558, -626145, -677761, -241885, -497589, -1709662, -2487148, -1538658, 429718, 1500001, 923660, -282094, -1022486, -1306087, -1523110, -1588111, -1300918, -794078, -175375, 571635, 989952, 343849, -1081207, -1815774, -1046354, 273778, 955351, 1259476, 1992586, 2825213, 2925638, 2661293, 3081565, 3958436]
36619C958436n862j135457q93602K98360P69838J73088l84026l09587p9875L0
36609B391343K16275N64938N29626r1501q71250j329304j294948q01606j05671
36600g92098L48615L82328K86625L21785L96011M34980M98251L52332k76219q05357
36590A147253k45502J009176J132158n65055k290837k157114p61796J9991j49564
36581b861290j46620L61557N61037K22590J35738O55834J142664J076242O70525
36572A818277K11571k82956o19134m64693O9189N22836O82750N17294j32674j078111
36562A244349j450570p51310J94188L20470q9255m0701L68470J55203p18137j139314
36552a906607n71528K68996O54624O77053O50225O51118P83908J026047Q35885
$$ y = [3958436, 3952574, 2817117, 1923515, 2221875, 2991713, 3164801, 2780775, 2471188, 2391313, 2391343, 2607618, 3172556, 3702182, 3610681, 2739431, 1410127, 115179, -686427, -792098, -443483, -61155, 225470, 547255, 943266, 1378246, 1876497, 2228829, 1952610, 1147253, 901751, 1910927, 3043085, 2478030, 187193, -1969921, -2731717, -2711726, -2861290, -3007910, -2646353, -2085316, -1862726, -1726988, -1071154, 71510, 1147752, 1818277, 2029848, 1746892, 1127758, 663065, 732254, 1255090, 1937840, 2455134, 2322460, 1244349, -206221, -957531, -763343, -442873, -532128, -572829, -204359, -49156, -767293, -1906607, -2478135, -2209139, -1554515, -877462, -227237, 423881, 1207789, 2233836, 3069721]
36543C069721j52818j164672j075994p4624O03753M84912J59190j12555o49709
36534A087204j156691q36275L6437K23787l69771l31278Q52871J653912Q02392
36525A962588o67925r77878j65091L09271j36952o52403m42283K97228R25352
36516D51907J065145P17879J58047k60727m14983m21557l18477o8266J34937N5021
36506A098926r1287P8072L44678J32751m74851q05106p24158p20714p42313j03018
36496b007020J106306J709507J116975K18492m2795O5683m8313k25516k49672
36487A643647n95280j427317j767392q66209L39533M53427k69911m41945J96792
36478b734655N30055M8637l85074r4478L35874J76735j48652L09645J516616K275920
$$ y = [3069721, 2916903, 1752231, 676237, 601613, 1205366, 1690278, 1849468, 1736913, 1087204, -69487, -905762, -869325, -645538, -1015309, -1346587, -493716, 1160196, 1962588, 1294663, 316785, 151694, 460965, 324013, -328390, -770673, -473445, 451907, 1517052, 2234931, 2392978, 2132251, 1717268, 1295711, 977234, 908968, 1043905, 1098926, 1007639, 1085711, 1430389, 1563140, 1088289, 283183, -440975, -1161689, -1904002, -2007020, -900714, 808793, 1925768, 2144260, 2101465, 2167148, 2118835, 1893319, 1643647, 1048367, -378950, -2146342, -3012551, -2673018, -2219591, -2489502, -2931447, -2734655, -2204600, -2155963, -2541037, -2635515, -2299641, -2122906, -2271558, -1961913, -445297, 1830623]
36468A830623J579699k13694j685606j792653q79643j06788J5323O9294O10596
36459e72849J217029J129724L97441k56685m78958n37614o01636m27533P8954
36450e2127M95179L63844k17386p14788p26009k73167L59216Q85617J095449Q38426
36440B054254J49003n83542p93723k84030N02131R00995O29428j14507r13345
36431A546664j313793j042344l43520J25867L0168k66459k99070q4076K10273
36422a436290O29633R89639P02891k49574q17266k64312N48695L85298m01835
36413H6879m83572K44274O34888L37890J94017M29386J66164p96032j300307o22967
36403a109380M18327Q49293P81010N99706J81597l47311k94453L80717P05775
$$ y = [1830623, 3410322, 3196628, 1511022, -281631, -1161274, -1268062, -1252739, -1183445, -572849, 644180, 1773904, 2171345, 1914660, 1435702, 898088, 296452, -131081, -52127, 443052, 806896, 589510, -125278, -851287, -1124454, -765238, 120379, 1215828, 2054254, 2203257, 1619715, 825992, 541962, 1044093, 1945088, 2574516, 2460009, 1546664, 232871, -809473, -1152993, -1027126, -996958, -1263417, -1562487, -1646563, -1436290, -806657, 182982, 885873, 636299, -180967, -445279, 103416, 488714, 86879, -396693, -152419, 482469, 820359, 1014376, 1443762, 1609926, 813894, -486413, -1109380, -691053, 158240, 939250, 1538956, 1720553, 1373242, 1078789, 1459506, 2165281]
36394B165281K84673J671L77856N94860P5077l71841o0103L09189R1932k8488
36384C440107L97368K29930j322940k729270k111091j96867Q15962N67096M71746
36375d37959Q91699P59402o1376l45406K58944N92036O5648m02056j11562L45970
36365A555340L75968L27163M89335M07166j20304m57434k07434J03902J4907j28093
36355B360516m924j5892m84990r15483p17422j19436K33977J58643p7167k72025
36345A45797l93956m12368k99368n0644L35010P12034P73183M74276K19900K42905
36335A746769J76749k25908m25955Q5365P34661N91693j49194m74421j76985m0824
36325A841950l89167o10338l70178k38105o68472j171505r78507n305J154773
$$ y = [2165281, 2449954, 2451625, 2829481, 3424341, 3499418, 3127577, 3067474, 3376663, 3468595, 3440107, 3837475, 4067405, 2744465, 15195, -2095896, -2292763, -1476801, -909705, -437959, 453740, 1213142, 1151766, 806360, 1065304, 1657340, 1722988, 1320932, 1209370, 1555340, 1931308, 2258471, 2747806, 3154972, 3034668, 2577234, 2369800, 2473702, 2488609, 2360516, 2355592, 2339700, 1854710, 939227, 221805, 102369, 336346, 494989, 417822, 145797, -248159, -660527, -959895, -1010539, -675529, 36505, 809688, 1283964, 1503864, 1746769, 1923518, 1697610, 1271655, 1357020, 2091681, 2683374, 2534180, 2059759, 1882774, 1841950, 1452783, 842445, 472267, 234162, -434310, -1605815, -2584322, -2589627, -1434854]
36316a434854J783440J471545M64321l63850l25136K83317O00534L17665q2802
36307B714180r4610K49748N21826L43063j40590j96635N75045J299364P48878
36298F020269o69397j166017k17022O20577K84119j86853K49604Q30527Q17108
36289F582915J178778K520997L343829K762862K888928N385002P470140N186581
36281C7320032m41747m477984m661609k997868j317487M85569K020651K646119
36273B8575676M056034Q029572J2144278J3546046J6322996K6496704L7743016
36266A46914322L2496227M280468k8832802m2448421l3096756j8048192j1258426
36259E0006420j0514805q486545n047342l765246m001141k861209r10256o81100
$$ y = [-1434854, 348586, 1820131, 2284452, 1920602, 1595466, 1878783, 2479317, 2796982, 2714180, 2619570, 2869318, 3391144, 3734207, 3593617, 3396982, 3972027, 5271391, 6020269, 5350872, 4184855, 3967833, 4588410, 4872529, 4685676, 4935280, 5765807, 6582915, 7761693, 10282690, 13626519, 16389381, 19278309, 24663311, 32133451, 37320032, 36878285, 32400301, 27738692, 24740824, 23423337, 23908906, 25929557, 28575676, 32631710, 40661282, 52805560, 66351606, 82674602, 109171306, 146914322, 179410549, 183691017, 154858215, 112409794, 79313038, 61264846, 50006420, 39491615, 31005070, 25957728, 22192482, 18191341, 15330132, 14419876, 13738776]
36251A3738776j881364k227665j430499r62087j032485o67268L948n4124p89120
36242D698112j165403q97557n98352n25135l59772J5694L59098M40164J46088
36233B112937l62499m85480J00389N97145L7719r38057o89625Q23797J653947
36224B850273O29998j010653j522078q20997Q5313O30529P55849M37998o0392
36215A975840k69142k94713o02863q22120q0701J179481J348349J59515o90939
36206A902707k55213J75434n30492j264857o27578N54955N87874k87732m61338
36197b06240L32062Q29843M96646J47194K65506K69491k35674o87775m90820R5332
36187H15565L63200R577n79877o82492o882P62985O32253l07947q45593l73909
$$ y = [13738776, 11857412, 9629747, 8199248, 7237161, 6204676, 5537408, 5541356, 5487232, 4698112, 3532709, 2635152, 2036800, 1511665, 1151893, 1167587, 1526685, 1966849, 2112937, 1750438, 1264958, 1365347, 1962492, 2000211, 1062154, 372529, 1196326, 2850273, 3480271, 2469618, 947540, 126543, 211856, 842385, 1598234, 2036232, 1975840, 1706698, 1411985, 809122, -12998, -93699, 1085782, 2434131, 2593646, 1902707, 1647494, 1822928, 1292436, 27579, -599999, -45044, 542830, 255098, -206240, 125822, 955665, 1452311, 1599505, 1865011, 2134502, 1898828, 1211053, 720233, 815565, 1178765, 1188342, 608465, -74027, -80909, 682076, 1314329, 1006382, 160789, -213120]
36177b13120K11334k7994n90610m22289M12410R75504Q99319N91306L26866M2783
36167B205509k13275m00616p67423j316920j384184n14214O25197J020853O51640
36158i3433K35542J5623k80214n34584k72992M43358R59534Q81167M05362r0181
36148A669182k70685J05214Q09369J097353N77846k06287n71927n77480n11818
36139B120767j38484O93306J243036P20319m22669j042962q69856n48823m16983
36130A337651k71409j38783k15156j83467L63696R44262P02697j74315o59305
36121A705871m70555l11364m75618m18212O8865M06452K92779J71704K64633J30408
36111A364963l85549p01351m60648p1209J75278O24237J343864J560509P31809
$$ y = [-213120, -1786, -29780, -620390, -1042679, -630269, 345235, 1244554, 1835860, 2162726, 2205509, 1992234, 1591618, 824195, -492725, -1876909, -2391123, -1765926, -745073, -93433, 142109, 157732, -122482, -657066, -930058, -486700, 472834, 1354001, 1759363, 1669182, 1398497, 1503711, 2313080, 3410433, 3988279, 3781992, 3210065, 2632585, 2120767, 1982283, 2675589, 3918625, 4638944, 4216275, 3173313, 2303457, 1754634, 1337651, 1066242, 927459, 712303, 528836, 892532, 1836794, 2539491, 2365176, 1705871, 1235316, 923952, 448334, 30122, 98987, 505439, 798218, 969922, 1234555, 1364963, 979414, 278063, -182585, -253794, -78516, 545721, 1889585, 3450094, 4181903]
36102D181903m84698j058283q55956m27130j7370M63030Q17790O66570J03889
36093C389745k83690r5545M75933Q77670O73552q3206q41554j081298q94484q07449
36083A329674j028669j206971r65371l15393M87098J112461J173293N18273m29840
36074F74555j043749j201527j178212r27773j48776Q84434J324758Q63428J90470
36065e62392O966J47529P2525k50769l94359q9570N21559J035878J043501N06239
36055B037107o5293j47457J12306J68181p8618k92633m51549q10472j121744p82237
36045a432409Q0142N77881L89726J90292L96277M63177k2746m80292k78081K23386
36035A07353L34151J08692K5173J46197K90033N13938P73097O34478k2567n73147
$$ y = [4181903, 3697205, 2638922, 1782966, 1355836, 1338466, 1801496, 2619286, 3285856, 3389745, 3106055, 3010510, 3486443, 4364113, 5037665, 4954459, 4112905, 3031607, 2137123, 1329674, 301005, -905966, -1871337, -2186730, -1699632, -587171, 586122, 1104395, 674555, -369194, -1570721, -2748933, -3676706, -3825482, -2941048, -1616290, -752862, -562392, -555426, -407897, -335372, -586141, -980500, -1070070, -548511, 487367, 1530868, 2037107, 1971814, 1824357, 1936663, 2104844, 2026226, 1733593, 1282044, 471572, -650172, -1432409, -1352267, -774386, -384660, -194368, 201909, 665086, 642340, 162048, -116033, 107353, 441504, 550196, 575369, 721566, 1011599, 1525537, 2298634, 2933112, 2910545, 2337398]
36025B337398n49039l61889m65599n17573j82040j2811n20187j021675n84228
36016a877643M12619Q86170P86317Q75382J068374M90522p86306j507385j030314
36007f82264j44759K38141J24829j58249n15790o33356l0233R32839J089769J22194
35997C43121p13214k13754J140758J901823J416858K37534p14361p93752M7025
35988B652038R93097R05277l00856j314541j066174j40795J92122j83275l55973
35979A380920m3270J7672n83297j186219j011175j37648Q12249J359411J183917
35970A792560J03475j378463j989854r49601Q36111J613247R08128O7579L45424
35961A348606J183418J107637j27371j242698j215464m02532L47038Q08583J107272
$$ y = [2337398, 1788359, 1426470, 960871, 443298, 261258, 248447, -271740, -1293415, -1877643, -1465024, -578854, 207463, 1082845, 2151219, 2641741, 1855435, 348050, -682264, -827023, -588882, -464053, -622302, -1138092, -1771448, -1801681, -868842, 220927, 343121, -370093, -583847, 556911, 2458734, 3875592, 4113126, 3398765, 2605013, 2652038, 3645135, 4550412, 4249556, 2935015, 1868841, 1728046, 1920168, 1736893, 1380920, 1337650, 1355322, 772025, -414194, -1425369, -1563017, -750768, 608643, 1792560, 1896035, 517572, -1472282, -2421883, -1585772, 27475, 935603, 1003182, 1348606, 2532024, 3639661, 3512290, 2269592, 1054128, 651596, 998634, 1807217, 2914489]
35952B914489J066533N33969j09155m11257m47191m06102r0440N07699P08844
35943D267389J13009m63317j06639N74986K70582q56128j339972p90539m29914
35934A239457q81239j118270l86522M12998L52912R8851N45225R99717L40844
35925A603973q35327r71241j7517N69704J83292k16912R3079N63668N38446K11716
35915A722881p8814m60854q88449q08360n9794O29293O15504K03788L3411J61435
35905A070041K61385K42940J75098p13k33742k17203J02500K32929k15825q94964
35895E22446j139652p68681j03706N20874Q68076O90766O514o33374o02038N2408
35885e86367O32341O05330J39295k47176l48609l85821n02949m32008P6794O35039
$$ y = [2914489, 3981022, 4514991, 4405836, 3994579, 3547388, 3141286, 3050846, 3558545, 4267389, 4380398, 3917081, 3810442, 4385428, 4656010, 3799882, 2459910, 1669371, 1239457, 358218, -760052, -1146574, -733576, -380664, -281813, 263412, 1263129, 1603973, 768646, -202595, -220112, 349592, 532884, 315972, 409051, 972719, 1511165, 1722881, 1644067, 1183213, 294764, -513596, -573390, 55903, 671407, 875195, 908606, 1070041, 1331426, 1574366, 1749464, 1748751, 1515009, 1297806, 1400306, 1633235, 1417410, 522446, -617206, -1385887, -1489593, -968719, -100643, 590123, 596637, -36737, -638775, -586367, 45974, 651304, 790599, 543423, 194814, -191007, -693956, -1125964, -1049170, -414131]
35875d14131N38917j45759m26040K28858R05632M37528p88037j225876l35149
35866a224057P13031P53921R0336k59769N444M15280N53884L52748o1452l51139
35856I88227j61927L10780L89140j04698m65227j38942M09946M12532j23855o35208
35846H80768q41260p48998k71573M55595P69186K43647n37917p15674l57447j40264
35836a263937j22096K13133P96335Q79686K54766l26786k54206J35001K02799
35827E14695r2797l19907k15293R3350K88617J65299r3412j8200N07106R09418
35817A738876O28449q5692n94494q12908j031188j032630l19239P75901J187733
35808D54808N99907m2124R4265N81364M61899m34023j403586j714192j153354
$$ y = [-414131, 124786, -20973, -447013, -218155, 687477, 1125005, 336968, -888908, -1224057, -511026, 242895, 333231, 73462, 78906, 494186, 1048070, 1400818, 1339366, 988227, 826300, 1137080, 1526220, 1421522, 956295, 817353, 1227299, 1639831, 1515976, 880768, 39508, -709490, -981063, -525468, 243718, 487365, -50552, -766226, -1123673, -1263937, -1386033, -1172900, -376565, 503121, 757887, 431101, 176895, 311896, 514695, 421898, 101991, -113302, -19952, 268665, 433964, 340552, 322352, 829458, 1738876, 2367325, 2281633, 1687139, 874231, -156957, -1189587, -1508826, -732925, 454808, 1054715, 1012591, 1106856, 1688220, 2150119, 1716096, 312510, -1401682, -2555036]
35799b555036p8929P89428R34866N59315K08347o9546n80718j014958n23413Q92633
35789a438011J933500J541645K60746n59886m16344J01460L10072Q6973k34155
35780A586000k14614K02590L78818l46752j465498j535043p8351J506657J623107
35771A656914M34036o24127p46848l14493O9362J84966O908l39720n08889l34042
35761e15933q7004O2813L81330Q59687Q26241J6431o47976l31135K80332K859
35751H47645q79512j074264m24803n8340l80789m90066R2737N73165L20509j24198
35741a597916j53442r1788l41003m92582r6476M64958O21126M64171L13837J10622
35731g98493j51764j13626K03404J14756n54703q35680j3429J106224J329113
$$ y = [-2555036, -2633965, -1844537, -909671, -350356, -142009, -211555, -792273, -1807231, -2330644, -1438011, 495489, 2037134, 2297880, 1737994, 1321650, 1423110, 1733182, 1820155, 1586000, 1371386, 1573976, 1952794, 1606042, 140544, -1394499, -1472850, 33807, 1656914, 2090950, 1466823, 719975, 405482, 474844, 659810, 666718, 326998, -181891, -515933, -602937, -540124, -158794, 700893, 1527134, 1543565, 895589, 564454, 844786, 847645, -31867, -1106131, -1530934, -1589274, -1970063, -2460129, -2367392, -1794227, -1473718, -1597916, -1751358, -1843146, -2184149, -2676731, -2773207, -2308249, -1687123, -1222952, -909115, -798493, -950257, -1063883, -860479, -745723, -1300426, -2136106, -2149535, -1043311, 285802]
35722B85802P99334M81840M82541J41771n31540q06975n13758j96799q533M05484
35712E39167Q44013N53908m36132j076606q12003l84848o19920j219330j344389
35703c956140p65695J03337Q09009J047782P35568K66881K25468N45551N54887
35694d33352J33851K1233M73140N43713m40697j498366j257417p9183M45293p2334
35684b164119l65956K86640Q80508M08258m29481l22394N79579R05175J05714
35675a16076q47630r01716j79400M85782O37182M39141K22112J52376K09290K85402
35665C86463L45924M67431O02854M72480j2623l83484j46638L65262K67935o11450
35655A754154j346635j116068k82334J94625M7408j38094J42131P31264J126546
$$ y = [285802, 1085136, 1566976, 2049517, 2191288, 1659748, 852773, 339015, 142216, 133683, 539167, 1383180, 1937088, 1500956, 424350, -387653, -772501, -1392421, -2611751, -3956140, -4721835, -4618498, -3809489, -2761707, -2026139, -1759258, -1533790, -988239, -433352, -299501, -278268, 194872, 738585, 297888, -1200478, -2457895, -2537078, -2091785, -2164119, -2530075, -2243435, -1362927, -954669, -1384150, -1706544, -1126965, -221790, -116076, -963706, -1865422, -2044822, -1559040, -921858, -482717, -260605, -108229, 101061, 386463, 732387, 1199818, 1802672, 2275152, 2262529, 1879045, 1732407, 2097669, 2365604, 1754154, 407519, -708549, -990883, -796258, -748850, -886944, -744813, -13549, 1112997]
35646A112997R69316K17155q40776j676624j833959j217626r6513J005625J429943
35637i30462Q13417l58399j007894o16195K03335O12492O08619O91340Q87398
35628I03651P96842L66562j07320o04065j244694j596510r67160M30576J368131
35619f53987R95949j89548j055557j035095l66766M07777Q67179R23169Q25715
35610G18836P83527O30939J93094j95709r9361K04798K5499o07733q68508l39022
35600D46360M31903P66797N67284L0223n97434q29283l37823K86821J17858n76600
35590C06106n36290L99149P60699k72861j429266j236098j54747M59090M64597
35581a239621N12121M08401l52478j010127l62584J047455J405962L48860n48724
$$ y = [1112997, 2082313, 2299468, 1458692, -217932, -2051891, -3269517, -3366030, -2360405, -930462, -117045, -475444, -1483338, -2099533, -1896198, -1283706, -675087, 16253, 903651, 1700493, 2067055, 1959735, 1355670, 110976, -1485534, -2452694, -2022118, -653987, 341962, 152414, -903143, -1938238, -2305004, -1897227, -1030048, -106879, 718836, 1502363, 2133302, 2326396, 2130687, 2031326, 2236124, 2261623, 1653890, 785382, 446360, 878263, 1645060, 2212344, 2242567, 1645133, 815850, 478027, 764848, 882706, 306106, -230184, 168965, 929664, 656803, -772463, -2008561, -2163308, -1704218, -1239621, -727500, -319099, -671577, -1681704, -2044288, -996833, 409129, 757989, 209265]
35572B09265k87884K52574Q6040l64895l33780j8492R1578J92041N58864P77221
35562A162532M49550J4919K8345J67722k19495r69565j262775p17108K46081R49900
35552a49894R72429L48812l92331o31948l32709j1095P4074K08772N21522O16125
35542A223757K50694j93825l28601l00736l00686q7569M71970Q86323O54085M1284
35532B316696k99998k06927l1141n6128l01600o46181q01533m68852J74293N00181
35522A78810K19571k76907n95033p68151p11967j4703J171777J771845J085444
35513B060686j32249o88303n08931l03403j97297K14750P55910P59326K40108
35504B200597n2702J57597L28461Q5696k87338n11129o57198o30907r5084P76703
$$ y = [209265, -78619, 173955, 259995, -104900, -438680, -457172, -365594, -173553, 385311, 1162532, 1612082, 1627001, 1655346, 1823068, 1603573, 634008, -628767, -1345875, -1099794, -149894, 822535, 1171347, 779016, 147068, -185641, -196736, -122662, 86110, 607632, 1223757, 1474451, 1280626, 952025, 651289, 350603, 263034, 735004, 1621327, 2275412, 2316696, 2016698, 1809771, 1778630, 1722502, 1420902, 774721, -26812, -495664, -321371, 178810, 398381, 121474, -473559, -1241710, -1953677, -1968380, -796603, 975242, 2060686, 1928437, 1240134, 731203, 427800, 230503, 445253, 1201163, 1960489, 2200597, 2147895, 2305492, 2633953, 2719649, 2432311, 1921182, 1263984, 633077, 537993, 1314696]
35494A314696J148640N06936o75731j510443j507911p28554L41866R42687O45132
35485D77318l0349j74130K25762K67112l89483q69097l99939M54305N92916o8986
35475H5429o02712l88752K46101O65596O44249L64168N2721k35762n78257r25401
35465f72620r34408l18151N94871J033076P06111J77147M0770J26715o6968m73094
35455B13449n26728j2161O52690R82320Q99115O20859L78257K74037K01088o5500
35445C617426m97907o78401l36971J17816L2832n77578j047170j037637r41603
35436a349193j075771j044013l93862N03483Q85414P25221P04820J028267J031057
35427A015423L00142m96434m95381R8746L55753j0476l87366l36527j22635r162
$$ y = [1314696, 2463336, 2970272, 2294541, 784098, -723813, -1452367, -1110501, -167814, 477318, 446969, 272839, 498601, 765713, 376230, -492867, -892806, -438501, 154415, 85429, -517283, -906035, -659934, 5662, 649911, 1014079, 1066800, 831038, 252781, -672620, -1607028, -1925179, -1330308, -297232, 408879, 586026, 626796, 753511, 686543, 213449, -313279, -325440, 327250, 1309570, 2208685, 2829544, 3207801, 3481838, 3682926, 3617426, 3119519, 2441118, 2104147, 2221963, 2254795, 1677217, 630047, -407590, -1349193, -2424964, -3468977, -3862839, -3359356, -2473942, -1748721, -1043901, -15634, 1015423, 1315565, 819131, 323750, 422496, 778249, 767773, 380407, 43880, -78755, -87917]
35417h7917K01828N68221O29840J45193l40100k46268J62471K78368J27140J09458
35407A548234Q6167l83917j001130q87411M1614P60269N62402K8739J5475L15358
35397A085800Q9074p05261j150311o83666R8362K62390k34282n60734j48384N99710
35387a347302Q86200N17533k01k32579k48287k25418r8995J53455K81824J63094
35377a50676Q8449K70801L98450J11147m12454q16255j121389j328572r30692
35368c891191L13703J458863J298829J19045o07155l35557l5318l59313n43276
35359b581370J62615J073904J061043K08910m78636n10584j67081K47838N73088
35350d10273N40613J28684j16710J98715N92728L78492k94134p81224r32848r30482
$$ y = [-87917, 113911, 682132, 1311972, 1457165, 1117065, 870797, 1033268, 1311636, 1438776, 1548234, 1634401, 1250484, 249354, -638057, -596443, 163826, 726228, 754967, 770442, 1085800, 1174874, 469613, -680698, -1364364, -1266002, -1003612, -1237894, -1798628, -1947012, -1347302, -461102, 56431, 56230, -176349, -424636, -650054, -749049, -595594, -313770, -150676, -62227, 208574, 607024, 718171, 305717, -510538, -1631927, -2960499, -3891191, -3577488, -2118625, -819796, -700751, -1307906, -1643463, -1678781, -2038094, -2581370, -2418755, -1344851, -283808, -74898, -553534, -1064118, -1231199, -983361, -410273, 130340, 259024, 142314, 341029, 933757, 1312249, 1018115, 236891, -695957, -1626439]
35340a626439n45302M40365J316771J047368k15922j205555j193610o34847p6071
35331b693242N32410J132798J158957M01475m19448n00748R1767P21134R83204
35322A408307Q49798M22384p7966l49378l01402j20160K036p2665n15832j200155
35312D4967j428325o99368K99986L37083n96518j096959k86890R65115J328276
35303a132633P50917K31215L92913R56552J283968R58388J21424m99005l40927
35294B722812P4624l01881j389564j876377j198682m42056n15884o66110N0910
35285c542208R39943Q11343R0186O5412O14532N36939j55810k73687K33047P9643
35275f00660q46960q93830N99462J872796J311868j67480p66333n05643n90127
$$ y = [-1626439, -2171741, -1731376, -414605, 632763, 416841, -788714, -1982324, -2617171, -2693242, -2160832, -1028034, 130923, 532398, 112950, -387798, -296031, 425103, 1408307, 2258105, 2680489, 2602523, 2253145, 1951743, 1831583, 1833619, 1760954, 1245122, 44967, -1383358, -2082726, -1782740, -1445657, -2042175, -3139134, -3426024, -2460909, -1132633, -381716, -150501, 242412, 1198964, 2482932, 3441320, 3562744, 3063739, 2722812, 2797436, 2495555, 1105991, -770386, -1969068, -2411124, -2927008, -3593118, -3542208, -2602265, -1790922, -1700736, -1635324, -1020792, -483853, -639663, -913350, -680303, -600660, -1447620, -2341450, -1741988, 130808, 1442676, 1275196, 508863, 3220, -586907]
35266e86907j032735p80214K21425Q34227N76499K04408K91974M67066L38349
35257E34092J43393R5758j05972o95867j293557j276046m53656O68268J139246
35248a244341L76743r40161j282797j36116J131162J063926J62414l1293O06495
35239b93968P69355P5017k71519L99717R94875L90572q07735j242314o81435N2761
35229f14674M05476M24280K21317q2207j61449J46242N47933P65452Q62003P56691
35219C271064P0161j048618j650309j177607k69910K67344N37868Q26635O65513
35210A492141k71277j049176n71300O40178J093693M89082j06079q3410Q7833
35201A721685Q0290J65757K77429o4228o11633m62343L63064O89204Q374p10027
$$ y = [-586907, -1619642, -2399856, -2178431, -1344204, -767705, -563297, -271323, 195743, 534092, 677485, 773243, 667271, -28596, -1322153, -2598199, -3051855, -2383587, -1244341, -867598, -1807759, -3090556, -3226672, -2095510, -1031584, -869170, -900463, -293968, 475387, 550404, 278885, 678602, 1673477, 2064049, 1256314, 14000, -667435, -614674, -209198, 215082, 436399, 354192, 192743, 338985, 886918, 1652370, 2514373, 3271064, 3341225, 2292607, 642298, -535309, -805219, -537875, -7, 826628, 1492141, 1220864, 171688, -399612, 240566, 1334259, 1823341, 1717262, 1633852, 1721685, 1801975, 1967732, 2245161, 2180933, 1569300, 1106957, 1470021, 2159225, 2167599, 1457572]
35191A457572o09279j22593J06700K36332L36412k29701j434537j778483k66541
35182b304118J696975J962696O05210l94108j24304L12564p1852p27610p93161
35173A62292m26461j76182p613K58102K79081j97849n73974j13313Q18318J064979
35163A087380K75080n44474l93309L26900L57986o53839j626301j483909n19452
35154c173938K18445M22381N82090P80945N13775j35197k41495N11612J111267
35145E89885O85417j44746k93813J13132J73266j96878k86165L9491J47847k20516
35135F06920o37821q17129q37124n80105J19670Q13969Q95486O41191P39672Q87043
35125A831772J75644j052928j283642j76652P06876K71357m80363k23072N76963
$$ y = [1457572, 848293, 725700, 832400, 1068732, 1405144, 1175443, -259094, -2037577, -2304118, -607143, 1355553, 1960763, 1566655, 1442351, 1754915, 1683063, 955453, 162292, -264169, -440351, -447964, -189862, 89219, -108630, -682604, -795917, 22401, 1087380, 1362460, 817986, 424677, 751577, 1109563, 455724, -1170577, -2654486, -3173938, -2955493, -2533112, -1951022, -1170077, -656302, -791499, -1032994, -521382, 589885, 1275302, 1130556, 836743, 949875, 1123141, 926263, 640098, 679589, 827436, 606920, -30901, -848030, -1685154, -2265259, -2145589, -1331620, -436134, 205057, 944729, 1831772, 2007416, 954488, -329154, -505806, 201070, 472427, -7936, -231008, 345955]
35116C45955O53266N2218k24165l3161n9466l45783k98306j7360k53517r56224
35106a136543j105735k62598P45588J024742O58739K27923J8813N1144K82261
35097E04334M75689L45853N092k13246m08602r44960j562715j461321n33040K85845
35087c507071L28773J21724M08841R13953Q56852K74697m9556J64169L41472M4325
35077a01821l82927m28404j58943O147o7610j92137k49174k39204m4269M45373
35067a412969R42852R27950L78486m6788J38664N62806O02532L57910L63647N06100
35057C321190J00513q31935j301722q04149j78013l26153q08246o15420J80670
35048a263265O03832L18334p3978j92283k70546l35292n8255L41628R5192q05127
$$ y = [345955, 999221, 1051439, 827274, 794113, 734647, 388864, 90558, 73198, -180319, -1136543, -2242278, -2504876, -1759288, -734546, -75807, 152116, 170929, 222073, 504334, 980023, 1325876, 1330968, 1117722, 709120, -235840, -1798555, -3259876, -3792916, -3507071, -3178298, -3056574, -2647733, -1733780, -876928, -602231, -651787, -487618, -146146, -101821, -484748, -913152, -1072095, -1065948, -1133558, -1325695, -1574869, -1814073, -1858342, -1412969, -470117, 457833, 836319, 789531, 928195, 1491001, 2093533, 2451443, 2815090, 3321190, 3421703, 2589768, 1288046, 483897, 305884, -20269, -828515, -1443935, -1263265, -659433, -341099, -415077, -607360, -877906, -1213198, -1271453, -929825, -834633, -1639760]
35038a639760j256485n89035L70951M76358j74191o09713m22923l0982K06728
35029c669052L88456O69190R83073J132830Q91727K25780m02805l76216J75483
35020A8466L65923j76332o85509m61905R894n5934l84268j92982L45452L84893
35010h32302o0523j06099M32582O59023O4768o73635p68224l17275J46244K97207
35000a158234j05625j097077j879680j299947M80765J743195J374371L86759L69808
34991a185665J224247J574123Q85173p6936o58332r77597j162248r94968n15575
34982a887778j30423O8827L76545P45771P21165K38380k26931m49776o49399p34525
34972a928144k11333Q05714J302369O10008o67166j451480j364853o85298K07884
$$ y = [-1639760, -2896245, -3485280, -3114329, -2637971, -2812162, -3421875, -3844798, -3875780, -3669052, -3280596, -2611406, -1628333, -495503, 396224, 622004, 219199, -157017, 18466, 384389, 208057, -477452, -939357, -929463, -985397, -1369665, -1562647, -1217195, -832302, -892825, -998924, -566342, 92681, 157449, -516186, -1284410, -1601685, -1455441, -1158234, -1263859, -2360936, -4240616, -5540563, -5059798, -3316603, -1942232, -1555473, -1185665, 38582, 1612705, 2497878, 2420942, 1762610, 785013, -377235, -1372203, -1887778, -2018201, -1949374, -1572829, -827058, -105893, 132487, -94444, -544220, -1193619, -1928144, -2139477, -1333763, -31394, 578614, -88552, -1540032, -2904885, -3590183, -3382299]
34963c382299P89369M53098o26939j221048m67008Q20623J165652M71832J6741
34954a979979M60625R82100P23323J14039R2642O39823Q78476L90750k86094n34577
34944A481128m57690m98178n87186j80901P81472J430501R25980l50448j166817
34935A377861j008353n58603m03498j39427N93750J030079L38416p14128n26057
34926i960R24095J799454R22416o73141j375568j087282p44839o20030k91096
34917a155951J75300K38881n4896j15606P8808o1777n21356m57462L95040J035699
34907d43320N78179l78495n72716J47332P48641N68469P2025j08533j25406m30154
34897E6022q29155o77162J09274Q42365R94601Q15857P08781M69919k35160q99598
$$ y = [-3382299, -2592930, -2139832, -2766771, -3987819, -4454827, -3634204, -2468552, -1996720, -1979979, -1519354, -537254, 186069, 300108, 392750, 1032573, 1911049, 2301799, 2015705, 1481128, 1023438, 525260, -61926, -242827, 538645, 1969146, 2895126, 2544678, 1377861, 369508, -189095, -592593, -732020, -138270, 891809, 1230225, 516097, -9960, 914135, 2713589, 3636005, 2962864, 1587296, 500014, -244825, -864855, -1155951, -980651, -741770, -796666, -912272, -833464, -895241, -1416597, -1874059, -1479019, -443320, 134859, -243636, -816352, -669020, 79621, 648090, 720115, 611582, 486176, 56022, -773133, -1450295, -1341021, -498656, 495945, 1311802, 2020583, 2490502, 2255342, 1355744]
34887A355744n53155O97095J364764M47467j030451j249844o9033Q30511L74677
34878B167775m74777l28399N33068P08587j47529q99412p15372j74549j50050
34869E19342m64975l98539P166J5245n90928j140779j010738l22836M30597R21271
34859b035174R58102M71103j63673k60842L04716P58112M14018l35435n56146
34850d45219k4778O54477R83485R30984M66223m45436j247226j018410K89460
34841A43560J468903J409286L78721n26725p95701p83769q61411r22282p25759
34832a215177k68412K46741N51345M60802R5450j47161k9261K67571M63642M88744
34822I14284K90565k44372q39519p74038J63434J061039R33902J16446k21198
$$ y = [1355744, 802589, 1499684, 2864448, 3311915, 2281464, 1031620, 962587, 1793098, 2167775, 1692998, 1364599, 1897667, 2606254, 2458725, 1559313, 843941, 669392, 519342, 54367, -344172, -337006, -321761, -912689, -2053468, -3064206, -3387042, -2956445, -2035174, -1077072, -605969, -769642, -1030484, -725768, 32344, 446362, 110927, -445219, -469997, 184480, 1167965, 2098949, 2565172, 2119736, 872510, -145900, 143560, 1612463, 3021749, 3400470, 2873745, 2078044, 1294275, 432864, -489418, -1215177, -1483589, -1236848, -685503, -224701, -129251, -276412, -305673, -38102, 425540, 914284, 1204849, 960477, 120958, -653080, -489646, 571393, 1505295, 1621741, 1400543]
34813A400543J78733L55089k78318r77469p82774J06845O75495L93650l51820
34804G19974q73409q01395k77650J39196n0688o57098r03440m25764J67751J30897
34794b831626l25520l16619M49053J243303J254022N14064k88887o14920m53958
34785a371088j18974O4376p2763m28178o26680l26414L31858P20095L98687k56354
34775a685435m12596J62074P60821O87552J97688O9776M58127P13898L35132m15560
34765H71477r59962j040070p32957k08495K92706N17386M61973L79688L78030
34756d0224K47284j31358m43537k76854K82611O03896J39855q86326j484324q27815
34746b816792O90296J657071J204688L2383o13060n84257o62687r79725p26763
$$ y = [1400543, 1579276, 1934365, 1656047, 678578, -104196, 2649, 678144, 1071794, 719974, -153435, -954830, -1232480, -1093284, -1143972, -1801070, -2704510, -3130274, -2962523, -2831626, -3157146, -3473765, -3024712, -1781409, -527387, -13323, -302210, -917130, -1371088, -1490062, -1425686, -1498449, -1926627, -2553307, -2879721, -2547863, -1827768, -1429081, -1685435, -2098031, -1935957, -1175136, -487584, -289896, -220120, 238007, 951905, 1287037, 871477, -88485, -1128555, -1861512, -2070007, -1777301, -1259915, -797942, -418254, -40224, 207060, 75702, -367835, -644689, -362078, 241818, 381673, -504653, -1988977, -2816792, -2126496, -469425, 735263, 767646, 154586, -429671, -1092358, -2072083, -2798846]
34737b798846L33257J140570P33266m05688j072192q29005j13032O24268J155333
34728a232069J235678Q59116N29231O50438Q51642M98822l12571q56472p35635
34719A488180k37751J49132J67047j00222k34472R0862M33773q1007j315306j807490
34709a447254p14763P17631P89078j71941m21658M29927R72356M37511j63956
34700D26931L3228K45040n18715j665692j869427r87068k4500L61094L56115K96109
34690c346885L32497O09384J073445J255732P98548L858o05255r51933j144293
34681a974902r68537k94321L60935L99732M5500j8418K97339M99715L86447J64461
34671a102049j36461n56793o35671J27391J209777J439009O37338n6287J47196
$$ y = [-2798846, -2465589, -1325019, -591753, -997441, -2069633, -2898638, -3011670, -2387402, -1232069, 3609, 862725, 1391956, 2042394, 2894036, 3392858, 3080287, 2223815, 1488180, 1250429, 1399561, 1566608, 1466386, 1231914, 1322776, 1756549, 1675542, 360236, -1447254, -2162017, -1444386, -655308, -827249, -1248907, -818980, 153376, 590887, 426931, 460159, 705199, 186484, -1479208, -3348635, -4335703, -4360203, -3999109, -3642994, -3346885, -3014388, -2405004, -1331559, -75827, 722721, 726579, 121324, -830609, -1974902, -2943439, -3237760, -2876825, -2477093, -2431593, -2450011, -2152672, -1652957, -1266510, -1102049, -1238510, -1795303, -2430974, -2303583, -1093806, 345203, 982541, 926254, 1073450]
34662A073450O55179O68794M55139O02059P37518J03574r41757j181928l71741
34653A800287K54995k74000j248943j284054k68515N07599J43540o76127o28012
34644a673230N07842J568562J440999L29938o12385o22951M2958O55711P45265
34635B382709K65369n19279j082212r33947k15046K64177k5569n44419l61073
34626g69290M70941Q83273L24995l65368j63116N55434M52493q28920k012270
34617a451828j792322m44214P10768J018402R53244R93348Q49213J57032o35715
34608C57928p22946j35321J54060m67354j309592j202292o7512Q99289P53628
34599a740112k927j67434N33698J148856Q31263r5146o33583k82396O00395J321356
$$ y = [1073450, 1728629, 2397423, 2852562, 3454621, 4192139, 4295713, 3353956, 2172028, 1800287, 2055282, 1781282, 532339, -751715, -1020230, -512631, -369091, -1045218, -1673230, -1165388, 403174, 1844173, 2174111, 1561726, 938775, 981733, 1637444, 2382709, 2648078, 2128799, 1046587, 112640, -102406, 161771, 136202, -408217, -769290, -298349, 584924, 909919, 544551, 381435, 936869, 1389362, 560442, -1451828, -3244150, -3688364, -2977596, -1959194, -1005950, -12602, 836611, 993643, 357928, -365018, -500339, -346279, -813633, -2123225, -3325517, -3393029, -2493740, -1740112, -1743039, -1910473, -1376775, -227919, 603344, 508198, -125385, -407781, 192614, 1513970]
34589A513970J403288P96159r9444o54888n26980K1759M24019L49209j38411p58361
34579B330320j152821j030625m40630J77879M00887J85523k41838n99140n26085
34570h96530K19744J211965J445639N10764o70688r15161l05822J01830r1675
34561F10066k23162J64350O15639O42959M48152K80393j74184j106484j844732
34552e87003j549289l71520P08561J039496P82929L97995J42885K7664j35953
34543D55765n82007j176905j303234n39698O34003J212869P58415j89907p89170
34534a519869o79841p4733O20234J089788J158072P83654J11495n37895r17545
34525C3360j141320j474559j699925j096589N13245K051496K224287J147587J62702
$$ y = [1513970, 2917258, 3713417, 3613973, 2959085, 2432105, 2453864, 2877883, 3227092, 3088681, 2330320, 1177499, 146874, -293756, -115877, 285010, 470533, 228695, -370445, -896530, -676786, 535179, 1980818, 2491582, 1820894, 905733, 599911, 701741, 610066, 386904, 551254, 1166893, 1809852, 2258004, 2538397, 2364213, 1257729, -587003, -2136292, -2507812, -1799251, -759755, 23174, 421169, 564054, 591718, 455765, -126242, -1303147, -2606381, -3146079, -2512076, -1299207, -540792, -730699, -1519869, -2199710, -2274443, -1654209, -564421, 593651, 1377305, 1488800, 950905, 33360, -1107960, -2582519, -4282444, -5379033, -4865788, -2814292, -590005, 557582, 720284]
34516G20284L3838K06624L3460k31769j35065J10515Q0949j56900l54820n03434
34506a96318m55808J49744J008872J021177j53407j207304q66468K42811N92277
34497A35576K9639l31101j28697j03861m44120l40461M50754R75592N88399m0818
34487G90902q5833K18289K46366J02428K76547O95601Q39226N13763j3629m28309
34477C155351n65649m48740l69763o28767j023702r91398m21807J22264K03983
34468i68228O0544R6895K72699K97237J05248j04805p4224L31814Q58586Q92213
34458A767979K18297m27906k49278L22661J38589q55640j408158q53315r7075
34449a443846j27342n30737l11852N30183J108451Q88669J27370n77064o60577
$$ y = [720284, 754122, 960746, 994206, 762437, 627372, 737887, 818836, 661936, 307116, -196318, -652126, -502382, 506490, 1527667, 1374260, 166956, -699512, -456701, 135576, 165215, -165886, -294583, -398444, -842564, -1183025, -732271, 243321, 831720, 790902, 705069, 923358, 1169724, 1272152, 1548699, 2244300, 3083526, 3597289, 3583660, 3155351, 2589702, 2140962, 1771199, 1142432, 118730, -872668, -1294475, -1172211, -968228, -907684, -810789, -538090, -240853, -135605, -240410, -314634, 17180, 875766, 1767979, 1986276, 1558370, 1309092, 1631753, 1770342, 914702, -493456, -1346771, -1443846, -1571188, -2101925, -2413777, -1883594, -775143, 113526, 240896, -336168, -996745]
34440i96745M8471R03158R00576J2709n96853k09126L71812J20090n90832o77191
34430g13931j10829J55041k05459m67437j02158M58951N46339J33280k45913j34313
$$ y = [-996745, -948274, -45116, 855460, 868169, 271316, 62190, 434002, 554092, -36740, -713931, -824760, -669719, -875178, -1342615, -1444773, -985822, -439483, -306203, -552116, -686429]
$$ [...]
##END NTUPLES=NMR SPECTRUM
##END=
