##TITLE=31Pdec_89-2021
 CDCl3, 24 sc
 1.09.2021
##JCAMPDX= 6.0         $$ Bruker NMR JCAMP-DX V2.0
##DATA TYPE= NMR SPECTRUM
##DATA CLASS= NTUPLES
##ORIGIN= UXNMR, Bruker Analytische Messtechnik GmbH
##OWNER= root
$$ XWIN-NMR		Version 3.5
$$ Wed Sep  1 11:41:07 2021 Russian Standard Time (UT+4h)  she@DPX200
##.OBSERVE FREQUENCY= 81.013821
##.OBSERVE NUCLEUS= ^31P
##.ACQUISITION MODE= SIMULTANEOUS
##.ACQUISITION SCHEME= undefined
##.AVERAGES= 24
##.DIGITISER RES= 16
##SPECTROMETER/DATA SYSTEM= spect
##.PULSE SEQUENCE= zgpg30
##.SOLVENT NAME= CD2Cl2
##.SHIFT REFERENCE= (INTERNAL, CD2Cl2, 0, 248.564)
##AUDIT TRAIL= $$ (NUMBER, WHEN, WHO, WHERE, WHAT)
$$ ##TITLE= Audit trail, XWIN-NMR		Version 3.5
$$ ##JCAMPDX= 5.01
$$ ##ORIGIN= Bruker BioSpin GmbH
$$ ##OWNER= she
$$ F:/spectra/data/she/nmr/P31/1/pdata/1/auditp.txt
$$ ##AUDIT TRAIL=  $$ (NUMBER, WHEN, WHO, WHERE, WHAT)
(   1,<2021-09-01 11:40:04.73 +0400>,<she>,<DPX200>,
      <created by zg, POWCHK disabled, PULCHK disabled
       configuration hash MD5:
       00 E9 B6 7A A2 85 ED C7 34 08 36 98 17 FE 4E 26
       data hash MD5: 32K
       A8 D7 0A FD D7 6E C6 6E 41 3E 40 76 9F 7B F3 F0>)
(   2,<2021-09-01 11:40:07.01 +0400>,<she>,<DPX200>,
      <Start of raw data processing
       efp BC_mod = 2 LB = 1 FT_mod = 6 PKNL = 1 PHC0 = -7618.098 PHC1 = -182.327 SI = 64K 
       data hash MD5: 64K
       8A 4E 41 C4 8A 7D 8B 29 51 39 52 63 F0 EC 12 3D>)
(   3,<2021-09-01 11:40:28.65 +0400>,<she>,<DPX200>,
      <pk PHC0 = 1.216709 PHC1 = 0 
       data hash MD5: 64K
       90 F6 9B 21 31 23 FC D9 23 72 26 D0 8B 20 E4 8A>)
(   4,<2021-09-01 11:40:31.73 +0400>,<she>,<DPX200>,
      <abs ABSG = 5 
       data hash MD5: 64K
       0B 1B 10 FE 28 D3 87 C6 07 B2 A3 59 C6 D6 15 9D>)
$$ ##END=
$$ 
$$ hash MD5
$$ 26 41 5F 03 A9 EF F3 4B 5A 96 D7 88 B0 F3 F8 B6
##$RELAX= 
##$RELAX= 
##$RELAX= 
##$RELAX= 
##$RELAX= 
##$RELAX= 
##$RELAX= 
##$RELAX= 
$$ Bruker specific parameters
$$ --------------------------
##$DU= <F:/spectra>
##$EXPNO= 1
##$NAME= <P31>
##$PROCNO= 1
##$TYPE= <nmr>
##$USER= <she>
##$AMP= (0..31)
100 100 100 100 100 100 100 100 100 100 100 100 100 100 100 100 100 100 
100 100 100 100 100 100 100 100 100 100 100 100 100 100 
##$AQSEQ= 0
##$AQ_mod= 1
##$AUNM= <au_zg>
##$AUTOPOS= <>
##$BF1= 81.014009
##$BF2= 200.13
##$BF3= 200.13
##$BF4= 200.13
##$BF5= 200.13
##$BF6= 200.13
##$BF7= 200.13
##$BF8= 200.13
##$BYTORDA= 1
##$CFDGTYP= 0
##$CFRGTYP= 5
##$CHEMSTR= <none>
##$CNST= (0..31)
1 1 145 1 1 1 1 1 1 1 1 1 1 1 1 1 1 1 1 1 1 1 1 1 1 1 1 1 1 1 1 1 
##$CPDPRG= <waltz16>
##$CPDPRG1= <>
##$CPDPRG2= <waltz16>
##$CPDPRG3= <>
##$CPDPRG4= <mlev>
##$CPDPRG5= <mlev>
##$CPDPRG6= <mlev>
##$CPDPRG7= <mlev>
##$CPDPRG8= <mlev>
##$CPDPRGB= <>
##$CPDPRGT= <>
##$D= (0..31)
0 1 0 0 0 0 0 0 0 0 0 0.03 2e-05 3e-06 0 0 0 0 0 0 0 0 0 0 0 0 0 0 0 0 
0 0 
##$DATE= 1630482003
##$DBL= (0..7)
120 120 120 11 120 120 24 19 
##$DBP= (0..7)
150 150 150 150 150 150 150 150 
##$DBP07= 0
##$DBPNAM0= <>
##$DBPNAM1= <>
##$DBPNAM2= <>
$$ [...]
##$SUBNAM3= <"">
##$SUBNAM4= <"">
##$SUBNAM5= <"">
##$SUBNAM6= <"">
##$SUBNAM7= <"">
##$SUBNAM8= <"">
##$SUBNAM9= <"">
##$SW= 501.771253377433
##$SWIBOX= (0..15)
0 1 3 0 0 0 0 0 0 0 0 0 0 0 0 0 
##$SW_h= 40650.406504065
##$TD= 32768
##$TD0= 1
##$TE= 0
##$TE2= 300
##$TE3= 300
##$TEG= 300
##$TL= (0..7)
0 120 53 12 22 120 120 120 
##$TP= (0..7)
150 150 150 150 150 150 150 150 
##$TP07= 0
##$TPNAME0= <>
##$TPNAME1= <>
##$TPNAME2= <>
##$TPNAME3= <>
##$TPNAME4= <>
##$TPNAME5= <>
##$TPNAME6= <>
##$TPNAME7= <>
##$TPOAL= (0..7)
0.5 0.5 0.5 0.5 0.5 0.5 0.5 0.5 
##$TPOFFS= (0..7)
0 0 0 0 0 0 0 0 
##$TUNHIN= 0
##$TUNHOUT= 0
##$TUNXOUT= 0
##$USERA1= <user>
##$USERA2= <user>
##$USERA3= <user>
##$USERA4= <user>
##$USERA5= <user>
##$V9= 5
##$VALIST= <valist>
##$VCLIST= <CCCCCCCCCCCCCCC>
##$VD= 0
##$VDLIST= <DDDDDDDDDDDDDDD>
##$VPLIST= <PPPPPPPPPPPPPPP>
##$VTLIST= <TTTTTTTTTTTTTTT>
##$WBST= 1024
##$WBSW= 4
##$XGAIN= (0..3)
0 0 0 0 
##$XL= 0
##$YL= 0
##$YMAX_a= 2303
##$YMIN_a= -3719
##$ZGOPTNS= <>
##$ZL1= 120
##$ZL2= 120
##$ZL3= 120
##$ZL4= 120
##$ABSF1= 248.5645
##$ABSF2= -253.2056
##$ABSG= 5
##$ABSL= 3
##$ALPHA= 0
##$AQORDER= 0
##$ASSFAC= 0
##$ASSFACI= 0
##$ASSFACX= 0
##$ASSWID= 0
##$AUNMP= <proc_1d>
##$AZFE= 0.1
##$AZFW= 0.5
##$BCFW= 0
##$BC_mod= 2
##$BYTORDP= 0
##$COROFFS= 0
##$CY= -3
##$DATMOD= 1
##$DC= 0
##$DFILT= <>
##$DTYPP= 0
##$F1P= 0
##$F2P= 0
##$FCOR= 1
##$FTSIZE= 65536
##$FT_mod= 6
##$GAMMA= 0
##$GB= 0
##$INTBC= 1
##$INTSCL= 5.30512e-09
##$ISEN= 30
##$LB= 1
##$LEV0= 0
##$LPBIN= 0
##$MAXI= 10000
##$MC2= 0
##$MEAN= 0
##$ME_mod= 0
##$MI= 50
##$NCOEF= 0
##$NC_proc= -6
##$NLEV= 6
##$NOISF1= 182.463
##$NOISF2= 159.3651
##$NSP= 0
##$NTH_PI= 0
##$NZP= 0
##$OFFSET= 248.5645
##$PC= 4
##$PHC0= -7616.881
##$PHC1= -182.327
##$PH_mod= 1
##$PKNL= yes
##$PPARMOD= 0
##$PSCAL= 0
##$PSIGN= 0
##$REVERSE= no
##$SF= 81.014009
##$SI= 65536
##$SIGF1= 159.3651
##$SIGF2= -187.1042
##$SINO= 113.3802
##$SIOLD= 16384
##$SREGLST= <1H.CDCl3>
##$SSB= 0
##$STSI= 65536
##$STSR= 0
##$SW_p= 40650.406504065
##$SYMM= 0
##$S_DEV= 0
##$TDeff= 32768
##$TDoff= 0
##$TI= <>
##$TILT= no
##$TM1= 0
##$TM2= 0
##$TOPLEV= 0
##$USERP1= <user>
##$USERP2= <user>
##$USERP3= <user>
##$USERP4= <user>
##$USERP5= <user>
##$WDW= 1
##$XDIM= 65536
##$YMAX_p= 301985876
##$YMIN_p= -104460810
$$ End of Bruker specific parameters
$$ ---------------------------------
##NTUPLES= NMR SPECTRUM
##VAR_NAME=  FREQUENCY,     SPECTRUM/REAL,   SPECTRUM/IMAG
##SYMBOL=    X,             R,               I
##VAR_TYPE=  INDEPENDENT,   DEPENDENT,       DEPENDENT
##VAR_FORM=  AFFN,          ASDF,            ASDF
##VAR_DIM=   65536,         65536,           65536
##UNITS=     HZ,            ARBITRARY UNITS, ARBITRARY UNITS
##FACTOR=    0.620285442955139, 1,           1
##FIRST=     20137.2065510759, 0,            0
##LAST=      -20513.1999529892, 0,           0
##MIN=       -20513.1999529892, -104460810,  0
##MAX=       20137.2065510759, 301985876,    0
$$ Real data points
##PAGE= N=1
##DATA TABLE= (X++(R..R)), XYDATA
$$ [...]
##PAGE= N=2
##DATA TABLE= (X++(I..I)), XYDATA
38734G91013l14880o55050n30987m49298j19348P12976J202946M94724o25972
38725E06124o03800M86051R18611l0858r62812o29867J22539j4268m30701K91039
38715c47942J497210R48750j550985l184681j831183R33594K009212P74141p31747
38706a483631r14642j71163M92321P98669Q96007Q48885P50567O17861J58794
38697A993668o64153j096567n35799K91908K42829m01689l68941M31212P43311
38688F35779J44483k98470l1730J6535p11131j153377l68315P74993R19464K28957
38678A57188j90720n9111J30546K62994N08927N93012J97729l57790o71598q73645
38668c02468r41749l06914R34153J467050N95598m49353m06571k0641m70350r41386
$$ y = [791013, 476133, -178917, -709904, -1159202, -1278550, -565574, 637372, 1132096, 506124, -97676, 388375, 1306986, 1276128, 313316, -316551, -194012, -208280, -638981, -347942, 1149268, 2098018, 547033, -2637648, -4468831, -3535237, -1526025, -751884, -1483631, -2398273, -2569436, -2077115, -1278446, -382439, 466446, 1217013, 1834874, 1993668, 1329515, 232948, -302851, -10943, 231886, -169803, -538744, -107532, 635779, 780262, 481792, 450062, 466597, -244534, -1397911, -1766226, -991233, -71769, 157188, -33532, -92643, 37903, 300897, 809824, 1402836, 1600565, 1242775, 571177, -302468, -1244217, -1551131, -616978, 850072, 1445670, 996317, 589746, 569105, 98755, -842631]
38658h42631m074J442758J223704m72051j242343l41967M02709L8316m1577Q75415
38648A038259J096859m88297k061520j588378j9075M57253j27249j95231L45694
38639a541685L08569j47529K97826J385725J221485n73272j871063j113589M32291
38630a601242P01607k50209p77595k55560L37886K21309j24168J5436M12828L70490
38620i49218q6658k22211K18549N36654J75031l13942j05814N09998N73968R8826
38610D35183K3528M13404J81340q47083j176514l3853R68885J76873j288243j106016
38600b252496N59453J290596K11009q37496l90692N69406O08782M8632r5306O0576
38590b27536j19154m17556l21919j04614j40352N9239R03426J563854J084256
$$ y = [-842631, -846705, 596053, 1819757, 1347706, 105363, -236604, 166105, 204421, 162844, 1038259, 2135118, 1646821, -414699, -2003077, -2022152, -1564899, -1692148, -1887379, -1541685, -1233116, -1380645, -1082819, 302906, 1524391, 951119, -919944, -2033533, -1601242, -899635, -1149844, -1927439, -2182999, -1845113, -1623804, -1747972, -1732536, -1319708, -949218, -1035876, -1258087, -1039538, -502884, -327853, -641795, -747609, -237611, 336357, 435183, 458711, 872115, 1053455, 206372, -970142, -1003995, -35110, 141763, -1146480, -2252496, -1693043, -402447, -191438, -1028934, -1419626, -850220, -241438, -192806, -288112, -227536, -346690, -764246, -1086165, -1190779, -1331131, -1271892, -368466, 1195388, 2279644]
38581B279644L4388l27958m6924j37872o10455m56755L84229O64095j93217j113101
38571D76074r62609n7846N53626M97498J50072p8304j8168K49295L07711k35382
38561H81967j062195j292579n63435M69653R26889O43979J75227J29909N18480
38552H27895O12653k14203j288075j045248P07774J921516R11491j053894j494348
38543a14439l76221J63721n24274q12492Q225M70982j69643m08590O78509J499467
38533D15245O87061m29593k41583K90221l16871j023039j62213J133129O49609
38524A001966q37259p05508Q95036J247901j57504q34820J53909N88847p48028
38515F04540j758847o86700Q74691P98576j61980j16591O83141O62436k95948
$$ y = [2279644, 2314032, 1986074, 1939150, 1801278, 1190823, 734068, 1118297, 1782392, 1589175, 476074, -486535, -544381, 9245, 506743, 656815, 578511, 560343, 809638, 1117349, 881967, -180228, -1472807, -2036242, -1566589, -639700, 4279, 179506, 309415, 827895, 1440548, 1226345, -61730, -1106978, -399204, 1522312, 2433803, 1379909, -114439, -490660, -326939, -851213, -1663705, -1655480, -1184498, -1354141, -1762731, -1084222, 415245, 1102306, 672713, 431130, 721351, 404480, -618559, -780772, 352357, 1001966, 164707, -540801, 354235, 1602136, 1444632, 609812, 763721, 1352568, 604540, -1154307, -1841007, -966316, -167740, -329720, -446311, 236830, 899266, 603318]
38506F03318r92277q94655l30872L85204P17830n2564j362176j350896M07580
38497b869508J806345J319089L67433O94930J272885K82263j386888j480913k09351
38488b03715K13831o71700j120141l57859M20201L94265J37764M0513k25768m47785
38478a820394L1249Q16352Q44776K52849P6195K73952K85m23749p766O70852J75229
38467H89830r57470p94035M90605O44082p16890j337905l13343M19203j70962
38458a846885k83581J064913J690511q278j791737r96724J113582J592699N24502
38449A059002J08758M61480n9884j151514q44458O71151R76932m60205j315886
38440e54624l28590P49231L25480m82429r4988P50755L54076j101422j843238
$$ y = [603318, -388959, -1283614, -1614486, -1229282, -511452, -564016, -1926192, -3277088, -2869508, -1063163, 255926, 623359, 1318289, 2591174, 2873437, 1486549, 5636, -203715, 10116, -661584, -1781725, -2139584, -1719383, -1325118, -1187354, -1146841, -1372609, -1820394, -1789145, -972793, -128017, 124832, 201027, 474979, 475264, 51515, 43749, 714601, 889830, -67640, -861675, -371070, 273012, -443878, -1781783, -2095126, -1675923, -1846885, -2130466, -1065553, 624958, 616680, -1175057, -2171781, -1058199, 534500, 1059002, 1167760, 1629240, 1569356, 417842, -426616, 244535, 1221467, 761262, -554624, -883214, -133983, 191497, -290932, -385920, 364835, 718911, -382511, -2225749]
38431b225749j016247N04591J499751J576232J072135M80091J7479m20887q20791
38422F66605p91638j89889L39828K00766r2584L13417J021470Q34301k25582p77098
38412A299596k49853K41770k23721r42998q65455k15797J18174R415l4829J51643
38402g12055L48017M38796L59796J5983l18517j36989L68257L07356m91256r94427
38392h15039n30690J61372K68673K22043O04029P89744P4373p31024m85014J81495
38382b60038j57375j056837o83799R87716J754777N67122q37057p39453Q1098
38373c43846J44115j74007K41708Q57610L89512o77800p12074K41364N00980l10132
38363A57430o19543K76216R34798L23216l27543K90405J140030M95349j074593
$$ y = [-2225749, -3241996, -2737405, -1237654, 338578, 1410713, 1890804, 1908283, 1487396, 666605, -125033, -314922, 24906, 225672, 133088, 446505, 1467975, 2302276, 2076694, 1299596, 1049743, 1291513, 1067792, 124794, -740661, -956458, -838284, -828869, -863698, -712055, -364038, 74758, 434554, 450537, 132020, -4969, 363288, 670644, 179388, -815039, -1345729, -1184357, -915684, -693641, -89612, 700132, 774505, 43481, -441533, -260038, -417413, -1474250, -2158049, -1170333, 584444, 1151566, 314509, -424944, -343846, -199731, -373738, -132030, 725580, 1115092, 437292, -274782, -33418, 467562, 157430, -462113, -185897, 748901, 1072117, 744574, 1034979, 2175009, 2670358, 1595765]
38354A595765j487090m14179L41278k03803q46575l58154O06662P13260n0353
38345a03189o34971n54312k76804k65289l88151k83095J24097N23502N42783K32268
38335a083161J06700M14703O08148J34284m42923l7719J173485J662128O76738
38326C212383o14361q66272m68596o11195j154457q58300M41062J308285P20946
38317A109495m92807q58032j60459N83094O52891L46952K10654K27928J04652
38308A724368n1794J18331M63969L21590m54449j027973p00279k1813K2400m11528
38298a7178l55044K08987K90452j91122m3987R32661J027914o73670k168698j124539
38288b114224J378133K081180K19306j543571j171871J90039O63155M15215M71750
$$ y = [1595765, 108675, -305504, 35774, -168029, -1014604, -1372758, -766096, -52836, -103189, -738160, -1292472, -1569276, -1834565, -2222716, -2505811, -2381714, -1858212, -1315429, -1083161, -976461, -561758, 46390, 180674, -262249, -299968, 873517, 2535645, 3212383, 2598022, 1731750, 1263154, 651959, -502498, -1360798, -919736, 388549, 1109495, 616688, -241344, -401803, 181291, 834182, 1181134, 1391788, 1619716, 1724368, 1672574, 1790905, 2254874, 2576464, 2122015, 1094042, 393763, 371950, 394350, -17178, -372222, -163235, 127217, -63905, -107892, 824769, 1852683, 1179013, -989685, -2114224, -736091, 1345089, 1564395, 20824, -1151047, -961008, -297853, 117362, 589112]
38279E89112M95090l19186j240487r09243L10747P65788J08194k96611L10100
38270a86496R68413O98836J1686j3355O90249J208617Q01803l93725j483975j509871
38260G92182m44274N38020L71836m40309n23454K82185O80489J7861o57705l10173
38250C06658M76385O17704L32582N57482J137400R94968m7194q97411q03109k75518
38240B399947j22232m14183p58878r12417p76227l28654J70110L74622M03333
38231C5421O58493R95112P47936j78187r49005r13829m47199k19413k00149M9245
38221d21575N27187Q14876O59667Q0699p81906j480805j325393k16310Q88297
38212a255263R75109K38807k95513k42553j88834n26320p61380l56036L30605
$$ y = [589112, 1084202, 765016, -475471, -1384714, -1073967, -308179, -199985, -496596, -186496, 781917, 1480753, 1492439, 1479084, 2169333, 3377950, 4179753, 3786028, 2302053, 792182, 347908, 885928, 1257764, 817455, 294001, 576186, 1256675, 1274536, 616831, 306658, 783043, 1400747, 1733329, 2290811, 3428211, 4423179, 4375985, 3478574, 2675465, 2399947, 2277715, 1863532, 1104654, 192237, -583990, -912644, -742534, -367912, 35421, 693914, 1689026, 2436962, 2258775, 1309770, 395941, -51258, -270671, -470820, -421575, 105612, 920488, 1580155, 1660854, 878948, -601857, -1927250, -2143560, -1255263, -280154, -41347, -336860, -579413, -768247, -1294567, -2055947, -2411983, -2081378]
38203b081378N18377J66116L8160N31205R81271N74025l63851o86290r3333L56203
38193e9495j37069q10154n58483K09114K61191k47328R2448J433884K044552Q91458
38183C120118p17880j129754o10992l38755l30473O0920N04534K64822j71516
38174F51024K24693J049132Q69286m91508j656886j711380j060141k56232N69624
38165a812388J026136O63104L539j3522L19531r8064j063846j159290j99689L45100
38155a989389o8947p7765J060026J895622J091678l50920p20719j47575Q5598
38146G77609k39277l76756k18581k63108m46087l10057N071J1646k36513l61606
38136a657659l14257j17123L87198R01491O89745r2006k38759M89302O10879o38430
$$ y = [-2081378, -1563001, -1396885, -1358725, -827520, 153751, 727776, 363925, -322365, -415698, -59495, -196564, -1006718, -1565201, -1356087, -1094896, -1342224, -1249776, 184108, 2228660, 3120118, 2402238, 1272484, 661492, 322737, -7736, 53184, 557718, 822540, 651024, 875717, 1924849, 2794135, 2302627, 645741, -1065639, -2125780, -2382012, -1812388, -786252, -123148, -119609, -133131, 186400, 88336, -975510, -2134800, -2334489, -1989389, -2058336, -2136101, -1076075, 819547, 1911225, 1560305, 839586, 692011, 777609, 538332, 161576, -57005, -320113, -766200, -1076257, -1071186, -1059540, -1296053, -1657659, -1971916, -2089039, -1701841, -800350, -110605, -202611, -441370, 47932, 658811, 20381]
38126B0381j645990q23015P52000J052451K43254j13906K7536m37428j189545
38117b114262q85857K25547O63757M58488Q90565J632881J059505m50437o69014
38108H11173M74165L88130j579658k488247n92067J465109Q26375r72962p38787
38099b406769J132842J682873L95282m42404R5450M78469n3955k88880K99128
38090H92036M17709n23324j087803k30945Q70862P47821j34007m35791l7025K70889
38080G50422K55843J51892j78763q02423j001178j51211J068481J387197O05973
38071B086233l55177q12602q11524m77940J32473N54049K21986n71041q36011
38062h69554k48141L74112K70665k34041l45248Q6524N79649P73304O21771J02825
$$ y = [20381, -1625609, -2448624, -1696624, -644173, -400919, -514825, -487289, -924717, -2114262, -3000119, -2774572, -2110815, -1652327, -761762, 871119, 1930624, 1480187, 811173, 1285338, 1673468, 93810, -2394437, -2986504, -1521395, -695020, -1667982, -2406769, -1273927, 408946, 804228, 361824, 457274, 935743, 881788, 592908, 892036, 1309745, 786421, -301382, -532327, 338535, 1086356, 952349, 516558, 479533, 750422, 1006265, 1158157, 979394, 176971, -824207, -975418, 93063, 1480260, 2086233, 1731056, 918454, 106930, -371010, -238537, 315512, 537498, -33543, -869554, -1117695, -743583, -472918, -706959, -1052207, -965683, -386034, 387270, 1009041, 1111866]
38052A111866o63388j100031o12444N07966J130788N57956n67601r88779l10314
38043i33981O24170Q14289K07301m27607m82132j04392J26394j12829n88469p61078
38033a638334k77336O61649J351022J171168L03998k85715J13860R93767J096783
38024C490862j4965j295435j459322n42215L12229M28242K52820L29179L64582
38015A865977j54185q82673q95463K382Q76724P96304p9706q67796j081528r10714
38005a330678n30304K11629J160360J491261O33231o79058j063430k85068M14574
37996B2517J28722m21860j37106O32778O39868j91866n69529J22118Q28575M57684
37986A511901n24673r74773p81120o52673o41086n5541J122150J805822J229696
$$ y = [1111866, 448478, -651553, -1263997, -756031, 374757, 932713, 365112, -623667, -933981, -309811, 504478, 711779, 284172, -197960, -302352, -175958, -288787, -877256, -1638334, -1915670, -1254021, 97001, 1268169, 1572167, 1286452, 1400312, 2394079, 3490862, 3475897, 2180462, 721140, 178925, 491154, 919396, 1172216, 1501395, 1865977, 1711792, 829119, -66344, -63962, 812762, 1609066, 1529360, 661564, -419964, -1330678, -1860982, -1649353, -488993, 1002268, 1635499, 956441, -106989, -392057, 22517, 151239, -270621, -407727, 225051, 864919, 673053, 103524, 225642, 1054217, 1511901, 987228, 12455, -768665, -1421338, -2062424, -2117965, -995815, 810007, 2039703]
37977B039703Q2536l96037m5972J85216k61974q03074p44738l90289l95358m50660
37967a180647K98059J489066J502008j96817j837989j564468L0769R32065N93727
37958F5773J84825L07929L08559o9328j55315J32302n4236p70679q80516n7892
37948i88578M77220N5358l12236R9367L92997p8417l05274L68909O30168m86464
37938a46950j349053j59931J747665J721362q2690j204942q55116m12543k98988
37929a041186M69631J458378P92674j314961k110325n46106Q91857J74912j105156
37920b330282n97061J008783J439943N12843j21343R8840K88580J29990J78336
37911F08629L97012J42119m77091o98289m89295m98153o89023l44613M80623P51608
$$ y = [2039703, 2122239, 1726202, 1680230, 1865446, 1603472, 800398, 55660, -334629, -729987, -1180647, -882588, 606478, 2108486, 1911669, 73680, -1490788, -1460019, -527954, 65773, 250598, 558527, 867086, 797758, 642443, 774745, 720509, -50170, -930686, -988578, -511358, -456000, -768236, -668869, -275872, -354289, -659563, -290654, 339514, -146950, -1496003, -1655934, 91731, 1813093, 1730403, 525461, -329655, -742198, -1041186, -571555, 886823, 1679497, 364536, -1745789, -2291895, -1400038, -1225126, -2330282, -2927343, -1918560, -478617, 34226, -87117, 11723, 300303, 430293, 608629, 1005641, 1147760, 670669, -27620, -516915, -1015068, -1704091, -2048704, -1568081, -816473]
37901h16473L3975p05395l94369O66575J173276M61353o37842p65185K64094J171528
37891D51537Q98327O989l04449l6969q0251m17715j77906N08671M42363m52001
37881H38596o60283M16336J236370N05326p98849j117689o07748k57816N43O29200
37871A83986J005040L82455m86186m19458K15451K86615o2133K9487K00096m79972
37861H55381j340536p70117J006341J903965R84326m03337q70225o28433l70835
37852C66530j08120K09790K07531j61711m02651l69037l50625j64362N92052J281378
37842A100775P10447q24244j520215o06615N94904P79980L64271K75171M19613
37833A294087L31908J78345J14658l27925j223141j579527p46619L32941L73156
$$ y = [-816473, -782498, -1487893, -1882262, -1215687, -42411, 418942, -218900, -984085, -719991, 451537, 1349864, 1356853, 1052404, 1015435, 935184, 517469, 339563, 848234, 1290597, 838596, 178313, 594649, 1831019, 2336345, 1537496, 419807, -187941, -445757, -445214, 183986, 1189026, 1571481, 1085295, 665837, 881288, 1167903, 1105770, 1135257, 1335353, 855381, -485155, -1255272, -248931, 1655034, 2639360, 2236023, 1365798, 737365, 366530, 258410, 468200, 675731, 514020, 111369, -257668, -608293, -772655, -180603, 1100775, 1811222, 986978, -533237, -1139852, -544948, 235032, 599303, 874474, 1294087, 1625995, 1804340, 1918998, 1591073, 367932, -1211595, -1958214, -1625273, -1252117]
37824a252117l85830o19464J90643J228121J464430O72666m53907q57587j70427
37815a83472O79818N71813j46003j89097M26802K65860r52219j502604m16244
37806a445346P15037K42868q08966m85148Q55946J285845N00214j02065j28719
37797F29666n27606j185172o58853J135392K190860J301257j74966n38553j37704
37788B034321k62197r37201j206934p45873N1349R07732J503951J146809k68705
37779B223252j492689j253152Q938Q01129O55970M11003N63104N57098m3618o70487
37769A760548n67062N3247K08660n88946j567730j413460R4883J455411J100079
37760E35630m04209q84264L65213J377024L72647j449618j646149j86554P40984
$$ y = [-1252117, -1637947, -2257411, -2066768, -838647, 625783, 1298449, 844542, -13045, -183472, 496346, 1068159, 922156, 733059, 1159861, 1425721, 473502, -1029102, -1445346, -730309, -487441, -1296407, -1781555, -925609, 360236, 860450, 758385, 629666, 102060, -1083112, -1741965, -606573, 1584287, 2885544, 2710578, 2172025, 2034321, 1772124, 834923, -372011, -1117884, -1066535, -158803, 1345148, 2491957, 2223252, 730563, -522589, -513651, 287478, 943448, 1354451, 1917555, 2474653, 2431035, 1760548, 1193486, 1246733, 1455393, 866447, -701283, -2114743, -2019860, -564449, 535630, 131421, -752843, -387630, 989394, 1362041, -87577, -1733726, -1920280, -1179296]
37751a179296L15369R0537R44213J375541J32434j363631j040641O11202J332547
37742A218275M54350m92407l79422J30633J17687j87291j64679J05691K29879
37733A032716K59221M23962N54610K79174m37467j222061j561910j087724Q8930
37724a670549J267749J704866J280104L89162n88203j285156j171241j39980Q91768
37715F78520Q36885j01789o80019l73863O6483J7845j17198J15665L19283K2450
37705G84262l82139k64427J94604L35636N1504j91847j33761M9051J32578M3815
37695F19276j76544l30351k19854l5603j97354o04112n64175K05092J045069J228086
37685I69530Q54192M39810J16102k55889n91405o96238n55401j90889L53633O84427
$$ y = [-1179296, -863927, -773390, 170823, 1546364, 1678798, 315167, -725474, -114272, 1218275, 1672625, 1180218, 800796, 931429, 1049116, 861825, 697146, 802837, 1032716, 1291937, 1715899, 2270509, 2549683, 2112216, 890155, -671755, -1759479, -1670549, -402800, 1302066, 2582170, 2971332, 2383129, 1097973, -73268, -213248, 678520, 1515405, 1413616, 733597, 359734, 426217, 444062, 326864, 442529, 761812, 784262, 402123, 137696, 332300, 667936, 719440, 527593, 393832, 442883, 575461, 619276, 442732, 112381, -107473, -143076, -340430, -944542, -1508717, -1303625, -258556, 969530, 1823722, 2263532, 2379634, 2123745, 1532340, 836102, 280701, 89812, 443445, 1127872]
37675A127872L47469l09528l76715J89672L88813r2394k17682M96628P84520l43827
37665A994828j610823j267318L7932K66811o40775p28153O01327J507653O72057
37656H33539p16276r94387l88115n4169l6415L84201J099903J295551P59045J1870
37646B194747n77445r44110q92267l43895J94607J88150n3416K11830R47906J277349
37636B203456P25335j22174m92427m70590o77725j096429q76700L56710J525955
37627A075411J251507j31295q14812j47203K71378q64423k146816j351651R51129
37618a906775J925123O32686o71523j23061J101545J049632J2403n28070n37380
37609I54580r12608j266826m93150Q61149J031561q7066o26081K43938R83530
$$ y = [1127872, 1475341, 1165813, 789098, 978770, 1367583, 1275189, 1057507, 1554135, 2338655, 1994828, 384005, -883313, -845381, -578570, -1219345, -1947498, -1346171, 161482, 833539, 117263, -877124, -1265239, -1319408, -1355823, -971622, 128281, 1423832, 2182877, 2194747, 1617302, 673192, -219075, -562970, -368363, -180213, -233629, -21799, 926107, 2203456, 2928791, 2806617, 2314190, 1843600, 1165875, 69446, -807254, -450544, 1075411, 2326918, 2195623, 1380811, 1233608, 1504986, 640563, -1506253, -2857904, -1906775, 18348, 651034, -20489, -143550, 957995, 2007627, 2020030, 1491960, 954580, 41972, -1224854, -1718004, -856855, 174706, 87640, -538441, -294503, 689027]
37600F89027K55846q95231p40709M75561J042775K90325p60216j003522m23391
37591a069535L14330O37035L98175j8680J7362N97113J002466O59237j8196l26056
37581B193251l76762o50380p86329n842J217192J211077n82336k386210k108712
37572b275051k216J652583J296525l03214j210629m54930J133718J870249R27784
37563B634819p60873j502139q51524j03293l98737j068526p42367M31680R67733
37554a393227L55934k05639K19002Q90168P26010K2731j94251J43181K43138j08577
37544F98470l21949j50958l9490j47999M3970P46714J201318O40649n09656j083551
37534A077518o92215r9593K7925K4397L96882P11460K13591p00100p94703N0489
$$ y = [689027, 944873, 49642, -691067, -215506, 827269, 1117594, 357378, -646144, -1069535, -755205, -118170, 280005, 261325, 278687, 875800, 1878266, 2537503, 2519307, 2193251, 1816489, 1166109, 379780, 373938, 1591130, 2802207, 2219871, -166339, -2275051, -2277267, -624684, 671841, 368627, -842002, -1296932, -163214, 1707035, 2634819, 1873946, 371807, -479717, -583010, -981747, -2050273, -2792640, -2360960, -1393227, -1037293, -1242932, -1023930, -133762, 592248, 614979, 420728, 563909, 807047, 698470, 376521, 225563, 186073, 38074, 82044, 828758, 2030076, 2670725, 2161069, 1077518, 385303, 285710, 313635, 338032, 734914, 1446374, 1659965, 959865, 165162, 215651]
37524B15651M67853k38472q59880k47039P17413O08086r2754O1974P97386O15799
37514B046017l48479m78085K49215O5358j160289j236307M43367J299632k41103
37505F39326j767734o84767J401125J280832o28095j214430J60537J070382L36320
37496E93496m96369k72218K42087M62868Q65953J158777K10985j488003j859323
37487e81747n14440N31223K92184K64593J248130J498077j69352j898949j600147
37478i30428k13108J62476k52822J68382J244312J284165O2038q24775m62660
37469B37580L62114O67264L33273l23111q66788p75543j05017K44252j79428m43175
37459h48579L43654J376695J242136P9982p52158p59750o07198n98634l30510
$$ y = [215651, 683504, 445032, -414848, -661887, 55526, 663612, 570858, 632832, 1430218, 2046017, 1697538, 1219453, 1468668, 1534026, 373737, -862570, -419203, 880429, 639326, -1128408, -1813175, -412050, 868782, 240687, -973743, -813206, 257176, 593496, 97127, -175091, 66996, 529864, 1395817, 2554594, 2765579, 1277576, -581747, -1096187, -564964, -272780, -8187, 1239943, 2738020, 2568668, 669719, -930428, -1143536, -981060, -1233882, -1065500, 178812, 1462977, 1525015, 700240, 237580, 599694, 1266958, 1600231, 1277120, 410332, -365211, -470228, -225976, -405404, -848579, -504925, 871770, 2113906, 2193888, 1441730, 681980, 74782, -523852, -854362]
37450h54362J76818L45419J50941K15905O55910Q57703N58729K19628J37204K034
37440B465929m25426q27127p46589j32859N87815Q05942L22134k15616K5869P76538
37430B636610Q30256j21010q29003l57126M42864L18416m62676p85245n13268
37421A159818l44265m37533m79494o03100r68922r36457K7460J093381J089889
37412c99223L22259m3766P1596r4457m00230q4129M55793Q9773q45408p59797
37402a687589N22996J290877O65675j07768Q9205M70886m9688q92717p52641M03910
37392d6854J412940J402547M28362q16624j383129q04841J34103J40361p57473
37383b90608j105669j65478R95341J187232P11650M35915L34471o115l34807l18901
$$ y = [-854362, -677544, -332125, -181184, 34721, 690631, 1548334, 2107063, 2326691, 2463895, 2465929, 2040503, 1213376, 466787, 333928, 921743, 1727685, 2049819, 1834203, 1860072, 2636610, 3466866, 3345856, 2516853, 2159727, 2602591, 2921007, 2458331, 1673086, 1159818, 815553, 378020, -101474, -704574, -1673496, -2609953, -2582493, -1489112, -399223, -76964, -120730, -49134, -143591, -543821, -627950, -172157, -82384, -927792, -1687589, -1164593, 126284, 791959, 684191, 773396, 1244282, 1194594, 301877, -450764, -46854, 1366086, 2768633, 3196995, 2380371, 997242, 192401, 326504, 466865, -290608, -1396277, -1561755, -566414, 620818, 1332468, 1768383, 2102854, 2096739, 1761932, 1443031]
37373A443031m20350j004364j229328j64090J402066J690161M02899q61563q64855
37364C93607j99178l2666l76306l74579K27116P38582N61436n3887m54634l97677
37354C1814j31959J04850K81661L10033L7763l53307l96067n3175R1690k46238
37344c22935m77065r8654K93529j26027q84624p02236N04078J298192P29363l81461
37334a67840o78696L3448R02586J174668O91737j97382p56692m33521K93360K71428
37324A133096o78571j236794l80188J018005J322304L75370m71673l53707K16686
37315I44528N58171Q08900J184177J115267J6286j455577j851620p67667N06807
37306A059272N65168m15811j100908p67529M9778N50514N36443K22962o9762J12556
$$ y = [1443031, 1022681, 18317, -1211011, -1375101, 26965, 1717126, 2120025, 1258462, 393607, 194429, 161763, -214543, -589122, -362006, 376576, 938012, 884125, 429491, 31814, -100145, 4705, 286366, 596399, 634162, 280855, -115212, -168387, -76697, -322935, -800000, -898654, -605125, -731152, -1615776, -2318012, -1813934, -515742, 213621, -167840, -846536, -813088, 89498, 1264166, 1955903, 1758521, 1001829, 568308, 861668, 1133096, 454525, -782269, -1162457, -144452, 1177852, 1553222, 1081549, 727842, 944528, 1502699, 2311599, 3495776, 4611043, 4627329, 3171752, 1320132, 552465, 1059272, 1624440, 1208629, 107721, -659808, -610030, -59516, 476927, 699889, 630127, 742683]
37296G42683R05154J449222O42946j055248j722653n76270P24296M60529o16362
37287I54297o64131K55013M80906l57045q05418n9981Q88720J022029O11006K21461
37277B546857j90276n96743n70117j92753j34084l76702j31494N33246M32581
37268A320515p05115j440971p81439K41115K44049m47957o19843m5955O29898
37259a605703J048434J081174M48088n69797q89297j38100N03276O0157o56935
37250g18703n05034K1660j49572n61283k8211J051049J146588J15525o34677m97893
37240g60551l34935n47072k71869R05703J931207J749771P05091k16933o38684
37231B521728o61520k81584L83349P90032M59110m42238j213387j144892q2357
$$ y = [742683, 1647837, 3097059, 3740005, 2684757, 962104, 385834, 1110130, 1570659, 954297, 290166, 545179, 1026085, 669040, -136378, -196359, 692361, 1714390, 2325396, 2546857, 2356581, 1759838, 1189721, 996968, 862884, 486182, 354688, 887934, 1320515, 615400, -825571, -1607010, -1365895, -1121846, -1569803, -2189646, -2235601, -1605703, -557269, 523905, 971993, 402196, -487101, -625201, -121925, -61768, -718703, -1223737, -1202077, -1351649, -1912932, -1941143, -890094, 256494, 372019, -262658, -760551, -1095486, -1642558, -1914427, -1008724, 922483, 2672254, 3377345, 3160412, 2521728, 1860208, 1578624, 1961973, 2752005, 3211115, 2768877, 1555490, 410598, 328241]
37222C28241J172962J351562J74134j058061j048457k06185J94146M1531K39594
37213A189467P88876N95157o21430j681257j638555q84547j22487N64137J105477
37204g05162J045747L70861k14845l47486l96295m17565J22770J060470J242930
37195A761425K98386n11347j30754P23960Q76191M86187L36925K96895j35777
37186D002091n32763k20933L28280K34757j83621n7644K32259l52881j302788
37177B146757q82386J007168K124402Q63358j491876k501904j525103J01723J071582
37168I13721J192407Q38008L14398j78540n13775o65543o07559l30563m4621l8976
37158H78957k04848p0297N21853J138543J305191R65517L37246k23337k09198
$$ y = [328241, 1501203, 2852765, 3026899, 1968838, 920381, 714196, 908342, 949873, 1189467, 1978343, 2573500, 1952070, 270813, -1367742, -2252289, -2374776, -1810639, -705162, 340585, 711446, 496601, 149115, -247180, -664745, -541975, 518495, 1761425, 2059811, 1548464, 1417710, 2141670, 3017861, 3504048, 3840973, 4137868, 4002091, 3469328, 3248395, 3576675, 3811432, 3627811, 3570167, 3802426, 3449545, 2146757, 1264371, 2271539, 4395941, 5259299, 3767423, 1265519, -259584, -157861, 913721, 2106128, 2944136, 3258534, 3079994, 2566219, 1900676, 1293117, 962554, 917933, 878957, 674109, 603812, 1125665, 2264208, 3569399, 4534916, 4872162, 4648825, 4439627]
37149D439627N23948J168845P62962j99365q0141J310686J632311j106773n239070
37140C213030o721354l888663N07246K602066J626118j07795n88208r5516J38601
37131c314475j01970j81713J0511k9445k63417J9510Q54628J167364L87882m22976
37121a874101j07974O85774N34713l46023m55524L50150N59260k79840o28296
37112a561861L59362J229679O69499k90348k52654L7304o86682j496775p41628
37103b734104P82112R78285J58604M68954J742312J371566j037750k351485p15726
37094a337232J428967J233448l08213n79042K74505J74358r67391j242950j86629
37085a510179N75389K06261j77253L28315R76853P51873j63178q63718p85128
$$ y = [4439627, 4963575, 6132420, 6895382, 6696017, 6615876, 7926562, 9558873, 8452100, 3213030, -3508324, -7396987, -6889741, -4287675, -2661557, -2769352, -3357560, -3453076, -3314475, -3416445, -3598158, -3587647, -3617092, -3880509, -3860999, -3006371, -1839007, -1451125, -1874101, -1982075, -1296301, -761588, -1107611, -1563135, -1212985, -653725, -933565, -1561861, -1202499, 27180, 696679, 406331, 153677, 190981, -495701, -1992476, -2734104, -1951992, -973707, -815103, -346149, 1396163, 2767729, 1729979, -621506, -1337232, 91735, 1325183, 1016970, 437928, 712433, 886791, -80600, -1323550, -1510179, -934790, -728529, -905782, -577467, 399386, 1151259, 988081, 124363, -660765]
37076f60765l0931O75511M71202n15558r24556N1896J221543R27115m97591j242042
37066e24176o37891K93082P50071R82613J110513O88567j88042o61765m02140
37057A410832l5996j8419j10788j78803m61168q41979q38882m55536j25921J57785
37047a498875O53058R66492N49517o5823R2672O57766L37736q31859j313982m29514
37037h82812P14209J032454O48085r9488j169687j856052j051846P92587J633992
37028b38558O19283o43724n16764M72395Q93347M86603j12931n10136m27382L65899
37018C88032J154154O39306r39795j568824l55289R73898P37933k06096k27302
37009E96017L70790L08671k40596k27224J55527n5417o03243m10720L95986N96611
$$ y = [-660765, -691696, -16185, 455017, -60541, -985097, -933201, 288342, 1215457, 717866, -524176, -1162067, -868985, -118914, 863699, 1974212, 2662779, 2474737, 1812972, 1410832, 1374836, 1356417, 1245629, 1066826, 605658, -236321, -1075203, -1530739, -1656660, -1498875, -845817, 120675, 670192, 604369, 697041, 1354807, 1692543, 860684, -453298, -882812, -168603, 863851, 1511936, 1412448, 242761, -1613291, -2665137, -1872550, -238558, 380725, -262999, -779763, -307368, 585979, 1072582, 959651, 449515, 22133, 388032, 1542186, 2181492, 1241697, -327127, -682416, 291482, 1029415, 823319, 596017, 966807, 1275478, 1034882, 807658, 963185, 907768, 304525, -106195, 289791, 886402]
36999H86402j80564j062865j270086o78784N17825J600291J416250j08280j288401
36990a68212p95387M00851O37753J45636K73263R55909R53968J19413n17091n87074
36980A419029n10932j80737O42385J051983J14942j097304p42272P49898J140049
36971B587041j22883j213120r84973l89337l13979k18657L04049N46633J00120
36962B94894m00599n93036q47403r58919j71567J021121J075074j447l62582N72511
36952c71953J029912M4180o55940L85073J625771R37717q83901j409964l32436
36943C68459M46027k9107o89640m80932L02557R05468J003695N27682l68419j019723
36933I66067p45566K50575J019958Q95301M7801p67444p90733N0327R01092R42172
$$ y = [886402, 705838, -357027, -1627113, -2305897, -1788072, -187781, 1228469, 1120189, -168212, -963599, -562748, 75005, 220641, 493904, 1449813, 2403781, 2523194, 2006103, 1419029, 908097, 727360, 1369745, 2421728, 2536670, 1439366, 697094, 1446992, 2587041, 2464158, 1251038, 266065, -123272, -437251, -655908, -351859, 194774, 294894, -105705, -698741, -1546144, -2505063, -2676630, -1655509, -580435, -581882, -944464, -371953, 657959, 702139, 46199, 431272, 2057043, 2994760, 2110859, 700895, 368459, 814486, 785379, 95739, -385193, -82636, 822832, 1826527, 2354209, 1985790, 966067, 220501, 471076, 1491034, 2386335, 2434136, 1666692, 875959, 926286, 1827378, 2769550]
36923B769550N12507M11950K77130q92755k484219k449165m35786J218136Q07354
36914b65298l02239j44191P11774N65720l05171l80868K01075M6832o69666l64285
36904i06317J006092J616094P46163j74864j19185K6497n91564j136262n56590
36895h9936O01639J046723N06978l01070p53744o36624n2103L99436K3912q95467
36885a50256j182694l95903M70643M79092O7365J17903M76875L63287k10890m19525
36875c84103Q3028O43281N48158J0500q8057O04469J219236O11062q95297j452473
36865H99804p9829J607961J310706p17776j966395j247118j25826j73164o63121
36856a154758k53531O08767O63427J41944K20441P90419O87854r2444l05450L00191
$$ y = [2769550, 3282057, 3694007, 3971137, 3078382, 594163, -1855002, -2290788, -1072652, -265298, -567537, -711728, 46, 565766, 260595, -120273, 80802, 127634, -542032, -906317, 99775, 1715869, 2462032, 2287168, 2167983, 2194480, 1602916, 466654, -89936, 511703, 1558426, 2065404, 1764334, 1010590, 373966, 321863, 721299, 745211, -150256, -1332950, -1728853, -1258210, -779118, -711753, -593850, -116975, 246312, 35422, -384103, -301075, 342206, 890364, 900864, 812807, 1417276, 2636512, 3247574, 2352277, 899804, 819975, 2427936, 3738642, 3020866, 1054471, -192647, -318473, -491637, -1154758, -1408289, -799522, -136095, 5849, 226290, 1016709, 1704563, 1612119, 1306669, 1606860]
36846A606860M52350m64752j328128j113832m12206j63077o9268N63105J279725
36837C50777J081123J06883n12454l25840k947p6125k13847j1036K51593P0542
36827G18669m72887p63459l94891L28685O69569L04950j54747J46650J008729
36818A391268J165510M1622j100872o56474J002009J790305N99603j308829j993661
36809I30481j072600K91044R66158P17002p2751p91721q73139k80095L06222K19395
36799C39996l10903m09634L03014J178220J261575L65049o87847q72268k8741
36790A138461R42629J068053L30260n58364j175756j584885j603008p83392N45964
36781a680038J127249L64355o09472l60233P96387J214656K43446r30042r53537
$$ y = [1606860, 2059210, 1594458, 266330, -847502, -1259708, -1422785, -1492053, -928948, 350777, 1431900, 1538783, 1026329, 700489, 697542, 621417, 407570, 396534, 648127, 718669, 245782, -517677, -912568, -583883, 85686, 390636, 235889, 382539, 1391268, 2556778, 2598400, 1497528, 841054, 1843063, 3633368, 4232971, 2924142, 930481, -142119, 148925, 1115083, 1832085, 1759334, 967613, 94474, -185621, 120601, 339996, 29093, -380541, -77527, 1100693, 2362268, 2727317, 2039470, 1167202, 1138461, 2081090, 3149143, 3479403, 2921039, 1745283, 160398, -1442610, -2226002, -1680038, -552789, -188434, -797906, -1158139, -361752, 852904, 1096350, 166308, -787229]
36772g87229O1813R90757J120770O26188J3094l92302n03796l74999j24477R9165
36762G28984J23265j33420m40203l50748K21056O81926L78836n02487j025116
36753c17907n77814L92246Q71680M06180l93910n54304P3302N97352L10837k51484
36743E56178j45534L46840J8008j148475j480782l3463J656582J508582j64282
36734A113654j172857n79407L05724K09196l35419j55219P09076J185251O57082
36725A937081m34778j236340j263405o56916P2303N48267P73482Q54681P58007
36716A352382N25629L64812K24064k47706r20198r83650j55168N84327L12503
36707A056995m10641m84933l3059N3365j61648J11000P08249O94141J52006J04032
$$ y = [-787229, -725416, 265341, 1386111, 2012299, 2025393, 1633091, 1129295, 754296, 629819, 728984, 852249, 718829, 278626, -72122, 148934, 830860, 1209696, 707209, -317907, -895721, -503475, 368205, 774385, 380475, -173829, -100527, 496825, 807662, 556178, 410644, 757484, 775492, -372983, -1853765, -1887228, -230646, 1277936, 1113654, -59203, -638610, -332886, -123690, -459109, -614328, 94748, 1279999, 1937081, 1502303, 265963, -997442, -1654358, -1582055, -1033788, -260306, 594375, 1352382, 1878011, 2242823, 2466887, 2219181, 1298983, 315333, 160165, 744492, 1056995, 646354, 161421, 128362, 181727, 20079, 131079, 839328, 1533469, 1685475, 1789507]
36697A789507N24264K26106q91717j320492l53164P01876O37335R1801P9257K29674
36687A714447j77745o19218k20565N88105O78229q1919q65976j116568q01884
36678i03094k6559P55668P84866N7127l93643m1305K54033j83102n26358N7276
36668a65091O93552J82927p44115l90937J110220J793645O38435j180728j954288
36659a6380j147422N54844J830272J493666k27593j461376q65044M31092M51066
36650A043125n94376p71586L18338R55430L00754k37744M72096J348394R72869
36641C807300j25351n44289k47566k00505n26487n40563k26855k77626p27236
36632C90822p46436R232P59237O52724j16725o17228l12489M18064Q48702P67871
$$ y = [1789507, 2313771, 2539877, 1648160, 327668, -25496, 676380, 1313715, 1405516, 1484773, 1714447, 1536702, 917484, 696919, 1285024, 1963253, 1881334, 1015358, -101210, -903094, -929653, -173985, 610881, 668008, 274365, 233060, 487093, 303991, -222367, -165091, 528461, 711388, -32727, -423664, 686556, 2480201, 3118636, 1937908, -16380, -1163802, -608958, 1221314, 2714980, 2487387, 1026011, 160967, 592059, 1043125, 448749, -322837, -4499, 950931, 1251685, 1013941, 1486037, 2834431, 3807300, 3681949, 3137660, 2890094, 2689589, 2163102, 1622539, 1395684, 1118058, 390822, -355614, -346382, 412855, 1065579, 948854, 331626, 19137, 437201, 1285903, 2053774]
36622B053774N37090L23877k28989j191304j700832r12499O34939J506547J195437
36613B218040N17873J37609j88332n92531n24315J43305M59276k68146j243887
36604F58892j226056k39199O33815P39600L17195j53896l06778P0687O61222O78760
36594A834242m2531n44899q9773O13209M72644k97859p02334o08489n31566k92036
36584a89392M75085Q38723l90852k132090j828331O52672K268895J121454p32046
36575H4118n56359R53241J234814J01016m08245K61922N32957k05125n89199L3711
36565A442851L74099l83436j060737n82923K36510L34071K04159O27313J029790
36556B221697O82399K72134N80021P04140m90996j994044j807030p4311J013215
$$ y = [2053774, 2590864, 2914741, 2685752, 1494448, -206384, -1118883, -483944, 1022603, 2218040, 2735913, 2873522, 2685190, 2092659, 1568344, 1711649, 2170925, 1902779, 658892, -567164, -806363, -172548, 567052, 884247, 730351, 423573, 494260, 1155482, 1834242, 1791711, 1246812, 1157039, 1770248, 2242892, 1945033, 1242699, 634210, 102644, -189392, 285693, 1124416, 733564, -1398526, -3226857, -2574185, -305290, 816164, 84118, -472241, 481000, 1715814, 1816830, 1408585, 1670507, 2203464, 1998339, 1409140, 1442851, 1816950, 1433514, 372777, -210146, 26364, 360435, 564594, 1191907, 2221697, 2904096, 3176230, 3756251, 4460391, 3969395, 1975351, 168321, 94010, 1107225]
36547A107225M24853n07468l97948L51459O07296J50872l88506m69245p8736K96629
36537A096431J16035m13534l99307L15971N92137k07321q49872j17100R18538
36528A051978M70537q21985p38395P92276J440129K38883j022221r03766l18706
36519A88730l45829l61075K56309O04855R429m97638k6588M97992J32116k56325
36509B01976K77739P61897L9887r07857n71065L53003K03997n82825k27204J099241
36499F48789J363047O4158r15130l01233Q25046R66887K09128n04272q01520q44427
36489G10473p53665o09089m29260q351O55922R81075O01366J60623L26914M94716
36479B130724k54799j293533j097806L40044J347551R86412J24652k31280k41725
$$ y = [1107225, 1532078, 1024610, 626662, 978121, 1585417, 1736289, 1347783, 878538, 799802, 1096431, 1212466, 798932, 399625, 715596, 1307733, 1100412, 250540, 133440, 1051978, 1522515, 700530, -37865, 754411, 2194540, 2433423, 1411202, 507436, 188730, -157099, -518174, -261865, 342990, 352419, -145219, -171807, 326185, 458301, 201976, 479715, 1241612, 1281499, 373642, -197423, 155580, 359577, -223248, -450452, 648789, 2011836, 2075994, 1160864, 859631, 1684677, 2651564, 2860692, 2356420, 1554900, 710473, -43192, -652281, -1081541, -1089892, -433970, 547105, 1148471, 1309094, 1636008, 2130724, 1875925, 582392, -515414, -175370, 1172181, 2158593, 2283245, 2051965, 1810240]
36470A810240l51219l63014o8840J52394j2845k71060k69111p2837J58459L79682
36460A091849M25546J67070j31225k30730m29005q49517o99093N47177J640924
36451A532996R04355r79548j433253L03400J840200J020306j009853j593128l08712
36442B76763Q00849L45655o88254o39724M98491J187326M60748p48031p63324
36433G30499O15323J762497J327811p5006r05288p32676l07823j27779p1137j53038
36423B063383m43794m16567L77553J105725N17955r38020j380640j99191J005688
36414A692092P90626k00200n32343p6286K23696p3241n20385n70306q3130O45057
36404A295580J007122O42590K5290r5756J11272j94907r50144r85087J24880J141608
$$ y = [1810240, 1459021, 1096007, 1027167, 1179561, 1166716, 895656, 626545, 553708, 712167, 1091849, 1517395, 1684465, 1553240, 1322510, 893505, 43988, -655105, -107928, 1532996, 2437351, 1457803, 24550, 327950, 2168150, 3188456, 2178603, 585475, 276763, 1077612, 1423267, 735013, 95289, 593780, 1781106, 2241854, 1493823, 730499, 1345822, 3108319, 4436130, 4361124, 3455836, 2723160, 2415337, 2287558, 2216421, 2063383, 1619589, 1203022, 1580575, 2686300, 3204255, 2266235, 885595, 686404, 1692092, 2482718, 2282518, 1750175, 1673889, 1897585, 1824344, 1303959, 733653, 650523, 1295580, 2302702, 2945292, 2970582, 2874826, 2986098, 2791191, 1841047, 855960, 980840, 2122448]
36394B122448Q77182j13421n04482j54046j5700m86896r06412o82766q9344K88241
36384C34804L66513M84741P23368O98133K13028j82115J54303P89059N49372o54305
36374C476901j350767o08513L95080R0891j040001j274227l27360N20778P04807
36365E87589Q89538J164283O70879n46316j129686m94314K87788L70943L18251
36356B118955O17655O13954o4594m81784J6372M61513j96125j259550j314411
36347E11985k65696Q63891J435320J345200M11292j129066k032815j235030O01745
36338E06826J738180J418829M80328M5918L01227N42561O5522r25066j318895
36329B855430m62368O54842M77394q94352j769514j308801m61750o1232L72367
$$ y = [2122448, 2999630, 2886209, 2381727, 2227681, 2211981, 1725085, 818673, 135907, 46563, 334804, 701317, 1186058, 1909426, 2607559, 2820587, 2638472, 2792775, 3581834, 4131206, 3476901, 2126134, 1517621, 1912701, 2003592, 963591, -310636, -637996, -117218, 587589, 1477127, 2641410, 3312289, 2765973, 1636287, 1141973, 1429761, 1800704, 2118955, 2736610, 3350564, 3285970, 2804186, 2820558, 3282071, 3085946, 1826396, 511985, 246289, 1110180, 2545500, 3890700, 4301992, 3172926, 1140111, -94919, 506826, 2245006, 3663835, 4144163, 4190081, 4491308, 5033869, 5099391, 4174325, 2855430, 2393062, 3047904, 3525298, 2630946, 861432, -447369, -909119, -970351, -597984]
36320e97984J125955J253400K44657p00760m51626K61005K82659L6124M02314
36311A855744P19180j15851j328039j180344J85894R26750M28241J1367M67999
36302A970941Q37075K54860o10135q12697n69871n60458p08736n16291J4569M96870
36292b03873P70241Q59536O72933J96547k49468l13427n7928J13727o1821l80156
36282A346311l60675J34344N64148L45665k05570j77657N25505Q40619P5752r58174
36272B130268j042887j76650O78034R49092P13548Q7919o67529q11381L5927R28878
36262B825219N99426o36890j136062k27100Q84731Q91794L4626n99095n94869
36253B041780l20864j01506r745j17005k98586p4337P11743J292634Q17428k87775
$$ y = [-597984, 527971, 1781371, 2026028, 1325268, 873642, 1134647, 1417306, 1453430, 1855744, 2574924, 2459073, 1131034, -49310, 136584, 1063334, 1491575, 1502942, 1970941, 2808016, 3062876, 2452741, 1640044, 1070173, 509715, -199021, -715312, -700743, -203873, 566368, 1425904, 2098837, 2295384, 2045916, 1732489, 1674561, 1788288, 1726467, 1346311, 985636, 1119980, 1684128, 2029793, 1824223, 1646566, 2172071, 3012690, 3088442, 2130268, 1087381, 910731, 1588765, 2537857, 3251405, 3339324, 2671795, 1860414, 1896341, 2825219, 3424645, 2787755, 1651693, 1424593, 2309324, 3201118, 3235744, 2636649, 2041780, 1720916, 1619410, 1609665, 1492660, 1194074, 1119737, 1831480, 3124114, 3941542, 3653767]
36243C653767o64064Q3485P35476K36338p11054p52501N024K47387l60474o68076
36233A805308p647P14899N65586q204k10689k26386m24230k72980O06277J196597
36223C738531M64739o95567o25186M66607Q84508K07259l20360j76433k71692
36214C672406q89952r27197Q2905R47902P05567J1074k45330k74748m26755k79696
36204B376176K80417L64389m05537q55615J0074J209488J068621l31042j289051
36195B427920p87911L80194P66095p5330j120011r52124N21390J704490J253396
36186D118109m4031l96388L40242O25594k13820j082592j037039m58814J24339
36177A975600P78716J211523P00453m07732p11101R0937O29068P6354p15645r24355
$$ y = [3653767, 2989703, 3073188, 3808664, 4045002, 3333948, 2581447, 2586471, 2833858, 2473384, 1805308, 1797661, 2512560, 3078146, 3069942, 2859253, 2632867, 2208637, 1935657, 2541934, 3738531, 4203270, 3507703, 2882517, 3349124, 4233632, 4440891, 4120531, 3944098, 3672406, 2782454, 1855257, 1938162, 2886064, 3591631, 3602705, 3357375, 3082627, 2655872, 2376176, 2656593, 3020982, 2615445, 1759830, 1769904, 2979392, 4048013, 3716971, 2427920, 1640009, 2020203, 2786298, 2710968, 1590957, 638833, 1160223, 2864713, 4118109, 4074078, 3677690, 4017932, 4643526, 4429706, 3347114, 2310075, 1851261, 1975600, 2754316, 3965839, 4666292, 4258560, 3547459, 3638396, 4267464, 4343818, 3628173, 2703818]
36167B703818q40748n77993L64039J423159R73343q91340j707869j98506J560353
36158B808256J215351m38606j011853l7465R71067R16428l4783j110613j278109
36149A999673K506J520509J286155m49095j083119M16068J784600J098426l06315
36140F269408m70382j2177l48162q10525j71038O81121K73167o55731m90387L82643
36130D647937N30934J17427J45055K31923m37009j090307o97913j17718m97378
36121B832951q40404K26300J552526J169307k36440n02155L19710M81888m7515
36112D956168J75374R56307P03543m75565q69432k38052J343l90760j83697O94861
36102E330090Q36122r1529p87730n98158k75404k46202n077N42863P27460K56785
$$ y = [2703818, 1863070, 1285077, 1649116, 3072275, 4045618, 3154278, 1446409, 1247903, 2808256, 4023607, 3585001, 2573148, 2535683, 3506750, 4423178, 4388395, 3277782, 1999673, 2002179, 3522688, 4808843, 4359748, 3276629, 3692697, 5477297, 6575723, 6269408, 5799026, 5786849, 5438687, 4628162, 4457124, 5138245, 5411412, 4755681, 4265294, 4647937, 5178871, 5296298, 5441353, 5673276, 5236267, 4145960, 3448047, 3330329, 2832951, 1992547, 2218847, 3771373, 4940680, 4704240, 4202085, 4521795, 5003683, 4956168, 5131542, 6087849, 6791392, 6315827, 5446395, 5208343, 5209686, 4818926, 4635229, 5330090, 6166212, 6074683, 5286953, 4688795, 4413391, 4167189, 4162112, 4704975, 5432435, 5689220]
36092E689220m37741q23680m71936N90752J141065j11381j935924j418812J425578
36083C647141K808253Q42731j235214l13531J514643Q46061j129889j124125L27154
36074F183224L35930q04065n89602N97788M14950n54164Q1015J450796P13669
36065G829541j298440j142243R30237J303914m01537p87244Q46388J248601n55391
36056G973826j381909K44558J547847O70274l78989M9623M22002m93113j205229
36047G448890n76052J28823k4774k0380O33334Q40791L35213J98315M22701K0518
36037I407379l75397N51366J547660M26448j450552q32530J596842K047081J70871
36028A3089168o02360N13141O08689r26765j184994M65212J084693j19055m18092
$$ y = [5689220, 5251479, 4427799, 3955863, 4546615, 5687680, 5576299, 3640375, 2221563, 3647141, 6455394, 7298125, 6062911, 5749380, 7264023, 8110084, 6980195, 5856070, 6183224, 6519154, 5715089, 5125487, 5723275, 6138225, 5584061, 5665076, 7115872, 7829541, 6531101, 5388858, 6319095, 7623009, 7221472, 6434228, 7280616, 8529217, 7973826, 6591917, 6836475, 8384322, 9054596, 8675607, 8725230, 9147232, 8654119, 7448890, 6872838, 7001661, 6976887, 6956507, 7589841, 8430632, 8765845, 8964160, 9386861, 9407379, 9031982, 9583348, 11131008, 11557456, 10106904, 9274374, 10871216, 12918297, 13089168, 12486808, 12999949, 13608638, 12681873, 11496879, 11962091, 13046784, 12927729, 12509637]
36019A2509637Q41486R39868o25446r68803M58602P87322l58814R0088K338254
36010A6012194K686193L02892j218897n22387l15650j247006o54015J323550J380642
36001A7747516j16652O33014K943879K162689j037682r73125K347908K759618
35993B6467165l93638q92436K223295K795866J03051O62311M696686M519067j37108
35984D0044259j60651N425070O514601J498104J268802P402396P480612M69371
35976F9942564K237126J4153693J4961478J402863L198686K8478968K8982823
35969A63358201l4124418j13425309j21746076m9563082K1634597L0550157M719995
35962i8595935j948694J2042388J5337776M133363k47376N877334P177278J309813
$$ y = [12509637, 13351123, 14290991, 13665545, 12696742, 13155344, 13942666, 13583852, 13673940, 16012194, 18698387, 19001279, 17782382, 17259995, 16944345, 15697339, 15043324, 16366874, 17747516, 17630864, 18263878, 21207757, 23370446, 22332764, 21359639, 23707547, 26467165, 26073527, 25181091, 27404386, 30200252, 30303303, 30965614, 35662300, 40181367, 40044259, 39883608, 45308678, 51823279, 53321383, 54590185, 61992581, 69473193, 69942564, 72179690, 86333383, 101294861, 102697724, 105896410, 134375378, 163358201, 129233783, 15808474, -105937602, -155500684, -133866087, -103315930, -98595935, -100544629, -88502241, -73164465, -69031102, -69278478, -63401144, -56223866, -54914053]
35954e4914053M06602N473731N745542O91539J22270M392741M396198k49031j014027
35945c4948488K721182L195892k26098m59447K905389L029634n26693j140541
35937b5449170J820723K123435q71305j169433J861332K275045p46284j298454
35929b1454111J817979K882985J79366j086799J152845K405850N64099n91746
35921a4129532P53333J283582l83573j077666K75474N69522r43278j010087Q90541
35912a3771684J092560j102836j648942Q27149K465906J224845O8037P89435Q84186
35903i171344q49258j508766L15906J590760L13211j042633k92337Q68578O44940
35894i130943J98394N03463K48702q86795q50499P81265J346364k87429j495989
$$ y = [-54914053, -54507451, -49033720, -43288178, -42596639, -42474369, -38081628, -33685430, -33934461, -34948488, -32227306, -29031414, -29257512, -29716959, -26811570, -23781936, -24308629, -25449170, -23628447, -21505012, -22376317, -23545750, -21684418, -19409373, -20155657, -21454111, -19636132, -16753147, -16573781, -17660580, -16507735, -14101885, -13537786, -14129532, -13376199, -12092617, -12476190, -13553856, -13278382, -12708860, -13652138, -14662225, -13771684, -12679124, -13781960, -15430902, -14603753, -12137847, -10913002, -10844965, -10055530, -9171344, -10020602, -11529368, -11213462, -9622702, -9309491, -10352124, -10644461, -9775883, -9130943, -8932549, -8429086, -8180384, -9067179, -9917678, -9136413, -7790049, -8077478, -9573467]
35885i573467l87268J167978J112428L60860L13002L84295n9764k14334J13529
35876f782741k22057j130423r14692M79587R61305J1872l72889N50248R71446
35867f448344Q8102m66522O8913K49571m03070l06210Q49902J067865l22416j295382
35857f917591p15313n3601k75703k82712L07630J44492q36286p13563Q34478J598834
35847f909335P16939L8432M14647K63938q34859r18995M63456J003733m4936k93772
35837f100752J122861J494547m81788j813392k22717J782357J142281q29380j217047
35828e123030k61673J30735P5953N03790N35143o65203j499908n21706O43309
35819f182590M3357r86652k16413J374003J326762P107l02777N27592O67156j84456
$$ y = [-9573467, -9960735, -8792757, -7680329, -7319469, -7006467, -6622172, -6681936, -6896270, -6782741, -7004798, -8135221, -9049913, -8570326, -7609021, -7597149, -7970038, -7419790, -6448344, -6360242, -6826764, -6757851, -6508280, -6911350, -7217560, -6367658, -5299793, -5622209, -6917591, -7632904, -7686505, -7962208, -8244920, -7937290, -7792798, -8629084, -9342647, -8508169, -6909335, -6192396, -6153964, -5739317, -5475379, -6310238, -7229233, -6765777, -5762044, -5806980, -6100752, -4977891, -3483344, -3965132, -5778524, -6001241, -4218884, -3076603, -3905983, -5123030, -5384703, -5253968, -5178015, -4674225, -4139082, -4804285, -6304193, -6825899, -6182590, -6139233, -7125885, -7342298, -5968295, -4641533, -4634426, -4937203, -4409611, -3742455, -3926911]
35809c926911n92056j95919m773k30080j62469J62733J59335J1305Q7761j20918
35799d811992q39504r31183K45294J229262O64400l00936J1415Q69820O20387
35790c243037j96512N9123R26187N82619q54003j528593r71966m21593k91727
35781e939502J40566O71590L04919n19819k66035R40096J259724K27396m44916
35772c625981J74454O79733j85352j318615r77642M91153J150603K09560r88048
35763d390135p99976O44675J645390J046177l40974q30847o8463O59238L19493
35754b115422o15713j127130r40127l74542L01127Q40082R75818P80768N05277
35745a769862L2957p00686r55772r3494R56072P44750k75358l75502L71139J30685
$$ y = [-3926911, -4518967, -4714886, -4719659, -4949739, -5112208, -4949475, -4790140, -4778835, -4691074, -4811992, -5651496, -6582679, -6337385, -5108123, -4443723, -4744659, -4733244, -3863424, -3243037, -3439549, -3380426, -2454239, -1871620, -2725623, -4254216, -5226182, -5647775, -5939502, -5798936, -5127346, -4822427, -5342246, -5608281, -4668185, -3408461, -3181065, -3625981, -3451527, -2771794, -2957146, -4275761, -5253403, -4762250, -3611647, -3402087, -4390135, -5190111, -4545436, -2900046, -1853869, -2194843, -3025690, -3094153, -2434915, -2115422, -2731135, -3858265, -4798392, -5172934, -4871807, -4031725, -3055907, -2275139, -1769862, -1736905, -2437591, -3393363, -3486857, -2530785, -1786035, -2061393, -2436895, -2065756, -1935071]
35735a935071j129998j066558R01586J943105K54024j718791j114783P40217P56093
35726b370176p67793j005291M35948J077123j03621j198371o28774P96293J655832
35717b108830J599697P90729m57318j145097m40133P03086M98102r31437j579394
35708c070595n95320N77169O08980O2313O095L60078M97933L43959P1686l65333
35698a503035p57446n33285K97862Q47504N06729k49063o46468n87028m06896
35689c031126k04311J25008N06293P10578O29701L55733L2422l56047r62864j606001
35679c800614j495722j06044J643110K025894P34264n09913k29322Q57725J071661
35670A91039J55926p00288p25792l30301j99282n08851r53577r91513l01818O15712
$$ y = [-1935071, -3065069, -4131627, -3230041, -1286936, -1032912, -2751703, -3866486, -3126269, -2370176, -3137969, -4143260, -3707312, -2630189, -2733810, -3932181, -4560955, -3764662, -2108830, -509133, 281596, -175722, -1320819, -1760952, -1057866, -559764, -1491201, -3070595, -3665915, -3088746, -2479766, -2417453, -2411358, -2051280, -1553347, -1209388, -1137702, -1503035, -2260481, -2793766, -2495904, -1648400, -1141671, -1390734, -2037202, -2624230, -3031126, -3235437, -3110429, -2604136, -1893558, -1263857, -908124, -875702, -1231749, -2194613, -3800614, -5296336, -5402380, -3759270, -1733376, -999112, -1509025, -1738347, -880622, 191039, 346965, -353323, -1079115, -1409416, -1608698, -2117549, -3071126, -4062639, -4364457, -3748745]
35660c748745P91772J16304m01706j64230J48387r5234l05289K24046R45686R02036
35650a586973K21104l02097m77220n45147l74625J35406M54462K03455q0884J19858
35640b232661L40615N4375k63327l3788L07669J93800M6597L63315O06598K25768
35630c91039j95886j00081j59159q78642j202731k37577Q22966M86104m34747
35621b290792k57009N25687K18365p86323n71806P45077J023801j44735o62367
35612b200102M31523J324676N46807o96845o90839K40021P75331O48882L17859
35603F97313j68238p77322r82484n92872k04476j63554p8691J31447r1824o79847
35593b910548o64358J46929N72678m0474o36727j65698P04152P18585m6562n31981
$$ y = [-3748745, -2956973, -2840669, -3242375, -3406605, -3258218, -3353452, -3658741, -3434695, -2489009, -1586973, -1365869, -1667966, -2145186, -2690333, -3064958, -2929552, -2475090, -2271635, -2352519, -2232661, -1892046, -1837671, -2100998, -2134786, -1827117, -1633317, -1586720, -1223405, -616807, -391039, -586925, -687006, -846165, -1724807, -2927538, -3165115, -2342149, -1856045, -2290792, -2547801, -2022114, -1803749, -2590072, -3161878, -2416801, -1393000, -1537735, -2200102, -1768579, -443903, 102904, -593941, -1284780, -1044759, -269428, 379454, 697313, 529075, -248247, -1230731, -1823603, -2028079, -2191633, -2270324, -2138877, -2230701, -2910548, -3574906, -3427977, -2855299, -2895773, -3532500, -3698198, -2994046, -2275461, -2322023, -2854004]
35583b854004k90636K36422N39812L97053j29292n49197l52683J35531P4016m81103
35573c274081n10144K58533P73643L71856j88701j87322j86243p86362j249797
35564d978618o12097O52740J330740J216082R73947P69153K47227m09741n33021
35555a343588J496O28905Q72478O20369r5225r27174j160444n49820J16281J4946
35545a821776n09606n43594l9496K91330K72193L75339N75132K14825o96480j069722
35535b951855k04485J050021J323199N05228k32717p3935M82384M72325k34009
35526A36156q76190q10131j53683N34984Q42652O78923J99690k78594n23644o54697
35516i04534q91131r91677m35954O17109J146094N36937m42123n81659J69517
$$ y = [-2854004, -3144640, -2908218, -2368406, -1971353, -2100645, -2649842, -3002525, -2866994, -2792978, -3274081, -3784225, -3525692, -2752049, -2380193, -2568894, -2756216, -2942459, -3728821, -4978618, -5590715, -4937975, -3607235, -2391153, -1417206, -648053, -400826, -810567, -1343588, -1342092, -713187, 159291, 779660, 684435, -242739, -1403183, -1953003, -1836722, -1821776, -2331382, -2874976, -2914472, -2623142, -2350949, -1975610, -1400478, -1185653, -1882133, -2951855, -3156340, -2106319, -783120, -277892, -510609, -584544, -102160, 370165, 136156, -740034, -1550165, -1703848, -1168864, -326212, 352711, 552401, 273807, -249837, -904534, -1795665, -2787342, -3223296, -2606187, -1460093, -923156, -1365279, -1946938, -1777421]
35507a777421P42475M20449m03432r09053p20687q2516L99907K38862l69243o39458
35497c100117k08889K88365J34850l78799m07104K39473R98698J350777J070979
35488a1767J39839q48645p71999N14624J344471K39755j695851k010601l84795
35479c484969R51966N49803m03540l14079M42735N84131P0345k03668m9612J2002
35469a844886r4763j3149J80759J30369J013K26267O17931N97089K25064J35276
35459A60970L81942K14796o98137j532443j321277k92235M28031L26009P6737
35450b255607M10164R92313J000186M56455J71802L85617L89745j97023o98619
35441F55033n01340p2982q2900k41102J6811L05320r0788p80195p11664R2904
$$ y = [-1777421, -1034946, -614497, -1017929, -1926982, -2647669, -2730185, -2330278, -2091416, -2460659, -3100117, -3309006, -3020641, -2885791, -3264590, -3671694, -3432221, -2433523, -1082746, -11767, 128072, -720573, -1492572, -977948, 366523, 606278, -1089573, -3100174, -3484969, -2533003, -1983200, -2386740, -2700819, -2258084, -1673953, -1603608, -1807276, -1856888, -1844886, -1939649, -1952798, -1772039, -1641670, -1640657, -1414390, -796459, -199370, 25694, 160970, 542912, 757708, 59571, -1472872, -2794149, -3086384, -2658353, -2332344, -2255607, -1845443, -853130, 147056, 603511, 775313, 1160930, 1550675, 1353652, 655033, 153693, 80711, -2189, -243291, -226480, 78840, -11948, -792143, -1503807, -1410903]
35431a410903M80152j07603r45669j200010q05690m3324Q21035J304017R63547
35422i44448N7004p36582j179228j321628q13744N38781J756545J546061J97096
35413i00143o69639l36609L32313N36861M33382J83406l76504p83683k32236P66865
35403a045987O86425m71754p78115N53689J601044O44349j059831j256612j49332
35394a276124K43500n53361r51398l8799J091026J145182L20349l99083o38143
35385a056851o87009p11465m84356J60842Q50702Q78290J29374m46728L7913R03222
35375d26066N51169j112861k121193j054696Q64971J409398L15774o66447l41438
35366b581389O09132R37764M27104k10181m30823l95788m97936o32610k78975
$$ y = [-1410903, -930751, -1038354, -1984023, -3184033, -3989723, -4033047, -3212012, -1907995, -944448, -887444, -1624026, -2803254, -4124882, -4938626, -4399845, -2643300, -1097239, -900143, -1569782, -1906391, -1574078, -1037217, -603835, -420429, -796933, -1580616, -1812852, -1045987, -359562, -831316, -1609431, -1055742, 545302, 1189651, 129820, -1126792, -1276124, -1032624, -1585985, -2537383, -2576182, -1485156, -339974, -19625, -418708, -1056851, -1743860, -2455325, -2939681, -2778839, -1928137, -1049847, -920473, -1367201, -1329288, -426066, 125103, -987758, -3108951, -4163647, -3298676, -1889278, -1573504, -2239951, -2581389, -1972257, -1034493, -607389, -817570, -1248393, -1644181, -2142117, -2774727, -3053702]
35357c053702N30723Q50514J04957p22385l03439Q57036R27981m19163j351623
35348b579101o30846O29049R19042N05415L70846L54153j14450n04879o9205N77628
35338e42348L89795k67240l36385k0121k65761p71161m00679N98356P28562k79628
35328a166610r47744l87800M84943O27506L02903J62911J24481j03492l27490
35319a230392l40077l08597k58631M8923M23263L13336j50865j82613K91366M22016
35309i72271J7811K8651P42175Q57756m88312j902818j439215N48809J808025
35300g99389J160327l72735j366078j489727r93971n3020Q22359Q17480k1844
35291b296598n07095P3999Q28756O13716j78097l02557L01364M73027k16998p88788
$$ y = [-3053702, -2522979, -1672465, -1567508, -2289893, -2593332, -1736296, -808315, -1227478, -2579101, -3209947, -2580898, -1661856, -1156441, -785595, -431442, -545892, -1050771, -1119976, -542348, -152553, -419793, -756178, -776299, -1042060, -1813221, -2213900, -1615544, -886982, -1166610, -2114354, -2502154, -2017211, -1389705, -1086802, -923891, -799410, -902902, -1230392, -1570469, -1879066, -2137697, -2088774, -1665511, -1352175, -1503040, -1685653, -1394287, -972271, -954460, -925809, -183634, 674122, 185810, -1717008, -3156223, -2607414, -799389, 360938, -11797, -1377875, -2867602, -3861573, -3914593, -3092234, -2274754, -2296598, -2803693, -2729694, -1900938, -1287222, -1465319, -1767876, -1466512, -993485, -1210483, -1999271]
35281a999271m66403J81349L06054M7817R324J97325K66664K51529L06245K19386
35271f79981r3704j32435L93114Q43019N60141m7313k65136l21780p58274j117741
35261a620090o31366J86299J60123n18710n10773M15161J024243P39160M23184
35252c32769N92164N10228k41430q13558n39058j4748Q2438L6900J85569J85293
35242c48971o6243j9746L02859L2941q44237j033718r2436N79370M2361n60228
35232b008048o5823O82754N04998j8415M3098J3800q20466j181970J66845J634804
35222a048423R12382j035089j246366M04280J053041k92713j203264p0549J300022
35213a226679R27119k08068k50505M18957L61037j86781k2376N67510K59136q82170
$$ y = [-1999271, -2465674, -2284325, -1978271, -1930454, -1921130, -1723805, -1457141, -1205612, -899367, -679981, -773685, -906120, -513006, 330013, 890154, 842841, 577705, 255925, -502349, -1620090, -2251456, -2065157, -1905034, -2423744, -2934517, -2519356, -1495113, -755953, -332769, 259395, 769623, 528193, -285365, -824423, -839171, -756733, -719833, -534264, -348971, -415214, -434960, -132101, -99160, -943397, -1977115, -2069551, -1490181, -1447820, -2008048, -2073871, -1391117, -886119, -904534, -861436, -847636, -1668102, -2850072, -2683227, -1048423, -136041, -1171130, -2417496, -2013216, -960175, -1252888, -2456152, -2526701, -1226679, -299560, -507628, -758133, -339176, 21861, -164920, -187296, 380214, 639350, -242820]
35203b42820j388480p06681J18012K01145j12207k12087j20535j5417K67901P71282
35193a439887J044550P09520L3294m28158n09038m51446m38392m25517l48929
35184b254003k12981j511K31741K34089j10174l32218J43297Q99408P15281n85808
35174a272879j360950k88853J425448J515140j8618q81499N8299J241208J002122
35165A419418j68963r93877j353036j544385j086806J84919J066878O60504K7271
35156a788077M92961J329395R99448j64572n97866k04862k49603q44288p32748
35147a760212L49555J096181P24900k7870l41942l01173j91221q4027k34635p18882
35137a489326q03212O8741R79383P00672k12965k10456O64584Q79206R21p94744
$$ y = [-242820, -1631300, -2337981, -2219969, -2018824, -2131031, -2343118, -2463653, -2479070, -2211169, -1439887, -395337, 314183, 347477, -80681, -589719, -1041165, -1479557, -1905074, -2254003, -2466984, -2468495, -2236754, -2002665, -2112839, -2445057, -2301760, -1402352, -687071, -1272879, -2633829, -2922682, -1497234, 17906, -712, -882211, -823912, 417296, 1419418, 1250455, 256578, -1096458, -2640843, -3727649, -3542730, -2475852, -1815348, -1788077, -1295116, 34279, 1033727, 869155, 271289, 66427, -183176, -1027464, -1760212, -1410657, -314476, 410424, 382554, 40612, -260561, -451782, -535809, -770444, -1489326, -2292538, -2223797, -1244414, -543742, -756707, -967163, -302579, 576627, 577548, -217196]
35127b17196q52138p07890n34640R9669P79453N67849j06322j4057M14791l07472
35117h77953j546251r47999J353651K165760J61617j779659j051259P68392Q98462
35108h55239k41681m55881K97973M15872j83380l08879q4830n32846j099115k71116
35098c319122J500168J993520N31722j061017j203046m02514J38436J82385Q8155
35089a551313j6829q9197r121N9508k06450o34201o24922J9483Q17285J157002
35079a078755Q02067L0643m90657l54310r1230n33513j320174j076181M61268
35070c650842J709544J412547L29621k55409m72577r83312j281561n42116N82681
35061c151424P40864L8064k04150L75494P70849L64543k37548k65291L12735R98534
$$ y = [-217196, -1069334, -1777224, -2311864, -2212195, -1432742, -864893, -971215, -985272, -570481, -877953, -2424204, -3372203, -2018552, 147208, 308825, -1470834, -2522093, -1753701, -855239, -1096920, -1552801, -1254828, -838956, -1022336, -1331215, -1416045, -1948891, -3048006, -3319122, -1818954, 174566, 706288, -354729, -1557775, -1960289, -1821853, -1639468, -1551313, -1568142, -1657339, -1666460, -1606952, -1813402, -2447603, -3072525, -3053042, -2235757, -1078755, -276688, -246045, -736702, -1091012, -1182242, -1715755, -3035929, -4112110, -3650842, -1941298, -528751, -199130, -454539, -927116, -1910428, -3191989, -3734105, -3151424, -2410560, -2372496, -2576646, -2201152, -1430303, -1065760, -1303308, -1568599, -1255864, -257330]
35051b57330J163862M48894o21288r17030k54443J32128m83560r70795j70692
35042a930254R80896Q26406l20299p45000j06920L12841n7656l90316j40281K70685
35032a299898N47020P72590N87749l57744j230298r17934K9231J42078m40458
35023b167664k47861P22298Q44677j21183l63221P94154J480594L55844j114339
35014A83299j074686o4029M09967L98490O37041N95092m01856j225270m64823
35005a006775Q81191O86253p63046j094628K24714R43212k82426j677581j178864
34996c267950M54912J107726N46093K35986O29646O30859k68130j053141q35441
34987a819440j18084K14725J81653K64779M34678L78233J92628J48238J38542
$$ y = [-257330, 906532, 1355426, 734138, -182892, -437335, -305207, -788767, -1759562, -1930254, -949358, -122952, -443251, -1188251, -1295171, -982330, -1039986, -1430302, -1570583, -1299898, -752878, 19712, 607461, 249717, -980581, -1898515, -1869284, -1727206, -2167664, -2415525, -1693227, -848550, -969733, -1332954, -538800, 941794, 1297638, 183299, -891387, -955416, -545449, -146959, 490082, 1085174, 683318, -541952, -1006775, -125584, 560669, -202377, -1297005, -1072291, -129079, -411505, -2089086, -3267950, -2813038, -1705312, -1159219, -923233, -293587, 337272, 69142, -983999, -1819440, -1937524, -1722799, -1541146, -1276367, -841689, -463456, -270828, -122590, 15952]
34978A5952j8318j16692q441n8554m54902n70793Q1723P35498L41927o62183q74603
34967a589386q7294M99782K83386m5191n1937j92762m43101j0428Q85828P56035
34957D932o26290j294541r6813J184222N68838q91841r08550L07656P24798R3765
34947i33824M4939Q51606R39741j03784o94820p9166M12111j52224p35606l72286
34937h23313J44219j21772n88524m24953m4815k8676J30894Q53439J251991N46095
34927H94585l57458k41992L32695j6593j058066j209774o8224R37999O33716m29804
34917e82916r81225o08797J03264M68558L55786J49450J81513K41044p2623n02897
34907a248843k68380O64104J162985L96899q73522j243884n12428K50573K90777
$$ y = [15952, -2366, -119058, -127499, -186053, -640955, -1211748, -1130025, -394527, -52600, -714783, -1589386, -1676680, -1176898, -893512, -938703, -990640, -1183402, -1626503, -1636931, -751103, 4932, -621358, -1915899, -2012712, -828490, -259652, -1151493, -2060043, -1752387, -1027589, -933824, -888885, -37279, 902462, 798678, 103858, 24692, 436803, 284579, -451027, -823313, -679094, -800866, -1389390, -1814343, -1859158, -1887834, -1756940, -903501, 348490, 894585, 537127, 295135, 627830, 611237, -446829, -1656603, -1724827, -786828, -153112, -582916, -1564141, -2172938, -2069674, -1601116, -1245330, -1095880, -914367, -673323, -745946, -1248843, -1517223, -853119, 309866, 706765, -166757, -1410641, -1923069, -1672496, -1381719]
34898a381719J0613J45874P19696J080653P38093k9395m65022k84767r2734m80849
34888c9557j010117q14994m9983K87581L1601J04280P44777Q67135n1661q05840
34878g36778l33433M59778K36214m13238J8559J194027J250969j96941j417705
34869F1452j270352o45767n08460l06667N41212J107027M08907o45712m25282
34860a683642Q98730J599173R28001j26595o28550p38008o73766r1111Q49148
34851C33380J049442L9825j008110q71554p2471R1687l53120l32423K87757N47843
34841b87744K01198Q7206M16127K61681o20986r74166J3697J212877J147294M1992
34831A499176r09558j348452j488301r60898M66656J639230J190057l35510j144756
$$ y = [-1381719, -1371106, -1225232, -505536, 575117, 1313210, 1283815, 818793, 534026, 441292, -39557, -1049674, -1864668, -1914651, -1627070, -1595469, -1491189, -746412, 120723, 69062, -736778, -1070211, -610433, -374219, -787457, -768898, 425129, 1676098, 1479157, 61452, -1208900, -1854667, -2363127, -2669794, -2128582, -1021555, -612648, -1258360, -1683642, -784912, 814261, 1742262, 1615667, 987117, 249109, -424657, -515768, 333380, 1382822, 1422647, 414537, -457017, -529488, -437801, -790921, -1123344, -835587, -287744, -86546, 660, 416787, 678468, 57482, -916684, -902987, 309890, 1457184, 1499176, 589618, -758834, -2247135, -3208033, -2741377, -1102147, 87910, -247600, -1392356]
34822a392356p58511k61875j58136J95610Q76822R64951K53846k68274j64756
34813g12679j80574n74845m85751L04706O30468q7531o99970k57844M16170L43369
34803a304481J34781O28781J072291M00425o62286o37977K36967M41277l05692
34794D086p38913j80706O28527R24480P67361L62504k58449p41574o54673k89979
34784a77336k49773l21067J46653Q46052P59843j19677o17560k05029K29138r9033
34774A92211o69505o11449j3121L85489K43570j75018m56058l47270N9075L12297
34764a079779J37788n1215K87218Q32374P06321j75384q64997p21427k43610k14132
34754a386843o09805p71845k91594N46686R94089N22058m43400p31343J31518
$$ y = [-1392356, -2150867, -2412742, -2570878, -2375268, -1498446, -533495, -279649, -547923, -712679, -893253, -1468098, -1953849, -1649143, -1018675, -1106206, -1806176, -2064020, -1647850, -1304481, -1169700, -540919, 531372, 931797, 269511, -368466, -131499, 309778, 4086, -734827, -915533, -287006, 637474, 1404835, 1767339, 1508890, 767316, 112643, -177336, -427109, -748176, -601523, 244529, 1004372, 884695, 267135, 62106, 291244, 192211, -477294, -1088743, -1101864, -716375, -472805, -647823, -1103881, -1451151, -1392076, -1079779, -941991, -993206, -705988, 126386, 832707, 657323, -207674, -929101, -1172711, -1386843, -1996648, -2768493, -3060087, -2513401, -1519312, -997254, -1440654, -2171997, -2040479]
34745b040479J063353Q01156k21550m77830L11144P62160j1205j112201j263539
34736b188991m29936N53950J050008P55475k84309j200626q07711P11222J600007
34727b40911Q43385l06388j74017Q71875J125565J05838j018440j275952q18338
34718h87383r8859O07651Q28670K25439n65954n24714J90024M14851r0225k09979
34708a10479N59370J075621L50534p91185j010260m92163l18556m54822J3521
34699a178419Q64274P26819n75496j332207m48337P46399M66268p56087q93446
34690b380232M24745J366772P03071m85756o43762K7627K74191j61034m77514
34681a351892l61269l02078m37936k50585L78214P79105N14261N318k26961k56825
$$ y = [-2040479, -977126, -175970, -397520, -875350, -564206, 197954, 186749, -925452, -2188991, -2618927, -2064977, -1014969, -259494, -543803, -1744429, -2552140, -1840918, -240911, 602474, 296086, 122069, 993944, 2119509, 2225347, 1206907, -69045, -887383, -986242, -378591, 450079, 675518, 109564, -415150, -225126, 189725, 99500, -110479, 448891, 1524512, 1875046, 1083861, 73601, -418562, -737118, -1191940, -1178419, -314145, 412674, -162822, -1495029, -1943366, -1196967, -730699, -1486786, -2380232, -1955487, -588715, 114356, -371400, -1015162, -987535, -713344, -874378, -1351892, -1713161, -2015239, -2453175, -2703760, -2325546, -1546441, -1032180, -1026862, -1253823, -1510648]
34671a510648k87482j57001J81262K53697k53545q08925o31524K62985J091846
34662a859335J178032M35971p02722j453740j139994J7963Q96205P52986J51725
34653a722909K9784K96105J70590m08838p07583m23099o261K67156N47535O47401
34643a310119J41700n18378k23592R47845J389562L26528p34908j92828J049205
34634H75015Q70457p43167j604193o03727P84654Q69517L548n03652m83557o31668
34624a166773q88221m88197N48467J143162N90564m94749r74125m93524K86558
34615a936838N76350L31668J52158L58258N07423J61262k18062J34675R35589
34606A002483J074549L29836k57931j57431k60983j191865j890598j181353J64980
$$ y = [-1510648, -1798130, -1955131, -1773869, -1520172, -1773717, -2582642, -3214166, -2951181, -1859335, -681303, -245332, -948054, -2401794, -3541788, -3523825, -2627620, -1874634, -1722909, -1693125, -1397020, -1226430, -1635268, -2342851, -2765950, -2772211, -2505055, -1957520, -1310119, -1168419, -1686797, -1910389, -962544, 427018, 753546, 18638, -174190, 875015, 1745472, 1002305, -601888, -1205615, -420961, 448556, 452104, -51548, -535105, -1166773, -2054994, -2543191, -1994724, -851562, -260998, -755747, -1729872, -2223396, -1936838, -1360488, -1028820, -876662, -518404, -10981, 150281, -67781, 66894, 1002483, 2077032, 2406868, 2148937, 1991506, 1730523, 538658, -1351940, -2533293, -2368313]
34597b368313N13660o7096q0586P84417J202895N91142O6981L65996M85986n09328
34587I85754j659974j412778Q5417J273172J242690M17132m46043q79580o02790
34578i97000K00863O27011j5767j056561j099363J39034J414126J524745O07786
34569A344874l55291p15719n16671j22178J33432J24660K213j5123K9600j05665
34559a95868m24699n64802k56911K46854M04976K7196m71096n40445j30721L24189
34549a581327N26011O03328O56617M26334k00591p14266n95412j56865o5118k02347
34539a303636R1700O65549N59783l27843p56597j9819P44827J75968j138616j400169
34529b708853j80474J041211J009973K24738q8599K94225N44159J08064n03971
$$ y = [-2368313, -1854653, -1921749, -2002335, -1217918, -15023, 576119, 643100, 1009096, 1495082, 985754, -674220, -2086998, -2001581, -728409, 514281, 931413, 485370, -394210, -997000, -796137, -169126, -184893, -1241454, -2340817, -2201783, -787657, 737088, 1344874, 989583, 273864, -242807, -364985, -231553, -106893, -104680, -119803, -90203, -195868, -620567, -1185369, -1442280, -1195426, -790450, -763254, -1234350, -1774795, -1905516, -1581327, -1055316, -451988, 204629, 630963, 430372, -283894, -879306, -1036171, -1101289, -1303636, -1211936, -546387, 13396, -314447, -1071044, -1090863, -346036, -170068, -1308684, -2708853, -2889327, -1848116, -838143, -613405, -702004, -407779, 136380, 244444, -259527]
34520b59527l82714N39776J215058O82888o32021j354993r12570j46371O3967
34511a186507n5454K2863K6540m66575r01336m48967M81566O90967Q6561j68155
34501a918497L82762O91269k8025q85871o30561M17909Q86983M21844M3610L91549
34491b27028P31168K35800n66140m93878M83170J102495N62588m50223q96895
34482D81057p78875o93760o15033j21052M75888L96602k01334k72480M10647P89490
34472a28850K44569l83158k42386J38959r0195n55668l41505M14166Q10853O40677
34462E07462M02593K10119j62102m02678j1818O10329N57582j65286p04042p57000
34452H5159p69154p56035k07467O58247Q19076L3578o26912l38687L79279O86561
$$ y = [-259527, -642241, -102465, 1112593, 1795481, 1163460, -191533, -1104103, -1250474, -1186507, -1241961, -1219098, -1192558, -1659133, -2560469, -3009436, -2527870, -1836903, -1750342, -1918497, -1535735, -844466, -872491, -1758362, -2388923, -1971014, -1084031, -662187, -618577, -227028, 504140, 739940, 173800, -320078, 163092, 1265587, 1828175, 1377952, 481057, -297818, -991578, -1606611, -1727663, -1251775, -855173, -1056507, -1328987, -918340, -128850, 115719, -267439, -509825, -370866, -461061, -1016729, -1358234, -944068, -133215, 507462, 910055, 1120174, 958072, 555394, 543576, 1153905, 1711487, 1546201, 842159, 85159, -683995, -1440030, -1647497, -989250, -170174, -136596, -763508, -1102195, -722916, -36355]
34442c6355O08102N32100L24472k52292p71452n93309J51628O41997L57711l86282
34432E76320q63133o70380l2744N64718R27860J086617P80249k99899j529681
34423E39927j565859k26897Q04654K35638p90445l86135J063455J483201M02598
34414A560137m63749j35717K57329l00901j037980r55738m75847l85695m39849
34405b378010j25006K84348M29472N66843O92869J66936q64062j009985K44298
34396a992297J321110Q29334k42086k31629M87028M06913m36748p79576n01282
34387a139233n32425p27748n2008J122444J134600j82331r45172j38861Q47903
34378f12831N99674j43298k0321N94947L94982n29166q45141k22802J34015n09583
$$ y = [-36355, 571747, 1103847, 1428319, 1176027, 404575, -188734, -37106, 604891, 962602, 576320, -286813, -957193, -989937, -425219, 502641, 1589258, 2369507, 2069608, 539927, -1025932, -1252829, -448175, -212537, -1002982, -1389117, -325662, 1157539, 1560137, 1096388, 960671, 1218000, 917099, -120881, -1076619, -1552466, -1938161, -2378010, -2503016, -2218668, -1789196, -1222353, -529484, -362548, -1226610, -2236595, -1992297, -671187, 158147, -83939, -315568, 171460, 578373, 141625, -637951, -1139233, -1671658, -2399406, -2451414, -1328970, -194370, -376701, -1321873, -1460734, -612831, -13157, -156455, -176776, 418171, 813153, 283987, -561154, -783956, -649941, -1159524]
34368a159524j128274m15440J149811J736605O23197p38209o50848N39169J064824
34359A021311L23945m54231l14044N3113k41965p19119n25909j8454k4195k62748
34349a162296O1139O27350M87297j65904k82790J69030K14782k82287m17554l034
34339g54267J04209l27502n28847l22242l89089n73553J81587J589572J776599
34330G56467K94447p10671K15306J381556P17779p57845o74346P02196R44821
34321B869710n85294j927223j706356p49047j36371K40077N81113M78562J0955
34312i23874k9081L80489K88345m03255n48791J46631M23535k28857m28801O44837
34302f78822J469359N81118q25252q09530P9482n5712r46261n82367J063095J645739
$$ y = [-1159524, -2287798, -2703238, -1553427, 183178, 806375, 68166, -582682, -43513, 1021311, 1345256, 891025, 576981, 630094, 388129, -330990, -856899, -875353, -899548, -1162296, -1101157, -473807, 13490, -152414, -435204, -266174, -51392, -333679, -751233, -754267, -650058, -977560, -1506407, -1828649, -2217738, -2791291, -2609704, -1020132, 756467, 1050914, 340243, 555549, 1937105, 2654884, 1897039, 1222693, 1924889, 2869710, 2284416, 357193, -1349163, -2098210, -2234581, -1994504, -1413391, -934829, -923874, -952955, -572466, -284121, -687376, -1236167, -1089536, -666001, -894858, -1323659, -678822, 790537, 1371655, 546403, -263127, -183645, -239357, -1185618, -1767985, -704890, 940849]
34292I40849K89388r16523l63807N60339M6844j030973o86840Q03217J347744
34283I90238K89672q42416p76449L557M28939K13846k68228n49344l17394K14713
34273f12866K95821k91247n29848M19572J516740R99749q46485j734172n27855
34264a310591J249730J736169J040622K58096m26894j247033j491255l61070J210841
34255F58615J262847n10878k083911j559131N83271K202854J893764J95049j278460
34246A364020j503855q41866k99470k09036j4215N77534Q74830J80304r52714
34237h24468j225515k63978R16053J189202M89234m37180r29705q28007l58095
34228b272459J02310K83798J99122K4564j18992j30833J68725Q10651J400458
$$ y = [940849, 1230237, 313714, -50093, 510246, 557090, -473883, -1160723, -357506, 990238, 1279910, 437494, -338955, -335398, 93541, 307387, 39159, -510185, -827579, -612866, -317045, -608292, -1138140, -718568, 798172, 1797921, 951436, -782736, -1310591, -60861, 1675308, 2715930, 2974026, 2547132, 1300099, -191156, -552226, 658615, 1921462, 1410584, -673327, -2232458, -1649187, 553667, 2447431, 2642480, 1364020, -139835, -981701, -1281171, -1490207, -1504422, -926888, -52058, 128246, -824468, -2049983, -2313961, -1397908, -208706, 280528, -156652, -1086357, -1914364, -2272459, -2170149, -1886351, -1687229, -1662665, -1781657, -1912490, -1743765, -933114, 467344]
34219D67344J366743N55302n63608j287301j236909o54586k06464k84872m65252
34210b309603j747J046806J693219J285227L34619l28106o24198q40969p80995
34201e25747j88194L99111K74368j72249M4851P72124P48186l60256j237747q62205
34191a107758k4247J5085n37011n73353J5938L27547Q5625l3322J86803O3419
34181a581274n61982o64563L54629J342805Q62747n58716j039131j05115O49952
34172a300648J18296n69848P5366J370011J376337j20602j280095r55267j14846
34163a401296N8936l7177M16316R38866N90803k35491l90997N3561l7174p93018
34153h36671j000099j61957N73164K49795l64100q0099P84326R72690K78115k72864
$$ y = [467344, 1834087, 2389389, 1825781, 538480, -698429, -1353015, -1559479, -1844351, -2309603, -2311350, -1264544, 428675, 1713902, 2048521, 1720415, 1096217, 255248, -525747, -713941, -314830, -40462, -212711, -167860, 604264, 1352450, 992194, -245553, -1107758, -1132005, -1116920, -1653931, -2227284, -2211346, -1883799, -1798174, -1831496, -1644693, -1581274, -2143256, -2807819, -2453190, -1110385, -247638, -806354, -1845485, -1950600, -1300648, -1182352, -1752200, -1676834, -306823, 1069514, 948912, -331183, -1286450, -1401296, -1342360, -1379537, -963221, -24355, 566448, 330957, -60040, -6479, -43653, -836671, -1836770, -1998727, -1425563, -1175768, -1539868, -1619967, -835641, 137049, 415164, 142300]
34143A42300j32858K0808m35307r34660m87916Q40336J857948J621770M64917
34134B957338m95723o33962l42175l30417o98938r30507o67810j65035J10515
34125a196714N7970o0726l1981J28400L25611M83071M78086J91543k75746n69996
34115d70482m09209R7041N43630O11399K94830j44427l28682l0615M51367L54243
34105I69095o34399j571864j081118P62181K131078J631152R6605o64857l41159
34096A296714j23639n38606p43622k00726L62010K67480r665J53529L95907J24012
34086I83394l96310o01635o11545p49531p00690q6796O47286Q55915P17846P30822
34076G88756P07409K59543k42670k78986k39404o93255j100141o22050J84492
$$ y = [142300, 9442, 30250, -405057, -1339717, -1827633, -987297, 870651, 2492421, 2957338, 2461615, 1827653, 1485478, 1155061, 456123, -474384, -1142194, -1307229, -1196714, -1138744, -1199470, -1231451, -1103051, -777440, -294369, 183717, 375260, 99514, -470482, -879691, -782650, -239020, 372379, 667209, 522782, 194100, 163485, 614852, 969095, 334696, -1237168, -2318286, -1556105, 574973, 2206125, 2302730, 1637873, 1296714, 1173075, 634469, -109153, -309879, 52131, 319611, 309946, 463475, 859382, 983394, 587084, -14551, -626096, -1375627, -2076317, -2163113, -1515827, -659912, 57934, 788756, 1496165, 1755708, 1513038, 1234052, 994648, 301393, -798748, -1420798, -1236306]
34067a236306O5432p41089p32730L59995J080677O38496N4722K25772M60125m5018
34057A30076o26999k89350N57207P19323k9263q69055j142935p76176O4894R29842
34047a332436J097349L77712m26952m84622J9856L71804M01935M09688M12059
34038H46393J95582j15941j75975M1314K69473L43676K20278j37316n82408p83211
34028A21865o26241k83681J88621P44984Q16994j76951j519288j536014R7577
34019b172134J511638J063123l96440r02030k05251K89088l1011k53920K67042
34010h29895Q53077O86426N766m33046l91859j66151k3804j376j2811K6713P0269
33999b16691p075j09050M8159M02278M82952K02015J35855N27405O54349q8190
$$ y = [-1236306, -1170874, -1911963, -2644693, -2284698, -1204021, -565525, -510803, -285031, 175094, 130076, -496923, -786273, -229066, 490257, 460994, -408061, -1550996, -2327172, -2262278, -1332436, -235087, 142625, -284327, -768949, -749093, -377289, 24646, 434334, 846393, 1041975, 926034, 750059, 791373, 1060846, 1404522, 1624800, 1487484, 905076, 121865, -504376, -788057, -599436, 145548, 962542, 785591, -733697, -2269711, -2172134, -660496, 402627, 6187, -895843, -1101094, -812006, -843017, -1096937, -829895, 23182, 709608, 715374, 282328, -109531, -275682, -299486, -300862, -313673, -286960, -216691, -223766, -332816, -284657, 117621, 600573, 802588, 938443, 1465848, 2120197, 2032007]
33989B032007j075787j302971q19790l47944L0227O37336J045208M99747o10712
33980H7321j024555m07057L19128N09077M41055L32265M793k72571N7732N83655
33970F30843K51836o87284o76580N64741J177109m2987j591352j495840k88428
33961b157942Q8574n41196n41933O92988J779579J477378K91728n07706m06040
33952A75430K00537N70076J27050r02058j367647m88294Q50907J070773J08828
33943C45602n31847j01293L56408j74089j028830r43627N9768Q68393Q73093M57693
33933A81271J44172L2836M1169J25778K15283K20945J01242j61453m54451m40421
33923F371J4881L79335P5803m39060j57142P32999P86712m43414j411071q54633
$$ y = [2032007, 956220, -346751, -1166541, -1514485, -1484258, -846922, 198286, 698033, 87321, -937234, -1344291, -1025163, -516086, -75031, 257234, 262027, -10544, 47188, 630843, 882679, 195395, -481185, 83556, 1260665, 1217678, -373674, -1869514, -2157942, -2069368, -2610564, -3152497, -2459509, -679930, 797448, 1089176, 581470, 175430, 375967, 946043, 1073093, 171035, -1196612, -1684906, -833999, 236774, 345602, -186245, -287538, 68870, -105219, -1134049, -2077676, -2017908, -1149515, -276422, 181271, 325443, 358279, 399448, 525226, 740509, 961454, 1062696, 901243, 446792, 6371, 21252, 400587, 476390, 37330, -119812, 613187, 1399899, 956485, -454586, -1309219]
33913a309219J77297N8888o82715l06286J040423J367408M3497j200589r93692
33904a804988r1548L83995O29727R65285O51304o08400j367406l78735J160216
33895d60550J132653l90867j422348j047919k63756J08755M60612J016631J100646
33886B33857M19398k38448k64397j11885l01648n49517n12634m55307n06359j77601
33876b464541O14496R26859J18332r19131q97273K0317O02566M47758L03215N22737
33866g24665M31387l44753r03115k37610J100484J445894J79640j315140j312683
33857a680561R2425J166272P68271l88689r59292o74541k17413M2295L38249P60363
33847g52621J032864J037626R28929P32273L62176l8817k77547m40972n56592
$$ y = [-1309219, -1131922, -1073034, -1755749, -2062035, -1021612, 345796, 389293, -811296, -1804988, -1896536, -1512541, -882814, 82471, 733775, 125375, -1242031, -1620766, -460550, 672103, 281236, -1141112, -2189031, -2452787, -2344032, -1883420, -866789, 233857, 653255, 414807, 150410, 38525, -263123, -812640, -1325274, -1780581, -2286940, -2464541, -1850045, -923186, -804854, -1723985, -2621258, -2600941, -1998375, -1550617, -1247402, -724665, -293278, -638031, -1541146, -1778756, -678272, 767622, 947262, -367878, -1680561, -1588136, -421864, 346407, -42282, -1001574, -1676115, -1893528, -1851233, -1512984, -752621, 280243, 1317869, 2246798, 2979071, 3341247, 3302430, 3024883, 2583911, 2027319]
33838B027319l11825K42345K81400n46220j102892l41118O62493O1900j618857
33829f45455j899462j88104J138226L92064r51745q75043J18530M51901L21712
33820b137376Q22713J387190N97423r83728j240483K24982J421032R37800k56934
33811G72619n94390J5960O09934N87278M7995n61715p31980l60341j1035j27389
33801c53064k23006K98060Q52813M03074o98440r83733j19874N34702L8652p73553
33791a024369p01486J06315O19964L79131k15070n79707m34731M9658L71353K93563
33781a135379K34868N47113P12116J18367o70843o09288L5126Q074p36344p93645
33771b289835L18897J207207P96891n2621j73155N9597k11873n72418j41017O75676
$$ y = [2027319, 1715494, 1957839, 2239239, 1693019, 590127, 249009, 911502, 973402, -645455, -2544917, -2733021, -1594795, -1202731, -2154476, -3029519, -2910989, -2459088, -2137376, -1314663, 72527, 669950, -313778, -1554261, -1329279, 91753, 1029553, 772619, 178229, 194189, 804123, 1391401, 1439396, 877681, 145701, -214640, -225675, -353064, -576070, -278010, 574803, 977877, 279437, -704296, -824170, -289468, -250816, -1024369, -1725855, -1619540, -999576, -620445, -835515, -1415222, -1849953, -1800295, -1428942, -1135379, -900511, -353398, 358718, 477085, -193758, -803046, -767920, -759846, -1496190, -2289835, -1970938, -763731, 33160, -19461, -192616, -133019, -344892, -917310, -1058327, -382651]
33761c82651P57954J04735l17020k20483j67609l03430k03995R5215J32702P5089
33751d29493N25840J169193Q62750n33810j580040j161081o1455J96291n38230
33742a550035j037072n29752L90560Q03892O27087L30243K8895m84307r76926
33733b397415p81645K12174J143703J182027N50777P6113L7452M3182j64293m01772
33723d99697m54375k53937K26859P44657P07662k4474n92661k40010L79132J10262
33713A03418p24549o88006L84657R67933K58293n96549m70934K3268j16937n07489
33703a366895k63863L14182L26979j49173l59686j94689l7828J74260N98850P33837
33693b24026J78637l89610j93085K57631L8006n04841m00750J11845M6220l81930
$$ y = [-382651, 375303, 480038, 163018, -57465, -225074, -528504, -732499, -637284, -504582, -429493, 96347, 1265540, 2128290, 1594480, 14440, -1146641, -1208096, -1011805, -1550035, -2587107, -3116859, -2726299, -1922407, -1295320, -965077, -936182, -1420489, -2397415, -3179060, -2966886, -1823183, -641156, -90379, -14266, 23186, 66368, -97925, -499697, -954072, -1208009, -981150, -236493, 471169, 446695, -145966, -385976, -6844, 103418, -621131, -1309137, -924480, 43453, 301746, -294803, -765737, -742469, -859406, -1366895, -1630758, -1316576, -989597, -1138770, -1498456, -1693145, -1730973, -1556713, -957863, -224026, -45389, -434999, -628084, -370453, -332447, -837288, -1238038, -1126193, -1079973, -1461903]
33683a461903o1486Q58256J001275J41912l15183L02780Q55079L71887m62437
33674A230180o71900m60034m01649l74820k20919l55468p90951o27220M83504
33665b189277J380776J000925K9378k16726K42266M42520J88599O2268J59180
33656A099909P8736j04437j9650P7831l11817q11861n71418K79837O87063K18580
33646F22773m60869p22740n86249j33685O26802J140401O38996n52635j059766
33637d86972k76512P90193J033579O76863M75778L53398j80754q16531p53757
33628H15285l2939M36246K08559j89100k51357k18273m33422n82159j38599O87929
33618C02170J004835L11815p73304j065211r5538J235270J466037J79516j363081
$$ y = [-1461903, -1523389, -665133, 336142, 478054, 162871, 465651, 1320730, 1692617, 1230180, 558280, 98246, -303403, -678223, -899142, -1254610, -2045561, -2672781, -2189277, -808501, 192424, 221802, 5076, 247342, 689862, 878461, 940729, 1099909, 1178645, 1074208, 1054558, 1132389, 820572, 8711, -562707, -282870, 404193, 622773, 161904, -560836, -1147085, -1280770, -653968, 486433, 1125429, 572794, -486972, -763484, 26709, 1060288, 1737151, 2212929, 2566327, 2385573, 1569042, 815285, 782346, 1218592, 1427151, 1238051, 986694, 768421, 334999, -247160, -385759, 302170, 1307005, 1618820, 845516, -219695, -315233, 920037, 2386074, 2565590, 1202509]
33609A202509j544867l29236O47175J80585q73638p84758N54163J369418M93409
33600I14760r60383j207902k77976L25153N2809r1042M32286O23373k84735j225594
33590a699251p38367P57052J538142J056780L77438J92724p9028q30623j282866
33581g07999p34920K30793O72473O40552O97180P17110J94725o11305q46179k79938
33571b7508M37102O87476L89997k84913j001205j159894m59137M64783O59039
33562b94260J00380l94681m53951m80001o26726m16496L00592Q79297Q15424M07612
33552a62810O6010k66329n28792k35302N81076R32500K39563n86582m33175K54398
33542a39443K07028n82227q90393l13856J30484k36015o57093k14671P62386J272972
$$ y = [1202509, -342358, -671594, -24419, 156166, -717472, -1502230, -948067, 421351, 914760, -45623, -1253525, -1531501, -1206348, -1153539, -1244581, -812295, -188922, -473657, -1699251, -2437618, -1680566, -142424, 914356, 1291794, 1484518, 1405490, 574867, -707999, -1442919, -1212126, -539653, 100899, 798079, 1515189, 1709914, 1098609, 252430, -27508, 409594, 1097070, 1487067, 1202154, 200949, -958945, -1418082, -953299, -294260, -193880, -588561, -1042512, -1522513, -2149239, -2565735, -2265143, -1385846, -570422, -162810, -96800, -363129, -891921, -1127223, -546147, 386353, 625916, 39334, -393841, -139443, 67585, -514642, -1405035, -1718891, -1588407, -1824422, -2481515, -2696186, -1933800, -660828]
33532f60828R57895K12089m71666p17022l32261K99244L77175k54876p21938l40681
33522a652869L50934M82748J82225J02239J23861k86892o84647k1350J397857
33513e894J762132K27551j630478j800284m02490Q24372R58387N37655J27558
33504E98509l28227o57288l20006M65640O24796j76086q74489o32790p8923m5895
33494a424759r6702M76195J035076N19404n48387p00034L8534J87563n70006p66248
33484a849364K75812J160014P40909L131K27879P50422K36576r21319j316114
33475f92054q32442l85703J2034R25858J637746P99527j034591j694189n85288
33466a849102M67088K07254k43629M01511J379929J263509K08865o16003q52979
$$ y = [-660828, 297067, 509156, 37490, -679532, -1011793, -712549, -335374, -590250, -1312188, -1652869, -1301935, -819187, -636962, -534723, -410862, -697754, -1382401, -1403751, -5894, 1756238, 1983789, 353311, -1446973, -1849463, -1025091, -66704, 470951, 598509, 270282, -387006, -707012, -241372, 383424, 207338, -667151, -1299941, -1378864, -1424759, -1521461, -1045266, -10190, 509214, -39173, -739207, -700673, -513110, -1083116, -1849364, -1573552, -413538, 327371, 330502, 558381, 1308803, 1545379, 624060, -692054, -1524496, -1910199, -1898165, -972307, 665439, 1464966, 430375, -1263814, -1849102, -1382014, -1174760, -1418389, -1016878, 363051, 1626560, 1835425, 1219422, 366443]
33457C66443q43201n08084L20686J031610R06528K47065j57120k06455k25444
33448I32028j05386K75395L26836m61059j425783j492196o68941J94618P31365
33439a693123J102444J135908N54367k08419m63985k67155k4040L86982R91406
33430A514385Q81501m94888j752635j122902O65105J141150j49791r19856J76063
33421f1868J386982P03421j026132j558545n39730N24739P79403O84576N50588
33412A443434R2893n27071n95423j0438M69728L52165m0416k87867l92756m26707
33402G7542l10289j11254l4229k0714J62638M29223M74685L42085L03410J91162
33392A504259m47353j378775j601870o43976O11281R23816K06105m98966m09292
$$ y = [366443, -476758, -984842, -664156, 367454, 1273982, 1521047, 1363927, 1157472, 932028, 826642, 1102037, 1428873, 967814, -457969, -1950165, -2619106, -2424488, -1693123, -590679, 545229, 1099596, 891177, 427192, 160037, 135997, 522979, 1514385, 2395886, 1900998, 148363, -974539, -309434, 831716, 681925, -237931, -61868, 1325114, 2028535, 1002403, -556142, -1095872, -571133, 208270, 892846, 1443434, 1536327, 1009256, 413833, 403395, 873123, 1225288, 1184872, 897005, 504249, 77542, -232747, -344001, -378230, -398944, -236306, 192917, 667602, 1009687, 1313097, 1504259, 1056906, -321869, -1923739, -2567715, -1956434, -1032618, -826513, -1325479, -1734771]
33383a734771J56701M20251J85739q3964m2362J32464K02956L22320O51376Q25355
33373A036065L85273l57210n82134j82171N3273k39708l69266J32902M88206j00117
33363B65113r02053o45688L48925N46908l03930p14744N7173P30604J80251n83505
33353a020946q0062J074140J080073j01084o73254J02411Q32046L34758o05671
33344I42411p48907k99002j41589k29505l6069J44126k41562o37690p8552R54496
33334c71843R36161l03277j115785m69108N58664N39757k25383m91277q2278J43410
33324h80959r6975j95686J20169L36984J00383k44709l16291k11659q5481J86180
33314a288044N71809O05452k1298q65652j120508m90349N49208J269167J300227
$$ y = [-1734771, -1578070, -1157819, -972080, -1056044, -1098406, -965942, -762986, -440666, 210710, 1036065, 1421338, 1064128, 481994, 299823, 353096, 113388, -255878, -122976, 365230, 265113, -636940, -1282628, -933703, -386795, -690725, -1405469, -1348296, -617692, -437441, -1020946, -1101008, -26868, 1053205, 952121, 278867, 381278, 1213324, 1548082, 942411, 193504, -105498, -247087, -476592, -512661, -368535, -610097, -1247787, -1326339, -371843, 564318, 261041, -854744, -1323852, -765188, -225431, -450814, -942091, -1024369, -880959, -977934, -1173620, -1053451, -716467, -616084, -860793, -1177084, -1388743, -1474224, -1288044, -716235, -110783, -132081, -997733, -2118241, -2608590, -2059382, -790215, 510012]
33305E10012Q28381L36289J32079R2200r4501m85773q27184q93404p00284l77445
33295a479630l4208K03149K15150M3317j15432j50161j57168k43119l19094k09553
33285b246749Q4305L57794M67803N25116P14322R53862R01603L77567l55813q47819
33275I31991q62654m30519K64553Q30996P84227Q8722o30004q35186p87898r58017
33265a603789j023511l02928Q99689J379553O71860l10706o12649l40908n4732
33256a298121O6615k748k97025l28713N76378J846450J786139m099j595806j296855
33246e47785k5203L61225n3621P2033O56875M53942l88946l49096P88997J421049
33236B389470O57538n71106j353742j819301j834569p10003J041175J622839N97230
$$ y = [510012, 1338393, 1674682, 1806761, 1898961, 1804460, 1318687, 491503, -401901, -1102185, -1479630, -1513838, -1310689, -1095539, -1052222, -1167654, -1317815, -1474983, -1718102, -2037196, -2246749, -2162444, -1804650, -1336847, -811731, -97409, 856453, 1758056, 2135623, 1779810, 931991, 69337, -361182, -96629, 734367, 1518594, 1607316, 977312, 142126, -645772, -1603789, -2627300, -2930228, -2030539, -650986, 20874, -289832, -902481, -1243389, -1298121, -1231506, -1234254, -1531279, -1859992, -1283614, 562836, 2348975, 2344876, 749070, -547785, -572988, -211763, -265384, -193351, 463524, 917466, 528520, 179424, 968421, 2389470, 3047008, 2475902, 1122160, -697141, -2531710, -3241713, -2200538, -577699, 19531]
33227A9531k54894K40590Q82669M26073k62763l4066L21344l56554j248457r12265
33217a178792J33163L53354j44295q0329N34072N83847K9885k08541j50769m26907
33207e55312m79575N86102J659926P50482j492884k150855m19489J159595P69840
33198a72170j45922J39330P16050J10365q30172n06506M68138L35504p35691j033574
33188a654648k27219L37386P7662j44267J37358K99855N1536m8086J50492P776
$$ y = [19531, -235363, 5227, 887896, 1313969, 1051206, 1017140, 1338484, 981930, -266527, -1178792, -1045629, -692275, -836570, -916899, -382827, 201020, 230905, 22364, -128405, -555312, -1034887, -448785, 1211141, 1961623, 468739, -1682116, -2101605, -942010, -172170, -318092, -178762, 537288, 647653, -182519, -689025, -220887, 114617, -621074, -1654648, -1881867, -1544481, -1466819, -1611086, -1473728, -1173873, -1122337, -1170423, -1019931, -1012155]
$$ [...]
##END NTUPLES=NMR SPECTRUM
##END=
