##TITLE=31Pdec_88-2021
 CDCl3, 24 sc
 1.09.2021
##JCAMPDX= 6.0         $$ Bruker NMR JCAMP-DX V2.0
##DATA TYPE= NMR SPECTRUM
##DATA CLASS= NTUPLES
##ORIGIN= UXNMR, Bruker Analytische Messtechnik GmbH
##OWNER= root
$$ XWIN-NMR		Version 3.5
$$ Wed Sep  1 11:32:46 2021 Russian Standard Time (UT+4h)  she@DPX200
##.OBSERVE FREQUENCY= 81.013821
##.OBSERVE NUCLEUS= ^31P
##.ACQUISITION MODE= SIMULTANEOUS
##.ACQUISITION SCHEME= undefined
##.AVERAGES= 24
##.DIGITISER RES= 16
##SPECTROMETER/DATA SYSTEM= spect
##.PULSE SEQUENCE= zgpg30
##.SOLVENT NAME= CD2Cl2
##.SHIFT REFERENCE= (INTERNAL, CD2Cl2, 0, 248.564)
##AUDIT TRAIL= $$ (NUMBER, WHEN, WHO, WHERE, WHAT)
$$ ##TITLE= Audit trail, XWIN-NMR		Version 3.5
$$ ##JCAMPDX= 5.01
$$ ##ORIGIN= Bruker BioSpin GmbH
$$ ##OWNER= she
$$ F:/spectra/data/she/nmr/P31/1/pdata/1/auditp.txt
$$ ##AUDIT TRAIL=  $$ (NUMBER, WHEN, WHO, WHERE, WHAT)
(   1,<2021-09-01 11:31:46.21 +0400>,<she>,<DPX200>,
      <created by zg, POWCHK disabled, PULCHK disabled
       configuration hash MD5:
       00 E9 B6 7A A2 85 ED C7 34 08 36 98 17 FE 4E 26
       data hash MD5: 32K
       2D 4E 68 2D A4 D6 83 AF CD 4E B1 8B F3 AE 5A 8C>)
(   2,<2021-09-01 11:31:49.56 +0400>,<she>,<DPX200>,
      <Start of raw data processing
       efp BC_mod = 2 LB = 1 FT_mod = 6 PKNL = 1 PHC0 = -7646.398 PHC1 = -142.9269 SI = 64K 
       data hash MD5: 64K
       AF D4 01 5C C0 E8 96 81 4C 00 29 FA 10 2B 09 49>)
(   3,<2021-09-01 11:32:10.29 +0400>,<she>,<DPX200>,
      <pk PHC0 = 28.29965 PHC1 = -39.4001 
       data hash MD5: 64K
       9E A4 F7 FA 6F E9 F2 C5 71 C8 93 78 99 7B 94 FD>)
(   4,<2021-09-01 11:32:13.50 +0400>,<she>,<DPX200>,
      <abs ABSG = 5 
       data hash MD5: 64K
       C1 5F E2 D4 9D 66 16 4A D9 1E AA 8E EB 12 8A 56>)
$$ ##END=
$$ 
$$ hash MD5
$$ DF 76 E3 31 83 C4 D5 3F 4D 0F 7C E7 57 44 17 26
##$RELAX= 
##$RELAX= 
##$RELAX= 
##$RELAX= 
##$RELAX= 
##$RELAX= 
##$RELAX= 
##$RELAX= 
$$ Bruker specific parameters
$$ --------------------------
##$DU= <F:/spectra>
##$EXPNO= 1
##$NAME= <P31>
##$PROCNO= 1
##$TYPE= <nmr>
##$USER= <she>
##$AMP= (0..31)
100 100 100 100 100 100 100 100 100 100 100 100 100 100 100 100 100 100 
100 100 100 100 100 100 100 100 100 100 100 100 100 100 
##$AQSEQ= 0
##$AQ_mod= 1
##$AUNM= <au_zg>
##$AUTOPOS= <>
##$BF1= 81.014009
##$BF2= 200.13
##$BF3= 200.13
##$BF4= 200.13
##$BF5= 200.13
##$BF6= 200.13
##$BF7= 200.13
##$BF8= 200.13
##$BYTORDA= 1
##$CFDGTYP= 0
##$CFRGTYP= 5
##$CHEMSTR= <none>
##$CNST= (0..31)
1 1 145 1 1 1 1 1 1 1 1 1 1 1 1 1 1 1 1 1 1 1 1 1 1 1 1 1 1 1 1 1 
##$CPDPRG= <waltz16>
##$CPDPRG1= <>
##$CPDPRG2= <waltz16>
##$CPDPRG3= <>
##$CPDPRG4= <mlev>
##$CPDPRG5= <mlev>
##$CPDPRG6= <mlev>
##$CPDPRG7= <mlev>
##$CPDPRG8= <mlev>
##$CPDPRGB= <>
##$CPDPRGT= <>
##$D= (0..31)
0 1 0 0 0 0 0 0 0 0 0 0.03 2e-05 3e-06 0 0 0 0 0 0 0 0 0 0 0 0 0 0 0 0 
0 0 
##$DATE= 1630481505
##$DBL= (0..7)
120 120 120 11 120 120 24 19 
##$DBP= (0..7)
150 150 150 150 150 150 150 150 
##$DBP07= 0
##$DBPNAM0= <>
##$DBPNAM1= <>
$$ [...]
##$SUBNAM3= <"">
##$SUBNAM4= <"">
##$SUBNAM5= <"">
##$SUBNAM6= <"">
##$SUBNAM7= <"">
##$SUBNAM8= <"">
##$SUBNAM9= <"">
##$SW= 501.771253377433
##$SWIBOX= (0..15)
0 1 3 0 0 0 0 0 0 0 0 0 0 0 0 0 
##$SW_h= 40650.406504065
##$TD= 32768
##$TD0= 1
##$TE= 0
##$TE2= 300
##$TE3= 300
##$TEG= 300
##$TL= (0..7)
0 120 53 12 22 120 120 120 
##$TP= (0..7)
150 150 150 150 150 150 150 150 
##$TP07= 0
##$TPNAME0= <>
##$TPNAME1= <>
##$TPNAME2= <>
##$TPNAME3= <>
##$TPNAME4= <>
##$TPNAME5= <>
##$TPNAME6= <>
##$TPNAME7= <>
##$TPOAL= (0..7)
0.5 0.5 0.5 0.5 0.5 0.5 0.5 0.5 
##$TPOFFS= (0..7)
0 0 0 0 0 0 0 0 
##$TUNHIN= 0
##$TUNHOUT= 0
##$TUNXOUT= 0
##$USERA1= <user>
##$USERA2= <user>
##$USERA3= <user>
##$USERA4= <user>
##$USERA5= <user>
##$V9= 5
##$VALIST= <valist>
##$VCLIST= <CCCCCCCCCCCCCCC>
##$VD= 0
##$VDLIST= <DDDDDDDDDDDDDDD>
##$VPLIST= <PPPPPPPPPPPPPPP>
##$VTLIST= <TTTTTTTTTTTTTTT>
##$WBST= 1024
##$WBSW= 4
##$XGAIN= (0..3)
0 0 0 0 
##$XL= 0
##$YL= 0
##$YMAX_a= 2730
##$YMIN_a= -2830
##$ZGOPTNS= <>
##$ZL1= 120
##$ZL2= 120
##$ZL3= 120
##$ZL4= 120
##$ABSF1= 248.5645
##$ABSF2= -253.2056
##$ABSG= 5
##$ABSL= 3
##$ALPHA= 0
##$AQORDER= 0
##$ASSFAC= 0
##$ASSFACI= 0
##$ASSFACX= 0
##$ASSWID= 0
##$AUNMP= <proc_1d>
##$AZFE= 0.1
##$AZFW= 0.5
##$BCFW= 0
##$BC_mod= 2
##$BYTORDP= 0
##$COROFFS= 0
##$CY= -3
##$DATMOD= 1
##$DC= 0
##$DFILT= <>
##$DTYPP= 0
##$F1P= 0
##$F2P= 0
##$FCOR= 1
##$FTSIZE= 65536
##$FT_mod= 6
##$GAMMA= 0
##$GB= 0
##$INTBC= 1
##$INTSCL= 5.30512e-09
##$ISEN= 30
##$LB= 1
##$LEV0= 0
##$LPBIN= 0
##$MAXI= 10000
##$MC2= 0
##$MEAN= 0
##$ME_mod= 0
##$MI= 50
##$NCOEF= 0
##$NC_proc= -5
##$NLEV= 6
##$NOISF1= 182.463
##$NOISF2= 159.3651
##$NSP= 0
##$NTH_PI= 0
##$NZP= 0
##$OFFSET= 248.5645
##$PC= 4
##$PHC0= -7618.098
##$PHC1= -182.327
##$PH_mod= 1
##$PKNL= yes
##$PPARMOD= 0
##$PSCAL= 0
##$PSIGN= 0
##$REVERSE= no
##$SF= 81.014009
##$SI= 65536
##$SIGF1= 159.3651
##$SIGF2= -187.1042
##$SINO= 113.3802
##$SIOLD= 16384
##$SREGLST= <1H.CDCl3>
##$SSB= 0
##$STSI= 65536
##$STSR= 0
##$SW_p= 40650.406504065
##$SYMM= 0
##$S_DEV= 0
##$TDeff= 32768
##$TDoff= 0
##$TI= <>
##$TILT= no
##$TM1= 0
##$TM2= 0
##$TOPLEV= 0
##$USERP1= <user>
##$USERP2= <user>
##$USERP3= <user>
##$USERP4= <user>
##$USERP5= <user>
##$WDW= 1
##$XDIM= 65536
##$YMAX_p= 308693607
##$YMIN_p= -59055125
$$ End of Bruker specific parameters
$$ ---------------------------------
##NTUPLES= NMR SPECTRUM
##VAR_NAME=  FREQUENCY,     SPECTRUM/REAL,   SPECTRUM/IMAG
##SYMBOL=    X,             R,               I
##VAR_TYPE=  INDEPENDENT,   DEPENDENT,       DEPENDENT
##VAR_FORM=  AFFN,          ASDF,            ASDF
##VAR_DIM=   65536,         65536,           65536
##UNITS=     HZ,            ARBITRARY UNITS, ARBITRARY UNITS
##FACTOR=    0.620285442955139, 1,           1
##FIRST=     20137.2065510759, 0,            0
##LAST=      -20513.1999529892, 0,           0
##MIN=       -20513.1999529892, -59055125,   0
##MAX=       20137.2065510759, 308693607,    0
$$ Real data points
##PAGE= N=1
##DATA TABLE= (X++(R..R)), XYDATA
$$ [...]
38938e18513M67176O23492K81381q0998j57197j74758l55777m95704l21359P4818
38928f57439M05607N23091L78458m4599n06910n46711p1916L58073K30625j85194
38918a16915k58646N0196K22517Q7621N6870L30054M84590J79111k29398k33539
38908E72461p53q6809m66754m81550J13250O14793L02523m59896o47153j6236
38898e56124N39706L06531k20209j67895L19601L40747k71347o51751k84637K10383
38888d34995J41367j64656k0391M23539M49798n1569m57094l43173R9785M96129
38878A38740N68056J46486n22304p02023p1145N54296K37377n71113n99778K43496
38868e77912P03431K21559k18746J31255M94443J5543o29265l52353M08543L40938
$$ plain form
38938 -518513 -51337 572155 853536 772538 615341 440583 84806 -410898 -732257 -657439
38928 -657439 -251832 271259 649717 605118 98208 -448503 -520419 -162346 68279 -116915
38918 -116915 -375561 -325365 -102848 -15227 41643 371697 856287 1035398 806000 572461
38908 572461 571708 484899 18145 -463405 -350155 264638 567161 107265 -539888 -556124
38898 -556124 -16418 290113 69904 -97991 221610 562357 291010 -360741 -645378 -434995
38888 -434995 -293628 -458284 -478675 -55136 394662 343093 -114001 -457174 -357389 138740
38878 138740 706796 853282 330978 -371045 -442190 112106 349483 -221630 -821408 -577912
38868 -577912 125519 347078 128332 259587 754030 769573 140308 -212045 196498 537436
38858E37436n43711q56992J105R73549R71898K66575k49126l30195l14506l59621
38848I6412l28842j45702J27715L74543M08278J40749j39986k7011L54156L78988
38838A239300j98625q15945q09272k16174L80821N21669J66678l74971o04885
38829g11404k26877M09641N73629P8208m18304l23127O8006R3180k28670k43668
38819i29386L05655Q33768O73366m9625n70828m26048N083L7051l40517l73931
38809h35412L50377J093589Q30839k33776q04304k89319L82396K03895m31985
38800B66300m73349J23493M44299J09812k71889k05769J7321o173j67784k21209
38790c84948k04073j61464M8144L56226L77124L4267j78243N6413L23133J24694
$$ plain form
38858 537436 -6275 -863267 -862162 111387 1083285 1349860 1100734 770539 456033 96412
38848 96412 -232430 -378132 -250417 124126 532404 673153 533167 506156 860312 1239300
38838 1239300 1040675 224730 -584542 -800716 -419895 101774 268452 -106519 -711404
38829 -711404 -938281 -528640 44989 123197 -295107 -618234 -550228 -457048 -685718 -929386
38819 -929386 -623731 210037 883403 833778 262950 -163098 -158015 -120964 -461481 -835412
38809 -835412 -485035 608554 1439393 1205617 401313 111994 494390 698285 266300
38800 266300 -207049 -83556 360743 470555 198666 -7103 10218 4045 -163739 -384948
38790 -384948 -589021 -750485 -702341 -346115 31009 65276 -112967 -56554 266579 391273
38780C91273l18462m46035k17019k7862l875N0419J41221R0147l8623m7343m9819
38769d75978k42703l23885J68563R01446R09814k1321q61709o74363J43501N31840
38759E5205K30221j12295m7174J64360J56295k3692j60450k13098k12986j11451
38749b75065P7967J79264O7831j30757j90731p2299M8617K7932m8936J1727J99464
38738a04986K52383M7743j21568N4406L36307K09765k52032l63912J03930M33659
38728E95695R119o57786o32640M6326M82259L03300P9910K46105M05544O3804
38718I41636n46129q03664m92327R1754N36339N67320J86896k38968l00483p0090
38708a27716K7760o9827J7556L42956M04599J906l20829j55868O0057j54537l83947
$$ plain form
38780 391273 72811 -373224 -590243 -618105 -621980 -571561 -430340 -340193 -378816 -426159 -475978
38769 -475978 -718681 -1042566 -874003 27443 937257 915936 54227 -620136 -476635 55205
38759 55205 285426 173131 125957 290317 446612 422920 262470 49372 -163614 -275065
38749 -275065 -197098 -17834 49997 -80760 -271491 -343790 -295173 -267241 -316177 -304450 -104986
38738 -104986 147397 195140 73572 127978 464285 674050 422018 58106 162036 595695
38728 595695 604814 -52972 -685612 -639286 -157027 146273 226183 472288 877832 941636
38718 941636 395507 -408157 -900484 -808730 -272391 294929 481825 242857 -57626 -127716
38708 -127716 -99956 -169783 -152227 190729 595328 597234 276405 120537 180594 26057 -357890
38697c57890O817O62267O70707L5397k90797R8206M89317K35282l45777o62554
38687E40975o96321o35573l09239L57467P89218M03336m36322q08727m74077n6219
38677a325482R302J9086L02314N96265N07059J67674j0653K2064Q647q3871m0894
38666A71511J41100J94331O476k53402m51584n52879l75915K09417P67458O09335
38656D65848j40117m89534l1438L21123k18936q69967m06572P64892J073583K23198
38646F92080l86580J5709M05463j21019p09433k31097P06119P05561j58008n86750
38636C32045k28347k2209l66217m43816K39067R10235P33155J4194m26903l89862
38626C51342k04384n9223K3719n3517k68232l32968p7219K97623N39193N90697
$$ plain form
38697 -357890 -351073 311194 981901 1017298 726501 824707 1314024 1549306 1203529 540975
38687 540975 -155346 -790919 -1100158 -742691 46527 449863 13541 -795186 -1269263 -1325482
38677 -1325482 -1316180 -1297094 -994780 -398515 108544 276218 265565 287629 296276 212405 171511
38666 171511 312611 506942 513418 260016 -191568 -744447 -1120362 -910945 -143487 465848
38656 465848 325731 -163803 -195241 125882 -93054 -963021 -1369593 -604701 468882 692080
38646 692080 305500 321209 726672 605653 -103780 -334877 371242 1076803 918795 332045
38636 332045 103698 81489 -284728 -728544 -489477 420758 1153913 1168107 741204 351342
38626 351342 146958 87735 111454 57937 -210295 -543263 -620482 -322859 216334 807031
38616H07031M09323k0134l82990k78011R9376J26156k25766k71695J87003L92373
38606H42666j07884n60392j65483N48316N12805j63653l91679J43995N63950K78347
38596A500988j47636l5936L29566K82733j29147l12472j07514M4088j47962m47727
38586H28981n56271n01328l72093m7477M74763P46525L51282l50979n11129L5133
38576I7407M46209Q8258m71745l19672L45968M80939j61950o15534j89646M75593
38566A75827L85969l94846r54742p79944j76102L41980N27778L67426K8426j70547
38556f48775n3230J90971K82287K03993Q0971o4326j76080m4802L45358N79889
38546F96256K98612k60293n65710m79519k67803q7520J19454L03131K82308N4182
$$ plain form
38616 807031 1216354 1196220 813230 535219 634595 760751 534985 263290 450293 842666
38606 842666 734782 174390 8907 557223 1070028 906375 514696 658691 1222641 1500988
38596 1500988 1353352 1317416 1646982 1929715 1800568 1488096 1380582 1424670 1276708 828981
38586 828981 272710 -228618 -600711 -648188 -173425 573100 924382 573403 62274 97407
38576 97407 543616 631874 160129 -159543 186425 667364 505414 -110120 -299766 175827
38566 175827 561796 166950 -787792 -1567736 -1743838 -1401858 -874080 -506654 -478228 -648775
38556 -648775 -702005 -511034 -228747 -24754 56217 -8109 -184189 -228991 116367 696256
38546 696256 994868 734575 168865 -310654 -578457 -665977 -546523 -243392 38916 93098
38536I3098j63398j94189k0436K56000L97319J79507k31654l34391P417K66074
38526B55347L1598l00631j63214K15386J84567k02525k54516J81145M35501J03222
38516D85880l33825l13902j9142N2322r9732p6234K41512N26765M57422Q2877
38506A003943k44704k23479O2358K00433k4415k91094j86781J59666K82858J16798
38496H55583K5042J08661N7191j98259k71211Q217K58865J97938R8211J98304
38486A338542J62347l30764q51172p16141j7419M85138M23161J63348N9525k7317
38476F89248k52574l56037q5206K75684K32388j94777m74436l00435L9324J69116
38466b57705J80733L70985O03087L83758l36611q59027n41274L32572Q59627N97248
$$ plain form
38536 93098 -70300 -264489 -284925 -28925 368394 547901 316247 -18144 -10727 255347
38526 255347 286945 -13686 -176900 38486 223053 20528 -233988 -52843 382658 485880
38516 485880 152055 -161847 -180989 -128667 -228399 -304633 -63121 463644 921066 1003943
38506 1003943 759239 535760 598118 798551 774136 483042 296261 455927 738785 855583
38496 855583 880625 989286 1046477 848218 577007 585224 844089 1042027 1140238 1338542
38486 1338542 1500889 1170125 318953 -397188 -414607 70531 493692 657040 716565 689248
38476 689248 436674 80637 -4569 271115 503503 308726 -165710 -466145 -426821 -257705
38466 -257705 -76972 294013 897100 1280858 944247 85220 -456054 -123482 736145 1333393
38456A333393k5310l58748k42527J6204P7183j45589m28586m01682L2052M25884
38446B82274K29419m42169q32001m93772J37109L86808K23673J01201J54263P0673
38436a82522k48666m07859j05132L44956L97479J7877k99062k31971k4777l2403
38426g72080j43957K5246M62117O62837L21377k17315m25483k62018o8289N729
38416d11836O9495Q7041j12354l60887j87353M35021Q00880L31247n49336q69350
38406g67432l47209L18667M59912K44799J93318K88340R3869l73528n09615m8638
38396d47517M06305K10808l31136l98780J02684M36112K16991m4967J13705L32520
38386E96725J22481k35274j98103L0183j59418o18979n43122J89996O73560L14595
$$ plain form
38456 1333393 1308083 949335 706808 723012 800195 654606 226020 -175662 -143610 282274
38446 282274 511693 69524 -762477 -1256249 -1119140 -732332 -508659 -407458 -253195 -182522
38436 -182522 -431188 -839047 -944179 -599223 -201744 -183867 -482929 -714900 -739677 -772080
38426 -772080 -916037 -890791 -428674 234163 555540 338225 -87258 -349276 -417565 -411836
38416 -411836 -342341 -255300 -367654 -728541 -915894 -480873 320007 651254 101918 -767432
38406 -767432 -1114641 -795974 -336062 -91263 102055 390395 484264 110736 -398879 -447517
38396 -447517 -41212 169596 -161540 -560320 -457636 -21524 195467 150500 264205 596725
38386 596725 719206 483932 285829 316012 156594 -462385 -1005507 -815511 -141951 172644
38376A72644k46859j35113L97711L59779m36880r92951m72180O12351J015277
38367B73779L67095l69270k32712M02348L86953m74043j051764n24192L95175
38358h26631N21315p3202l12119J67107N84783L75402j6458l9895R3284m2826
38348D30760k98405k81808m8983P9951P8481J07399J05449o6256k66706k66668
38338d26786j44301j31649j97271j12598J51441L64989L25394M1807k69221k87923
38328f86118J16908O14139O80248K44644k23098l68723l35427l47842l28583j66599
38318h00451J1669J00592J92282K61897Q0580k86756l41252J36753O44960O24297
38308F24571J99685j33490k00531j28850O54Q0607q9397m14056m36279l0410L00936
$$ plain form
38376 172644 -74215 -209328 188383 548162 111282 -881669 -1353849 -741498 273779
38367 273779 640874 271604 38892 441240 828193 354150 -697614 -1221806 -826631
38358 -826631 -305316 -378518 -690637 -523530 61253 436655 420197 380302 473586 430760
38348 430760 132355 -149453 -198436 -118485 -40004 67395 172844 106588 -160118 -426786
38338 -426786 -571087 -702736 -900007 -1012605 -861164 -496175 -170781 -128974 -398195 -686118
38328 -686118 -569210 44929 725177 969821 746723 378000 42573 -305269 -633852 -800451
38318 -800451 -788782 -688190 -495908 -234011 -153431 -440187 -781439 -644686 274 624571
38308 624571 824256 690766 490235 361385 362039 442646 353249 -60807 -497086 -527496 -226560
38297b26560K19809Q3700K02891K16487j52772l94527o8911K71868k2968m79454
38287c50437k83701K29260J68615k17518P0601Q54682Q50727j68279q83313n38323
38277b67686j9692j64815m07488j6555N24606M43978M0673L0411K69379J84493
38267F17304j14706j57448n3638j69137k97394p2227J86976m6930n20619n69280
38257a197099j77097J65736L48509N36270N24376J12721j98924J18432N44679
38248G77603J97789o06690o99062P3459N86736K28864k80362k18931J25212K61500
38238D46118K86061K88186q5427q00805j016533k65635O28395O19544j12452n60475
38228e73023l06252K12774N13442M37035j3393n51668n83149O6870O59133M31374
$$ plain form
38297 -226560 -6751 76949 279840 496327 343555 -50972 -119883 151985 129017 -350437
38287 -350437 -634138 -404878 -236263 -453781 -383180 471502 1322229 1153950 270637 -267686
38277 -267686 -287378 -452193 -859681 -876236 -351630 92348 133021 163432 432811 617304
38267 617304 502598 345150 291512 122375 -175019 -247246 -60270 -107200 -627819 -1197099
38257 -1197099 -1374196 -1208460 -859951 -323681 200695 313416 114492 232924 777603
38248 777603 975392 368702 -330360 -256901 329835 558699 278337 59406 184618 446118
38238 446118 732179 1020365 934938 134133 -882400 -1148035 -519640 99904 -12548 -573023
38228 -573023 -879275 -666501 -153059 283976 270583 -281085 -864234 -797364 -138231 293143
38218B93143k65275m53610J5829L17293k5637m71820l62457J44992M15312K18894
38208a73336q0423n3316L02625N64615L55594j59153m04901j48132J60675O5840
38198D30088j83410n5820L54478M25917l1622m85321m44066n3373K08945P3794
38188B39610l72616p62831o42953N2023P10516O37762l0045m42887j38953M33473
38178c16901O25706L52195o4629l89054n36478m62507k49171q4863j1031Q4628
38168a052105J80667J56456J30703L16237M78469J08387o74535j006937m19765
38159a782423M60643P82298N36873K65795J67734R2534N5429J24260O6856k72988
38149D97011m99412k16576J72561l1666o47866p57194p0321O53321P47563M50600
$$ plain form
38218 293143 27868 -425742 -409913 -92620 -118257 -590077 -952534 -807542 -392230 -173336
38208 -173336 -253759 -307075 -4450 560165 915759 756606 351705 203573 364248 430088
38198 430088 246678 190858 545336 971253 939631 454310 10244 -43129 165816 239610
38188 239610 -133006 -895837 -1538790 -1486767 -776251 -138489 -168534 -611421 -750374 -316901
38178 -316901 308805 661000 596371 207317 -329161 -791668 -1040839 -1125702 -1136733 -1052105
38168 -1052105 -871438 -714982 -584279 -268042 210427 318814 -355721 -1362658 -1782423
38159 -1782423 -1321780 -539482 -2609 263186 430920 523454 578883 703143 769999 497011
38149 497011 -2401 -218977 -46416 -78082 -725948 -1483142 -1553463 -900142 -152579 298021
38139B98021K53378J21110j63632m09776l17849l4021R8720J02052K07430L31436
38129D86869J93779j33561k70105j23468o226q5140j38823l9114p0860m39186
38119f25835p47018m33867L44570P72320M32132j34183k04701J52479L21481J13466
38109i156m9331J16072L66888M15593L18166J90686l3161l28885m60744l83138
38099A42990l64371m46573k47956L25402O65690L00236k74718k58253K58177M97979
38089E98603K27693k6429K1557K2341k17928k99517N7003M35239K99404k29497
38079H88469n65599l87376J08140M80369L81132j64996o63687n79281l5L94643
38069a08221J78684l03371m52755j67444J63209J99419n5335l60247m45273k14868
$$ plain form
38139 298021 551399 672509 508877 99101 -218748 -252769 -154049 -51997 155433 486869
38129 486869 680648 547087 276982 153514 147288 62148 -76675 -115789 -186649 -625835
38119 -625835 -1372853 -1806720 -1462150 -689830 -257698 -391881 -596582 -444103 -122622 -9156
38109 -9156 -58487 57585 424473 840066 1158232 1348918 1315757 986872 526128 142990
38099 142990 -221381 -667954 -915910 -590508 75182 375418 100700 -157553 100624 598603
38089 598603 826296 799867 821424 843765 625837 326320 383323 818562 1117966 888469
38079 888469 322870 -64506 43634 524003 905135 740139 76452 -502829 -502864 -108221
38069 -108221 70463 -232908 -685663 -853107 -689898 -490479 -545814 -906061 -1351334 -1566202
38059a566202J34624L01407K30764J32804J34471J34796N3290k3858l4741n1655
38049e54300r7094n2009J44136L58065M04863K15526j29391m10518l98719j41336
38039f60777K1269o4204r3888J67820L81442J39068k75855k72109O8864J38338
38029d50032j31248j75161J40708K44016j03416l38702n8900L26978L60298K22809
38019C7350J78790N3363j84203o6949M72117N99000j81989r62451o32718L54783
38009c32907N98034j39727o70219k75727L32540L11547n5378o309M48974O09616
37999H20444J44748m59215n10645P8824O67485N78524p9078m83442j37462M56671
37989A076854M85349q2228n60276n44920k99755j60577r0137M1366J46088Q5406
$$ plain form
38059 -1566202 -1431578 -1130171 -899407 -766603 -632132 -497336 -444046 -467904 -502645 -554300
38049 -554300 -651394 -703403 -559267 -201202 203661 419187 289796 -120722 -519441 -660777
38039 -660777 -639508 -703712 -797600 -629780 -248338 -109270 -385125 -657234 -588370 -450032
38029 -450032 -581280 -756441 -615733 -371717 -475133 -813835 -872735 -545757 -185459 37350
38019 37350 216140 269503 85300 18351 490468 1089468 907479 -54972 -687690 -332907
38009 -332907 265127 125400 -544819 -820546 -488006 -176459 -231837 -238146 210828 820444
37999 820444 965192 505977 -4668 74156 741641 1320165 1241087 757645 620183 1076854
37989 1076854 1562203 1479975 919699 374779 75024 -85553 -175690 -134324 11764 97170
37979I7170r6168k34385k04011N3K19690K39696N0837j34423k20818l16770l60667
37968i59796q7360L75694M07492j61226n45178r5639N97162N33931j28691l50038
37958d13649J20212M34078J05022k84637j57734J93188K60835R2883n6008k02300
37948I1890l23402j68090J80336J38737m84134r74824o43894J94396P29466P29549
37938e29970N30003L14928N1256j06350K4880K21672J25898j54339k13059j0400
37928B54519J29578R5507M4844o3611m28622q46624p62043p7093N64241N89768
37918d99536K30981J02923L16186M13173J00698l42449m78409k59199J5299J32950
37908b67383J36041R7310j1617j41743r6023J62877L21378J20483j77591j16521
$$ plain form
37979 97170 1002 -233383 -437394 -437341 -217651 22045 72882 -61541 -282359 -599129 -959796
37968 -959796 -1047156 -671462 -263970 -425196 -970374 -1066013 -468851 65080 -63611 -413649
37958 -413649 -293437 140641 245663 -38974 -196708 -3520 257315 350198 294190 91890
37948 91890 -231512 -399602 -219266 -80529 -564663 -1539487 -2183381 -1988985 -1259519 -529970
37938 -529970 33 314961 366217 259867 284747 506419 632317 477978 264919 254519
37928 254519 384097 479604 524448 460837 32215 -814409 -1576452 -1653545 -1089304 -499536
37918 -499536 -268555 -165632 150554 563727 664425 321976 -156433 -415632 -400333 -267383
37908 -267383 -131342 -34032 -45649 -187392 -283415 -120538 200840 321323 143732 27211
37898B7211J92949J29596m65358q80981m88630K95316N61994K11664J8211L55644
37888d2384N89071J05787o30648o86664j3066N31144M60896K21269K57838K57900
37878A051143j83386o91219n94527K1486M60281M58169L49262K39174j65737p55366
37868A89280q56274k29826M52225N49039K68139J11740J05674P2030Q3365J00494
37858H45886k38540q50519q90397P744Q24527M91862m16013n24799J99509N35019
37848a5721Q9217j97682J78411M88526K30300K7215L40020M74793j86654r30272
37838D98153p43426Q8979M81592J60517k27432k82242j69732K4866L68290N83123
37828G82688K69829l74322p14054n43120k19141k051J49443J87617J0642j21169
$$ plain form
37898 27211 220160 349756 -115602 -996583 -1485213 -1189897 -627903 -416239 -398028 -42384
37888 -42384 546687 652474 21826 -664838 -677904 -146760 314136 535405 793243 1051143
37878 1051143 867757 176538 -417989 -396503 63778 521947 871209 1110383 944646 189280
37868 189280 -666994 -896820 -444595 104444 372583 484323 589997 662027 745392 845886
37858 845886 607346 -243173 -1133570 -1125826 -301299 190563 -225450 -750249 -550740 -15721
37848 -15721 73496 -124186 54225 542751 773051 800266 1140286 1615079 1428425 498153
37838 498153 -245273 -156294 325298 485815 258383 -23859 -193591 -168725 199565 782688
37828 782688 1052517 678195 -35859 -578979 -798120 -800171 -650728 -463111 -452469 -573638
37818e73638J69380O62611O84460Q2703n07779n44865j99491J06165K72183L50466
37808E02195K47396l9160k07805n4008J35425m4543m75736o10386k06005L28846
37798d23781M28704L6857l63021l20875J00661M47673L84626m792l83034m97328
37788e94310l29409k8762K19391L11623K75714K02191J46272J26253J43879J27223
37778F00065l6565k80855l26750q9750O1612j98652n54523m36706M9106K05594
37768a007424j31905k48619L18617R40182P57890o1755o07600m89758j35763O8729
37758e97406K33418M54427M51052N274n79030p49072l20787L12216N50431J89160
37748e0317l03918k54188L72680Q41367N93777J5089j62772L9862l3822n27992
$$ plain form
37818 -573638 -404258 258353 942813 1025516 517737 -27128 -226619 -120454 151729 502195
37808 502195 749591 710431 502626 448618 584043 539500 63764 -546622 -752627 -423781
37798 -423781 4923 41780 -321241 -642116 -541455 -93782 290844 286052 -96982 -594310
37788 -594310 -923719 -952481 -733090 -421467 -145753 56438 202710 328963 472842 600065
37778 600065 563500 282645 -44105 -133855 -72243 -270895 -825418 -1262124 -1213018 -1007424
37768 -1007424 -1139329 -1387948 -1069331 -129149 628741 566986 -40614 -530372 -666135 -597406
37758 -597406 -363988 90439 541491 546765 -32265 -781337 -1102124 -789908 -239477 -50317
37748 -50317 -354235 -608423 -235743 605624 1199401 1214490 1051718 1091580 1057758 529766
37738E29766p60427k89133L31149L23768j79606l54479J11403N85535L82184l17572
37728C62588p20088m14525J98795M93968L62167J74060J55391J29517o0203j97682
37718D83988l0194K19305L9371o32266j156428q68098J20724R82444J034999M10428
37708F04273j89435k97780q9589J1501q8445j57414r2568o7010j70612j82461
37698g19540J07538N07041N82851J97237k86060l95304q2703K17276R2984l38136
37688a16816n57438k97149J28419K71264J24624P476L7194N6571K1344Q9235K84512
37677D9236M01432L16483J16982j25219l98108n19086k32172L23236N88114K46111
37667G67009l44749n88229l24544R4081K39553M865l02033k42378K15134N38142
$$ plain form
37738 529766 -230661 -519794 -188645 135123 -44483 -398962 -287559 297976 680160 362588
37728 362588 -357500 -772025 -573230 -79262 282905 456965 612356 741873 681670 483988
37718 483988 453794 673099 712470 80204 -1076224 -1944322 -1823598 -841154 193845 604273
37708 604273 414838 117058 27469 38970 -49475 -206889 -299457 -366467 -537079 -719540
37698 -719540 -612002 -104961 477890 675127 389067 -6237 -88940 128336 221320 -116816
37688 -116816 -674254 -971403 -842984 -571720 -447096 -439620 -402426 -345855 -324511 -235276 49236
37677 49236 450668 767151 884133 758914 360806 -158280 -390452 -67216 520898 767009
37667 767009 422260 -165969 -490513 -396432 -156879 -152014 -454047 -696425 -481291 56851
37657E6851L01606j30597o6097M52115O61504K34793k57069k77744o9054q5037
37647H21271k58174k94206k30749k24972j74150M908Q3776o7691j56083K8533
37637d67537J81128Q511k26573j77598r235O989M4685K66280K74841k46308p41749
37626a086566m67937L09832O77378M36654J96326K01320O0659k81995k93632J51531
37616i6430L88187j1121n21280m42600J42067O26433O73569L59586j12703m74043
37606E31665m48075p8039K14377J28353j67521l51977l57952k77426j16613J24526
37596g98682L05586K86177J21061j841N1493K62439M53573M06473J01048k22221
37586I65106l49630l20722k47582j21086J9050n473j70154j26486K38346M61855
$$ plain form
37657 56851 358457 227860 161763 613878 1275382 1510175 1253106 975362 906308 821271
37647 821271 563097 268891 38142 -186830 -360980 -356072 -272296 -339987 -496070 -467537
37637 -467537 -286409 -277898 -504471 -682069 -691304 -684315 -639630 -373350 -98509 -344817 -1086566
37626 -1086566 -1554503 -1244671 -567293 -130639 65687 267007 327666 45671 -247961 -96430
37616 -96430 291757 280636 -240644 -683244 -541177 85256 758825 1118411 1005708 531665
37606 531665 83590 5551 219928 348281 180760 -171217 -529169 -806595 -923208 -798682
37596 -798682 -493096 -206919 -85858 -87699 -36206 226233 679806 1086279 1187327 965106
37586 965106 615476 294754 47172 -73914 -54864 -60337 -230491 -356977 -118631 343224
37576C43224J66728k77853k93159K0227J49738N4286P9875J99696R2919j49001
37566C86680j55612j4779j02550k85205j30139J81834Q0569l13932l50689p0021
37556g73844j20778l86451j6192Q90276J059889Q1802p39949m00410K65150J26573
37546a3934l54869j19113N51617N70469p7706m47662k56236n1345q111J70434
37536c6456L18466K470m50524l09765K40996L29857r9157k48946L9022Q0374k03366
37525c37029k6046O96005Q97647R6337o93759n53842l0817q641k27869r092L56181
37514A59075J33272m62300n68308q5798K70253J81945L9430R0646J26308L8888
37504g6589j9145n8132k10736k97510l5662L69659M40981J69919m3953p8138q3354
$$ plain form
37576 343224 509952 232099 -61060 -40833 108905 163191 243066 442762 535681 386680
37566 386680 231068 216289 113739 -171466 -301605 -119771 -39202 -353134 -703823 -773844
37556 -773844 -894622 -1281073 -1297265 -406989 652900 734702 -5247 -405657 -140507 -13934
37546 -13934 -368803 -487916 63701 634170 556464 108802 -147434 -198779 -206890 -36456
37536 -36456 282010 284480 -166044 -475809 -234813 95044 -4113 -253059 -214037 -133663 -337029
37525 -337029 -363075 332930 1230577 1326914 633155 79313 48496 39855 -188014 -197106 159075
37514 159075 292347 -169953 -738261 -824059 -553806 -371861 -332431 -241785 -115477 -76589
37504 -76589 -95734 -153866 -364602 -662112 -697774 -328115 112866 282785 238832 160694 77340
37493G7340K9476L54978M34187j52894p48722k84422R30708J328174L49134o74791
37483A643168n55569O6208L1367m25047l44244J44374J25949l83382m55213J15635
37473c6754N17990L46418R3346L0335k22164o85233p07232j18402L25249J78387
37463b78060O279K47664L68422p0321m17770K2036O97639O42969L6549k10464
37453A044943j4245o4019m31164m62468n4550J39670p6499j36084J34044J45775
37443B25403k57188l15389L22389P67383K18609o50287o27542K08996O53793J65126
37433G11293n02496n24255k2590L83607M07725J62007j45075k74180n6062L07032
37423D47006L30945r6117m19020j03420N73779Q12928L19575l44417n25114k50651
$$ plain form
37493 77340 106816 461794 895981 743087 -5635 -290057 640651 1968825 2317959 1643168
37483 1643168 1087599 1153807 1185174 760127 415883 560257 686206 302824 -152389 -36754
37473 -36754 481236 827654 921000 951335 729171 43938 -663294 -781696 -456447 -278060
37463 -278060 -271781 -24117 344305 273984 -143786 -121750 575889 1218858 1255407 1044943
37453 1044943 1030698 966679 535515 73047 18497 158167 81668 -54416 79628 225403
37443 225403 -31785 -347174 -24785 742598 961207 310920 -316622 -107626 546167 711293
37433 711293 208797 -315458 -338048 45559 453284 615291 470216 196036 139974 447006
37423 447006 777951 681834 262814 159394 733173 1546101 1865676 1521259 996145 745494
37413G45494k4995r4624k41629k19022o2190Q2636J75806K21192J88299J15586
37403H86553J15257J58983M9360k43955m14899k05460J77315K68580q5787n49092
37393A56855o45747j93989N07695Q44261M25226m06524q32617m87502J43536M42695
37383d6111L94216K79843Q6362k43790l46098O8581M91550K18560m28213m25189
37373D9711L10138O38730m6425p91456n18877L22601N02419j15883n13122j46315
37363c08479L94254M66865K16475K3077j54930m37861n64196k87810J09026K00409
37353c43170R3215K17900N51530N73848O7596m99032o04216l38302j37213r5074
37343e12918O2987L98042N61162L00906j27455k62430J1167L80140M70991J74675
$$ plain form
37413 745494 720499 625875 384246 165224 103034 185670 361476 582668 770967 886553
37403 886553 1001810 1160793 1210153 966198 551299 345839 523154 791734 705947 156855
37393 156855 -488892 -682881 -175186 669075 1094301 687777 -144840 -632342 -488806 -46111
37383 -46111 348105 627948 714310 470520 124422 193003 684553 903113 474900 49711
37373 49711 359849 998579 952154 160698 -358179 -35578 466841 350958 -162164 -308479
37363 -308479 85775 552640 769115 792192 637262 199401 -364795 -652605 -543579 -343170
37353 -343170 -249955 -32055 519475 1093323 1160919 661887 57671 -280631 -417844 -512918
37343 -512918 -449931 -51889 509273 810179 682724 420294 431461 811601 1282592 1457267
37333A457267k90324n27626l01351J49519K77228j33728o30391o00132j3522N59147
37323e3913O07818J52142l91215n95552l12905K10677N06138L31780o7154k84025
37313A03791k44636j75612j76568j14376N5568J51106M5265j14530r3436J27169
37303d36259L21214K62103k2576k45257j70301Q1778J94301J22758J40686L23489
37293E71936L23765q4669n30856m84832o354L21259J53212k25543k83836J50874
37283i5044O61931O13338p9237o39033l26256M02508L67348n36851r89348k28254
37273h48898O65245M39166l15973k03892N97085O76825j54215n86928j38781Q6510
37263B16144m79980p46133R2113R89422O87595k65051n09648k0655J71684j83092
$$ plain form
37333 1457267 1166943 639317 337966 487485 764713 630985 594 -599538 -613060 -53913
37323 -53913 553905 706047 314832 -280720 -593625 -382948 123190 454970 387816 103791
37313 103791 -140845 -316457 -493025 -607401 -551833 -400727 -355462 -469992 -563428 -436259
37303 -436259 -115045 147058 124482 -120775 -291076 -209298 -14997 107761 248447 571936
37293 571936 895701 811032 280176 -204656 -211010 110249 263461 37918 -245918 -95044
37283 -95044 566887 1180225 1100988 461955 135699 538207 905555 368704 -620644 -848898
37273 -848898 -183653 255513 -60460 -264352 332733 1009558 855343 268415 129634 216144
37263 216144 -263836 -1009969 -917856 71566 759161 494110 -15538 -36193 135491 -47601
37253d7601l94542j83467O0163J83992L31658K77039k37743o85793l68045L17609
37243g46730L74396j37661k22494K52645L02710l24828n09530L55942J150375
37234D94825O81531m56464q24391k25754L29044K94178M5537j23319l43061n09442
37224f37316k85049J22505Q9264l41329l87272J87399O03656L11667j42484r4532
37214e73491J62358O2409j18579J87485O09845K80692o30009r63464k93199M65037
37204h10916M92375J31440J7916N4726o6061q0000K87547N47838J22185n96756
37194A00294p30110k06384K64676L30843K78019K71373J41405p2186j19623r8744
37184A59563k91598m72339j82365K97979J73218n22719p71752r3380P03494P73446
$$ plain form
37253 -47601 -442143 -625610 -565447 -381455 -49797 227242 -10501 -696294 -1064339 -746730
37243 -746730 -372334 -509995 -732489 -479844 -177134 -501962 -1011492 -655550 494825
37234 494825 1176356 719892 -104499 -330253 -1209 292969 338506 215187 -127874 -637316
37224 -637316 -922365 -799860 -710596 -1051925 -1439197 -1251798 -648142 -336475 -478959 -573491
37214 -573491 -411133 -348724 -467303 -279818 330027 610719 -19290 -982754 -1275953 -810916
37204 -810916 -318541 -187101 -169185 -114459 -180520 -260520 27027 574865 697050 100294
37194 100294 -629816 -836200 -571524 -240681 37338 308711 450116 377930 258307 159563
37184 159563 -132035 -604374 -786739 -488760 -315542 -838261 -1610013 -1703393 -999899 -226453
37174b26453L83884J86531J03170k60736o43085m60659J48173M34892J39254k01067
37164c96096j07819K15905L05009J04695m0481O3653J76330O652k53368j23372
37154d8892L49207M49157j38378o05619p9702R26412J064353Q5130p94455o33941
37144E73272J17208O02556P21418Q18892J056352J634470K811987M041451L885714
37135A6263320J656998j408344l398421l680043k929046j848978q05927k65376
37127C584183m82292q77549o46590N8050L63227K7316k96001j96175o8805l06860
37117A158504o22571n36564r3549K45875J90916j02636k21842O6871M75388M26977
37107I87369j90512p24022n00440L15553R33016Q42395J95775n39071r45983q20330
$$ plain form
37174 -226453 157431 343962 447132 186396 -456689 -917348 -769175 -334283 -195029 -396096
37164 -396096 -503915 -288010 16999 121694 81213 144866 321196 327848 74480 -48892
37154 -48892 300315 749472 611094 5475 -74227 852185 1916538 2001668 1207213 573272
37144 573272 690480 1293036 2014454 2833346 3889698 5524168 8336155 12377606 16263320
37135 16263320 17920318 16511974 13113553 9433510 6504464 4655486 3849559 3584183
37127 3584183 3101891 2224342 1577752 1635802 1999029 2026345 1730344 1534169 1465364 1158504
37117 1158504 535933 -631 -94180 151695 342611 239975 18133 85004 560392 987369
37107 987369 796857 72835 -427605 -112052 820964 1663359 1859134 1320063 374080 -446250
37097d46250l20122J09866K10054J68049K12605K12294j6134k63788j92915J15491
37087b10850K53053M1954k86835m09113k08906J47442L42257K55764J66839L25485
37077D17090M22333l104o52068o70121Q1263P16098N96339J53653J6841P3800
37067A152124m1734k07287j78245j21146j94453j51061J01810J54060j53928l04484
37057E5656n039K31496M3535q1846J82136K14244l99718q44215l31595M63546
37047d71800M88494N4050R8610M19008K00827k50350j7856N56934L11218n88311
37037H00824p62433M5162N60153J76946j92558O2176K55482j03162l40035L9751
37027E42306L48678m9015n92317n07967m2875J25621k7419j24752j02652n9689
$$ plain form
37097 -446250 -766372 -656506 -446452 -278403 -65798 146496 130362 -133426 -326341 -210850
37087 -210850 42203 84157 -202678 -611791 -820697 -673255 -330998 -75234 91605 417090
37077 417090 839423 836319 184251 -485870 -404607 311491 907830 1061483 1078324 1152124
37067 1152124 1110390 903103 724858 603712 409259 258198 360008 514068 360140 55656
37057 55656 50617 282113 325648 243802 425938 640182 240464 -603751 -935346 -471800
37047 -471800 16694 70744 169354 588362 789189 538839 520983 1077917 1389135 800824
37037 800824 38391 83553 643706 820652 628094 690270 945752 842590 502555 542306
37027 542306 890984 841969 249652 -258315 -301190 -175569 -202988 -327740 -430392 -490081
37017d90081P5115K68075K89882J69213J51542J03480k73792o02308j98136O08023
37007A01013O87208j08317o39136l23043N2094j10101k30834J24485K96431j68868
36997c19068n19716j45461K39208r1340m63967m574P10663O15063q633j17901
36987a05726K46348J97136l09918m86149j99285p9031k14255l5432M61401N57849
36977C2938K9981m86747n03632j90045J89578N28969N65512J48753k01969J14599
36967B27937O75017M90077l93636q25366k95442L33375K55183j26908r9930J47904
36957C88211J3032l81246l69805J60386N75282L86027j64685m94977l55907l980
36947b47662J58582L0284j19786l6989J77511K55191J75264J34459J51154J4568
$$ plain form
37017 -490081 -414966 -146891 142991 312204 463746 567226 293434 -308874 -507010 101013
37007 101013 788221 679904 40768 -282275 -230181 -340282 -571116 -446631 -150200 -319068
36997 -319068 -838784 -984245 -745037 -836377 -1300344 -1304918 -594255 20808 12175 -105726
36987 -105726 140622 337758 27840 -458309 -657594 -736625 -950880 -986312 -524911 32938
36977 32938 62919 -423828 -927460 -1117505 -927927 -398958 166554 315307 113338 227937
36967 227937 902954 1393031 999395 174029 -121413 211962 467145 340237 240307 388211
36957 388211 401243 19997 -349808 -189422 385860 771887 607202 112225 -243682 -247662
36947 -247662 -89080 -58796 -178582 -215571 -38060 217131 392395 526854 678008 692576
36937F92576l13760n34569l84404J8476L37098L99440L06124K26848J77976J8232
36927I44037l05849n25980k30403N93598J335903J306117M75163m94290r37495
36918B160801p50583k96683L2500Q2258p2552k30676j88218Q5986L32090J86380
36908A341303l55636p57493m91923K30275O23708L17675k17658m30475l89631
36899a29855l58668j90470K44500M67411L6603n09389l00179M06189M81222k70150
36889a22786p14280j71548N15105L57137k68447l50222J86500N64657L96147j7051
36879C75212l64574n55781m43886O242M00142L44503O1650L9628K35573J92810
36869B91519j73031m66992m28380j54352K12126N40877N53244R7018m74243o57323
$$ plain form
36937 692576 378816 -155753 -540157 -521681 -184583 214857 520981 747829 925805 944037
36927 944037 638188 112208 -118195 475403 1811306 3117423 3592586 3098296 2160801
36918 2160801 1410218 1113535 1146035 1228293 1155741 925065 736847 822833 1154923 1341303
36908 1341303 985667 228174 -263749 -33474 590234 907909 690251 259776 -129855
36899 -129855 -488523 -678993 -434493 32918 69521 -439868 -740047 -333858 147364 -122786
36889 -122786 -837066 -1008614 -493509 -136372 -404819 -755041 -568541 -3884 392263 375212
36879 375212 10638 -545143 -989029 -982787 -582645 -238142 -176492 -136864 98709 291519
36869 291519 118488 -348504 -776884 -931236 -719110 -178233 375011 472029 -2214 -659537
36859f59537m63964k81716j95888J5930L02705L61230K40447K99643M85919L13493
36849D18262k36456m65103J5560N83414M64016j42954m23316j74748K7598j50137
36839h3864l26301j51093R2058M0296o1238K18886O68464O61414J40206k71323
36829I27505k14500l4003p6247j69649j33403k08022n07075n69968n4730N47141
36819d92951N43461O1681k33585j57944l0089P8209L37006N63008M21400J18201
36809A208397J02969J97699j07527n79878m68916J46838L06609l15506q74797
36800c84112o84837j09983K83483N23761O91238M91344m9599k87817L5343K73891
36790G82712l6264l74597j97949R9212j4756j92060R1447M41714J67185m51371
$$ plain form
36859 -659537 -1123501 -1405217 -1601105 -1585175 -1282470 -921240 -680793 -381150 104769 418262
36849 418262 181806 -283297 -267737 315677 779693 636739 213423 38675 66273 -83864
36839 -83864 -410165 -561258 -469200 -428904 -490142 -271256 397208 1058622 1198828 927505
36829 927505 713005 679002 602755 433106 299703 91681 -415394 -985362 -1040092 -492951
36819 -492951 50510 112191 -121394 -279338 -309427 -231218 105788 668796 1090196 1208397
36809 1208397 1311366 1509065 1401538 821660 352744 499582 806191 490685 -384112
36800 -384112 -1068949 -1178932 -895449 -371688 319550 810894 761295 473478 508821 782712
36790 782712 746448 371851 173902 273114 258358 66298 157745 599459 766644 315273
36780C15273n37171r82M13875L43499J80419K40663L09703J26123k26568m98023
36770F66811m88171j42708K73502K77138k41474p46659o90947j71798L24516N18114
36760d21676L96542O6319j54218P7015N35923N26940j00733o22260n28718k67216
36750d92082l33884l44193K11830Q75792Q08794J19500k92194m7499L30313K75151
36740A111528j93310o46665o34360n9225N41524M56328j77233l92694J64573N80211
36730G50677R4016o21640n19608J62103L92041J8024k20468q0776o0260l23265
36720d09156m29724j88947Q2803K00015K58597J89658j14772l21069l2659M54973
36710c10281N06982J30039j30917j12173q0496m9069J31671J79118k43740p10007
$$ plain form
36780 315273 -221898 -222880 190995 534494 714913 955576 1265279 1391402 1164834 666811
36770 666811 178640 35932 309434 586572 345098 -401561 -1092508 -1264306 -939790 -421676
36760 -421676 -25134 41185 -113033 -36018 499905 1026845 926112 303852 -224866 -492082
36750 -492082 -825966 -1170159 -958329 -82537 726257 845757 553563 506064 836377 1111528
36740 1111528 918218 271553 -362807 -422032 119492 575820 398587 5893 170466 750677
36730 750677 844693 223053 -296555 -134452 257589 275613 55145 -25631 -85891 -409156
36720 -409156 -838880 -1027827 -945024 -745009 -486412 -296754 -411526 -732595 -765254 -310281
36710 -310281 196701 326740 195823 83650 3154 -45915 85756 264874 21134 -688873
36700f88873n23854Q7111K70303l8616q9779K65305L09058j63388l70008J02866
36690h39875N24152K26229k79290j48786M52674O52423J69653m01291n02962k46440
36680c93513m5008J9384K12322N87426P02521J91248n22156o15272n5897K61855
36670C42910j35826n54410k61641L58108N29559L24971K68246K41746j66514o21743
36660C25406m68531N4614J56532j22255m4621L76080L22000l07754n61281L1617
36650b38193O77423N43867j23481n90702o08486l58154l9912J18043m2662k59570
36640i21827r4274L47288M91734J67072k05052l26401k91125j30968K04400M10242
36630c48911J31560k88627j82781L18101M48569J31833R7787N13432O14220O5727
$$ plain form
36700 -688873 -1212727 -1125616 -855313 -893929 -983708 -718403 -409345 -572733 -942741 -839875
36690 -839875 -315723 -89494 -368784 -517570 -64896 587527 757180 355889 -147073 -393513
36680 -393513 -438521 -419137 -206815 380611 1083132 1274380 752224 136952 81055 342910
36670 342910 207084 -347326 -608967 -250859 278700 603671 871917 1113663 947149 325406
36660 325406 -143125 -88511 68021 -54234 -98855 277225 599225 291471 -269810 -238193
36650 -238193 439230 983097 859616 268914 -339572 -697726 -737638 -619595 -662257 -921827
36640 -921827 -1016101 -668813 -177079 -10007 -215059 -541460 -832585 -963553 -759153 -348911
36630 -348911 -217351 -505978 -688759 -370658 77911 209744 307531 820963 1435183 1500910
36620A500910l92299j96275J30186k9450l29914j52454L12317M27545R8709k53841
36610A115434l69650k72722k3105K32877K39754k2058k48138k67966k35482k15888
36600f6944l5141K78374L82106J63747n3136m1474K7103l4077j77146l51524n25923
36589d34035m55636K7433N02410L93593p5234j30125K78195L38042k50787o87776
36579d93920k98157M45642O78141K94919j87732m29822m22461k30043r40M7918
36569e96455p2138j14855j0076O3721N5204P6665R2429L5103J05162L88002M14382
36558D37144j29931n46326j7278Q50602O89636m17261q96158j59918M80329N0502
36548C41341n18744j23654N81768L68561m58158o49674r1616K04943j05593l13543
$$ plain form
36620 1500910 1108611 912336 1042522 1013072 683158 530704 843021 1270566 1369275 1115434
36610 1115434 745784 473062 449957 682834 922588 900530 652392 384426 148944 -66944
36600 -66944 -102085 176289 558395 722142 669006 627532 654635 620558 443412 91888 -434035
36589 -434035 -889671 -862238 -359828 33765 -41469 -171594 106601 444643 193856 -493920
36579 -493920 -792077 -346435 331706 626625 438893 9071 -413390 -643433 -644373 -596455
36569 -596455 -668593 -783448 -793524 -729803 -674599 -597934 -505505 -470402 -365240 22762 437144
36558 437144 307213 -239113 -256391 594211 1283847 866586 -29572 -189490 290839 341341
36548 341341 -177403 -301057 280711 649272 191114 -458560 -550176 -345233 -450826 -764369
36538g64369l8495K09701N3546j40489L838K39176J60678j48446k66277j3021
36528g04158L27369L34918l2564l26830j65663K04669K45670m6722j55938Q7009
36518b32240K54124R5955o5259J5036P8338o0940r6833J84871M16737K05787k38857
36507E56719m67910m17609k85986j28074O2226J69217J54563J56295J89261Q5288
36497G3990j24797j82597p8262p7205j64134k6931K76137K86711k7421j30158
36487a74667J33774K10737j61396l95225k5437M39828K73179l73226p44242n02517
36477a319192M5045M59498N05392K27994k7474N7802K97415K23042j57077l38827
36467b6382j30287J21104J92155K13233J58979j45330m32562k52701R6472j14811
$$ plain form
36538 -764369 -802864 -593163 -539617 -680106 -676268 -437092 -276414 -424860 -691137 -704158
36528 -704158 -376789 -41871 -74435 -401265 -566928 -362259 -116589 -163311 -319249 -232240
36518 -232240 21884 117839 52580 67616 145954 85014 -11819 173052 589789 795576 556719
36507 556719 88809 -328800 -614786 -742860 -680634 -511417 -356854 -200559 -11298 73990
36497 73990 -50807 -233404 -311666 -388871 -553005 -579936 -303799 -17088 -44509 -174667
36487 -174667 -40893 169844 8448 -386777 -412214 27614 300793 -72433 -816675 -1319192
36477 -1319192 -1274147 -814649 -309257 -81263 -108737 -50935 246480 469522 312445 -26382
36467 -26382 -156669 -35565 156590 369823 528802 383472 -49090 -301791 -205319 -320130
36457c20130o67851n00824M99814J097367O30580L6069J75683M05943j49364r78161
36447B29126j030475l77045J63818M05552O52197P21630K54415l79920n17961
36438A21337k43243j02692j28993O21K00640K14806K29654M19826L31206l64197
36428F78965r44710n17880M97632Q56003K68672l56818l83285j09653P3523K14288
36418B76737L09810J32429k17732k85497o632J41521m7209j37012K08759O04953
36408I80127M59658j58006n50467k63779L25573M45475j05398o67656n59197M1927
36398e1743L98836K07493j88273m40691m81638k32071L16360P23934M95397j09521
36388F38083l67189j93887j31923k29537M5356O27091P19240J64408k00909q088
$$ plain form
36457 -320130 -987981 -1488805 -988991 108376 738956 775025 950708 1356651 1207287 229126
36447 229126 -801349 -1178394 -1014576 -609024 43173 764803 1019218 639298 121337
36438 121337 -121906 -224598 -353591 -352970 -152330 62476 292130 711956 1043162 678965
36428 678965 -265745 -783625 -285993 570010 838682 481864 98579 -11074 62449 276737
36418 276737 586547 718976 501244 215747 209115 350636 303427 166415 375174 980127
36408 980127 1439785 1281779 731312 467533 793106 1238581 1133183 465527 -93670 -51743
36398 -51743 347093 554586 366313 -74378 -556016 -788087 -471727 252207 747604 638083
36388 638083 270894 77007 -54916 -284453 -239097 387994 1107234 1271642 1070733 1062645
36378A062645J4883n24563q34263l28708K59739J30069k28547k164M88185M45827
36368D83103K6137n8541J62924J25864j63682k44349j10326j12647k35258k37562
36358c64337j90836j96346L50M47260N69591N0259m34466j70071M43462N50672
36348G05538J48761j54451k31134l54250m01780o3262M16064N15896K47463m288
36338H24557j59781l30718l66932j38466Q0203O2922N1266K13028K12227j39969
36328C08337m01373k35822J0797M3529J78181N30089M94350j70914n96822q2239
36318G8113O47415M82677m11382r86778q12218k58480K72305M63572L1275o59704
36308a153205o27346L09061R91740O36159O0482J87347M36670p2633p46385m94371
$$ plain form
36378 1062645 1077528 552965 -281298 -610006 -350267 -220198 -448745 -450909 37276 483103
36368 483103 509240 450699 613623 739487 575805 331456 221130 108483 -126775 -364337
36358 -364337 -555173 -751519 -751169 -303909 265682 315941 -118525 -288596 154866 705538
36348 705538 854299 699848 468714 114464 -287316 -350578 65486 581382 828845 824557
36338 824557 664776 334058 -32874 -171340 -91137 -28215 23051 236079 448306 308337
36328 308337 -93036 -328858 -318061 -274532 -96351 433738 928088 757174 160352 78113
36318 78113 725528 1208205 796823 -189955 -1002173 -1260653 -988348 -524776 -493501 -1153205
36308 -1153205 -1780551 -1471490 -479750 156409 216891 404238 840908 768275 21890 -472481
36298d72481L10013M62175p4920l67520k13929j32768q9391K72761N33053J03622
36288C30615m56498k26227L77901K49421m15378m37015K52199N39401J14737j45477
36278A83679J09178J97062j39165k33680J81045M36797J26006k42487j66495J56541
36268F08481L42320K92138K2546l38150m29637j36155N8244j80020l67362m0360
36258a67955L05220L6014m47682m06746l8243O9096J22680N15250O73523m6378
36248F14779q72401n96217L82011O22722l2704l91183j8062K67484N7802o5064
36238c0833J89877L52953K13187J03973O3270j78193l91575j44826K13669J2728
36228D04230m76049m21812J22015L79501K16935R2048o1764n58636q83210l40073
$$ plain form
36298 -472481 -162468 299707 224787 -142733 -356662 -489430 -578821 -306060 226993 330615
36288 330615 -125883 -352110 25791 275212 -140166 -577181 -324982 214419 329156 183679
36278 183679 292857 489919 350754 117074 298119 734916 860922 618435 451940 608481
36268 608481 950801 1242939 1265485 927335 497698 361543 419787 239767 -127595 -167955
36258 -167955 137265 173279 -274403 -681149 -719392 -650296 -527616 -12366 661157 614779
36248 614779 -257622 -853839 -471828 150894 118190 -272993 -291055 -23571 34231 -30833
36238 -30833 159044 511997 725184 829157 892427 714234 322659 177833 391502 404230
36228 404230 -71819 -493631 -371616 7885 224820 316868 255104 -303532 -1186742 -1526815
36218a526815M85714M28074l18952n20841J0987K90197M5058N6732N08820O13747
36208G2721J33119j77702O6164L25759J78617j70111m92326o74726l94313L60458
36198g72340P90359L59308j71537L7821L90646j5165n72476k19294M67486K16873
36188E11681n49893m39722L22497L33307l27260l07589L41756K54721m85717l12287
36178f58506Q24127J078445p5750q15714k8194R36625O51833k71818o14984l96680
36168F29384j96298l2074J61333J12898r4496j9197J47117j84657o68391l72983
36158e17364M60891O07160r9588n63970l77809k40793l25783k1717N41008N16170
36148b1795L2750N0677M72395L12331k44132m3087P16407O03951m06232p35061
$$ plain form
36218 -1526815 -1041101 -613027 -931979 -1452820 -1441833 -1151636 -1106578 -1049846 -541026 72721
36208 72721 205840 28138 94302 420061 598678 428567 -63759 -738485 -1132798 -772340
36198 -772340 18019 377327 205790 243611 634257 619092 46616 -172678 294808 511681
36188 511681 -38212 -477934 -155437 177870 -149390 -456979 -115223 139498 -346219 -658506
36178 -658506 165621 1244066 1168316 352602 324408 1261033 1912866 1641048 1026064 629384
36168 629384 433086 401012 562345 675243 580747 561550 708667 524010 -144381 -517364
36158 -517364 -56473 550687 451099 -112871 -490680 -731473 -1057256 -1078973 -537965 -21795
36148 -21795 10955 61632 534027 846358 602226 559139 1275546 1879497 1473265 738204
36138G38204K5173M52833j14201n96324l36121p9053k27213j77951J20259j2177
36128b06571k95636K30657J040287O07443p09144q76978L41830R01885L2105n80284
36118D85594J1007M91252M0736j53320N73317R01500J3258q00651m26286L01772
36108A438179L96337K59179K74974j20952q89880q97773K8999N32600O9472k31602
36098H59533J53449J90882n44897r33343l95381J63865K04223K57678L11042k66574
36088D77q60134j68247J121225R70104m48938q54539J81106O70074K3936j28408
36078E06656M63691M6909j316995j243461N47071J298140M5725p02320L34041
36069b0543J000704N0123m93639N28435R92650l73857j368574m03304N55478j73303
$$ plain form
36138 738204 763377 1216210 1102009 505685 169564 90511 -136702 -314653 -194394 -206571
36128 -206571 -502207 -271550 768737 1376180 667036 -209942 131888 1033773 1065878 485594
36118 485594 496601 987853 1028589 875269 1448586 2350086 2363344 1562693 1136407 1438179
36108 1438179 1834516 2093695 2368669 2247717 1357837 460064 489063 1021663 1091135 859533
36098 859533 1012982 1203864 658967 -274376 -669757 -505892 -301669 -43991 267051 477
36088 477 -859657 -1027904 93321 1063425 614487 -240052 -58946 611128 635064 506656
36078 506656 970347 1017256 -299739 -1543200 -996129 302011 347736 -354584 -20543
36069 -20543 980161 1030284 536645 1065080 2057730 1683873 315299 -88005 467473 294170
36059B94170q61851R1607R97464J59894r21100m90012L77582K92912J25042N75314
36049F41022L34205r40535j116308N40894J443458R2199j171487l79882P53250
36040A96816M02557j64020L31013N45628l48484o02094M85043P49732n68362r38161
36030H9668O09420J283022k06250j055346J64042O57478r16159j451546N02849
36021c22822J430599n51824j743742K59359J827257J00267j608014k66334J164728
36012B89474j41410j218848N39531J792943k15741j825259J21180J935081J62411
36003A439362j609283J53698J867498M3866j541294N35855K030440o08131k448564
35994a36553O44778L260090M14845k455660K07262L004586J13857k748926O27062
$$ plain form
36059 294170 -567681 -476074 521390 681284 -239816 -729828 -352246 -59334 65708 641022
36049 641022 975227 34692 -1081616 -540722 902736 994935 -176552 -556434 196816
36040 196816 599373 435353 766366 1311994 963510 361416 846459 1596191 1027829 89668
36030 89668 699088 1982110 1775860 720514 884556 1542034 625875 -825671 -322822
36021 -322822 1107777 555953 -1187789 -928430 898827 999094 -608920 -875254 289474
36012 289474 148064 -1070784 -531253 1261690 1045949 -779310 -658130 1276951 1439362
36003 1439362 -169921 -16223 1851275 1895141 353847 889702 2920142 2312011 -136553
35994 -136553 508225 3768315 4183160 1727500 1934762 4939348 5053205 2304279 2931341
35985B931341M047808P70809k434564J773285N853043J846648j428745M769490
35977A8129115R318233J813435k833104J0097839K1814622J1329202N479137M4480578
35969A19629057R9740178Q9324372m983976r5196301r7945223l9279535k689587
35962F8598985j1875757k2861763r965802L374595j687038r263190m393267J893545
35954A3820308j471814n422340j381703K453793j013414m011588j51475L183747
35946F005514k17893l664885j017123K120450J96006k007223J48893K021316m92939
35937C092116k658991l97705J799662q1179j940979p4981J582864l95344k025816
35928a100353J10377K046818K02926j694495K374J842967J61453j868427n36648
$$ plain form
35985 2931341 6979149 7749958 5315394 7088679 12941722 14788370 13359625 18129115
35977 18129115 27447348 29260783 26427679 36525518 58340140 69669342 75148479 119629057
35969 119629057 219369235 308693607 303709631 208513330 110568107 71288572 68598985
35962 68598985 56723228 33861465 23895663 27270258 25583220 16320030 11926763 13820308
35954 13820308 12348494 6926154 5544451 7998244 6984830 2973242 2821767 6005514
35946 6005514 5787621 2122736 1105613 3226063 3422069 1414846 1563739 3585055 3092116
35937 3092116 433125 35420 1835082 1753903 -187076 -262057 1320807 925463 -1100353
35928 -1100353 -989976 1056842 1259768 -434727 -432353 1410614 1572067 -296360 -833008
35919h33008J408814M19656j129598o6084J283130l9345j626412m45940J247729
35910B18942L82333j097264k85287J109145M56581o42490J01984R70539j19752
35901A094731j190572q4912J110949R2775j110501j70618Q73202l28676j554786
35892a268408q7765J918414J182918q26456q03369N14178L62822p09652m04934
35883a22252O48018M07381l89726Q9665Q23993j20059j518848r63778P52448J112026
35873G18868J76048k46673j55428n54606o94829M22830J357999M22354j014246
35864D32317p27684M59126L50799n98288m09358O01086N74682l57351n34539R2336
35854a16874K20245j96074k14503O1278L1437J23392O54996N60564o32023j228044
$$ plain form
35919 -833008 575806 995462 -134136 -200220 1082910 1043565 -582847 -1028787 218942
35910 218942 601275 -495989 -781276 327869 784450 141960 243944 1214483 1094731
35901 1094731 -95841 -180753 930196 1022971 -87530 -258148 615054 286378 -1268408
35892 -1268408 -1356173 562241 1745159 918703 115334 629512 992334 282682 -122252
35883 -122252 525766 933147 543421 633086 1457079 1337020 -181828 -1145606 -393158 718868
35873 718868 894916 648243 492815 -61791 -756620 -333790 1024209 1446563 432317
35864 432317 -295367 163759 514558 -83730 -493088 107998 682680 325329 -209210 -116874
35854 -116874 103371 -92703 -307206 -245928 -214491 -91099 563897 1124461 492438 -735606
35844g35606m7149J172240N52480o58332l70211O62287M69343m75905m15719K57579
35834D11007o6017r64981p89963J97559M45206L9489K00932O64453L16236l25569
35824A28352L2999Q39745N56562n22097q43975l46248j79106l39408J3532N16088
35814a43556K18364l84441j89573L34746L1251o37534m18794L42934M13622J8267
35804d14714K06630O16835J84052o08892m90696K35828L34484l7012J16050M50743
35794E93308k8385p83261n69562J84264J54788l54671n9096P29443O25247j97818
35784B94257l43433K10345K54183k33630j89357K81125J02872n18915l65609M29926
35774g8236N46050j15196l75594k6076L0318k49404p2836L37327O0987n23216
$$ plain form
35844 -735606 -782755 389485 941965 283633 -86578 575709 1045052 569147 153428 411007
35834 411007 344990 -619991 -1409954 -1212395 -767189 -727700 -526768 137685 453921 128352
35824 128352 161351 1001096 1557658 1035561 191586 -154662 -333768 -673176 -659644 -143556
35814 -143556 74808 -309633 -499206 -164460 -133209 -770743 -1189537 -846603 -432981 -414714
35804 -414714 -208084 408751 592803 -16089 -506785 -270957 63527 26515 142565 593308
35794 593308 564923 -218338 -787900 -603636 -448848 -803519 -862615 -133172 492075 294257
35784 294257 -49176 161169 415352 181722 -7635 273490 376362 -142553 -508162 -78236
35774 -78236 467814 352618 -22976 -49052 -18734 -268138 -340974 -3647 57340 -465876
35764d65876k51359M95890K73422p23585q30060J61149O60169R8310k91434R2620
35754g80754K96833j26077k70772K38585M57960q4968n38538l11378N7085J41050
35744i20974K60804M49209K32664k20495j52611L52917M23940o192j68125m1415
35734B09722l00549o57842j23111R31461R55575j79397p82274r7396N36672O5517
35724E58378o30496m75190O1458R8267j27267R691L27326L70189K64675K43937
35714G00968J18246j55463j85076O3256L1576m11158n99418j79816K77255K36579
35704a03051l7258r8392L9203K29200M63208N57559K47799k53268m66393m21103
35694A57504m74525m78748l8808N32238N52578J63474P3423K18950p8564o59357
$$ plain form
35764 -465876 -717235 -221345 52077 -671508 -1501568 -1340419 -680250 -581940 -873374 -780754
35754 -780754 -483921 -609998 -880770 -642185 -184225 -269193 -807731 -1119109 -1062024 -920974
35744 -920974 -660170 -210961 21703 -198792 -351403 1514 425454 419262 251137 209722
35734 209722 -90827 -748669 -871780 59681 1015256 835859 53585 -43811 492861 558378
35724 558378 -72118 -547308 -485850 -387583 -514850 -505159 -177833 192356 457031 700968
35714 700968 819214 663751 478675 541931 573507 162349 -437069 -616885 -339630 -103051
35704 -103051 -140309 -238701 -199498 29702 492910 1050469 1298268 1045000 578607 157504
35694 157504 -317021 -795769 -834577 -302339 250239 413713 487136 706086 627522 -31835
35684c1835n97290J48830N28191J04094l43340k47572k6708m4832m421K14362
35674c00521K32723O2209K06848N58059L60107l77919o72641j89782J87997o8065
35664i85k78837O5246L18858q9824n44575l02960K29508K64015n1101m7784K50568
35653a87871K70503o5299k46122k3797K47599J55485k26263m25484j62286K05900
35643d57635J03187l10573j81461O45863J039370J99557q65379o81841M10915
35634i7997P85050N4004n32037k52971J53756O0304q3245J24096K86793J74709
35624F72462K04773M00085R7191p01760r45066k26307L81258N4510m19173p4801
35614e56828N20604K78019n00620o21233M0840M36603Q3516k94909m3432M53879
$$ plain form
35684 -31835 -629125 -480295 47896 151990 -191350 -438922 -465630 -510462 -514883 -300521
35674 -300521 -67798 -5589 201259 759318 1119425 741506 68865 -120917 67080 -985
35664 -985 -279822 -214576 104282 14458 -530117 -833077 -603569 -339554 -390655 -438439 -187871
35653 -187871 82632 17333 -228789 -252586 -4987 150498 -75765 -501249 -663535 -457635
35643 -457635 -354448 -665021 -846482 -200619 838751 1038308 172929 -508912 -97997
35634 -97997 687053 741057 209020 -43951 109805 170109 86864 210960 497753 672462
35624 672462 877235 1277320 1374511 672751 -272315 -498622 -117364 -62854 -482027 -556828
35614 -556828 -36224 241795 -258825 -880058 -839218 -402615 -319099 -614008 -657440 -203561
35604b03561M62673j9236l11021R509N35473N17486j60101p64148o53921j24322
35594g11169R9740o0915o9810K59259N09270L87220Q3701j39528j72973Q7175
35584B71970N26864N85676n7441p22731n01074L24058O13514J15039k50887o052
35574H98936J76796k11420o04564l73357J57104L46440J63502r5698l38482m21887
35564c02630o1934N07159N03721k32332p68652l87063L47620N20797K08164P0256
35554D05106J50887J977l13677k68383J60293L63202L3276l96258m21443j16508
35544d01528J08517R3135J5427L7380J13459J71930K64680L73804K60069j76707
35534H60166n25428l38057Q6122O0183l00397j50234N50535O81608k16088r24637
$$ plain form
35604 -203561 259112 239876 -71145 -61636 473837 991323 831222 67074 -586847 -711169
35594 -711169 -611429 -672344 -742154 -482895 26375 413595 497296 357768 184795 271970
35584 271970 798834 1384510 1327069 604338 103264 427322 1040836 1155875 904988 898936
35574 898936 1075732 864312 259748 -113609 43495 389935 553437 457739 119257 -302630
35564 -302630 -364564 142595 646316 413984 -354668 -741731 -394111 126686 334850 405106
35554 405106 555993 557970 244293 -24090 136203 499405 532681 136423 -285020 -401528
35544 -401528 -293011 -199876 -184449 -147069 -33610 138320 403000 776804 1036873 860166
35534 860166 334738 -3319 82803 142986 -157411 -307645 242890 924498 708410 -216227
35524b16227l84798N25672M18166l14319l13195K94342K00715o14796p75208M1848
35514a137800N45518J13247k79011r640J39899k89967l91810L82259R90223M98431
35504E61349l09809k88987K43636L34661N9106K9651P0122k80042n97521k21918
35494c99752M37878M74533n3740l76924l48816l98327m70687j56469L26989L64496
35484f00819L8558j402L06442L65225L802k52078p7586K34087L47778K49435j4317
35473E99125l89498n93917l68907N7989K30443J09705P548J4051l019K4732K40854
35462g0894M30166K69711o8092j18522J26913K30324L2803j94533l27714n26873
35452b16711p10476m92264J28330N31846K89077j60548o7153N67993R32631M65532
$$ plain form
35524 -216227 -601025 -75353 342813 28494 -284701 9641 210356 -404440 -1179648 -1137800
35514 -1137800 -592282 -479035 -758046 -767686 -627787 -917754 -1309564 -927305 62918 561349
35504 561349 251540 -37447 206189 540850 599956 629607 699729 419687 -177834 -399752
35494 -399752 38126 512659 458919 81995 -266821 -665148 -1135835 -1292304 -965315 -600819
35484 -600819 -562261 -563663 -257221 108004 111806 -140272 -217858 16229 364007 613442 599125
35473 599125 209627 -384290 -753197 -695208 -464765 -355060 -347512 -333461 -336480 -311748 -70894
35462 -70894 359272 628983 560891 442369 569282 799606 832409 637876 310162 -216711
35452 -216711 -927187 -1419451 -1291121 -759275 -470198 -630746 -697899 -129906 802725 1268257
35442A268257l74529o76652k58078J31315j10346n78904m77962J93390O47018
35433b36491M47371K8694q0908J6084m2614k21020k10698L0280K31904J98274
35423A60876m611j74778j52787L9487J85706J18645m6760j05615j08339k26070
35413c14246l38821j44084K96263N05733K05154l17859n52639k77724K70582N61466
35403a06175K19958m66152p11518j95282M60177N65505L01770K11139K07162j02049
35393C84535m67305l44478L7840K604l14197j63302L83160M46262o5131j89856
35383b89868L96565P32073J78081n28156n54484k27405j90591k70919o6343J61653
35373f59394P6310J5782K75969L36909k64364r00165o71221K08418P78925O99046
$$ plain form
35442 1268257 893728 217076 -41002 90313 -20033 -598937 -1076899 -883509 -236491
35433 -236491 210880 239574 158666 174750 132136 -88884 -299582 -269302 -37398 160876
35423 160876 156265 -18513 -171300 -131813 53893 172538 125778 20163 -88176 -314246
35413 -314246 -653067 -797151 -500888 4845 209999 -107860 -660499 -938223 -667641 -106175
35403 -106175 113783 -352369 -1063887 -1259169 -798992 -233487 68283 279422 486584 384535
35393 384535 -82770 -427248 -389408 -386804 -701001 -864303 -481143 -34881 -100012 -289868
35383 -289868 106697 838770 1016851 488695 -65789 -293194 -483785 -754704 -821047 -659394
35373 -659394 -583084 -567302 -291333 45576 -218788 -1118953 -1790174 -1581756 -802831 -103785
35363a03785L61214O386l73314n18614j77662K56794J79490k62367l57088Q3998
35353i04948M85160L55615j47789n26449m42662K6906L96253K16851k95383m26468
35343a262914L8297M74376L70833M6935Q0J30951J43938J58858L29763L69389
35333H00506P6979j48033M0292K54106K3773l49342l27362p5019p5909k11596
35323H395o4772J90410Q3359k07128r9227L27469L90786p4372m51231k94271J07969
35312h2613K51734R81m23789o53082l85354K66901P49931O82252K91165l8949
35302F59177k97757n57913n84268k36811J26049J77567J58848L34616L75372m6840
35292A08040m88642l47199J08325J50411k20654l50176j9108L56821N07692N18157
$$ plain form
35363 -103785 257429 263815 -109499 -628113 -805775 -548981 -369491 -631858 -988946 -904948
35353 -904948 -419788 -64173 -211962 -738411 -1181073 -1154167 -757914 -541063 -836446 -1262914
35343 -1262914 -1224617 -750241 -379408 -332473 -332393 -201442 -57504 101354 431117 800506
35333 800506 877485 729452 769744 1023850 1047623 698281 370919 295900 219991 8395
35323 8395 -56377 134033 217392 10264 -88963 238506 629292 554920 103689 -190582 -82613
35312 -82613 169121 170102 -253687 -906769 -1292123 -1025222 -275291 406961 698126 659177
35302 659177 361420 -196493 -780761 -1017572 -891523 -713956 -555108 -220492 154880 108040
35292 108040 -380602 -727801 -619476 -469065 -689719 -1039895 -1059003 -702182 -194490 323667
35282C23667L51201q0955m38121k77079J86520L25013M4072j89412j72774j21252
35272d9120p5101J30541L45344K43797n3061j48934p2344j31138k16723j3875
35262d0614K44570Q9457k27966m4774M72162M36966k75940p32315m12745M3388
35252d47811J2932j48699Q7294M70547N04923K89683J47479m5211m57485o88892
35242b75240l15460K45425J97601m07472o50043n6326O99480P20843Q9568l13699
35232f5323l6227L99785L33452p6482j86739M3580l2623o23793r79443m45581
35222a669394M93660Q49001M50038l3737j66969j21115n6315J37188L84388L34221
35212F00966r1304n16800o15617m05510j1857M19838N54165J29968m98948o01533
$$ plain form
35282 323667 674868 593913 155792 -121287 65233 390246 434318 244906 72132 -49120
35272 -49120 -124221 6320 351664 595461 542400 393466 321122 189984 -26739 -40614
35262 -40614 203956 293413 65447 20673 492835 929801 653861 -78454 -491199 -447811
35252 -447811 -434879 -583578 -496284 -25737 479186 768869 916348 871137 413652 -275240
35242 -275240 -590700 -345275 -147674 -555146 -1205189 -1261515 -562035 158808 248376 -65323
35232 -65323 -101550 298235 631687 555205 368466 412046 379423 -244370 -1223813 -1669394
35222 -1669394 -1175734 -326733 123305 89568 -77401 -198516 -254831 -117643 266745 600966
35212 600966 509662 -7138 -622755 -1028265 -1040122 -620284 -66119 63849 -435099 -1036632
35202a036632l2522N04025L83455j56015m37040k27592J13206J93281J7668j08091
35192g86257K5639K70401L09624J09396l0837K0062j3487k99014m84685k14170
35182a093328K24961K76610m2837k16938l2201K31423L50225L57816K23074j29802
35172A49003m56972l71551N9754L66743L46310K10734Q4312j02768k10070J0436
35162H5931L26004J85555l54712n23800N5341P56851Q34629L81280m3399k77463
35152A426217n07752o78858n39959j62617Q3459O0790r761L8070J10887J13013
35142f6511J14128J52141J07466o5558j63396j3150J80049O8756k43791k30246
35132a60112K33356M68074j02842r13816q24056K63324J115446P98883j05639
$$ plain form
35202 -1036632 -1069154 -565129 -181674 -337689 -774729 -1002321 -889115 -695834 -678166 -786257
35192 -786257 -760618 -490217 -180593 -71197 -102034 -81972 -95459 -394473 -879158 -1093328
35182 -1093328 -868367 -591757 -634594 -851532 -883733 -652310 -302085 55731 278805 149003
35172 149003 -307969 -679520 -619766 -253023 93287 304021 388333 285565 75495 85931
35162 85931 411935 597490 242778 -281022 -225681 531170 1365799 1747079 1703680 1426217
35152 1426217 918465 239607 -300352 -462969 -379510 -318720 -328481 -290411 -179524 -66511
35142 -66511 47617 199758 307224 241666 78270 65120 245169 313925 70134 -160112
35132 -160112 73244 541318 438476 -475340 -1299396 -1036072 79374 878257 772618
35123G72618m42622p4209J84276q8951m22221k98477J29632L61288K00101j16197
35113B05238k64782j95600j50177k87210l71485q7712L77559M84346J35651j70532
35103c24704j37858n3714j27089p6041K39553M07633J79473k1172J28531K06272
35093D20884j40386l82533J7273M84622J31690o97270q10716L6342Q21216P74101
35083F55223K44350j11761j58531o0727Q3253J57163O6920m7360m2493r3503l12631
35072C79903l24065J39094N29355K00299m31297m08387K21104M45970r8469o43169
35062A0338n88694k62715p5678J18746M21144M93449K11197q969P0590J24435
35052E13843n5745j72625o5725o2316k98777l53331L871L03612J07364k70271
$$ plain form
35123 772618 329996 255787 440063 351112 -71109 -369586 -239954 121334 321435 205238
35113 205238 -59544 -255144 -405321 -692531 -1064016 -1151728 -774169 -289823 -154172 -324704
35103 -324704 -462562 -516276 -643365 -719406 -479853 -72220 107253 86081 214612 420884
35093 420884 280498 -102035 -84762 399860 531550 -165720 -976436 -940094 -118878 655223
35083 655223 899573 787812 629281 568554 651807 808970 875890 828530 786037 692534 379903
35072 379903 55838 194932 724287 924586 493289 84902 306006 751976 653507 10338
35062 10338 -578356 -841071 -916749 -798003 -376859 116590 327787 318818 389408 513843
35052 513843 458098 285473 219748 157432 -141345 -494676 -490805 -187193 -79829 -350100
35042c50100k61199J35987M74778M82869K12602j57245m01813l72616j97805j17149
35032e51691r3067P8293L05590K90766N2270j09817j18019q9211O8822M35809
35022B69745O23192K64944k06045j32447J78113j00650p31148n57834N31147J132742
35012A271759L84586p26049q98115l20964O774o5103N7628M50911N57203J70586
35002H89216k54625k75025N2771L30734K12736k37692n04719k15931K51130K37273
34992D85868j79920l16638l2120J06812o9322m2732K91880K77397k90172o25163
34982c94110k50332J53935n1480l47993m0018M63994L70781j30126k63691L1231
34972d57809K10371J85078L00427M79357K94558k19060n93419o64800o07137l73815
$$ plain form
35042 -350100 -611299 -475312 -534 482335 694937 537692 135879 -236737 -434542 -551691
35032 -551691 -644758 -566465 -260875 29891 82161 -27656 -145675 -234886 -166064 269745
35022 269745 892937 1157881 951836 819389 997502 896852 165704 -392130 139017 1271759
35012 1271759 1656345 930296 32181 -288783 -282009 -347112 -289484 161427 718630 889216
35002 889216 634591 359566 412337 743071 955807 718115 213396 -2535 248595 485868
34992 485868 305948 -10690 -42810 64002 -5320 -48052 243828 521225 231053 -394110
34982 -394110 -644442 -490507 -541987 -889980 -929998 -466004 -95223 -225349 -489040 -457809
34972 -457809 -247438 -62360 238067 717424 1011982 792922 199503 -465297 -1072434 -1446249
34962a446249J99487Q07890Q51498K46232m18811n75425k05261K80857M43925
34953A84143J82582j60880k08165m4836J0241K3968K60324M56634J07714m83931
34943C27794m35756K34746M79869n0800l88236M2787L83790r3595o26077l09877
34933d35355K82712J65865l06910k01888K36942J26676l24006j99448L87826N01943
34923B34357Q3958p1918J04960o9648n22120m02229L00479N88280J52575j45576
34913B53118J61403M09725Q3649l42257l55035j81590j24567k4059J78928J69158
34903B28473q7415k01125j27070k35696m23094j17441N73714P61932J82287l34470
34893B20095k21814K2950r5119k24129M594K44778J79903J24120K50453J13667
$$ plain form
34962 -1446249 -1246762 -438872 412626 658858 240047 -335378 -540639 -259782 184143
34953 184143 366725 205845 -2320 -47156 -36915 -12947 247377 704011 811725 327794
34943 327794 -107962 126784 606653 555853 167617 210404 594194 500599 -125478 -435355
34933 -435355 -152643 13222 -293688 -495576 -258634 -131958 -455964 -655412 -267586 234357
34923 234357 318315 246397 351357 281709 -240411 -642640 -342161 246119 398694 253118
34913 253118 414521 824246 907895 565638 210603 29013 -95554 -119613 59315 228473
34903 228473 141058 -60067 -187137 -422833 -845927 -963368 -389654 372278 554565 220095
34893 220095 -1719 21231 -73888 -298017 -293423 -48645 131258 255378 505831 619498
34883F19498l88053n04842J35876P01938M39932q4345k7390K67180L437n43471
34873F19760n20330l8197R5756j15138L5471M72907L44821l84909o82733j30888
34863c03480L54293L2461n05147m12960N7572J58279m2283P7777M60374L92146
34853B69032k50909o57706k38633N19913P55115L52244r5394k12719k08169l12371
34843g9597l43405q9119J88994K9198n24820q61558n44066J53111O15629O05589
34833h50044L87309K46975J61680K239j49193q0443J92426L47838J48168k15112
34823A91843l45792j60331M8929P9335O0539J23240J40516K7863M255K14451L37241
34812G22089J0981n09526o30705k95295k8268o9744o7840J69204K28559j97426
$$ plain form
34883 619498 231445 -273397 -137521 564417 1004349 920004 892614 1159794 1163231 619760
34873 619760 99430 61233 156989 41851 77322 550229 895050 510141 -172592 -303480
34863 -303480 50813 83274 -421873 -834833 -777261 -618982 -661265 -583488 -123114 269032
34853 269032 18123 -639583 -878216 -358303 396812 749056 653662 440943 232774 -79597
34843 -79597 -423002 -512121 -323127 -293929 -818749 -1680307 -2224373 -2071262 -1455633 -850044
34833 -850044 -462735 -215760 -54080 -51841 -201034 -281477 -89051 258787 406955 191843
34823 191843 -153949 -314280 -265351 -186016 -125477 -2237 138279 166142 170397 384848 722089
34812 722089 733070 223544 -407161 -702456 -730724 -800468 -868308 -699104 -470545 -667971
34802f67971o48473m84380J67861O18140N96157M55569M32900K90087j43266n50812
34792F5812n47074k14803O8897J49809J61477K00345K18930K01895K00226J77200
34782F82714K9928j96828l07823k33433j37503j58917k01158j01422J14821K85575
34772b24046L28213K73617J60274J8865r9278j78447k48442k66976j30702R5307
34762b71615J44913r1239l64673m12048k77040p1636K76722O91102O97358N1498
34752C73342o31771n50710R9585L67128k3689l15888O270M49565M37627K16309
34742D27768K25972K22783k14376p48869o79778n4619L67415K04474j48182k27321
34732f24733l8875K04465M02058M74012L12429j6711k59797k73853j77045j44303
$$ plain form
34802 -667971 -1316444 -1800824 -1632963 -1014823 -418666 36903 469803 759890 616624 65812
34792 65812 -481262 -696065 -627168 -477359 -315882 -115537 103393 305288 505514 682714
34782 682714 712642 515814 207991 -25442 -162945 -321862 -523020 -624442 -509621 -224046
34772 -224046 104167 377784 538058 556923 457645 279198 30756 -236220 -366922 -271615
34762 -271615 -126702 -217941 -582614 -994662 -1271702 -1343338 -1066616 -375514 321844 373342
34752 373342 -258429 -809139 -709554 -342426 -366115 -682003 -675733 -226168 211459 427768
34742 427768 653740 876523 662147 -86722 -766500 -821119 -453704 -249230 -397412 -624733
34732 -624733 -663608 -459143 -57085 416927 729356 712645 452848 178995 1950 -142353
34722a42353j72500r2592K06872N39672M85821j00454p10963o67967j9944M73383
34712b01025L64198M2109K7111K47223L47208K53276N3824k56514n30077l98404
34702e1071J40974N17215L88261J47128J51338N2291m42408p38384j84671O95437
34692F76110Q18611J54178l24647k36812k46571p24793r82357l49806O86321J042057
34682E12291M02441m48317n81559N1327O11724L90161k90778n07167m7747L03375
34672C95751K9231l30916k02142j2971l46646o97813k09640P35247R09580J14672
34662C84353n61180m34554j5643J18298J40983K86510K88631k1020k97300k69502
34652c80424j22493j0982J82608L96446L45160R0477j0324q09k01688l76419J0642
$$ plain form
34722 -142353 -314853 -407445 -200573 339099 824920 724466 13503 -654464 -674408 -201025
34712 -201025 163173 205282 232393 479616 826824 1080100 1133924 877410 347333 -51071
34702 -51071 89903 607118 995379 1142507 1293845 1346136 903728 165344 -19327 676110
34692 676110 1494721 1648899 1324252 1087440 840869 116076 -866281 -1216087 -529766 512291
34682 512291 914732 466415 -115144 -63817 547907 938068 647290 140123 92376 395751
34672 395751 424982 94066 -108076 -121047 -467693 -1165506 -1375146 -639899 269681 384353
34662 384353 -176827 -611381 -627024 -508726 -367743 -81233 207398 186378 -110922 -380424
34652 -380424 -502917 -513899 -331291 65155 410315 500792 490468 489659 287971 -88448 -77806
34641g7806O08413L98947o09404j130586n40138J64969N6723k72339Q1011P05834
34631f14376O46332M8816j89747O2480J73809k5105q6623J18296K25782P9721
34621D39385j31950l35721n23594m36615N6011M86457L60896l7542j04809Q9760
34611a37722L0419k49493k43285P3194K09326O2244L2697J98109J70751j08822
34601C7418k07144L502J11132n9152j40680L9174J08742j25428k62294k9936J83728
34590c40938K7037j43663R4730L79785J05327m64320m64640K17027O94512L95022
34580D99879j43948k12350o98p2884k37077J60861R40254J050909R8735r35664
34570A148017j025431m66338k06544l22676r4991N92257R22202M00341l71033
$$ plain form
34641 -77806 530607 929554 320150 -810436 -1350574 -1185605 -1128882 -1401221 -1320210 -614376
34631 -614376 31956 80772 -108975 -46495 127314 102209 15586 133882 359664 439385
34621 439385 307435 -28286 -551880 -988495 -932484 -446027 -85131 -122673 -227482 -137722
34611 -137722 -107303 -356796 -600081 -526887 -317561 -255317 -222620 -24511 146240 37418
34601 37418 -169726 -166224 -55092 -114244 -254924 -215750 -107008 -232436 -494730 -524666 -340938
34590 -340938 -313901 -457564 -362834 16951 122278 -342042 -806682 -589655 104857 499879
34580 499879 355931 143581 142883 69999 -167078 -6217 934037 1984946 2083681 1148017
34570 1148017 122586 -343752 -550296 -872972 -967963 -375706 546496 946837 575804
34561E75804n57084j62676J85537J54269j5138K9547K91954M05997M8256n46287
34551D10179o72438n7007N76461L77482l72602n92041K2259N78759L70041j58741
34541D82352k63061k2437p230k92910m29736j70361K42149M15861K07776r2278
34531G0125K7607O00734Q34297P4562r83574r72787J38100Q19249J94480o86171
34521A16622n57026J80912L87899R8299J43188M39830J54172o32399q76061k94363
34511h38927J81150j4933k37730J25903N84293L98678k17763m96400k54724L0094
34501g40359M4284k7315Q6351L76519N95865M81049N070m95615n98147k90413
34491e62711K228k447o9385J49798N32531O04366K04287k66883l83786k48709
$$ plain form
34561 575804 18720 -143956 41581 195850 180712 210259 502213 908210 956466 410179
34551 410179 -262259 -319266 257195 634677 262075 -329966 -307707 271052 641093 482352
34541 482352 219291 196854 189624 -103286 -533022 -703383 -461234 -45373 162403 70125
34531 70125 97732 698466 1532763 1607325 623751 -349036 -210936 608313 802793 116622
34521 116622 -440404 -259492 128407 226706 369894 809724 963896 331497 -544564 -838927
34511 -838927 -657777 -672710 -910440 -784537 -200244 198434 -19329 -515729 -770453 -740359
34501 -740359 -696075 -723390 -637039 -260520 335345 816394 821464 325849 -272298 -562711
34491 -562711 -560483 -562930 -632315 -482517 50014 654380 858667 591784 207998 -40711
34481d0711k40105l37461j28717M13207O63620K26755l49606l19757J24171K13274
34471B24670j04236j67927R5099l4276o64307q01431R0797J017185Q32857m8906
34461D39525l63884J02176M25830J16283k96726k70363L9835K39743K20065O7350
34451G19834p9664k5895K51409M19588J88376k43618m88709m95824l98061j39552
34441b92116K70804M38318O6658m78012o15172l25818Q045K33176L70833K78265
34431d5019o3673k71421j30053k6608k30852k98257Q6411L13411j62849o67469
34421a496379k95756M76250N17699k0420j6275N68654O02548j53932n66554r1084
34411d75249L51615N8248l30376j34685K05837J31564K258K26689L32707j24815
$$ plain form
34481 -40711 -280816 -618277 -746994 -333787 329833 556588 206982 -112775 11396 224670
34471 224670 120434 -47493 47606 13330 -650977 -1452408 -1361611 -344426 488431 439525
34461 439525 75641 177817 603647 719930 423204 152841 192676 432419 652484 719834
34451 719834 640170 614275 865684 1285272 1473648 1230030 741321 245497 -152564 -292116
34441 -292116 -21312 417006 483664 5652 -609520 -935338 -927293 -694117 -323284 -45019
34431 -45019 -108692 -380113 -510166 -536774 -767626 -1065883 -979472 -666061 -828910 -1496379
34421 -1496379 -1792135 -1315885 -798186 -818606 -834881 -266227 336321 182389 -384165 -475249
34411 -475249 -123634 -65386 -395762 -530447 -324610 -193046 -190788 35901 368608 243793
34401B43793n50476k03355N29187P03850J86362m02622o95472p50360n56150q6321
34391a581564L79251N45350M99950M37331L10680R6229q723K0213r7495l82223
34381B18999m26934j03238J55150R4490J2069M6373j52193o07594o71671m9381
34371a483930N79251N69060K23806Q2002L2186j69115k22200J13897M00931K46864
34361C72752Q247O0122Q4052j64294j80064L30707O47639J88168l65817k14747
34351G66765J17373k10425o93673l50629L76925K96962l62573k85162N63738P82537
34341A001838n6204o63470k07262M10339J90378m23050n05167p9793K60249L37536
34331B65394K65661J7645k90151k85376M4010K23731R4565M7791K01130J48018
$$ plain form
34401 243793 -306683 -510038 19149 722999 909361 506739 -188733 -939093 -1495243 -1581564
34391 -1581564 -1202313 -656963 -157013 280318 590998 687227 678504 698717 601222 218999
34381 218999 -207935 -311173 -156023 -61533 -49464 -3091 -155284 -762878 -1434549 -1483930
34371 -1483930 -904679 -335619 -111813 -29811 2375 -166740 -388940 -275043 125888 372752
34361 372752 380999 441121 525173 360879 180815 511522 1159161 1347329 981512 766765
34351 766765 884138 673713 -19960 -370589 6336 303298 -59275 -344437 219301 1001838
34341 1001838 945634 282164 74902 485241 675619 252569 -252598 -332391 -72142 265394
34331 265394 531055 548700 258549 -26827 17183 240914 335479 383270 584400 732418
34321G32418j70528k21129J26893K65004o7747k86659m9283J00055k27268m93574
34311b91818j99600K32838K83903K29855M23377M66615j5235m81685l01106J42560
34301D89704J25898j78539j37544J44478R6756k10486k53291p1162j03612k44310
34291c42108n5518K56879J02020l67394m08409M9295L07880J35928R3798M43044
34281B15415O82038M60845J15498m0565j93765m49946m90419k02847k1323k21295
34271a46364m32787k75379J8038M0769j41378j94659l0694K34601N20531O72958
34261B65636M39082j33859n62452m88040j18448J42610K24288K72577K76647J30511
34251D48552j03184k53623k53575j38276K2173R8395K039j37006j32708q3955
$$ plain form
34321 732418 561890 340761 467654 732658 664911 378252 328969 429024 201756 -291818
34311 -291818 -491418 -258580 25323 255178 678555 1145170 1129935 648250 347144 489704
34301 489704 615602 437063 299519 443997 540753 330267 76976 5814 -97798 -342108
34291 -342108 -397626 -140747 -38727 -406121 -814530 -765235 -457355 -321427 -227629 215415
34281 215415 897453 1358298 1473796 1433231 1239466 789520 299101 96254 74931 -146364
34271 -146364 -579151 -854530 -836492 -795723 -937101 -1131760 -1162454 -927853 -407322 265636
34261 265636 704718 570859 8407 -479633 -598081 -455471 -231183 41394 318041 448552
34251 448552 345368 91745 -161830 -300106 -277933 -179538 -177499 -314505 -447213 -531168
34241e31168k10629l48397r2975M42607N85264R3970l60368j45343L67106L54265
34231A54332k30843o04083k50147M40286P18211L40849k15282k83867K46390P21163
34221A037009M46723l77569q35428n18323o5105j50531m52195k09087N22030Q82333
34211B79857M37163k39530l59534J24085N61640L94836k38980o50554l79196K03781
34201A33568L28636j13806m07150j00819L09742K31220o7842q074K57025J76595
34191G39095j45393j72667k2393k80795p47305n10412M70486R96605L66844n22355
34181A71710n26945J39082M95486L24559J56798J73884Q4809j44427l01709m90973
34171H2274q56006r15675j03865J065549J368101N73214j78729m3003M04050K46791
$$ plain form
34241 -531168 -741797 -1090194 -1183169 -740562 -155298 -61328 -421696 -567039 -199933 154332
34231 154332 -76511 -680594 -930741 -490455 227756 568605 353323 69456 315846 1037009
34221 1037009 1483732 1106163 270735 -247588 -312693 -463224 -915419 -1124506 -602476 279857
34211 279857 717020 477490 117956 242041 803681 1198517 959537 308983 -70213 133568
34201 133568 462204 348398 -58752 -159571 150171 381391 313549 305475 562500 739095
34191 739095 593702 421035 398642 117847 -629458 -1139870 -669384 327221 694065 171710
34181 171710 -355235 -216153 279333 603892 760690 934574 1019383 874956 573247 82274
34171 82274 -773732 -1689407 -1793272 -727723 640378 1213592 1034863 991860 1395910 1642701
34161A642701l83052p56554p63080p77654o95633q4343P94450J068906N28757
34152E74498k1228L420J40518k04947o77782n45328L9958K01916l15836p68203
34142a573014n23550J18935N20322N46687M33707K63642M5071j6809J77058K81699
34132B73748k6908m20829k90602L27167P33012N04676m3824m24675n18664m09109
34122b96008j25607K12711L44692J90938k5966j31264j86260k15842r6910J27746
34112b01770J94579P0803P5624L15133M02691N6934m04818n40668l96595k37050
34102f65137k4034L29731N03977J85070k58682j83241L22458N23900J84949r1327
34092H27664J11665L44108P1924m01048l95471N8560K53284j22176n33401m01696
$$ plain form
34161 1642701 1259649 503095 -259985 -1037639 -1733272 -1817615 -1023165 45741 574498
34152 574498 553270 556690 697208 492261 -185521 -730849 -690891 -488975 -804811 -1573014
34142 -1573014 -2096564 -1977629 -1457307 -910620 -476913 -213271 -168200 -185009 -7951 273748
34132 273748 246840 -173989 -464591 -137424 595588 1100264 1056440 631765 113101 -296008
34122 -296008 -421615 -208904 135788 326726 300760 169496 -16764 -232606 -329516 -201770
34112 -201770 -7191 63612 139236 454369 857060 913994 509176 -31492 -428087 -665137
34102 -665137 -689171 -359440 144537 329607 70925 -112316 210142 734042 918991 827664
34092 827664 939329 1283437 1355361 954313 558842 617402 870686 748510 215109 -186587
34082a86587R9560L64460J89874q7536j70362j20927p3427M039J11258R6826m7251
34071A79927o1607J36876J88059j55450m92475l12347J48258K35247m7848o4559
34061b45919L06275M03250o9997m78718l06511N020j10758l53676j53694K87981
34051g16747L86837J91725J62129K53813J02633j33710l4207J68939r6179o01105
34041c15872n21461J72527N80753L11939O578R8639J08116l06155n58030j21751
34031e44717M66079M07238j17708l22475l3192K39797J90971k0908k45638m60685
34021d41238n08441k29969J93720M27869M14108L02121J45689p494K9156K72585
34011E98106L80495J47590j13468j02010p0530l07748m68501j18171L56034K20822
$$ plain form
34082 -186587 -87027 277433 467307 379771 209409 88482 15055 19094 130352 227178 179927
34071 179927 118320 255196 443255 287805 -204670 -517017 -368759 -133512 -181360 -245919
34061 -245919 60356 463606 393609 -85109 -391620 -386600 -497358 -851034 -1004728 -716747
34051 -716747 -329910 -138185 23944 277757 380390 246680 212473 381412 285233 -315872
34041 -315872 -837333 -664806 -84053 227886 234464 333103 441219 135064 -422966 -544717
34031 -544717 -78638 328600 210892 -111583 -144775 95022 285993 265085 19447 -441238
34021 -441238 -949679 -1179648 -985928 -558059 -143951 158170 303859 296365 325521 598106
34011 598106 978601 1126191 1012723 910713 840183 532435 63934 -54237 301797 522619
34001E22619l58249m72279Q0179M53729J37366k51139o6542K72658M5572m82274
33991a18360m35530K41614O36752K26147l97655m60041o5226J46126Q016q4528
33981c02685L2089J2270l36419n92762k70102M45922R00836P96046M28632J38080
33971A251907q0253l12725m50973l90577k45903j49457m6256J03791J33695n8211
33961b44962k16878k6298L82378N27733J97525k78676m45665k36334L1071Q5802
33951b24304K3975J34385M18499M53717o5942p57010q60953j91752N77760P38476
33941B46851L35779q0126j87868q2483K9943N275j96567l70541j73508L48049
33931a25196O03212K03389l96589m81938r4268J16485n0004j10398J94008M27406
$$ plain form
34001 522619 164370 -307909 -227730 225999 363365 112226 45684 318342 363914 -118360
33991 -118360 -553890 -312276 324476 550623 152968 -307073 -372299 -226173 -218157 -302685
33981 -302685 -270596 -258326 -594745 -1187507 -1457609 -1011687 -110851 685195 1113827 1251907
33971 1251907 1171654 858929 407956 17379 -228524 -377981 -424237 -320446 -186751 -244962
33961 -244962 -461840 -488138 -105760 421973 619498 340822 -104843 -341177 -310106 -224304
33951 -224304 -200329 -65944 352555 806272 740330 -16680 -877633 -1069385 -491625 246851
33941 246851 582630 502504 314636 232153 262096 267371 70804 -299737 -473245 -125196
33931 -125196 478016 681405 284816 -197122 -291390 -174905 -224909 -335307 -141299 286107
33921B86107J93670k01022k38899K7387J41710k3230j56197o3231P5680P3420
33911A15395L9034J39865K60276J48157j45509k52446l3356J17569j84696o31602
33901d27313n43675J11177N77438M02180P5371J46281K75281j14935o51687m31337
33891e81219M64865Q84692K65706n35847n44817k1528J47613j50216k64390P4294
33881b60847L95093K81853p7202k71828j86859K1839J91939K46561J73262Q872
33871E22683j95658l74165m01739k03965L2327q065k85066l27139J21208O41075
33861d78504O59458K12411j98137l35718l59643l21247n7066L55266N18753K69204
33851B64777o5757j34382L4955K48506M17325M22672Q5545m44946o18774j80635
$$ plain form
33921 286107 479777 278755 39856 67243 208953 185723 29526 -33705 41975 115395
33911 115395 154429 294294 554570 702727 557218 304772 271416 388985 204289 -427313
33901 -427313 -970988 -859811 -282373 119807 195178 341459 616740 501805 -149882 -581219
33891 -581219 -116354 768338 1034044 498197 -46620 -68148 79465 -70751 -335141 -260847
33881 -260847 134246 416099 338897 67069 -119790 -97951 93988 340549 513811 522683
33871 522683 327025 -47140 -448879 -652844 -620517 -628582 -913648 -1240787 -1119579 -478504
33861 -478504 180954 393365 195228 -140490 -500133 -821380 -878446 -523180 -4427 264777
33851 264777 199020 64638 99593 348099 765424 1188096 1273641 828695 209921 29286
33841B9286L37310K72280k14825l79651k0781K46500j3745l78017k57623J62400
33831b16866K18274j97662m74593j93714K99263M40051J96319k8445j9579N0342
33821G3390k5620k11560l22861k31121K5840K30664J51877j44690k67901P606
33811g14376L47574K68675j22402k12400K21402O30801M50530j21539m34731k35922
33801G7612J53481L58072K80036q196l47403m82340k79748L6853J37687M4957
33791b8989M2841J59837J09816j96162m44795l55644k1622K98531M40984L13981
33781C18778l9306k66994k2924L99811K65337n01318r78272m82544L92271O25883
33771b89278K18212m0123M8698n7758m25954l59562L51325Q55670M83082k05196
$$ plain form
33841 29286 366596 638876 424051 44400 23619 270119 256374 -121643 -379266 -216866
33831 -216866 1408 -196254 -670847 -864561 -565298 -125247 71072 42627 23048 73390
33821 73390 47770 -163790 -486651 -717772 -691932 -461268 -309391 -454081 -721982 -714376
33811 -714376 -366802 -98127 -220529 -432929 -211527 419274 869804 748265 313534 77612
33801 77612 231093 589165 869201 861005 513602 31262 -248486 -211633 -73946 -28989
33791 -28989 13852 173689 283505 87343 -357452 -713096 -734718 -436187 4797 318778
33781 318778 279472 12478 -10446 389365 654702 153384 -824888 -1307432 -915161 -289278
33771 -289278 -71066 -111189 -62491 -120249 -546203 -905765 -554440 301230 784312 579116
33761E79116l03088R0192J99890j34104l37966j17406J83863K49295J67977P5769
33751F53538m0494j02427J4827J41677j0456l02993l19938j05538j38637m34464
33741f44905l70916K61758P25116L84737k68848l47021R0381K24832j77510m81914
33731f04290k98700m0392p6277p4702L01190O11476K37930n37227p72874j44154
33721a398020O57908Q93774N78272J38251j83582k71190J8237M95084N23504j75611
33711A276627r05245q23450j87789J1428l90436m72166K26925Q48566N11955k82148
33701a85733l90604K77872P20217L33708l81926o67415l79576J06458L70254K21139
33691B4394j24833j67323K25931M78841J05059m22601l00182L15987N21721J04289
$$ plain form
33761 579116 276028 366220 566110 432006 94040 -23366 160497 409792 577769 653538
33751 653538 613044 510617 525444 667121 656665 353672 33734 -71804 -210441 -644905
33741 -644905 -1015821 -754063 -28947 355790 86942 -260079 -169698 55134 -122376 -604290
33731 -604290 -902990 -943382 -1019659 -1094361 -793171 -181695 56235 -480992 -1253866 -1398020
33721 -1398020 -740112 153662 731934 870185 686603 415413 433650 928734 1452238 1276627
33711 1276627 371382 -452068 -639857 -628429 -1018865 -1491031 -1264106 -415540 96415 -185733
33701 -185733 -576337 -298465 421752 755460 373534 -293881 -673457 -566999 -196745 24394
33691 24394 -100439 -267762 -41831 437010 542069 119468 -180714 135273 656994 761283
33681G61283k18913j05593p6877m00204n37912j90608J05682R548J5842L75260
33671b62492M00484k49079o07582J04757R33439N63812m62164n71878K20132L98843
33661D68272l69976o31289K89651R81898K15875j004698r91575Q4009O50183J39353
33651a68297m72931l46718K06053M85637L00135r6059l68751k82537Q4010L13163
33641c46295J67789l0919P4479K44186M8668l27583l21878Q4960L30225J38265
33631F1897j79038l18718k96250j06885L13187O70446M78251j54143m86029j77578
33621a94860K10545J16811j64451m0595L78207M56713K2049m12417m00056q0696
33611a08750J21673l30l07746m69644k34705K73314N76449L48881j63996m34730
$$ plain form
33681 761283 542370 436777 359900 -40304 -578216 -768824 -663142 -653594 -637752 -262492
33671 -262492 137992 -111087 -718669 -613912 319527 883339 421175 -150703 69429 468272
33661 468272 98296 -532993 -243342 738556 954431 -50267 -1041842 -957833 -307650 -168297
33651 -168297 -641228 -987946 -781893 -296256 3879 -92180 -460931 -743468 -659458 -346295
33641 -346295 -178506 -209425 -134946 109240 157908 -169675 -491553 -406593 -76368 61897
33631 61897 -117141 -435859 -732109 -838994 -525807 144639 622890 468747 -17282 -194860
33621 -194860 15685 132496 -31955 -72550 305657 762370 784419 372002 -28054 -108750
33611 -108750 12923 12593 -295153 -764797 -999502 -726188 -149739 199142 35146 -399584
33601c99584k76445M9897K51671K49351P0421j98879l70159l27596k10202j59335
33591a320860j25M46848Q45324O67983O0654k22985Q4006L60941J01691l14552
33581G08925l31110j07548o5635l9723L16652O30870K63610m79871n97291O6804
33571C65683N20945J57581l70382k94418J05242J52659j00608j84897j16883j70437
33561F4485j48181K44511N84912K29283n11590o65956r7377K83292P549k53583
33551b62655O0214L74457n3987q19942r14864k25228M08443N03230M38972N51147
33541E9787N19604L4064n06277m73623R6292N61697N03583J08563k24006k92480
33531C87204r3914K28338L39451m2937o74653q72175l50687L03331L62493p7303
$$ plain form
33601 -399584 -676029 -626132 -374461 -125110 -54689 -253568 -623727 -951323 -1161525 -1320860
33591 -1320860 -1320985 -874137 -28813 639170 699824 476839 560845 921786 1023477 708925
33581 708925 377815 270267 204632 164909 481561 1112431 1376041 896170 298879 365683
33571 365683 886628 1044209 673827 379409 484651 637310 536702 351805 234922 64485
33561 64485 -83696 160815 745727 975010 463420 -202536 -299913 -16621 -9072 -262655
33551 -262655 -202441 172016 118029 -701913 -1616777 -1842005 -1433562 -930332 -491360 59787
33541 59787 579391 613455 107178 -366445 -270153 291544 795127 903690 679684 387204
33531 387204 293290 521628 861079 818142 143489 -728686 -1079373 -776042 -413549 -490852
33521d90852l38646j92620k7072j6510J39582M55687L96831j93349n87249k15767
33511a069965L56115K65467k77952l64418J31978M38990K14509j7480P6887J06908
33501a38961j79055l50530p8659K61907K71414J52908J53272K9881l34749m24262
33491f36834R0020N83423L58806j74392j34278L61600M08410j35816m21175o4243
33481B35521K14020j86868p38963n85503K10337P94969O08106q2914n61812l52963
33471d46070K96098N80346P1899n95177m89228K32373M73014j21302n57198m7545
33461f02790P18574O50449q0479m28153j06615J96007O5707j74831k67302l59033
33451c88466m06909r6359M12877M61727o7462m34754j73209J71865l6323m80242
$$ plain form
33521 -490852 -829498 -1022118 -1049190 -1065700 -926118 -470431 -73600 -266949 -854198 -1069965
33511 -1069965 -713850 -448383 -726335 -1090753 -958775 -519785 -305276 -322756 -245869 -138961
33501 -138961 -318016 -668546 -747205 -485298 -213884 -60976 92296 122177 -212572 -636834
33491 -636834 -546814 36609 395415 221023 86745 448345 856755 720939 299764 235521
33481 235521 449541 262673 -476290 -1061793 -851456 -56487 551619 468705 -93107 -446070
33471 -446070 -149972 430374 502273 -92904 -582132 -349759 123255 1953 -555245 -602790
33461 -602790 115784 766233 685754 257601 150986 346993 412700 237869 -29433 -388466
33451 -388466 -795375 -891734 -478857 -17130 -84592 -519346 -692555 -520690 -557013 -1037255
33441a037255m16122J85974P00871P67605N24508J25604l52516o05710k99827
33432d06868L64132P34808M66716j10669m31094k68890J19796K57504q5907n61387
33422G8141n66464m5330L55220J69833k49657l64607k73101l34895l62252O4817
33412a528295O95377Q32172M05723M8125P2105J37530R866j18655j96531m27378
33402f9961o41634l53501L16182N97038K51417n6747N2708O0102l46302n13619
33392g04317M8186O38526M11491k45317m07868j29112j35524m11956k81402K75992
33382i41301N34157K60282P426P0267R1399j28827k76251j61542K5983K21597
33372b96810N12278O14191J46701n00942m96524Q6168K43998l38203p01852j53978
$$ plain form
33441 -1037255 -1453377 -1267403 -566532 201073 725581 851185 498669 -107041 -406868
33432 -406868 -42736 692072 1158788 1048119 617025 348135 467931 725435 639528 78141
33422 78141 -488323 -533653 -178433 -8600 -258257 -622864 -895965 -1230860 -1593112 -1528295
33412 -1528295 -832918 -746 404977 453102 525207 662737 672603 553948 357417 -69961
33402 -69961 -711595 -1065096 -748914 -151876 99541 42794 95502 155604 -190698 -704317
33392 -704317 -656131 -17605 393886 148569 -259299 -388411 -523935 -935891 -1217293 -941301
33382 -941301 -407144 -146862 -139436 -69169 22230 -106597 -382848 -544390 -518407 -296810
33372 -296810 215468 829659 976360 475418 -21106 65062 309060 -29143 -730995 -884973
33362h84973O07866O24695Q9434j98264j20242r3364j36781M618J37176j05661
33352g5496m68208l75600Q5391K82236J00131R5245M75185O77926K61415l82498
33342F75727o00199l52918j02062p5801q6544J321L0045j15168k15525l6M08077
33331d33083N94633L96901P1849j37819k92628m53245m31095j25579J98239L11653
33321c00174L80752N20395L94016j59331n19972j25096M32702J88445n18742m49247
33311a56252L96115N51537n03974j258203m67652Q05022Q29093j35217m43280
33302c82811K79563Q22046N29484P3586o9521l33867q15971p37258J37851P36933
33292B40035K24175o18014n44439K95015P14050L00364k02002k09326k0211o3058
$$ plain form
33362 -884973 -277107 347588 437022 238758 118516 25152 -111629 -107011 30165 -75496
33352 -75496 -543704 -919304 -833913 -551677 -451546 -356301 118884 796810 1058225 675727
33342 675727 75528 -277390 -379452 -455253 -541797 -540476 -510431 -625599 -841124 -841160 -433083
33331 -433083 161550 558451 630300 492481 199853 -253392 -684487 -810066 -611827 -300174
33321 -300174 80578 600973 994989 835658 315686 190590 623292 811737 292995 -156252
33311 -156252 239863 791400 287426 -970777 -1438429 -633407 195686 60469 -382811
33302 -382811 -103248 718798 1248282 1321868 1252347 918480 102509 -634749 -496898 240035
33292 240035 464210 -153804 -698243 -403228 310822 611186 409184 199858 179647 116589
33282A16589j95035p9364K41320M75480M77814K79381l0416k70626k55499q8229
33272F71415j25747m50821o37756l30220J74818L10087O6751l0465K31412M41878
33262C21352K43026j58144l93763m15358k81205P8190N00126M75473q7510m48918
33252a66731m6099N16130L17345l87647n52198k5414L10365J12169K4806K92140
33242C94866K23420m12532p10758j33918M39633J41963m20206k69190K48780J99362
33232b98580j74795R1522Q33299Q85550K4371o54526m99414j52696k46094l78797
33222e70160Q936N89773O46707J16870m04253m43068j01302J41482j8377k86345
33212c19737r9000M76937O46947P2311m64695k42178K00957p424n23671l82848
$$ plain form
33282 116589 -78446 -157810 83510 558990 1036804 1316185 1285769 1015143 759644 671415
33272 671415 545668 94847 -542909 -873129 -698311 -388224 -321473 -351938 -120526 321352
33262 321352 564378 406234 12471 -402887 -684092 -605902 -105776 369697 282187 -166731
33252 -166731 -212830 303300 620645 232998 -319200 -344614 -34249 77920 102726 394866
33242 394866 618286 205754 -505004 -638922 -199289 -57326 -477532 -746722 -497942 -298580
33232 -298580 -473375 -381853 451446 1336996 1361367 706841 207427 54731 -191363 -570160
33222 -570160 -561224 28549 675256 792126 387873 -55195 -156497 -15015 -33392 -319737
33212 -319737 -418737 58200 705147 777458 312763 70585 271542 264118 -259553 -642401
33202f42401K58931L79127q5423j62121L54541N49804R9249j81729O0151N6346
33192F86475n17327p51883r2860N97741M91266J02329J50954K47003j75667o19124
33182A18907l97547J19367L02081M36829Q69982Q53665k84398j506557j231337
33173g19008K45603J097180N75962k55371m27855k19493j43671q1690J35861K61552
33163D69070J36063o6823k65616m46130k56383N16855J145154O66825n58776j105713
33153B34526m67850L14495L12590j04283k03128j3087P1902K1519n9753k38153
33143a31222l93397k01088J94341K23099q5342O70N88214P31750l7732p49594
33133A39699m40267K88811K34919n03756p73441j91233M24565M04943K0160k03699
$$ plain form
33202 -642401 -383470 -4343 -89766 -251887 102654 652458 751707 569978 630129 686475
33192 686475 169148 -582735 -675595 -77854 413412 515741 666695 913698 738031 118907
33182 118907 -278640 -159273 142808 579637 1449619 2303284 2018886 512329 -719008
33173 -719008 -473405 623775 1199737 944366 516511 297018 153347 71657 207518 469070
33163 469070 605133 538310 272694 -173436 -429819 87036 1232190 1899015 1340239 234526
33153 234526 -233324 81171 393761 289478 86350 73263 145165 166684 106931 -131222
33143 -131222 -524619 -725707 -531366 -308267 -393609 -392939 195275 927025 889293 139699
33133 139699 -300568 -11757 223162 -280594 -1054035 -1245268 -820703 -415760 -395600 -599299
33123e99299j66709J067K22915L78864L50902K51738K58360K41584n2067m83496
33113D03859n94664k25890K62965M04471M1351n69072q66595m22348M70529R17428
33103a77966M72007k51231m26940j10747P7686M630J2463Q5280j17700m29496
33093h62014k54738L74387O58543K34702k51257j79070J41207J30642q6666k9792
33083a24056K36005K53356J3768m5284J56023J66291k41796o43947n36016r838
33073g75494M09048M23139K13782Q6716Q4673L1423j51432l22961l34253k16853
33063e52212o1098J56143M32612N31091J96099m03894p38669n26562n1854K39056
33053g79288K25853N9338j31829k57087j78606J24065M06949M12858J98479J0195
$$ plain form
33123 -599299 -766008 -764941 -542026 -163162 187740 439478 697838 939422 887355 403859
33113 403859 -190805 -416695 -153730 250741 292092 -276980 -1143575 -1565923 -1095394 -177966
33103 -177966 294041 42810 -384130 -494877 -417191 -412561 -400098 -314818 -432518 -862014
33093 -862014 -1116752 -742365 -83822 150880 -100377 -279447 -138240 -7598 -94264 -124056
33083 -124056 111949 365305 379073 333789 489812 656103 414307 -229640 -765656 -775494
33073 -775494 -366446 56693 270475 357191 441864 473287 321855 -1106 -335359 -552212
33063 -552212 -613310 -457167 -24555 506536 702635 298741 -439928 -966490 -1018344 -779288
33053 -779288 -553435 -494097 -625926 -883013 -1061619 -937554 -530605 -117747 80732 90927
33043I0927p5785j56312k16761j26454O9404J25143m6920k11336j36690P6630
33033f08154J64954R6510R5023K65278L83907J88856k09512l86579j17811L08940
33023A81412M21601J21251k49174l54758j94554L7362J99366K15261L8594k27301
33013A89060l10846p3780K40170K56238n2236l22407k65529m998J26962J2619
33003b04747j45963j05116J39782L76464M17661K65708N9629o8043p1782j2692
$$ plain form
33043 90927 15142 -141170 -357931 -484385 -414981 -289838 -336758 -548094 -684784 -608154
33033 -608154 -443200 -346690 -251667 13611 397518 586374 376862 -9717 -127528 181412
33023 181412 603013 724264 475090 120332 -74222 -36860 162506 377767 416361 189060
33013 189060 -121786 -195566 44604 300842 248606 -73801 -339330 -344328 -217366 -204747
33003 -204747 -350710 -455826 -316044 60420 478081 743789 803418 735375 663593 650901
$$ [...]
##END NTUPLES=NMR SPECTRUM
##END=
