##TITLE=31Pdec_87-2021
 CDCl3, 24 sc
 31.08.2021
##JCAMPDX= 6.0         $$ Bruker NMR JCAMP-DX V2.0
##DATA TYPE= NMR SPECTRUM
##DATA CLASS= NTUPLES
##ORIGIN= UXNMR, Bruker Analytische Messtechnik GmbH
##OWNER= root
$$ XWIN-NMR		Version 3.5
$$ Tue Aug 31 12:05:40 2021 Russian Standard Time (UT+4h)  she@DPX200
##.OBSERVE FREQUENCY= 81.013821
##.OBSERVE NUCLEUS= ^31P
##.ACQUISITION MODE= SIMULTANEOUS
##.ACQUISITION SCHEME= undefined
##.AVERAGES= 24
##.DIGITISER RES= 16
##SPECTROMETER/DATA SYSTEM= spect
##.PULSE SEQUENCE= zgpg30
##.SOLVENT NAME= CDCl3
##.SHIFT REFERENCE= (INTERNAL, CDCl3, 0, 248.564)
##AUDIT TRAIL= $$ (NUMBER, WHEN, WHO, WHERE, WHAT)
$$ ##TITLE= Audit trail, XWIN-NMR		Version 3.5
$$ ##JCAMPDX= 5.01
$$ ##ORIGIN= Bruker BioSpin GmbH
$$ ##OWNER= she
$$ F:/spectra/data/she/nmr/P31/1/pdata/1/auditp.txt
$$ ##AUDIT TRAIL=  $$ (NUMBER, WHEN, WHO, WHERE, WHAT)
(   1,<2021-08-31 12:04:50.26 +0400>,<she>,<DPX200>,
      <created by zg, POWCHK disabled, PULCHK disabled
       configuration hash MD5:
       00 E9 B6 7A A2 85 ED C7 34 08 36 98 17 FE 4E 26
       data hash MD5: 32K
       D7 39 0F 7A 93 EA 23 98 6D EC 00 B8 15 1C BA 24>)
(   2,<2021-08-31 12:04:52.76 +0400>,<she>,<DPX200>,
      <Start of raw data processing
       efp BC_mod = 2 LB = 1 FT_mod = 6 PKNL = 1 PHC0 = -7676.797 PHC1 = -73.52672 SI = 64K 
       data hash MD5: 64K
       3F 60 0A C6 AC B6 0C B6 7A 2C AF 5C 3B AD D7 4E>)
(   3,<2021-08-31 12:05:15.23 +0400>,<she>,<DPX200>,
      <pk PHC0 = 13.31153 PHC1 = -10.8 
       data hash MD5: 64K
       C1 FC 08 DF 64 AF C9 2D 08 B8 78 D4 D3 DB B7 C1>)
(   4,<2021-08-31 12:05:19.48 +0400>,<she>,<DPX200>,
      <abs ABSG = 5 
       data hash MD5: 64K
       06 19 43 AA F7 C1 9B 28 01 65 5C 37 EA D0 F7 8B>)
$$ ##END=
$$ 
$$ hash MD5
$$ A2 AF E8 BA C4 5A 17 36 83 82 62 24 D6 6A E1 EA
##$RELAX= 
##$RELAX= 
##$RELAX= 
##$RELAX= 
##$RELAX= 
##$RELAX= 
##$RELAX= 
##$RELAX= 
$$ Bruker specific parameters
$$ --------------------------
##$DU= <F:/spectra>
##$EXPNO= 1
##$NAME= <P31>
##$PROCNO= 1
##$TYPE= <nmr>
##$USER= <she>
##$AMP= (0..31)
100 100 100 100 100 100 100 100 100 100 100 100 100 100 100 100 100 100 
100 100 100 100 100 100 100 100 100 100 100 100 100 100 
##$AQSEQ= 0
##$AQ_mod= 1
##$AUNM= <au_zg>
##$AUTOPOS= <>
##$BF1= 81.014009
##$BF2= 200.13
##$BF3= 200.13
##$BF4= 200.13
##$BF5= 200.13
##$BF6= 200.13
##$BF7= 200.13
##$BF8= 200.13
##$BYTORDA= 1
##$CFDGTYP= 0
##$CFRGTYP= 5
##$CHEMSTR= <none>
##$CNST= (0..31)
1 1 145 1 1 1 1 1 1 1 1 1 1 1 1 1 1 1 1 1 1 1 1 1 1 1 1 1 1 1 1 1 
##$CPDPRG= <waltz16>
##$CPDPRG1= <>
##$CPDPRG2= <waltz16>
##$CPDPRG3= <>
##$CPDPRG4= <mlev>
##$CPDPRG5= <mlev>
##$CPDPRG6= <mlev>
##$CPDPRG7= <mlev>
##$CPDPRG8= <mlev>
##$CPDPRGB= <>
##$CPDPRGT= <>
##$D= (0..31)
0 1 0 0 0 0 0 0 0 0 0 0.03 2e-05 3e-06 0 0 0 0 0 0 0 0 0 0 0 0 0 0 0 0 
0 0 
##$DATE= 1630397089
##$DBL= (0..7)
120 120 120 11 120 120 24 19 
##$DBP= (0..7)
150 150 150 150 150 150 150 150 
##$DBP07= 0
##$DBPNAM0= <>
##$DBPNAM1= <>
##$DBPNAM2= <>
$$ [...]
##$SUBNAM3= <"">
##$SUBNAM4= <"">
##$SUBNAM5= <"">
##$SUBNAM6= <"">
##$SUBNAM7= <"">
##$SUBNAM8= <"">
##$SUBNAM9= <"">
##$SW= 501.771253377433
##$SWIBOX= (0..15)
0 1 3 0 0 0 0 0 0 0 0 0 0 0 0 0 
##$SW_h= 40650.406504065
##$TD= 32768
##$TD0= 1
##$TE= 0
##$TE2= 300
##$TE3= 300
##$TEG= 300
##$TL= (0..7)
0 120 53 12 22 120 120 120 
##$TP= (0..7)
150 150 150 150 150 150 150 150 
##$TP07= 0
##$TPNAME0= <>
##$TPNAME1= <>
##$TPNAME2= <>
##$TPNAME3= <>
##$TPNAME4= <>
##$TPNAME5= <>
##$TPNAME6= <>
##$TPNAME7= <>
##$TPOAL= (0..7)
0.5 0.5 0.5 0.5 0.5 0.5 0.5 0.5 
##$TPOFFS= (0..7)
0 0 0 0 0 0 0 0 
##$TUNHIN= 0
##$TUNHOUT= 0
##$TUNXOUT= 0
##$USERA1= <user>
##$USERA2= <user>
##$USERA3= <user>
##$USERA4= <user>
##$USERA5= <user>
##$V9= 5
##$VALIST= <valist>
##$VCLIST= <CCCCCCCCCCCCCCC>
##$VD= 0
##$VDLIST= <DDDDDDDDDDDDDDD>
##$VPLIST= <PPPPPPPPPPPPPPP>
##$VTLIST= <TTTTTTTTTTTTTTT>
##$WBST= 1024
##$WBSW= 4
##$XGAIN= (0..3)
0 0 0 0 
##$XL= 0
##$YL= 0
##$YMAX_a= 2546
##$YMIN_a= -2868
##$ZGOPTNS= <>
##$ZL1= 120
##$ZL2= 120
##$ZL3= 120
##$ZL4= 120
##$ABSF1= 248.5645
##$ABSF2= -253.2056
##$ABSG= 5
##$ABSL= 3
##$ALPHA= 0
##$AQORDER= 0
##$ASSFAC= 0
##$ASSFACI= 0
##$ASSFACX= 0
##$ASSWID= 0
##$AUNMP= <proc_1d>
##$AZFE= 0.1
##$AZFW= 0.5
##$BCFW= 0
##$BC_mod= 2
##$BYTORDP= 0
##$COROFFS= 0
##$CY= -3
##$DATMOD= 1
##$DC= 0
##$DFILT= <>
##$DTYPP= 0
##$F1P= 0
##$F2P= 0
##$FCOR= 1
##$FTSIZE= 65536
##$FT_mod= 6
##$GAMMA= 0
##$GB= 0
##$INTBC= 1
##$INTSCL= 5.30512e-09
##$ISEN= 30
##$LB= 1
##$LEV0= 0
##$LPBIN= 0
##$MAXI= 10000
##$MC2= 0
##$MEAN= 0
##$ME_mod= 0
##$MI= 50
##$NCOEF= 0
##$NC_proc= -6
##$NLEV= 6
##$NOISF1= 182.463
##$NOISF2= 159.3651
##$NSP= 0
##$NTH_PI= 0
##$NZP= 0
##$OFFSET= 248.5645
##$PC= 4
##$PHC0= -7663.485
##$PHC1= -84.32672
##$PH_mod= 1
##$PKNL= yes
##$PPARMOD= 0
##$PSCAL= 0
##$PSIGN= 0
##$REVERSE= no
##$SF= 81.014009
##$SI= 65536
##$SIGF1= 159.3651
##$SIGF2= -187.1042
##$SINO= 113.3802
##$SIOLD= 16384
##$SREGLST= <1H.CDCl3>
##$SSB= 0
##$STSI= 65536
##$STSR= 0
##$SW_p= 40650.406504065
##$SYMM= 0
##$S_DEV= 0
##$TDeff= 32768
##$TDoff= 0
##$TI= <>
##$TILT= no
##$TM1= 0
##$TM2= 0
##$TOPLEV= 0
##$USERP1= <user>
##$USERP2= <user>
##$USERP3= <user>
##$USERP4= <user>
##$USERP5= <user>
##$WDW= 1
##$XDIM= 65536
##$YMAX_p= 511998910
##$YMIN_p= -16656770
$$ End of Bruker specific parameters
$$ ---------------------------------
##NTUPLES= NMR SPECTRUM
##VAR_NAME=  FREQUENCY,     SPECTRUM/REAL,   SPECTRUM/IMAG
##SYMBOL=    X,             R,               I
##VAR_TYPE=  INDEPENDENT,   DEPENDENT,       DEPENDENT
##VAR_FORM=  AFFN,          ASDF,            ASDF
##VAR_DIM=   65536,         65536,           65536
##UNITS=     HZ,            ARBITRARY UNITS, ARBITRARY UNITS
##FACTOR=    0.620285442955139, 1,           1
##FIRST=     20137.2065510759, 0,            0
##LAST=      -20513.1999529892, 0,           0
##MIN=       -20513.1999529892, -16656770,   0
##MAX=       20137.2065510759, 511998910,    0
$$ Real data points
##PAGE= N=1
##DATA TABLE= (X++(R..R)), XYDATA
$$ [...]
39031B40480j459841l64452M85630M61327r7846p33705r96643n07832L57272N68805
$$ 240480 -1219361 -1583813 -1098183 -636856 -734702 -1468407 -2465050 -2972882 -2615610 -2046805
39021b046805j38046p01843k24122P60623J191866R20365N05759K35066P6308
$$ -2046805 -2184851 -2886694 -3110816 -2350193 -1158327 -237962 267797 502863 579171
39012E79171N7547P0020j48016l64433L4264P94727P14205m39848j119209k28467
$$ 579171 636718 706738 558722 194289 228553 1023280 1737485 1297637 178428 -50039
39002e0039J002044Q93938M0099J88536J087641Q04715q47165j666049n17708
$$ -50039 952005 1845943 1886042 2074578 3162219 3966934 3119769 1453720 936012
38993I36012P86392L01362j143958j437764l31390O09145M65875j98523n94640
$$ 936012 1722404 2023766 879808 -557956 -889346 -280201 185674 -12849 -607489
38984f07489m51223K41912J077069J095888n3437j148949q22403L43309N64033
$$ -607489 -1058712 -816800 260269 1356157 1302720 153771 -668632 -325323 238710
38975B38710m56284j195175p72229j4779L53009Q03574J485895J331951r5167
$$ 238710 -217574 -1412749 -2184978 -2199757 -1846748 -1043174 442721 1774672 1679505
38966A679505j306589q99498K96361O18545Q9915j49794l1667k66518n29844q488
$$ 1679505 372916 -526582 -230221 388324 478239 328445 296778 30260 -499584 -508072
38956e08072O59088J91018p95312m53029R77295J148003n02031j542351m25867
$$ -508072 151016 342034 -453278 -906307 70988 1218991 716960 -825391 -1251258
38947a251258J002743O12326o55122p03431K64492O60060M89938Q13805J193471
$$ -1251258 -248515 363811 -291311 -994742 -730250 -70190 419748 1233553 2427024
38938B427024M10017q06182n36439R15233J108085o36455j989255j135884O73249
$$ 2427024 2837041 2030859 1494420 2409653 3517738 2881283 892028 -243856 429393
38929D29393J284463N66690j69430l34225k68589j72135r932L5675j56946l51549
$$ 429393 1713856 2280546 2111116 1776891 1508302 1336167 1326235 1361910 1204964 853415
38919H53415m06948m63792m03346Q2664O03615K55845q47827j280524j99678J353159
$$ 853415 446467 -17325 -420671 -338007 265608 521453 -326374 -1606898 -1806576 -453417
38909d53417J773160P82394o29964j447370j217692j22174R40778R79189J18883
$$ -453417 1319743 2102137 1472173 24803 -1192889 -1315063 -374285 604904 723787
38900G23787m69708k27873Q6994j77358m78847j51749L85314M14878J68178L36020
$$ 723787 254079 26206 113200 -64158 -543005 -694754 -309440 105438 273616 609636
38890F09636Q70909J114166P01107k72250j463888k156036j612263j52909Q63679
$$ 609636 1480545 2594711 3295818 3023568 1559680 -596356 -2208619 -2361528 -1497849
38881a497849P26488K19924J99579L41187J03067j41387N3307K35135K9568N7605
$$ -1497849 -771361 -551437 -351858 -10671 92396 -48991 4316 239451 269019 326624
38871C26624O38180O73584o00140j740755r02243J137931J853011O19133o29569
$$ 326624 964804 1638388 1038248 -702507 -1604750 -466819 1386192 2005325 1375756
38862A375756n29530k611k64696r04058q76635j60840N02118O97252M80709N0255
$$ 1375756 846226 843615 578919 -325139 -1201774 -1362614 -860496 -163244 317465 367720
38852C67720k83196k95402j92481k42679j78305L13302P32914L73497m04313o18757
$$ 367720 84524 -210878 -403359 -646038 -824343 -511041 221873 595370 191057 -427700
38842d27700k50796j22778k76816O5870Q15682Q66120J1035n44989j67161K28885
$$ -427700 -678496 -801274 -1078090 -1012220 -196538 669582 680617 135628 -31533 197352
38832A97352o8929l00509K79967R38738O77335q7562k84766J12202L08651P6147
$$ 197352 128423 -172086 107881 1046619 1723954 1636392 1351626 1463828 1772479 1848626
38822A848626j27986o0528J31645L23699L79571R8047l32082l60152K1505R7640
$$ 1848626 1720640 1660112 1791757 2115456 2495027 2593074 2260992 1900840 1922345 2019985
38812B019985l96635p60033n18581j99553k61785k56107J53829L62941m4362l52884
$$ 2019985 1623350 863317 344736 145183 -116602 -372709 -218880 144061 99699 -253185
38802b53185L3723M20044R6013k44124K17812O88091j3460j245726j405225m86135
$$ -253185 -219462 200582 296595 52471 270283 958374 944914 -300812 -1706037 -2192172
38792b192172J21914P5220L06001Q73877O74051l92994r21565k63942M57288L33019
$$ -2192172 -2070258 -1995038 -1689037 -815160 -141109 -534103 -1455668 -1719610 -1262322 -929303
38782i29303N4534M17886Q58231N27590k67504o99307n98283j70897N70922J297371
$$ -929303 -874769 -456883 401348 928938 661434 -37873 -636156 -807053 -236131 1061240
38772A061240J174638N8732r18942q03747j05093J85998P1208R4202J37569k37584
$$ 1061240 2235878 2294610 1375668 571921 466828 652826 724034 818236 955805 718221
38762G18221p22319n90683J34549P04197O65377K05818k98922n33572l29720L3932
$$ 718221 -4098 -594781 -460232 243965 909342 1115160 816238 282666 -47054 -13122
38752a3122N361l83006m04483J89175O39496L96858K507L426p8048o80366j012786
$$ -13122 -7761 -390767 -795250 -606075 33421 430279 432786 436212 358164 -322202 -1334988
38741a334988k22004R56404J151077M56371Q0742K57997J25631m43948n51600
$$ -1334988 -1556992 -600588 550489 1006860 1087602 1345599 1471230 1027282 475682
38732D75682M0844M65406K79694L9460K9010j89960n95130m84966R5353J52608
$$ 475682 516526 981932 1261626 1301086 1330096 1140136 545006 60040 155393 308001
38722C08001m49932m85664N46368J317306P07931m15354p26910n22375p89909
$$ 308001 -141931 -627595 -81227 1236079 1944010 1528656 801746 279371 -510538
38713e10538j199526p15681L89343Q27476L39343q4326N4601K04631K1383r4687
$$ -510538 -1710064 -2425745 -2036402 -1208926 -869583 -953909 -899308 -694677 -673294 -767981
38703g67981O5707J12394j60781m26813m20599j90234K11296N99947M75685k10119
$$ -767981 -702274 -589880 -750661 -1177474 -1598073 -1788307 -1577011 -977064 -501379 -711498
38693g11498n15681J73359P83881J3201j235052q61562R28703J473181k46413
$$ -711498 -1227179 -1053820 -269939 -256738 -1491790 -2353352 -1424649 48532 -197881
38684a97881j702998n55756J695955J922822r4410j720824j411237k32467M66600
$$ -197881 -1900879 -2456635 -760680 1162142 1067732 -653092 -2064329 -2296796 -1830196
38675a830196O96144P37955L08750m61802o75997o2164M37305J52551l16477k58731
$$ -1830196 -1134052 -396097 -87347 -549149 -1225146 -1287310 -850005 -697454 -1013931 -1272662
38665a272662N4642J80252L61210P03915N13097m72459j089329l07483R22873
$$ -1272662 -1218020 -1037768 -676558 27357 540454 67995 -1021334 -1328817 -405944
38656d05944R09575j08429k68929Q77658J472450K04824j491737j396786K94887
$$ -405944 503631 395202 126273 1003931 2476381 2681205 1189468 -207318 87569
38647H7569J288078M53301p45907n30306O74522R90716j80396j373334j162379
$$ 87569 1375647 1828948 1083041 552735 1227257 2217973 2037577 664243 -498136
38638d98136k3269N87222L16197M0094J71571R1436m56645o14174J87508J014189
$$ -498136 -521405 65817 382014 422108 593679 685115 228470 -385704 -198196 815993
38628H15993O83254l83741p60866j48572L50602M4357m95099n93189l60195o5522
$$ 815993 1499247 1115506 354640 206068 556670 601027 105928 -487261 -847456 -912978
38618i12978L40967O48497L24160m38027n91933J74343O95100K0457j032699j076168
$$ -912978 -572011 76486 400646 -37381 -629314 -454971 240129 260586 -772113 -1848281
38608a848281j86157M51752M27617L35405L78842J17748l41654k22492M93472
$$ -1848281 -2034438 -1582686 -1155069 -819664 -440822 -323074 -664728 -887220 -393748
38599c93748O70333l02989j314370q68478Q05890J838832R57356r14249j643378
$$ -393748 276585 -26404 -1340774 -2209252 -1403362 435470 1392826 478577 -1164801
38590a164801l73049J396518J568597L1877j283094j023940o1471J18749l42890
$$ -1164801 -1537850 -141332 1427265 1459142 176048 -847892 -909363 -790614 -1133504
38581a133504k46704M97119P72618K07197k58773L9L99230L26312Q1950Q1409
$$ -1133504 -1380208 -883089 -110471 96726 -162047 -162008 237222 563534 645484 726893
38571G26893J03985n9540j12006k2051l79719j229711j433901j94337J440084
$$ 726893 830878 771338 659332 637281 257562 -972149 -2406050 -2600387 -1160303
38562a160303J716396M98504o32095n24320K72120N70520J04490m03140l46944
$$ -1160303 556093 1054597 422502 -101818 170302 740822 845312 442172 95228
38553I5228K8078N3926l80440n91280o3478O70777O99775J26787l3870N26882
$$ 95228 123306 177232 -203208 -794488 -857966 -187189 512586 639373 605503 1132385
38543A132385Q49218K05010p18215q44265k35557K25795J82132k1287j39355j67048
$$ 1132385 1981603 2186613 1468398 624133 388576 614371 796503 775216 635861 468813
38533D68813N9213N59013O99394j13840j277937j444941l15497Q30319P60225
$$ 468813 528026 1087039 1786433 1672593 394656 -1050285 -1365782 -535463 224762
38524B24762j86609o91346j58551P31242J048256O81712K02126m0147k77557p34538
$$ 224762 38153 -653193 -811744 -80502 967754 1649466 1851592 1811445 1533888 799350
38514G99350j069807p96388j00403K47461j19552o54115n46884L48202J343839
$$ 799350 -270457 -1066845 -1167248 -919787 -1039339 -1693454 -2240338 -1892136 -548297
38505e48297J523411N83702p15621j145969l82228N20185M99614q0399j48139
$$ -548297 975114 1558816 843195 -302774 -685002 -164817 334797 254398 106259
38496A06259L22410L98256j03163k87623K34419O99425N31608J60689r122l08231
$$ 106259 428669 826925 723762 436139 670558 1369983 1901591 2062280 2053158 1744927
38486A744927q54112r76842l34919L37051L30359m2617k07524k01063j60618J41955
$$ 1744927 890815 -86027 -420946 -83895 246464 203847 -3677 -204740 -365358 -223403
38476b23403O41266P65860L84082l5719m89443j283222j587298j28167K067006
$$ -223403 417863 1183723 1567805 1532086 1042643 -240579 -1827877 -1956044 110962
38467A10962K060967n91182k410440r10262J576402J613208q0085m26517O75534
$$ 110962 2171929 1580747 -829693 -1739955 -163553 1449655 1369570 943053 1618587
38458A618587P00740p06893j270881k98012M01440J42794L44846J205910Q76136
$$ 1618587 2319327 1612434 341553 43541 444981 587775 932621 2138531 3014667
38449C014667r36326j768117l11344J332896J021100l11700p31035l42136l32582
$$ 3014667 2078341 310224 -1120 1331776 2352876 2041176 1310141 968005 635423
38440F35423p20459q58117p80006n76423J98086J256051J261943j062q32669k70519
$$ 635423 -85036 -943153 -1723159 -2299582 -2101496 -845445 416498 415436 -417233 -687752
38430f87752K85147l89310j070573k54164J074553J005447k11972q24817m06075
$$ -687752 -402605 -791915 -1862488 -2116652 -1042099 -36652 -248624 -1073441 -1479516
38421a479516L4989J18893L72823Q49912J046665Q57002M29976l32591j118320
$$ -1479516 -1444527 -1325634 -952811 -102899 943766 1800768 2230744 1898153 779833
38412G79833r64846K08081R25276K51485o70312n57309p8534l40683o98726r8954
$$ 779833 -185013 23068 948344 1199829 529517 -27792 -106326 -447009 -1145735 -1244689
38402a244689O47843K18128o16440j81960J043522J111696j11948q76299n41093
$$ -1244689 -596846 -378718 -995158 -1177118 -133596 978100 866152 -10147 -551240
38393e51240j61989j20646L41677J022983O33553p48266j340530m27737N67393
$$ -551240 -713229 -833875 -492198 530785 1164338 416072 -924458 -1352195 -784802
38384g84802M91873M1786J35393M50479M60200L97847L61481j27175q99348q71019
$$ -784802 -292929 -251143 -115750 334729 794929 1192776 1554257 1427082 527734 -343285
38374c43285J89615R50764M38774n35466p51697k80302J00955K37802M34998O80659
$$ -343285 -153670 797094 1235868 700402 -51295 -331597 -230642 7160 442158 1122817
38364A122817P81748P02701L17657m97953j232209j057371j03084N41613M31167
$$ 1122817 1904565 2607266 2924923 2426970 1194761 137390 34306 575919 1007086
38355A007086L12584O64287Q40780K88381m49922o62142m85442l18889r2372K08964
$$ 1007086 1319670 1983957 2824737 3113118 2663196 2001054 1515612 1196723 1104351 1313315
38345A313315J45476l62538o32041l02285p489k72788n77980l11611J37579J35000
$$ 1313315 1458791 1096253 464212 161927 154438 -118350 -696330 -1007941 -870362 -735362
38335g35362m2658K26596P04854O32683l4935n83502n44979p8371M54634P25088
$$ -735362 -778020 -551424 153430 786113 751178 167676 -377303 -455674 -1040 724048
38325G24048M95056k1800j33680M45724R59517M62960q39415j703928j303241
$$ 724048 1219104 1197304 1063624 1509348 2468865 2931825 2092410 388482 -914759
38316i14759j37416N87072K44529o02035q15590N5777J209387J478981O79797
$$ -914759 -1052175 -465103 -220574 -822609 -1638199 -1582422 -373035 1105946 1785743
38307A785743k96445o51984m67709k86418m01391o80387p17100j36439Q47298
$$ 1785743 1489298 837314 369605 83187 -318204 -998591 -1715691 -1852130 -1004832
38298a004832J278695M67210q81880j268514k73439Q85190R51013J25512m54558
$$ -1004832 273863 741073 -140807 -1409321 -1682760 -797570 153443 278955 -175603
38289a75603k31528K90150L54603j45428o01530m25663K24061O64202O30154N10681
$$ -175603 -407131 -116981 237622 92194 -509336 -934999 -710938 -46736 583418 1094099
38279A094099M74753J16980n46556o21004K59545R24209K78664q08286p57585
$$ 1094099 1568852 1685832 1139276 518272 777817 1702026 1980690 1172404 414819
38270D14819J27046J76571p16887p85839O16611J709791Q73292j048147k091055
$$ 414819 541865 718436 1549 -784290 -167679 1542112 2415404 1367257 -723798
38261g23798j612327l83476P19697J148067O61828k13346m13925K70417P78935
$$ -723798 -2336125 -2719601 -1999904 -851837 -190009 -403355 -817280 -546863 232072
38252B32072L67095k73056k11227K74926L25055j31339n03067n24772l62721j36420
$$ 232072 599167 326111 114884 389810 714865 583526 80459 -444313 -807034 -943454
38242i43454Q3444J64353J74711L24270M48466J54700l87996n46732k06477J77427
$$ -943454 -860010 -695657 -520946 -196676 251790 406490 18494 -528238 -734715 -557288
38232e57288M86962Q73354Q94431O4684q00968m57263N03245K65698j027317j109834
$$ -557288 -70326 803028 1697459 1762143 961175 503912 1007157 1272855 245538 -864296
38222h64296O06522J674579M78797j081734p90496L03282L5602j020669q03999
$$ -864296 -257774 1416805 1895602 813868 23372 326654 362256 -658413 -1462412
38213a462412M28692O55043k44827m33028M57056P27803k88942j136364p89267
$$ -1462412 -1033720 -378677 -623504 -1056532 -599476 128327 -160615 -1296979 -2086246
38204b086246p6336J47680L24552Q92519J246658Q01315p8855p49085r25419m84421
$$ -2086246 -2162582 -2014902 -1690350 -797831 448827 1250142 1171287 422202 -503217 -987638
38194i87638L45868O49359j32973r94945n85961N81839P91190j33481o13308J0681
$$ -987638 -641770 7589 -125384 -1120329 -1706290 -1124451 -333261 -466742 -1080050 -1069369
38184a069369N60270K32042j63030J19086N20570M45325K78488L39518J73746
$$ -1069369 -509099 -277057 -440087 -321001 199569 644894 923382 1262900 1436646
38175A436646l44636n01742p6455R3349l81346o30885o502Q24420J023281O86043
$$ 1436646 1092010 590268 513813 607162 225816 -405069 -411571 412849 1436130 2122173
38165B122173J55362n48276r94327m31372O73727O83582p56712j882697j451479
$$ 2122173 2277535 1729259 734932 303560 977287 1660869 904157 -978540 -2430019
38156b430019n40330l92131k10128J073789K308116J653384k87133j157496k83995
$$ -2430019 -2970349 -3362480 -3572608 -2498819 -190703 1462681 1175548 18052 -265943
38147b65943O84703N00117k39857n72734m69619k80287j32407j70796l96073k28559
$$ -265943 418760 918877 679020 106286 -363333 -643620 -776027 -946823 -1342896 -1571455
38137a571455P30879J607793J142893l44497j204992q01565k21300l07895l93395
$$ -1571455 -840576 767217 1910110 1565613 360621 -440944 -662244 -970139 -1363534
38128a363534L04029J192891J189107L47269l28107l10832j2281K1557k23041
$$ -1363534 -1059505 133386 1322493 1669762 1341655 1030823 1018542 1040099 817058
38119H17058l79843j99376J63684L00309K1259m08474o44886o75146n99754k82277
$$ 817058 437215 237839 401523 701832 723091 314617 -330269 -1005415 -1605169 -1887446
38109a887446L59343R41710J000971O18201J70475k94770q28849r98199l51648
$$ -1887446 -1528103 -586393 414578 1032779 1203254 908484 79635 -918564 -1270212
38100a270212O27620R14257L53435j49669J6002M61141O45735N63301K54019m71190
$$ -1270212 -642592 271665 625100 475431 491433 952574 1598309 2161610 2415629 1944439
38090A944439j307581j291253q9097J163923J137511K7673p93284o06235o259
$$ 1944439 636858 -654395 -743492 420431 1557942 1585615 792331 186096 179837
38081A79837K24065R8442L4713P8425l5230l14447m41554k60839j6436L0612j165
$$ 179837 403902 502344 537057 615482 580252 265805 -175749 -436588 -453024 -422412 -423577
38070d23577J46277L61142K68862j30022l66822k11026j843l570L5754K50905
$$ -423577 -277300 83842 352704 222682 -144140 -355166 -357009 -360579 -324825 -73920
38060g3920J81470l95161p14041n2200Q97470Q32624j72720p74262m66771j66292
$$ -73920 107550 -287611 -1001652 -1053852 -156382 676242 503522 -270740 -737511 -903803
38050i03803l82478l24241M65527J003902M66646k73929P45Q54903R57439K25001
$$ -903803 -1286281 -1610522 -1144995 -141093 325553 51624 52369 907272 1864711 2089712
38040B089712k60675j33453q5639m12666n71895l25044j43035k50464k78803q5278
$$ 2089712 1829037 1695584 1609945 1197279 625384 300340 157305 -93159 -371962 -457240
38030d57240L850n7075O1096K61229N4692m41087n09204m2367K57856J40257J94982
$$ -457240 -453390 -510465 -449369 -188140 -133448 -574535 -1083739 -1126106 -868250 -727993 -533011
38019e33011O39412Q23497M19069q310j71441o18477j375999j272512K96610J953658
$$ -533011 106401 929898 1348967 1340657 1169216 550739 -825260 -2097772 -1801162 152496
38009A52496J957724M98554q52934j306193j155384n45381N26287J279661P86051
$$ 152496 2110220 2608774 1755840 449647 -705737 -1251118 -724831 554830 1340881
38000A340881m60077r81657m13042J61940Q0184r1191O9876O0540l51587l90486
$$ 1340881 880804 -100853 -513895 -351955 -271771 -362962 -293086 -232546 -584133 -974619
37990i74619M54845J359893J221352J40331q45876r99065l52815M91762O70551
$$ -974619 -519774 840119 2061471 2201802 1355926 356861 4046 495808 1166359
37981A166359j75527j137902r11587K53560O40479l30614j007212p8262J175794
$$ 1166359 990832 -147070 -1058657 -805097 -164618 -495232 -1502444 -1580706 -404912
37972d04912Q38805n54585r59906j88799M2463o54416n95366Q50883J785107P39228
$$ -404912 433893 -120692 -1080598 -1269397 -1226934 -1881350 -2476716 -1625833 159274 898502
37962H98502q34349p68377N65522J148449M72279k44860m32431o46220q26032
$$ 898502 64153 -704224 -138702 1009747 1482026 1237166 804735 158515 -667517
37953f67517j89670Q49688O88610q34924j649118l80179J457076J588390J49767
$$ -667517 -857187 -7499 681111 -153813 -1802931 -2183110 -726034 862356 1012123
37944A012123q28069l78405N29151P56019K27051n55492j080621q89076q968P07032
$$ 1012123 184054 -194351 334800 1090819 1317870 762378 -318243 -1207319 -1216287 -509255
37934e09255N26277m6605K324N97575P72489K84089j64600k57345l70421n07925
$$ -509255 17022 -29583 -27259 570316 1342805 1626894 1462294 1204949 834528 326603
37924C26603k28570K38158J39512l70424l84810j4846l07680j014305m53390J523708
$$ 326603 98033 336191 475703 105279 -279531 -294377 -602057 -1616362 -2069752 -546044
37914e46044K522047J007853j143419j378310j73121K24531m34021m70350M54905
$$ -546044 1976003 2983856 1840437 462127 289006 513537 79516 -390834 64071
37905F4071P97846m9967p47130l14044M80967O94087N33340M24674J55147l40689
$$ 64071 861917 811950 64820 -249224 231743 925830 1459170 1883844 2038991 1698302
37895A698302n27668k58745j68445n05154n81896K5689O72909O39215J17296l30745
$$ 1698302 1170634 911889 743444 238290 -343606 -317917 354992 994207 1111503 780758
37885G80758n62089o02394k97471K90507O77238N15240m9057o64616r40880m73681
$$ 780758 218669 -383725 -681196 -390689 286549 801789 752732 88116 -852764 -1326445
37875a326445N87662J224900P04211k15950l22737J26023n0232o81329l37978
$$ -1326445 -738783 486117 1190328 974378 651641 777664 727432 46103 -291875
37866b91875J072270J713117N23795j177624j697888j085144k85699L85130Q33509
$$ -291875 780395 2493512 3017307 1839683 141795 -943349 -1229048 -843918 -10409
37857a0409N63875l07455n42071M71854J469855J075918j10671n35777j4755L68288
$$ -10409 553466 246011 -296060 175794 1645649 2721567 2610896 2075119 2060364 2428652
37847B428652J25329k39319l75620m36179m52783l04472j28530n8569J14076M11506
$$ 2428652 2553981 2314662 1939042 1502863 1050080 745608 617078 558509 672585 1084091
37837A084091L26303l28975q33424n57245N3750K52575J35186K15623M41377M31177
$$ 1084091 1410394 1081419 247995 -309250 -255500 -2925 132261 347884 789261 1220438
37827A220438J87277j02398m26483n96052k70015J89469j13427j004115j037820
$$ 1220438 1407715 1305317 878834 282782 12767 202236 88809 -915306 -1953126
37818a953126K73342J381380R56579j24906m10242j90491n33304j083316o97159
$$ -1953126 -1679784 -298404 658175 533269 123027 -67464 -600768 -1684084 -2381243
37809b381243M47667J148409J039861O01573n2607q35588q93655J70839J076157
$$ -2381243 -1933576 -785167 254694 856267 803660 -31928 -925583 -754744 321413
37800C21413O47625q0162L86977J121401K25223j520349j487960M13801J370576
$$ 321413 969038 888876 1275853 2397254 2622477 1102128 -385832 27969 1398545
37791A398545J87914r30121k29376Q54680M72087n45854m26401M88285N81944
$$ 1398545 1586459 656338 426962 1281642 1753729 1207875 781474 1269759 1851703
37782A851703k98845r37440q46853n44282k06289M21542J033203R80564L82313
$$ 1851703 1552858 615418 -231435 -775717 -982006 -560464 472739 1453303 1835616
37773A835616j4571m277q0869m64767p39769n69109k31577k44478o62983q77455
$$ 1835616 1821045 1816768 1735899 1271132 531363 -37746 -269323 -513801 -1176784 -2054239
37763b054239k10446J137042J948957J247692m09566j431813j013626P9688O22540
$$ -2054239 -2264685 -1127643 821314 2069006 1659440 227627 -785999 -706311 -83771
37754h3771L05170j89454j43037L64947N68758O3378m30192M0278J027240J006881
$$ -83771 221399 31945 -111092 253855 822613 885991 455799 496077 1523317 2530198
37744B530198l16802j321898q42492J46032L51624K39220O92389R59404j615j191158
$$ 2530198 2213396 891498 49006 195038 546662 785882 1478271 2437675 2436060 1244902
37734A244902r42293J24430N8765j002136j112701l2059M39930j66288k42605
$$ 1244902 302609 427039 485804 -516332 -1629033 -1661092 -1221162 -1387450 -1630055
37725a630055P00222J029101J16870l73816M12814Q65328j14447j023533m57166
$$ -1630055 -929833 99268 216138 -157678 255136 1120464 1006017 -17516 -474682
37716d74682M42100K32692k76378R3723M32920m17416j279845n38781P49377M54487
$$ -474682 -32582 200110 -76268 17455 450375 32959 -1246886 -1785667 -1036290 -581803
37706e81803q87435q64182P34593J536466M18281r20168q36108J5881K83040M4496
$$ -581803 -1469238 -2333420 -1598827 -62361 355920 -564248 -1400356 -1384475 -1101435 -1056939
37696a056939J63753O08925N98562m7330o12538n01737N995K42873J22032J22291
$$ -1056939 -893186 -284261 314301 266971 -345567 -847304 -841309 -598436 -476404 -354113
37686c54113K31335k73470j335717j382303N02276K390793J587023j294682k758944
$$ -354113 -122778 -396248 -1731965 -3114268 -2611992 -221199 1365824 71142 -2687802
37677b687802j322586O41129Q86966L74128P03785J073476J72704r05096l80479
$$ -2687802 -4010388 -3369259 -2482293 -2108165 -1404380 -330904 -158200 -1063296 -1443775
37668a443775R75737J053417j14554p12418k88439K0126o5230K09620O26967K30667
$$ -1443775 -468038 585379 470825 -241593 -530032 -509906 -575136 -365516 261451 492118
37658D92118n46471l21354O57170O61405n93712j411351q65169J4915L18738N18386
$$ 492118 -54353 -375707 281463 942868 349156 -1062195 -1927364 -1912449 -1593711 -1075325
37648a075325R60663R10209j7876r15013q97021k20526M99735J067508J222221
$$ -1075325 -114662 795547 777671 -137342 -1034363 -1254889 -755154 312354 1534575
37639A534575N39194o37302j175795n99896K75972N10016P0292m95291o78361
$$ 1534575 2073769 1436467 260672 -339224 -63252 446764 517056 21765 -656596
37630f56596k23217N51072P39908n2496q71400n77373N02867J130723R26077M01944
$$ -656596 -879813 -328741 411167 358671 -512729 -1090102 -587235 543488 1469565 1871509
37620A871509k59056j062826j320981m94051M76143L48377l10685n5014Q08474
$$ 1871509 1612453 549627 -771354 -1265405 -789262 -440885 -751570 -806584 1890
37611A890O89054l75255o80624J30863N14481q2190k91044M49482P20786k30086
$$ 1890 690944 315689 -364935 -234072 280409 198219 -92825 356657 1077443 847357
37601H47357r89545m63033K52169q684m00313K04136J058190Q79198L061m68854
$$ 847357 -142188 -605221 -353052 -361736 -762049 -557913 500277 1379475 1382536 913682
37591I13682n22798o82813o84081j65436L19496L09486L62903P33352M66284p29159
$$ 913682 390884 -291929 -976010 -1141446 -821950 -512464 -149561 583791 1050075 320916
37581C20916j212223J27262J555911R10077q19913r37395O27522J310939J71848
$$ 320916 -891307 -764045 791866 1701943 882030 -55365 572157 1883096 2054944
37572B054944p63467p5948P83104J46661j040659q63702M19927Q52716j30455
$$ 2054944 1291477 1215529 1998633 2145294 1104635 240933 660860 1513576 1383121
37563A383121r30662l20675P13942M89525q55804j494258m55948J051048J352849
$$ 1383121 452459 131784 845726 1335251 479447 -1014811 -1470759 -419711 933138
37554I33138M84431k30801k12771p6617k47350l60269j75161L2603K07647N63630
$$ 933138 1417569 1186768 973997 897380 650030 289761 114600 147203 354850 918480
37544I18480P29036P3744q80579q04425K80837P79131Q9397l55987L75469R54739
$$ 918480 1647516 1721260 840681 36256 317093 1096224 1185621 829634 1205103 2159842
37534B159842N2214j237399j099378Q3769N41787p07k97046P9081L24710J03548
$$ 2159842 2212056 974657 -124721 -40952 500835 500128 203082 282163 606873 710421
37524G10421r7574j74665m26534n51903q1272M50511K12587l82423l48575R7698
$$ 710421 612847 438182 11648 -540255 -621527 -171016 41571 -340852 -689427 -591729
37514e91729Q2190r7739L97402R07289Q1975j414286j425172K62784J451123R87782
$$ -591729 -509539 -607278 -209876 697413 779388 -634898 -2060070 -1797286 -346163 641619
37504F41619K28259K60128J81436o43123j004544j51490M54813l90122j247676
$$ 641619 869878 1130006 1311442 668319 -336225 -487715 -32902 -423024 -1670700
37495a670700l31405J276052J173806n12108j361128l80463Q68900R73946M04207
$$ -1670700 -2002105 -726053 447753 -64355 -1425483 -1805946 -937046 36900 441107
37486D41107P0908j15360m94815p08063l04974M31619Q61557P43859L20998M051
$$ 441107 512015 396655 -98160 -806223 -1111197 -679578 181979 925838 1246836 1250887
37476A250887N5589K68158J00303m94141p35614j07405O50781M78101m03395q26388
$$ 1250887 1306476 1574634 1674937 1180796 445182 337777 988558 1466659 1063264 236876
37466B36876m47133m5168j6309K12108Q83764J154493L33756r19753j443084j089949
$$ 236876 -210257 -255425 -271734 -59626 824138 1978631 2312387 1392634 -50450 -1140399
37456a140399o32136m82429l18450J04010M90779N23080L18901J53354Q6940J05366
$$ -1140399 -1772535 -2254964 -2573414 -2469404 -1978625 -1455545 -1136644 -983290 -896350 -790984
37446g90984K87748N19910L71487k50522n88643P9776J089437R05088o53208j763920
$$ -790984 -503236 16674 388161 137639 -451004 -371228 718209 1623297 970089 -793831
37436g93831r92354O32698J136166M08622j05391l6211l77221j093942o93858
$$ -793831 -1786185 -1153487 -17321 391301 285910 249699 -127522 -1221464 -1915322
37427a915322J060847K108059J041085o66945r76600k75214j66101n47930j71304
$$ -1915322 -854475 1253584 2294669 1627724 651124 375910 209809 -338121 -509425
37418e09425O55284L55575j043773j582960k74435J480441J906672Q74940n33393
$$ -509425 145859 501434 -542339 -2125299 -2399734 -919293 987379 1862319 1328926
37409A328926j293955r64870J4170M36530k81160j034227n43149N00834M34088
$$ 1328926 34971 -929899 -915729 -479199 -760359 -1794586 -2337735 -1836901 -1402813
37400a402813n67087o82770N43699J545940J384443Q92263O62979Q9615q47291
$$ -1402813 -1969900 -2652670 -2108971 -563031 821412 1713675 2376654 2466269 1618978
37391A618978r74025N704Q58510J021651J291233J704002J499226J995983N788768
$$ 1618978 644953 650657 1509167 2530818 3822051 5526053 7025279 9021262 14810030
37382A4810030J1133423J1249174K900229p517488j1031264p115908k805493k267695
$$ 14810030 25943453 37192627 40092856 32575368 21544104 14428196 11622703 9355008
37374I355008k894823j772180k95213n24984j445172j347902p25740n10617j03455
$$ 9355008 6460185 4688005 4392792 3867808 2422636 1074734 348994 -161623 -265078
37365b65078P55781O16952j060176k147978r22783J051732J346414K57861k99188
$$ -265078 490703 1107655 47479 -2100499 -3023282 -1971550 -625136 -367275 -666463
37356f66463p675R1551j02201K3013J45929k94888n50819K54069J132892N31608
$$ -666463 -674138 -582587 -684788 -661775 -515846 -810734 -1361553 -1107484 25408 557016
37346E57016r63362j347317k71504O92373P01730N22657O88582O85959K90143
$$ 557016 -406346 -1753663 -2025167 -1332794 -631064 -108407 580175 1266134 1556277
37337A556277Q9496K99855L97906J85341k0927l53434j204000j950283j337557
$$ 1556277 1645773 1945628 2343534 2528875 2507948 2154514 950514 -999769 -2337326
37328b337326N16634J859179J537333L26565m57400n45513l40311J0384M19192
$$ -2337326 -1820692 38487 1575820 1902385 1444985 899472 559161 569545 988737
37319I88737M58750j38869r66094j328053q70197K27679J240504J212345k2835
$$ 988737 1447487 1308618 342524 -985529 -1855726 -1628047 -387543 824802 801967
37310H01967j229741j010346L80567J359666J126949L86831j26365n81140j081548
$$ 801967 -427774 -1438120 -1057553 302113 1429062 1815893 1689528 1108388 26840
37301B6840r88940N49R87669R51967J36343m07583k45719J35251J66722k19941
$$ 26840 -962100 -961551 26118 978085 1114428 706845 461126 596377 763099 543158
37291E43158o85646p79296k90340M75240R56352R46005O57361K31726l35289p86842
$$ 543158 -142488 -921784 -1212124 -736884 219468 1165473 1822834 2054560 1719271 932429
37281I32429p48057l88863l13670o23597p22332k52027M14985Q16707Q72905N49300
$$ 932429 184372 -204491 -518161 -1141758 -1864090 -2116117 -1701132 -884425 -11520 537780
37271E37780j73498p70458m98979L93047P30481J52437k45710L06803R14039M50928
$$ 537780 364282 -406176 -905155 -512108 218373 370810 125100 431903 1345942 1796870
37261A796870o02860j007330o94261m45937k14717N80879J323809O17611j266995
$$ 1796870 1194010 186680 -507581 -953518 -1168235 -587356 736453 1354064 87069
37252H7069k128649p97752J095374J375391J93009o28601k98655L24662M45397
$$ 87069 -2041580 -2839332 -1743958 -368567 -175558 -804159 -1102814 -778152 -332755
37243c32755K55113J12438l1959j41552N8208M44905M61049k5009m97034o35894
$$ -332755 -77642 34796 2837 -138715 -80507 364398 825447 800438 303404 -332490
37233c32490o54562n66493J4280R30676J229054M88515l73254l84096R5386J52790
$$ -332490 -987052 -1553545 -1539265 -608589 620465 1108980 735726 351630 447016 599806
37223E99806j57419j57560Q5678j2359k23042K46733J146623J171783r9467j417249
$$ 599806 442387 284827 370505 358146 135104 381837 1528460 2700243 2600776 1183527
37213A183527j505685n59778L79353P00728M16631j20407k57207M10849J144380
$$ 1183527 -322158 -881936 -502583 198145 614776 494369 237162 648011 1792391
37204A792391O35505j037345k067067j261823K58867O80222l2606m58046K6718
$$ 1792391 2427896 1390551 -676516 -1938339 -1679472 -999250 -1031856 -1489902 -1463184
37195a463184N99916M93152L8357m899M98783R39590O66074j98956o86063j19709
$$ -1463184 -863268 -370116 -331759 -336658 162125 1101715 1767789 1568833 882770 763061
37185G63061P25044M16195j003469j743707o86691R91498J498506P90912J70352
$$ 763061 1488105 1904300 900831 -842876 -1529567 -538069 960437 1751349 1921701
37176A921701K49588N34844N71370L55048j11951p10383r53885o84911n62709
$$ 1921701 2171289 2706133 3277503 3632551 3520600 2810217 1856332 1171421 608712
37167F08712r91371j177869l34670P81976Q20983j11352o93527l98489O7607J38377
$$ 608712 -382659 -1560528 -1895198 -1113222 -292239 -403591 -1097118 -1495607 -1428000 -1289623
37157a289623j03052o20692j313598j346985N131J852429K402158J287429r1085
$$ -1289623 -1392675 -2013367 -3326965 -4673950 -4668819 -2816390 -414232 873197 782112
37148G82112o09513m87189k33623N2780J06667l99448q61786k07617J278376J936673
$$ 782112 172599 -314590 -548213 -495433 -388766 -788214 -1650000 -1857617 -579241 1357432
37138A357432J015221l24910q33415p38390q06057r66429o93267N3905R07568
$$ 1357432 2372653 2047743 1214328 475938 -330119 -1296548 -1989815 -1935910 -1028342
37129a028342J462393J249613J50643r53365r35316n1397L00051l03477p35834
$$ -1028342 434051 1683664 1834307 880942 -54374 -105771 194280 -109197 -845031
37120h45031k75186K99795K49229J21655N29199Q75867L97849m57984p59596m73420
$$ -845031 -1120217 -820422 -571193 -449538 79661 955528 1353377 895393 135797 -337623
37110c37623j94863j32325j64617l00643l94389n0255N92150P34626J69370k11117
$$ -337623 -532486 -664811 -829428 -1130071 -1524460 -1574715 -982565 -247939 -78569 -289686
37100b89686J91984P03780N49497Q3457k1183N4368j58545m46699m18958k52938
$$ -289686 -97702 606078 1155575 1239032 1217849 1272217 1113672 666973 248015 -4923
37090d923j12121L53287J057863J000985j81113j125890n18890Q13805J024620
$$ -4923 -117044 236243 1294106 2295091 2113978 988088 469198 1283003 2307623
37081B307623j08287j135425j178557p36374l84088q5231Q8068k32598q95539
$$ 2307623 2199336 1063911 -114646 -851020 -1235108 -1320339 -1232271 -1464869 -2360408
37072b360408j119592m64035O68586J528872J575441P79075j43975k42418L74366
$$ -2360408 -3480000 -3944035 -3275449 -1746577 -171136 607939 463964 221546 595912
37063E95912M14222o76077j523535p12690R27471J429964N63428j19000J04451
$$ 595912 1010134 334057 -1189478 -1902168 -974697 455267 1018695 899695 1004146
37054A004146L00875j40657m99906k44651J964k50862m56950k32703k21394q05518
$$ 1004146 1305021 1164364 664458 419807 421771 170909 -286041 -518744 -740138 -1545656
37044a545656j066043j62917J114770J402310P42003K75206L80733M09029R4847
$$ -1545656 -2611699 -2774616 -1659846 -257536 484467 759673 1140406 1549435 1644282
37035A644282p3098k0752l94186j257702j543109n31490Q54554J117655J48827
$$ 1644282 1571184 1550432 1156246 -101456 -1644565 -2176055 -1321501 -203846 -55019
37026e5019p48340o52199K0104M57034N27677M95596K97397k27918o94263m68108
$$ -55019 -803359 -1455558 -1435454 -978420 -450743 44853 342250 114332 -579931 -1048039
37016a048039L60810Q85633M90644l19070n17784J63436Q91890P66601k6840m55827
$$ -1048039 -687229 198404 689048 369978 -147806 15630 907520 1674121 1647281 1191454
37006A191454j02557J29368o91016j903235j909327m76901P78867O89089J07468
$$ 1191454 1088897 1218265 527249 -1375986 -3285313 -3762214 -2983347 -2294258 -2186790
36997b186790K86328Q14711N82624m6664J59633R10322O24707p91109j456485
$$ -2186790 -1900462 -1085751 -503127 -549791 -390158 520164 1144871 353762 -1102723
36988a102723m80946N08908k5031j052798p12769O74341J236580N78498J88949
$$ -1102723 -1583669 -1074761 -1099792 -2152590 -2865359 -2191018 -954438 -375940 -186991
36979a86991Q17040J284633N23578o34376p20463J74296O19960j8955p64168n76571
$$ -186991 630049 1914682 2438260 1803884 1083421 1257717 1877677 1858722 1094554 517983
36969E17983J27101J84426n25046r14008l59979L72174L54352j18827j41427L40024
$$ 517983 645084 829510 304464 -609544 -969523 -597349 -242997 -361824 -503251 -163227
36959a63227O20442M92566L78498K98486k09440r93454j153654l77920M64930
$$ -163227 457215 949781 1328279 1626765 1417325 423871 -729783 -1107703 -642773
36950f42773N44611J64404J13434M86100P00297L66227k89719p17246n75907j00042
$$ -642773 -98162 66242 179676 665776 1366073 1732300 1442581 725335 149428 49386
36940D9386J24035p5036j95293R4649L20803m685m80150m99217k96889l21293
$$ 49386 173421 98385 -96908 -2259 318544 313859 -166291 -665508 -962397 -1283690
36930a283690j45359P18451J441357Q84339l65239p18883j46934m1715n54688
$$ -1283690 -1429049 -710598 730759 1615098 1249859 530976 384042 342327 -212361
36921b12361l45093O71098P75808n30634j388731o68561J50455k42586o16064
$$ -212361 -557454 113644 889452 358818 -1029913 -1698474 -1548019 -1790605 -2406669
36912b406669L66058J395828P22565n37719j57230J249328J118937o88779j572437
$$ -2406669 -2040611 -644783 77782 -459937 -617167 632161 1751098 1062319 -510118
36903e10118m65731N58050j44364j219120p90422N08169Q17558O7453k49243K92287
$$ -510118 -975849 -417799 -562163 -1781283 -2571705 -2063536 -1245978 -1178525 -1427768 -1135481
36893a135481N44974j2193k48285P08639J724049J065203r26478j987671r59032
$$ -1135481 -590507 -602700 -850985 -142346 1581703 2646906 1720428 -267243 -1226275
36884a226275O69931R66921J29473l53528j86970k65582o55073m32315M45036
$$ -1226275 -556344 410577 540050 186522 -448 -266030 -921103 -1353418 -908382
36875i08382Q92221N74302L15677L16158j86080r68957n95108R96581J741901
$$ -908382 -16161 558141 873818 1189976 1003896 34939 -560169 436412 2178313
36866B178313N52232q18322n94768K09539j99922j197755r39409L30963P12264
$$ 2178313 2730545 1912223 1317455 1526994 1327072 129317 -810092 -479129 233135
36857B33135j33751o06219N9715P81025O24153K1462l75345n84404o43417k73890
$$ 233135 99384 -506835 -447120 333905 958058 979520 604175 19771 -623646 -897536
36847h97536M27330Q73898P87624L89560j66317p88974j029663n13002K96143
$$ -897536 -470206 403692 1191316 1580876 1414559 625585 -404078 -917080 -620937
36838f20937N25658J9329n99607q01289n19794O2425N66433N93599K69903J25464
$$ -620937 -95279 -75950 -675557 -1476846 -1996640 -1934215 -1367782 -774183 -504280 -378816
36828c78816J36274k99697j053446j057879o7859O14355J10724n77458k53667
$$ -378816 -242542 -542239 -1595685 -2653564 -2721423 -2107068 -1996344 -2573802 -2827469
36819b827469N33184O26977K68623L75540O71626K16068p54064j069525l74693
$$ -2827469 -2294285 -1667308 -1398685 -1023145 -351519 -135451 -889515 -1959040 -2333733
36810b333733O24604J240801J094640l296j397511j640119l19245J096308J339790
$$ -2333733 -1709129 -468328 626312 623016 -774495 -2414614 -2733859 -1637551 -297761
36801b97761J047102J084696P16916p38069j895101j214480K39318M07236l51839
$$ -297761 749341 1834037 2550953 1812884 -82217 -1296697 -1057379 -650143 -1001982
36792a001982j17137J023383J134774q2280q23855l50063M6528l47064n43491
$$ -1001982 -1119119 -95736 1039038 956758 132903 -217160 -170632 -517696 -1061187
36783a061187L1605M87423K48554R599K39647L82925J06588j42889k06970m11753
$$ -1061187 -1029582 -542159 -293605 -284006 -44359 338566 445154 302265 95295 -316458
36773c16458n16507N0023Q38754Q24472J64867j37162j53051o99110j268515n47776
$$ -316458 -832965 -782942 55812 880284 1045151 907989 754938 55828 -1212687 -1760463
36763a760463R24700J057515m12924j284679l63183P98427O65391K9879K21456
$$ -1760463 -835763 221752 -191172 -1475851 -1839034 -1040607 -375216 -345337 -123881
36754a23881Q50543Q03284J00757n40889q98530r55342m81073K41984L38029k63604
$$ -123881 726662 1529946 1630703 1089814 191284 -764058 -1245131 -1003147 -665118 -928722
36744i28722m48415L51139J171155J009438K32205k66373l45793l45074l55936
$$ -928722 -1377137 -1025998 145157 1154595 1386800 1120427 774634 429560 73624
36735G3624l64453m24993l57878J4070K66821q1827n14129j39592P27084R60498
$$ 73624 -290829 -715822 -1073700 -1059630 -792809 -874636 -1388765 -1528357 -801273 159225
36725A59225N07511L20259M25243j30117j178377j246790o5505O39698k09110
$$ 159225 666736 986995 1412238 1282121 103744 -1143046 -1208551 -568853 -777963
36716g77963j273452q32263P23703J653333J225184K38532k65791l0036L87330
$$ -777963 -2051415 -2883678 -2159975 -506642 718542 957074 691283 661247 1048577
36707A048577K57044m10809p70139l84613L449k48883m45178J75033P86546K58888
$$ 1048577 1305621 894812 124673 -259940 -256491 -505374 -950552 -775519 11027 269915
36697B69915p02223o81028j22430m34917j060168k00586J663916K010342M01755
$$ 269915 -432308 -1113336 -1235766 -1670683 -2730851 -2931437 -1267521 742821 1144576
36688A144576o68630J03548Q56872K966j140150q92973k6632l6484m73702n5635
$$ 1144576 475946 579494 1436366 1439332 299182 -593791 -620423 -656907 -1130609 -1186244
36678a186244R18900J170557N26442j53249m21707m26220k98127k24118m38804
$$ -1186244 -267344 903213 1429655 1276406 854699 428479 130352 -93766 -532570
36669e32570o11915j20255P38066R29069L57173L7548L35402N07744K62079J46809
$$ -532570 -1144485 -1264740 -526674 402395 759568 797116 1132518 1640262 1902341 2049150
36659B049150J19232m81548j226888q48749L89021P06205k54019p63273J923O95306
$$ 2049150 2168382 1686834 459946 -388803 218 706423 452404 -310869 -308946 386360
36649C86360M55779L52098R54625R31436l86894j351706o80179K99326j2832q16029
$$ 386360 842139 1194237 2148862 3080298 2693404 1341698 661519 960845 948013 131984
36639A31984o13200J01591O962n69162m72490M6952m4010n08240k59714P00384
$$ 131984 -481216 -379625 -372663 -941825 -1414315 -1367363 -1411373 -1919613 -2179327 -1478943
36629a478943J311685J022163J87973o20376q77956l09316N41023P36357L38334
$$ -1478943 -167258 854905 1042878 422502 -455454 -764770 -223747 512610 850944
36620H50944K87437O41883M25356m07126o32162M1903L43410k64964o53651k48979
$$ 850944 1138381 1780264 2205620 1798494 1166332 1208235 1551645 1286681 633030 384051
36610C84051q4846o11125o45134K57066O19999k87592q18087K90228J580403J248872
$$ 384051 299205 -311920 -957054 -699988 -79989 -367581 -1185668 -895440 684963 1933835
36600A933835K577m99425m22414q36020j361843q81225L36680J044487Q39812
$$ 1933835 1936412 1436987 1014573 178553 -1183290 -2064515 -1727835 -683348 156464
36591A56464K09706m34512p22261l33737J66601j93200r01709l40812J295735
$$ 156464 366170 -68342 -790603 -1124340 -957739 -1150939 -2052648 -2393460 -1097725
36582a097725J729185K35396r73353m05491L19631m03325j240748m50594R27391
$$ -1097725 631460 866856 -106497 -511988 -192357 -595682 -1836430 -2287024 -1359633
36573a359633J002030K93412M36096J120207Q72057k66830j079045j163361p55852
$$ -1359633 -357603 -64191 371905 1492112 2364169 2097339 1018294 -145067 -900919
36564i00919K10325J221067Q86474p79116j517657q4955J527987J131442l43970
$$ -900919 -690594 530473 1416947 637831 -879826 -964781 563206 1694648 1350678
36555A350678p85377k65845o4395n0335M67378Q08835K09603m35151k62574j75467
$$ 1350678 565301 299456 235061 184726 652104 1460939 1670542 1235391 972817 797350
36545G97350p68476n94173J070836J985495L61143j654010j192537N86806N95196
$$ 797350 28874 -565299 505537 2491032 2852175 1198165 5628 592434 1187630
36536A187630r57105j308793k3692P71725M25245L53774Q38384N90680m55503
$$ 1187630 230525 -1078268 -1101960 -330235 95010 448784 1287168 1877848 1422345
36527A422345q46631j81694M55068M78195J20369o52634j526795j167643O55237
$$ 1422345 575714 394020 849088 1327283 1447652 795018 -731777 -1899420 -1244183
36518a244183J659730K77874j343301n60454J247292R90506p36088p44823J086289
$$ -1244183 415547 693421 -649880 -1210334 36958 1027464 291376 -453447 632842
36509F32842J672877J55800q41978L9928Q35539j5403j233392j249807m57128
$$ 632842 2305719 2461519 1619541 1659469 2495008 2479605 1246213 -3594 -460722
36500d60722K26977P63016J056697O03820k95821p07048o71726r14635j078381
$$ -460722 -233745 529271 1585968 2189788 1893967 1186919 515193 -399442 -1477823
36491a477823k57023R12192R03186n0646k16420P18057J195325L90869p69694
$$ -1477823 -1734846 -822654 80532 29886 -186534 531523 1726848 2117717 1348023
36482A348023j338475j282774o88273L12450R58831P10884K80535M32911N72349
$$ 1348023 9548 -1273226 -1961499 -1649049 -690218 20666 301201 734112 1306461
36473A306461M3112l10337K99695P81698j3581r94406o60564J42588j53139q17828
$$ 1306461 1349573 1039236 1338931 2120629 2107048 1112642 452078 594666 441527 -376301
36463c76301k18813R73330R09306j22321m09838P7802J25080j58920K4541N0420
$$ -376301 -595114 378216 1287522 1165201 755363 833165 958245 799325 823866 874286
36453H74286q22863j312444j81888J017160L94240p28805j67242R53923K71545
$$ 874286 51423 -1261021 -1442909 -425749 -31509 -760314 -927556 26367 297912
36444B97912j184791p19905J017025J254064J94644K09552R13190J8739j584885
$$ 297912 -886879 -1606784 -589759 664305 858949 1068501 1981691 2000430 415545
36435D15545q54231J564493J840559m96202j776448n17681O11819M2141m37448
$$ 415545 -438686 1125807 2966366 2470164 693716 176035 787854 829995 392547
36426C92547J59596K34906p09163q72304J71080O36997K32839N61472J215506
$$ 392547 552143 787049 77886 -794418 -623338 13659 246498 807970 2023476
36417B023476L51k240738j941597R93426K400184O86260p46611K14638R36613
$$ 2023476 2023827 -216911 -2158508 -1165082 1235102 1921362 1174751 1389389 2326002
36408B326002o13243j998891q62128R62815J055380L42821L62165J25280j204520
$$ 2326002 1712759 -286132 -1148260 -185445 869935 1212756 1574921 1700201 495681
36399D95681j777501l01615J120964M11221r28219o01710O01691O17771l21487
$$ 495681 -1281820 -1583435 -462471 -51250 -979469 -1581179 -979488 -361717 -683204
36390f83204o43791k10633J83809M96571P49891L12439o10964n92361O11166J277611
$$ -683204 -1326995 -1537628 -1353819 -857248 -107357 205082 -405882 -998243 -387077 890534
36380H90534N34064k58238r0506Q5331m50328p78024l50829n6955j85250K11993
$$ 890534 1424598 1166360 1075854 1161185 710857 -67167 -417996 -474951 -660201 -448208
36370d48208R56172M67940j070185j194349Q39900K404632J439694n96325j374117
$$ -448208 507964 975904 -94281 -1288630 -448730 1955902 3395596 2799271 1425154
36361A425154q85151l46272o9201K9281l75385j057270j065405k60795N24131
$$ 1425154 540003 193731 124530 153811 -221574 -1278844 -2344249 -2605044 -2080913
36352b080913J035954J501843J282570r3269j076884m7970J477503P97467j380690
$$ -2080913 -1044959 456884 1739454 1646185 569301 521331 1998834 2796301 1415611
36343A415611j927813m68244M07931o4997m4207P84098N76452p39005j048844
$$ 1415611 -512202 -980446 -572515 -637512 -681719 102379 678831 -60174 -1109018
36334a109018k6445M75111K26304P06004J378411L23989j439199j025816R26355
$$ -1109018 -1135463 -660352 -434048 271956 1650367 1974356 535157 -490659 435696
36325D35696J019389p01786q24913Q60106P97717j535734k333272k69079J287606
$$ 435696 1455085 753299 -71614 788492 1586209 50475 -2282797 -2551876 -1264270
36316a264270M77504k99060M40444Q03834j9065r9101Q61918O36579q14485r53779
$$ -1264270 -786766 -1085826 -645382 158452 139387 40286 902204 1538783 724298 -229481
36306b29481J64398r6961j258231k04633K171231J643803j377333j954861L86000
$$ -229481 -65083 -162044 -1420275 -1624908 546323 2190126 812793 -1142068 -756068
36297g56068P68516j579870j561420J966213L388144L07949k261365j098689K19442
$$ -756068 12448 -1567422 -3128842 -1162629 2225515 2533464 272099 -826590 -607148
36288f07148p96750r77136J182881J777183o86291j655256R80778K621942M85052
$$ -607148 -1403898 -2381034 -1198153 579030 -107261 -1762517 -781739 1840203 2325255
36279B325255j416647j35263J149648J45719k95803J038921O89632j937344k300492
$$ 2325255 908608 773345 1922993 2068712 1772909 2811830 3501462 1564118 -736374
36270g36374M92374J455565n18427l89493K392573J831031k465905k935337J875039
$$ -736374 -244000 1211565 693138 303645 2696218 4527249 2061344 -873993 1001046
36261A001046L535295r71538l509122j10738J930952j107827k040812K248899
$$ 1001046 4536341 3564803 55681 -55057 1875895 768068 -1272744 976155
36253I76155L570496j479372l743863J072948L455703j520272l967607J575212
$$ 976155 4546651 3067279 -676584 396364 3852067 2331795 -1635812 -60600
36245f0600M672699q82361m252217J448201N023529q07768m101614K816646O697856
$$ -60600 4612099 3729738 -522479 925722 5949251 5141483 1039869 3856515 10554371
36236A0554371r34591n154613L976060J0017413J542312l206331Q389154J4739689
$$ 10554371 9619780 4465167 8441227 18458640 20000952 16794621 25183775 39923464
36228C9923464J569299l101983K0069803L4671070J3103801R971448Q4919096
$$ 39923464 41492763 38390780 58460583 93131653 106235454 116206902 201125998
36221B01125998J72827948J38044964k7321699j64430130j50837111n1080060
$$ 201125998 373953946 511998910 484677211 320247081 169409970 118329910
36215A18329910j441326k3651820l9052356j4352120O147131l994903j5247881
$$ 118329910 116888584 93236764 54184408 39832288 45979419 41984516 26736635
36208B6736635o384714K464716l669821q438753j023188L662580k902266o367031
$$ 26736635 20351921 22816637 19146816 10708063 9684875 13347455 10445189 4078158
36200D078158Q64797M909576j773366o009746K57801N261736N83023m057761q72162
$$ 4078158 4942955 9852531 8079165 2069419 2327220 7588956 8171979 4114218 3242056
36191C242056K141920j256140l364033J086675L927034m14850l956527m78952
$$ 3242056 5383976 4127836 763803 1850478 5777512 5362662 1406135 927183
36183I27183L049284K76611l021993q91184J904962K13219j743593K69357J902325
$$ 927183 3976467 4253078 1231085 339901 2244863 2458082 714489 983846 2886171
36174B886171p21789l050686r17014J679737O53614q36242M06356J315296n10696
$$ 2886171 2164382 -886304 -1803318 -123581 530033 -306209 100147 1415443 904747
36165I04747j539842M38796J531296o22696k076006k61145J197796o6042o32600
$$ 904747 -635095 -196299 1334997 712301 -1363705 -1624850 -427054 -493096 -1125696
36156a125696J308805J855578p62754k032293M67875K203861J2260k179631q68667
$$ -1125696 183109 2038687 1275933 -756360 -288485 1915376 1927636 -251995 -1120662
36147a120662R89677L87221k54395J088453J487848p60532j946311K16606J914289
$$ -1120662 -130985 256236 1841 1090294 2578142 1817610 -128701 87905 2002194
36138B002194J86121j689052n47636J039633L06213n48331M50573O19438j707042
$$ 2002194 2188315 499263 -48373 991260 1297473 749142 1199715 1819153 112111
36129A12111k860549k77886K291187J172975r31569k57557J454830J001619l44415
$$ 112111 -2748438 -3026324 -735137 437838 -493731 -751288 703542 1705161 1360746
36120A360746j68603J41642j159651j914246j32662J633913P10112q11672j80504
$$ 1360746 1192143 1333785 174134 -1740112 -1872774 -238861 471251 -340421 -520925
36111e20925R35107R7884j026763j44643J009247J77252q15160L22425J555312
$$ -520925 414182 512066 -514697 -659340 349907 527159 -288001 34424 1589736
36102A589736J94025j799255j092131J155228J506311L0196o30866k4685L30710
$$ 1589736 1783761 -15494 -1107625 47603 1553914 1584110 953244 928559 1259269
36093A259269J94607J81327j27378q37334o87708L09311K5777j737843j958382
$$ 1259269 1453876 1635203 1507825 670491 -17217 292094 317871 -1419972 -3378354
36084c378354L23403J603440j11187j472140K76290K191446J031201p36994L44975
$$ -3378354 -3054951 -1451511 -1562698 -3034838 -2758548 -567102 464099 -272895 72080
36075G2080K075923O62120j976720j436958J205920J328752j046544j627336M08933
$$ 72080 2148003 2810123 833403 -603555 602365 1931117 884573 -742763 -333830
36066c33830J407641l9951j160979l55672N80618M12360K61234O15349L59393
$$ -333830 1073811 1033860 -127119 -482791 97827 510187 771421 1386770 1746163
36057A746163n10601o06325k1718k71699j138246q12908O16757J078016J91155
$$ 1746163 1235562 629237 607519 335820 -802426 -1615334 -998577 79439 270594
36048B70594j79735N35080O86709l37490r20053j48153P05791N84468J92199K11981
$$ 270594 90859 625939 1312648 975158 55105 -93048 612743 1197211 1389410 1601391
36038A601391Q6823m53597n06775L49201J025486N05601o78283j316042j003310
$$ 1601391 1688214 1234617 727842 1077043 2102529 2608130 1929847 613805 -389505
36029c89505k28555L44389L67282O8257M3804M13909N27737m933n51705l97037
$$ -389505 -618060 -273671 93611 161868 205672 619581 1147318 1142385 590680 193643
36019A93643J27348K00661k85822p50117o96947k6352Q73764J101264J17453j191921
$$ 193643 320991 521652 235830 -514287 -1211234 -1237586 -363822 737442 854895 -337026
36009c37026j388890n11299J11286J16933M10936R80861N99547o30872p86371
$$ -337026 -1725916 -2237215 -2125929 -2008996 -1598060 -617199 -17652 -648524 -1434895
36000a434895P11392J725726O75710r59588j133324k71480J09894R2987N56974
$$ -1434895 -723503 1002223 1677933 718345 -414979 -686459 -576565 -483578 73396
35991G3396J084748P81846J37944J75483O41631O94977M39644K49132l57074j573786
$$ 73396 1158144 1939990 2077934 2253417 2895048 3590025 4029669 4278801 3921727 2347941
35981B347941k145163j039540O56373J178364N64259Q4204J1979l45117r41650
$$ 2347941 202778 -836762 -180389 997975 1562234 1646438 1658417 1313300 371650
35972C71650r02607N3937J184239J529006O25841j034580j988001j199012L03773
$$ 371650 -530957 -477020 707219 2236225 2862066 1827486 -160515 -1359527 -1055754
35963a055754N17735o15526j131037k31628N84085L06804O961N13973Q11624J98911
$$ -1055754 -538019 -1153545 -2284582 -2516210 -1932125 -1625321 -1618360 -1104387 -292763 -93852
35953i3852j34410O46784J240327M53167o56892o98751j97064j05040J03386R29643
$$ -93852 -228262 418522 1658849 2112016 1455124 756373 559309 454269 557655 1487298
35943A487298J235864J91413q43235m72606L04178n1676r16017q74887l07130
$$ 1487298 2723162 2914575 2071340 1598734 1902912 1851236 935219 60332 -246798
35934b46798l18556m96516k4301L24987l33903q57485J02012J354599Q96859o16390
$$ -246798 -565354 -1061870 -1086171 -761184 -1095087 -1952572 -1850560 -495961 400898 -215492
35924b15492q47534M56220J327775Q39032L6712k41512l21678m51530l64888q1608
$$ -215492 -1063026 -606806 720969 1560001 1596713 1355201 1033523 581993 217105 135497
35914A35497J54487M29008O56666L13917l78182k61447O64173O27951r82077k034566
$$ 135497 289984 718992 1375658 1689575 1311393 1049946 1714119 2342070 1359993 -674573
35904f74573r17923O53308M91294m00316Q3614J165814O78498p71413p90840M30425
$$ -674573 -1592496 -939188 -447894 -848210 -764596 401218 1079716 308303 -482537 -52112
35894e2112M97525p24396q01418Q16097J636939L00741j253707j031476K08500
$$ -52112 445413 -278983 -1080401 -264304 1372635 1673376 419669 -611807 -403307
35885d03307P42212L97166l4804k87902l92579j80331J76166J38882k51883m05784
$$ -403307 338905 736071 701267 413365 20786 -159545 16621 155503 -96380 -502164
35875e02164k72485k90939l24675P0298M76881J76878k95197J80369J160172J009677
$$ -502164 -774649 -1065588 -1390263 -1319965 -843084 -666206 -961403 -781034 379138 1388815
35865A388815l79691j145825k80467Q46920O68282k89887m13674N66289J274624
$$ 1388815 1009124 -136701 -417168 429752 1098034 808147 394473 960762 2235386
35856B235386N98427q63291j504861p08372L03669R9897q56749q71710K65180
$$ 2235386 2833813 1970522 465661 -242711 60958 160855 -695894 -1567604 -1302424
35847a302424Q60746J13534n35663N7520O96076j2625j053249o12632Q40223J284791
$$ -1302424 -441678 -328144 -863807 -806287 -110211 -122836 -1176085 -1788717 -948494 336297
35837C36297K87627o51797n21837K20794Q08417P97598o5421j283047j488885
$$ 336297 623924 -27873 -549710 -328916 479501 1277099 1211678 -71369 -1560254
35828a560254j79870J194370J160957K45592l27888o85388j316826j394767k09224
$$ -1560254 -1740124 -545754 615203 860795 532907 -152481 -1469307 -2864074 -3073298
35819c073298R06548M43246n20853L3364J519460J610125J05542q94490m93477
$$ -3073298 -2166750 -1723504 -2244357 -2210993 -691533 918592 1024134 129644 -363833
35810c63833M6535r9275l02026k35905l40322l80542K80059R56985M07057p43824
$$ -363833 -317298 -416573 -718599 -954504 -1294826 -1675368 -1395309 -438324 -31267 -775091
35800g75091o78662N18850R26820O3781m56671J15882N96827K80530j4530M6260
$$ -775091 -1453753 -934903 -8083 55698 -400973 -285091 311736 592266 577736 623996
35790F23996l70840j191731r76074N47325J617241J116084J71602P2707L79129
$$ 623996 253156 -938575 -1914649 -1367324 249917 1366001 1537603 1610310 1989439
35781A989439J59173m55123r10720j068308o93114M88834J666360J395760k29357
$$ 1989439 2148612 1693489 782769 -285539 -978653 -489819 1176541 2572301 2342944
35772B342944j360222r06155K16792Q19003Q33557M81938l08705j058389q81193
$$ 2342944 982722 76567 293359 1112362 1945919 2427857 2119152 1060763 179570
35763A79570n2744J16828n41481o84466J96427Q32236L06055n66767p98480n95754
$$ 179570 126826 243654 -297827 -982293 -785866 46370 352425 -214342 -1012822 -1608576
35753a608576l69503J07861P66223R01716M93892M23755P60873M10183q50521
$$ -1608576 -1978079 -1870218 -1103995 -202279 291613 715368 1476241 1886424 1035903
35744A035903j650536j180760m32066l31173k35864N85058J388183J114357M7621
$$ 1035903 -614633 -1795393 -2227459 -2558632 -2794496 -2209438 -821255 293102 340723
35735C40723p42589p66898j99990N06251O15566k49712j157456q11472L61883
$$ 340723 -401866 -1168764 -1368754 -862503 -246937 -496649 -1654105 -2465577 -2103694
35726b103694O53257j49618l49458P26320J462846O20276o83716r15072l66733
$$ -2103694 -1450437 -1600055 -1949513 -1223193 239653 859929 176213 -738859 -1105592
35717a105592j25650k43682k28750r8828J57687R00896J681537J233843l98487
$$ -1105592 -1231242 -1474924 -1703674 -1802502 -1644815 -743919 937618 2171461 1772974
35708A772974j351763o53929K84453J34129k76178R9672M14591k76939q30852
$$ 1772974 421211 -232718 51735 185864 -90314 9358 423949 147010 -683842
35699f83842O9562J206483O04766r65233r96061O86101J564351K91931j487626
$$ -683842 -614280 592203 1196969 231736 -764325 -78224 1486127 1778058 290432
35690B90432j761481o57375M46965Q40858O50445J27651m20028n75173k39728
$$ 290432 -1471049 -2128424 -1681459 -840601 -190156 -62505 -482533 -1057706 -1297434
35681a297434J99910L70430L03831K76829M90953Q65993J028674P12174J90553
$$ -1297434 -1097524 -727094 -423263 -146434 344519 1210512 2239186 2951360 3141913
35672C141913j01670l32452r30032j469030r62945M28866J181405M95989n49912
$$ 3141913 3040243 2707791 1777759 308729 -654216 -225350 956055 1452044 902132
35663I02132p37850m30782n11628o60791l5812J032233J383998P10751k37543
$$ 902132 164282 -266500 -778128 -1438919 -1474731 -442498 941500 1652251 1414708
35654A414708q27730r56553n97890J37487P10936O70974K14503k72054p04787
$$ 1414708 586978 -369575 -967465 -829978 -119042 551932 766435 494381 -210406
35645b10406q25679o4890J329150J896423P63059q95037j335341n50480J44031
$$ -210406 -1036085 -1100975 228175 2124598 2887657 1992620 657279 106799 250830
35636B50830K24295K34802L23994K4485n29620n32860J55904P09379N56782n714
$$ 250830 475125 709927 1033921 1058406 528786 -4074 151830 861209 1417991 1412277
35626A412277n32357q79958q75770l92219J71599K78110J21896K95365O60941
$$ 1412277 879920 -38 -875808 -1268027 -1096428 -818318 -696422 -401057 259884
35617B59884N33265l808o8712N12787P85795J79903n92892p72980p44812j138237
$$ 259884 793149 789341 720629 1233416 2019211 2199114 1606222 833242 88430 -1049807
35607a049807j471871p96595O13170J331090O81350l24102l62377N03868J068236
$$ -1049807 -2521678 -3318273 -2705103 -1374013 -692663 -1016765 -1379142 -875274 192962
35598A92962N91584m21685r89738o87961J49230Q42021Q74401L63093P8801N40389
$$ 192962 784546 362861 -626877 -1314838 -1165608 -323587 550814 913907 992708 1533097
35588A533097J068516M93086r57259j480108j45396J433905J094032q34637j966912
$$ 1533097 2601613 3094699 2137440 657332 511936 1945841 3039873 2205236 238324
35579B38324j137384L49612R27810O63568L66967J91843J1768J33376O31046P31701
$$ 238324 -899060 -549448 378362 1041930 1408897 1600740 1612508 1745884 2376930 3108631
35569C108631j41405j243708j366636m78871L21945K95553k14552m55843j27867
$$ 3108631 2967226 1723518 356882 -121989 199956 495509 280957 -174886 -302753
35560c02753M17575N51925O0522m46362j69212P26106J135288M45008o55981j155512
$$ -302753 114822 666747 727269 280907 111695 837801 1973089 2418097 1762116 606604
35550F06604r28250n26696l08825k87270l89626l65691J47373R89987J338201
$$ 606604 -321646 -848342 -1157167 -1444437 -1834063 -2199754 -2052381 -1062394 275807
35541B75807P00404l39175q64058p07812k91232J66599O33442Q13086M28737j98687
$$ 275807 976211 637036 -227022 -934834 -1226066 -1059467 -426025 387061 815798 617111
35531F17111m69499l06959j26238j41186k36662l89452n91383m14475N86654J835607
$$ 617111 147612 -159347 -285585 -426771 -663433 -1052885 -1644268 -2058743 -1472089 363518
35521C63518J875500J62052j775991j855511p1416J333478P15269q56904j191228
$$ 363518 2239018 2401070 625079 -1230432 -1301848 31630 746899 -110005 -1301233
35512a301233J8123J087096R62497L26487j39242p97335j544786j049676J012326
$$ -1301233 -1283110 -196014 766483 1092970 953728 156393 -1388393 -2438069 -1425743
35503a425743K428464J155280j405188k074095l51687J166017P94735k75132n64141
$$ -1425743 1002721 2158001 752813 -1321282 -1672969 -506952 287783 12651 -551490
35494e51490m98435q64832r97225p2368J068852J002213r9935p58434k81630N67089
$$ -551490 -1049925 -1914757 -2911982 -2984350 -1915498 -913285 -1013220 -1771654 -2053284 -1486195
35484a486195Q55518N45452J78272L2615j48364n86907p79788O3306J577936K072429
$$ -1486195 -630677 -85225 93047 125662 -22702 -609609 -1389397 -1326091 251845 2324274
35474B324274O86941j051642j151811N839M42956k52580o28455j89713j67502
$$ 2324274 3011215 1959573 807762 813601 1256557 1003977 375522 185809 18307
35465A8307r56851j128522k6897P70206n763j110162p63848N79413J161705N76626
$$ 18307 -938544 -2067066 -2093963 -1323757 -1329520 -2439682 -3203530 -2624117 -1462412 -885786
35455h85786j52608m05195l64638r9539M47860Q70034O84860N2912n11736o99331
$$ -885786 -1038394 -1443589 -1808227 -1907766 -1459906 -589872 94988 147900 -363836 -1063167
35445a063167l13128O15904J317125R10687j32828m27475J12058J08481p23231
$$ -1063167 -1376295 -760391 556734 1467421 1334593 907118 1019176 1127657 404426
35436D04426q35730M03614J312801O17731m21472k90782K58040q1963p00182m99491
$$ 404426 -431304 -27690 1285111 1902842 1481370 1190588 1448628 1366665 666483 166992
35426A66992j96456p82299j145710R0462J592087J111757o29011r54155L92479
$$ 166992 -29464 -811763 -1957473 -1867011 -274924 836833 207822 -746333 -353854
35417c53854J071880K20936m92765j65251Q2597k42877m7316P39258M15101j344502
$$ -353854 718026 938962 446197 280946 363543 120666 73350 812608 1227709 -116793
35407a16793k180277n33372J739262K054311O50638m14780m07350j39411n0578
$$ -116793 -2297070 -2830442 -1091180 963131 1613769 1198989 791639 652228 601650
35398F01650R6729J57937k11216o14341l53419M26235R35763Q04289K36916m83260
$$ 601650 698379 856316 645100 30759 -322660 103575 1039338 1843627 2080543 1597283
35388A597283j003662q82873k06902K27447p2375n69324n25405l9205L00686L01164
$$ 1597283 593621 -289252 -496154 -268707 -341082 -910406 -1435811 -1475016 -1174330 -873166
35378h73166J55874L496l2053J81985L98820J45968l88820l53791M27838R29971
$$ -873166 -717292 -713796 -745849 -563864 -165044 -19076 -407896 -761687 -333849 596122
35368E96122L76269n51467p30955j39352M73528Q21036J021752Q16543q6212j173286
$$ 596122 972391 420924 -310031 -449383 24145 845181 1866933 2683476 2597264 1423978
35358A423978j631511j475131j227566p62158L87634J678195J845720P93389o9951
$$ 1423978 -207533 -1682664 -2910230 -3672388 -3284754 -1606559 239161 1032550 962599
35349I62599J19464M70078n6917q95067q32884L0668N88416N57940O07929P57927
$$ 962599 1082063 1552141 1495224 600157 -232727 -202059 386357 944297 1552226 2310153
35339B310153J74239j080432j545663m17967J059865J300778N26144M022q4990
$$ 2310153 2484392 1403960 -141703 -559670 500195 1800973 2327117 2331139 2246149
35330B246149n18271j209913j198964m49510k5909j95638K4903Q90267J134292
$$ 2246149 1727878 517965 -680999 -1130509 -1156418 -1352056 -1327153 -436886 697406
35321F97406R1222q94605m76332N19613M89762l23862m20010L05640M64937l06417
$$ 697406 788628 -105977 -582309 -62696 427066 103204 -316806 -11166 453771 147354
35311A47354o80644N3829P43265K95871n35923m53419L13559N59937J43949M6724
$$ 147354 -533290 -479461 263804 559675 23752 -429667 -116108 443829 587778 634502
35301F34502N10489N11756m97972j455990j103097J73758Q96281N57989O2730
$$ 634502 1144991 1656747 1158775 -297215 -1400312 -1226554 -330273 227716 290446
35292B90446R1003J70627j71142l74154J59115P76596M01789p35626j346504r33032
$$ 290446 381449 552076 380934 6780 165895 942491 1344280 608654 -737850 -1670882
35282a670882k63308M1655K43865N58435N83447J26904k92546k69064p9243k956
$$ -1670882 -1934190 -1892535 -1648670 -1090235 -506788 -379884 -672430 -941494 -1020737 -1023693
35272a023693J67749N07120N93440K32434j45152k12023j70169j26779J33834
$$ -1023693 -855944 -348824 244616 477050 331898 119875 -50294 -177073 -43239
35263d3239M22165J40405n76311p59988j64841K14800j73509m77690k2898M11423
$$ -43239 378926 519331 -56980 -816968 -981809 -767009 -940518 -1418208 -1441106 -1029683
35253a029683K8141m52198n7933O43369N51106p74N1387M50268O9066r12140j117172
$$ -1029683 -1001542 -1453740 -1511673 -868304 -317198 -317972 -266585 183683 252749 -659391 -1776563
35242a776563k74045L33051O074l59442L2881N43844K67725m52177o03925n6414
$$ -1776563 -2050608 -1717557 -1711483 -2070925 -2038044 -1494200 -1226475 -1678652 -2282577 -2338991
35232b338991L27355j1671n59620m53515L40463R77743R14183N98735N36941K86419
$$ -2338991 -2011636 -2023307 -2582927 -3036442 -2695979 -1718236 -804053 -205318 331623 618042
35222F18042o11356j193184j65552J612650J721024k00299j542987n83123Q83796
$$ 618042 6686 -1186498 -1352050 260600 1981624 1781325 238338 -344785 539011
35213E39011N26428q39927r49823J1532P1011p85237n90359R61423J775309P59631
$$ 539011 1065439 225512 -724311 -712779 -641768 -1427005 -2017364 -1055941 719368 1478999
35203A478999n96219q39644m70329k62054K16281J129081J245177j73352j695158
$$ 1478999 882780 43136 -427193 -689247 -472966 656115 1901292 1727940 32782
35194C2782j504104N4427J133499R11617J26323m46508p40843p74510m04007J47182
$$ 32782 -1471322 -1416895 -283396 628221 754544 308036 -432807 -1207317 -1611324 -1464142
35184a464142L15365J960j73555K82918R45206Q72863j80432j266364j245436
$$ -1464142 -1148777 -1146817 -1320372 -1037454 -92248 780615 600183 -666181 -1911617
35175a911617j63388Q31196R60945O00516L80709K47357q6474l98205l42882j18060
$$ -1911617 -2075005 -1243809 -282864 317652 698361 945718 859244 461039 118157 97
35165I7r6352j88906j45065p1299j42145k55575l74309n84921n07832M00225J546114
$$ 97 -96255 -285161 -430226 -501525 -643670 -899245 -1273554 -1858475 -2366307 -1966082 -419968
35154d19968J482468J67048n72739J45369O79619l88792j646494j075576N34280
$$ -419968 1062500 1229548 656809 802178 1481797 1093005 -553489 -1629065 -1094785
35145a094785Q83132j44082p24656l61483j66054k69807K59548J036048O76232
$$ -1094785 -211653 -355735 -1080391 -1441874 -1607928 -1877735 -1618187 -582139 94093
35136I4093m30296m79760M20887K57033j116946j360387K90953J496270P14848
$$ 94093 -336203 -815963 -395076 -138043 -1254989 -2615376 -2324423 -828153 -113305
35127a13305l47895M4921P73104K98780m73276j67272L42374k50821r31650j54976
$$ -113305 -461200 -416279 356825 655605 182329 15057 357431 106610 -825040 -980016
35117i80016J050543O41474q22527j071447M950L97322k88597k04277J170768
$$ -980016 70527 712001 -110526 -1181973 -1177023 -779701 -1068298 -1272575 -101807
35108a01807J731397J94477j546688j190491N68370J310786M86057l08998k22109
$$ -101807 1629590 1824067 277379 -913112 -344742 966044 1452101 1143103 920994
35099I20994k24390r24339j180372n9727J157681O59820q70484r60161Q56830
$$ 920994 696604 -227735 -1408107 -1467834 -310153 349667 -520817 -1480978 -624148
35090f24148K133301J197866l91558n79462l6239m45792j136630k77999J429845
$$ -624148 1509153 2707019 2315461 1735999 1699760 1253968 117338 -160661 1269184
35081A269184J448934l29951j220842j40263P50308j43934j310581r44262K50897
$$ 1269184 2718118 2388167 1167325 1027062 1777370 1633436 322855 -621407 -370510
35072c70510Q80147J217082J734785J323530p13069k523336k011503o1531Q92478
$$ -370510 509637 1726719 3461504 4785034 4071965 1548629 -462874 -524405 368073
35063C68073M78572J65681K92786p2203p24920l94064P14382Q48556l93992j242849
$$ 368073 846645 1012326 1305112 1232909 507989 113925 828307 1676863 1282871 40022
35053D0022n13776O61617P71167N8566l49281k88988l46024n16518k65203L31051
$$ 40022 -473754 187863 959030 1017596 668315 379327 33303 -483215 -748418 -417367
35043d17367N00581k1142m26752Q3111J025028J105605L9019q59734m52463N08350
$$ -417367 83214 62072 -364680 -281569 743459 1849064 1888083 1028349 575886 1084236
35033A084236M49752o16230j101078l10849N40094K94630m82204o28478j30037
$$ 1084236 1533988 917758 -183320 -494169 45925 340555 -141649 -770127 -900164
35024i00164K09123Q3110k11446m11479l18898K36492Q81315P98434r7583q02800
$$ -900164 -691041 -607931 -819377 -1230856 -1549754 -1313262 -431947 366487 268904 -533896
35014e33896n99272M711K91920L90653N86128M90623j82776p53625m28493N06537
$$ -533896 -1133168 -1128457 -836537 -445884 140244 630867 448091 -305534 -734027 -227490
35004b27490J130496J041172M57819k55563o37860l54543J60920L7283o85767
$$ -227490 903006 1944178 2401997 2146434 1508574 1154031 1314951 1352234 666467
34995F66467r87067n20906j42035k39511M4969J084123J665340P83486o63533
$$ 666467 -320600 -841506 -983541 -1223052 -1178083 -93960 1571380 2354866 1691333
34986A691333j208991q21805l86095j64509J4928m2283l51063k88095K83368M53770
$$ 1691333 482342 -339463 -725558 -890067 -875139 -917422 -1268485 -1556580 -1273212 -819442
34976h19442j53239m81052J19565N52054r8712p39781r4768R81983R72557K91032
$$ -819442 -972681 -1453733 -1334168 -782114 -880826 -1620607 -1715375 -733392 239165 530197
34966E30197K65188N29641k14379j517132j647608m02927P49315J095785J149137
$$ 530197 795385 1325026 1110647 -406485 -2054093 -2457020 -1707705 -611920 537217
34957E37217R30076n8153j181364j095256N9440P69195N21632K18782K12683r3878
$$ 537217 1467293 1409140 227776 -867480 -808040 -38845 482787 701569 914252 820374
34947H20374n33293p3651J177744J715362Q72037l09346q54636r51287q93196
$$ 820374 287081 213430 1391174 3106536 3978573 3669227 2814591 1863304 970108
34938I70108m83578Q3183J57459j98799k82034r3947j90018k29305N94561J643856
$$ 970108 486530 569713 727172 528373 246339 152392 -37626 -266931 327630 1971486
34928A971486J349796j10641p97857j90310r2207j412725k319556j133371Q34561
$$ 1971486 3321282 3210641 2412784 2222474 2130267 717542 -1602014 -2735385 -1900824
34919a900824J239854J57320m38293J52140O84599K80384l20830j49191N38489
$$ -1900824 -660970 -503650 -941943 -789803 -105204 175180 -145650 -294841 243648
34910B43648P71048K42664l76899m09799n4971l3563m96568q12511n75504j66486
$$ 243648 1014696 1257360 880461 470662 415691 382128 -114440 -926951 -1502455 -1668941
34900a668941M3535K82177O11446M61582k56466n16845K59818R59811M38766m91468
$$ -1668941 -1625406 -1343229 -731783 -270201 -526667 -1043512 -783694 176117 614883 123415
34890A23415l77647L95442L82875k67399j21995Q50075J148358L35597m08275
$$ 123415 -254232 141210 524085 256686 134691 984766 2133124 2468721 2060446
34881B060446n16153o98986j094540q63257l4428L00288L8434K10912P19247K78833
$$ 2060446 1544293 845307 -249233 -1112490 -1146918 -846630 -808196 -597284 121963 400796
34871D00796q71855q29244N60259R42587n69841j520349j16721J563078R08380
$$ 400796 -471059 -1300303 -740044 202543 -367298 -1887647 -2004368 -441290 467090
34862D67090r06838r61421O24587J211003J34229n97798m6889K87816n13132j043156
$$ 467090 -439748 -1401169 -776582 434421 568650 -29148 -76037 211779 -301353 -1344509
34852a344509o8632J232243J116166N4331q0828R81962J472852L15607j193603
$$ -1344509 -1413141 -180898 935268 989599 908771 1890733 3363585 3679192 2485589
34843B485589j281341k29994K98852o4152j08765M91565L95939q86536j622035
$$ 2485589 1204248 974254 1273106 1208954 1100189 1591754 1987693 1101157 -520878
34834e20878n14748R25443O81948n04113n88287J80106k7377r92500p22496P75089
$$ -520878 -1035626 -110183 571765 67652 -520635 -340529 -367906 -1360406 -2082902 -1307813
34824a307813J253560J22246o29629r3679J78436n18325n57550P55739J476677
$$ -1307813 -54253 67993 -561636 -655315 -476879 -995204 -1552754 -797015 679662
34815F79662L54276q95321n88610K11399J3218m73207j23061M30154M41750O24420
$$ 679662 1033938 138617 -449993 -238594 -225376 -698583 -821644 -391490 50260 674680
34805F74680J115637L96249j611981k157523L7041J955476Q87405r87657l57408
$$ 674680 1790317 2186566 574585 -1582938 -1545897 409579 1296984 309327 -48081
34796d8081J468929J000479j194814j570036J90475R67153j46682p21087K45400
$$ -48081 1420848 2421327 1226513 -343523 -153048 814105 667423 -53664 191736
34787A91736Q07601l5263q41347q62374j082175j431599m92024J280980J535932
$$ 191736 999337 964074 122727 -739647 -1821822 -3253421 -3745445 -2464465 -928533
34778i28533N4662o66928K53024P56124p1092k87360J034756J811775O66524o55565
$$ -928533 -873871 -1540799 -1287775 -531651 -602743 -890103 144653 1956428 2622952 1967387
34768A967387n63682j94730o55088p65923J88752M68841q79669j687117l10606
$$ 1967387 1403705 1208975 553887 -212036 -23284 445557 -434112 -2121229 -2431835
34759b431835J155311L95536r86277l41564J228951Q69695q35132q02487J208868
$$ -2431835 -1276524 -880988 -1867265 -2208829 -979878 -110183 -945315 -1747802 -538934
34750e38934K207312Q39363r28968j345353r51507n49799J56847J101644J303083
$$ -538934 1668378 2507741 1578773 233420 -718087 -1267886 -1111039 -9395 1293688
34741A293688N65284r7547k43768m67734p45234j94629J006956J292827K4789
$$ 1293688 1858972 1761425 1517657 1049923 304689 110060 1117016 2409843 2434632
34732B434632j391245j468894m52229N07196Q51540O44973N2560n90160q51427
$$ 2434632 1043387 -425507 -877736 -370540 481000 1125973 1178533 588373 -263054
34723b63054p15119m91149j90338L52160Q39116P75709K57912k32257n53234o79369
$$ -263054 -978173 -1469322 -1659660 -1307500 -468384 307325 565237 332980 -220254 -899623
34713h99623k48529P15464J221841O05996k30304j96906J03983m62670j232528
$$ -899623 -1148152 -432688 789153 1395149 1164845 967939 1071922 609252 -623276
34704f23276o66576P89751J128723O0167n69003K3907M24539j79538n11513L14166
$$ -623276 -1289852 -500101 628622 688789 119786 143693 568232 388694 -122819 191347
34694A91347J017881L40105q23564j028685m74477o2921K97845Q64887Q68500
$$ 191347 1209228 1549333 725769 -302916 -777393 -840314 -542469 322418 1190918
34685A190918j43423r13856k07229J015875R64904k01765q09669l46073J29243
$$ 1190918 1047495 133639 -73590 942285 1907189 1705424 895755 549682 678925
34676F78925j0419k45203j79567r8583j91639l12214m12950l41420L40921J359900
$$ 678925 668506 423303 243736 145153 -46486 -358700 -771650 -1113070 -772149 587751
34666E87751J312715m01459k019520j503736M11407J240620M32311k09102K40140
$$ 587751 1900466 1499007 -520513 -2024249 -1612842 -372222 60089 -149013 91127
34657I1127N90966M7895m00909p1602L0119q03610j418478p28813L04726K96264
$$ 91127 682093 729988 329079 257477 287596 -516014 -1934492 -2663305 -2358579 -2062315
34647b062315k09735J66929J111778J152952K50304j22681N27400R36197J85689
$$ -2062315 -2272050 -2105121 -993343 159609 409913 287232 814632 1750829 1936518
34638A936518r04379j152369o66863l19707k98962m1987O69885J240812R77999
$$ 1936518 1032139 -120230 -787093 -1106800 -1405762 -1447749 -777864 462948 1440947
34629A440947o961p67805m63036O45292J317882O73182p51335j570257j116694
$$ 1440947 1433986 666181 203145 848437 2166319 2839501 2088166 517909 -598785
34620e98785j10256K97548j38020o03626l69479K10478J94249m86696p08177K22006
$$ -598785 -709041 -411493 -549513 -1153139 -1522618 -1312140 -1117891 -1604587 -2312764 -2090758
34610b090758J238062Q30322n92370j034434J35083J064411J42724j462034j442184
$$ -2090758 -852696 -22374 -614744 -1649178 -1514095 -449684 -306960 -1768994 -3211178
34601c211178K69587J492841R85462q2959k10599L83835O12458L29969J92620
$$ -3211178 -2941591 -1448750 -463288 -546247 -756846 -373011 239447 569416 762036
34592G62036K78627j1634p38268j055683l98827N65146P12502k3144n07352N2125
$$ 762036 1040663 1029029 290761 -764922 -1163749 -598603 113899 90755 -416597 -364472
34582c64472R36718Q53127k04617q56498k81720O04890N36623k42614m66984J47170
$$ -364472 572246 1425373 1220756 364258 82538 687428 1224051 981437 514453 661623
34572F61623N25077m3004q56590r26323l26085J90594L48181M23258N04451L91242
$$ 661623 1186700 1143696 287106 -639217 -965302 -774708 -426527 -3269 501182 892424
34562H92424J21794j3308L724r8855l24052l50659j61776j77894m86939m93780
$$ 892424 1014218 1000910 1004634 905779 581727 231068 69292 -108602 -595541 -1089321
34552a089321J74682Q80337P83037J31747j17650J48528R5693m45229m75382M37576
$$ -1089321 -914639 -34302 748735 880482 762832 911360 1007053 561824 86442 524018
34542E24018J085060L41803r50547j177278l84654N2471j63830K1010Q19127R97817
$$ 524018 1609078 1950881 1000334 -176944 -561598 -509127 -672957 -651947 167180 1164997
34532A164997K9363q26736m56702M77582P90257M40103j9292n06698r08708o20478
$$ 1164997 1194360 367624 -89078 388504 1178761 1618864 1599572 1092874 184166 -436312
34522d36312L26856P75907K01211k35734L38174Q18260N3582q57817l24741P55470
$$ -436312 -109456 666451 867662 631928 970102 1788362 1841944 984127 659386 1414856
34512A414856L07063j249876j441985J63659J150809J34655j164244q15757N44788
$$ 1414856 1721919 472043 -969942 -806283 344526 479181 -685063 -1500820 -956032
34503i56032J180404P59225M8639n13143p22976k82418M03646K63970p19739j127431
$$ -956032 224372 983597 1032236 519093 -203883 -486301 -82655 181315 -538424 -1665855
34493a665855k99915N69405N41786M38364R19805Q52316o02668j882904j227761
$$ -1665855 -1965770 -1396365 -854579 -416215 503590 1355906 753238 -1129666 -2357427
34484b357427K95978M49405m68956l49284Q22604Q54136o71054j346782J74263
$$ -2357427 -2061449 -1612044 -2081000 -2430284 -1607680 -753544 -1424598 -2771380 -2597117
34475b597117J913818J641021O3434p71037n57682l25743k22082K69992O85986
$$ -2597117 -683299 957722 1021156 250119 -307563 -633306 -855388 -585396 100590
34466A00590J54306p58805o59888L10959N75745k12695m67881O55418J604783
$$ 100590 254896 -503909 -1163797 -852838 -277093 -489788 -957669 -302251 1302532
34457A302532P49667q90209r68561O78407J701668O22409j125589j391335k96975
$$ 1302532 2052199 1161990 193429 871836 2573504 3195913 2070324 678989 382014
34448C82014L03845k74459p63210j62238O87907N16288l74764o38621p258L24775
$$ 382014 685859 411400 -351810 -514048 173859 690147 315383 -323238 -330496 -5721
34438e721l94728j215501p70555P70483J856013J520754M34546j98251j34624
$$ -5721 -400449 -1615950 -2386505 -1616022 239991 1760745 2195291 1997040 1862416
34429A862416p850j67681l06334k05487j86568n29481q83979o67120J32135Q59712
$$ 1862416 1854566 1686885 1380551 1175064 988496 459015 -424964 -1092084 -959949 -100237
34419a00237Q63965J32559o45801o62777J35543Q15913N07542l79717o52104j15000
$$ -100237 763728 896287 250486 -412291 -276748 539165 1046707 666990 14886 -100114
34409a00114Q9433o45138j236405n31082Q03836J228445N72389m1528j40144k44531
$$ -100114 -10681 -655819 -1892224 -2423306 -1619470 -391025 181364 139836 -308 -244839
34399b44839l90639M7307Q30935P95702j59532n98475J42376O84373k18188j550299
$$ -244839 -635478 -588171 242764 1038466 878934 280459 422835 1107208 889020 -661279
34389f61279j529703k66053O57864O46468M98461O35533N39702L7600k86107k41985
$$ -661279 -2190982 -2457035 -1799171 -1152703 -654242 -18709 520993 558593 272486 30501
34379C0501l54803o68997m40558M46062R09418L07194l65610L4854Q86543P02267
$$ 30501 -324302 -993299 -1433857 -987795 -78377 228817 -136793 -101939 784604 1486871
34369A486871m27622q00258L05634J432347J058436k25030p48452k18191K01203
$$ 1486871 1059249 258991 564625 1996972 3055408 2830378 2081926 1863735 2064938
34360B064938p1957l67037k44913k34561n93767o12863O9511N67315J38154m81162
$$ 2064938 1992981 1625944 1381031 1146470 552703 -60160 9351 576666 714820 233658
34350B33658k66170L74018L47937k87889o33076n76975o53645o52920J6467Q18164
$$ 233658 -32512 341506 689443 401554 -231522 -808497 -1462142 -2115062 -2098595 -1280431
34340a280431O89871Q6803N06212J765093J826522p544j736017j532773k04326
$$ -1280431 -590560 -503757 2455 1767548 3594070 3586526 1850509 317736 113410
34331A13410M93611L90789K37961r8065r60788j404316l15289J432907J767621
$$ 113410 607021 997810 1235771 1137706 176918 -1227398 -1542687 -109780 1657841
34322A657841K90225j188128j142680p5938N69550K40618m48912o83133k83857
$$ 1657841 1948066 759938 -382742 -458680 110870 351488 -97424 -780557 -1064414
34313a064414K34407L38806J61993K35303N78370O48561L04920M8503L8988k36080
$$ -1064414 -830007 -491201 -329208 -93905 484465 1133026 1437946 1486449 1525437 1289357
34303A289357q74741j090384m52340K92223L50976Q010j16718p3956p2403J46704
$$ 1289357 414616 -675768 -1128108 -835885 -484909 -476899 -593617 -667573 -739976 -593272
34293e93272N59777M11457n04549j046324l34288P15819P31735l2852l36113j605
$$ -593272 -33495 377962 -126587 -1172911 -1507199 -791380 -59645 -92497 -428610 -430215
34283d30215J60750J4321J36564M37636K22638l74352l47290O06324J506430J321470
$$ -430215 -269465 -255144 -118580 319056 541694 167342 -179948 426376 1932806 3254276
34273C254276R0359j245622j655638q40535L68774P88693L14312n4442K29039
$$ 3254276 3344635 2099013 443375 -397160 -28386 760307 1074619 1020177 1249216
34264A249216P08431J145327J861633K545974K619701L239131O145223R260992
$$ 1249216 1957647 3102974 4964607 7510581 10130282 13369413 19514636 28775628
34256B8775628O995426k057929j0782433j1232497m812802K1354p66543l006761
$$ 28775628 35771054 33713125 22930692 11698195 6885393 6906747 6140204 3133443
34248C133443k283715m4377L93393o45247q65111j39019J77009N8875K31380K62699
$$ 3133443 849728 805351 1198744 553497 -311614 -450633 -273624 -214749 16631 279330
34238B79330m48029j038069n62587J50533j05592p59365n11542M07078P82010
$$ 279330 -168699 -1206768 -1769355 -1618822 -1724414 -2483779 -2995321 -2588243 -1806233
34229a806233M64700K74849M44401N31596L91074J65597j16442j61737N05641
$$ -1806233 -1341533 -1066684 -622283 -90687 300387 465984 349542 187805 693446
34220F93446J384840J101310m91268j659468j247231l34557k54589n03546j17555
$$ 693446 2078286 3179596 2688328 1028860 -218371 -552928 -807517 -1311063 -1428618
34211a428618L52862K2091m33294M9300Q74024Q05976J30956p8785Q591l55137
$$ -1428618 -1075756 -1053665 -1486959 -1437659 -563635 242341 373297 294512 303103 -52034
34201e2034o17809J81816J249336R46350m87920j235611o95574O2910M44567Q06967
$$ -52034 -669843 -488027 761309 1707659 1219739 -15872 -711446 -648536 -203969 602998
34191F02998Q76255p5629j286657r84798P16629J556304M71100q39621o84377
$$ 602998 1479253 1403624 116967 -867831 -151202 1405102 1876202 1036581 352204
34182C52204J50614K0171r44311j292091m49197Q04117J502731J245261K69377
$$ 352204 502818 522989 -421322 -1713413 -2162610 -1358493 144238 1389499 1658876
34173A658876n78116m93504K05497L59035k87834n76911K23007J097073P22695
$$ 1658876 1080760 587256 792753 1151788 863954 287043 510050 1607123 2329818
34164B329818n91434j450142j270538n80979J49557Q66160J287672R82877J83839
$$ 2329818 1738384 288242 -982296 -1563275 -1413718 -547558 740114 1722991 1906830
34155A906830l34078l55080m59716r32707j170883o27068K27055N03750J56802
$$ 1906830 1572752 1217672 757956 -174751 -1345634 -1972702 -1745647 -1241897 -1085095
34146a085095m1423K84294O15921M59106J04108P099n1293m61905p65606j00015
$$ -1085095 -1126518 -842224 -226303 232803 336911 344010 292717 -169188 -934794 -1034809
34136a034809J271820J871046Q98638n66961r46291j85883L87149m2894q66418
$$ -1034809 237011 2108057 3006695 2439734 1493443 1307560 1694709 1651815 785397
34127G85397j082110n75560m5340J7896j11869P7641M87711M64190j83528o93122
$$ 785397 -296713 -872273 -917613 -899717 -1011586 -933945 -446234 17956 -165572 -858694
34117h58694l47984M23682O54459K62935k2984p801j99165n95241n14400R5696
$$ -858694 -1206678 -782996 -128537 134398 111414 103613 -95552 -690793 -1205193 -1109497
34107a109497M12881K13024K91892Q48505Q38585k21019j159932r19964j38944
$$ -1109497 -696616 -483592 -191700 656805 1495390 1274371 114439 -805525 -944469
34098i44469K05615M29170R96637J036020k20543j550127j296141o8884J95899
$$ -944469 -738854 -309684 686953 1722973 1502430 -47697 -1343838 -1412722 -1216823
34089a216823o41763r33548j22888O07429O08266N29656N81323J34786n35166
$$ -1216823 -1858586 -2792134 -2915022 -2307593 -1699327 -1169671 -588348 -453562 -988728
34080i88728k00715J017148J325924N9795j124725q51034o477N9652l46596l19216
$$ -988728 -1189443 -172295 1153629 1213424 88699 -762335 -768812 -709160 -1055756 -1374972
34070a374972q0445j71558j09173O44841J331787R55388j05661q44806j158242
$$ -1374972 -1455417 -1626975 -1736148 -1091307 240480 1195868 1090207 245401 -912841
34061i12841j318471q20698O86212K017203J692578J79996p00308l70811O9505
$$ -912841 -2231312 -3052010 -2365798 -348595 1343983 1523979 823671 452860 522365
34052E22365r1208k74208K8549L96537L75929J24985j80677o26400r66075o70882
$$ 522365 431157 156949 185498 582035 957964 1082949 902272 275872 -690203 -1361085
34042a361085J55490P55107Q19153P61886P43163L97776k12575m24452j44890
$$ -1361085 -1205595 -450488 368665 1130551 1873714 2271490 2058915 1634463 1489573
34033A489573j46805o56621p24233K06650J080341O51216n75657j030674l27407
$$ 1489573 1342768 686147 -38086 168564 1248905 1900121 1324464 293790 -33617
34024c3617L90846K73183k15069l02835J788K44308K66842J83277N6600n3908
$$ -33617 357229 630412 415343 112508 114296 358604 625446 808723 865323 811415
34014H11415n2823l7472k28946n22836n20931j78907N9698P546N7444M00190N15607
$$ 811415 758592 721120 492174 -30662 -551593 -730500 -670802 -663256 -605812 -205622 309985
34003C09985L2549m11064K0413R49772J084413k7682j314131j482315m37260Q42645
$$ 309985 342534 -68530 -48117 901655 1986068 1958386 644255 -838060 -1275320 -432675
33993d32675J391008R89597J76656l05572l05963m45536j144012j702080j079983
$$ -432675 958333 1947930 2124586 1819014 1513051 1067515 -76497 -1778577 -2858560
33984b858560M58319J389476Q68162k38276o71498l43467r846o5601l35064n57059
$$ -2858560 -2400241 -1010765 -142603 -380879 -1052377 -1395844 -1405690 -1471291 -1806355 -2363414
33974b363414m62039J84719J053774J247561M15705o07071q75654n17732j88993
$$ -2363414 -2825453 -2640734 -1586960 -339399 76306 -530765 -1406419 -1924151 -2113144
33965b113144M3811M20678O20997J98855m35540m70170P6149N07795O30554Q02304
$$ -2113144 -2069333 -1648655 -1027658 -828803 -1264343 -1734513 -1658364 -1150569 -520015 282289
33955B82289R71630P05358J37267j16560k0102j39562n64260p55128n27865k48989
$$ 282289 1253919 1959277 2096544 1979984 1959882 1820320 1256060 500932 -26933 -275922
33945b75922k2649L28676M78442o1502p37989m03460P58800J140264O8593j090936
$$ -275922 -298571 30105 508547 447045 -290944 -694404 64396 1204660 1273253 182317
33935A82317r70053q3101L12730J44099R5367Q8022m41188j161781j048275Q3326
$$ 182317 -787736 -870837 -558107 -414008 -318641 -230619 -671807 -1833588 -2881863 -2798537
33925b798537J224527J444174Q16334L9195l33245k36483n303Q8092K51833P48403
$$ -2798537 -1574010 -129836 686498 725693 392448 155965 150662 238754 490587 1238990
33915A238990J042081K04907j461079k195883r77352Q87431J407452M88113l45649
$$ 1238990 2281071 2485978 1024899 -1170984 -2148336 -1260905 146547 634660 289011
33906B89011l15764m3089J2795K26223O28870M62096m53151j025427m07752O39434
$$ 289011 -26753 -69842 -57047 169176 798046 1260142 806991 -218436 -626188 13246
33896A3246Q25396J55592l36682l16330m63045j023976j142375j39949J263278
$$ 13246 838642 994234 657552 341222 -121823 -1145799 -2288174 -2428123 -1164845
33887a164845J722364R23928j86518o76454m73068L4178N00831N26004k12410
$$ -1164845 557519 1481447 1294929 618475 145407 179585 680416 1206420 994010
33878I94010j239563j356465j56167J038572P05679o79434j113200J87364J676412
$$ 994010 -245553 -1602018 -1758185 -719613 -13934 -693368 -1806568 -1619204 57208
33869E7208J602012K38756p81632o72615r6573R4285j72156m65791m41310k8382
$$ 57208 1659220 1897976 1116344 443729 347156 441441 269285 -196506 -637816 -666198
33859f66198N47678Q45262N83301k0093m58810m45371p5130L84440O86285O81884
$$ -666198 -118520 726742 1310043 1289950 831140 385769 310639 695079 1381364 2063248
33849B063248L69348j48906p34413j141835j061566n50401k20077m66425o65506
$$ 2063248 2432596 2283690 1549277 407442 -654124 -1204525 -1424602 -1891027 -2556533
33840b556533Q7128J416453J825809P62647m61266m72975L08017N25925p3576
$$ -2556533 -2469405 -1052952 772857 1535504 1074238 601263 909280 1435205 1361629
33831A361629n67689m63326k35014k75847l06350l6091L19522M20012J92284k53385
$$ 1361629 793940 330614 95600 -180247 -486597 -522688 -203166 216846 409130 155745
33821A55745o44893n26852K20585Q71022N24290o12063j271774o85554M80934
$$ 155745 -489148 -1016000 -795415 75607 599897 -12166 -1283940 -1969494 -1488560
33812a488560J024448N56642l40397q92220p36800p4122M82895M42661J8627j09572
$$ -1488560 -464112 92530 -247867 -1140087 -1876887 -1951009 -1468114 -1025453 -1006826 -1116398
33802a116398K23193L74451p7010m90347l297J022744J232365J24818j080840
$$ -1116398 -893205 -518754 -595764 -1086111 -1089408 -66664 1165701 1290519 209679
33793B09679r61553K19183Q78298K14988q50265j016992j89786O94440R08174
$$ 209679 -751874 -532691 345607 560595 -289670 -1306662 -1496448 -802008 106166
33784A06166M82176j25754l74260O6939Q28853R27751p1031j258845j443767p17728
$$ 106166 588342 462588 88328 155267 984120 1911871 1840840 581995 -861772 -1579500
33774a579500j12628N8302M03093J011681J086487L61630k93077k60939j10310
$$ -1579500 -1692128 -1633826 -1230733 -219052 867435 1229065 935988 675049 564739
33765E64739m35605p58649m63837J8988l1902l58063k41986K09589L49160J80438
$$ 564739 129134 -629515 -1093352 -1074364 -1106266 -1464329 -1706315 -1496726 -1147566 -967128
33755i67128K40288N44269O22797M27693K81380Q1919n01877j121780r76792o916
$$ -967128 -726840 -182571 440226 867919 1149299 1231218 729341 -392439 -1369231 -1376147
33745a376147R48619J249234R77424L64423m93852j216396j206387m41795L30142
$$ -1376147 -427528 821706 1799130 2163553 1669701 453305 -753082 -1194877 -864735
33736h64735M37241k1710m09173j88969N99462J221185Q26026m77936j450676
$$ -864735 -427494 -449204 -858377 -1047346 -447884 773301 1599327 1121391 -329285
33727c29285j111499L3625P22269N27477N0806j32959K7539L53058N01773L4771
$$ -329285 -1440784 -1407159 -684890 -157413 -106607 -239566 -212027 141031 642804 677575
33717F77575q77305j213588l85967O94168P93953J31925j59309J00548J55153
$$ 677575 -199730 -1413318 -1799285 -1105117 -311164 -179239 -338548 -238000 -82847
33708h2847j01803l7228L20835K89574n1597K3756L01889j63401j042686p84854
$$ -82847 -184650 -221878 98957 388531 336934 360690 662579 499178 -543508 -1328362
33698a328362P67253J664840O68709q82064j149299l07016K95099K70744J40827
$$ -1328362 -561109 1103731 1772440 890376 -258923 -565939 -270840 -96 140731
33689A40731O2080q4809k8568L56371M98957R5341j11011M79155J099567O92918
$$ 140731 202811 118002 89434 445805 944762 1040103 929092 1408247 2507814 3200732
33679C200732m22432j058130q28219l24900p4571j84888n74782q42303m69624
$$ 3200732 2778300 1720170 891951 567051 492480 307592 -267190 -1109493 -1579117
33670a579117K60819L59291l01698o07495p0861L10061k615N0237R45351J082429
$$ -1579117 -1318298 -959007 -1260705 -1868200 -1939061 -1629000 -1631615 -1581378 -636027 446402
33660D46402n52783j937882q12515J403859J541276k98674j033886K79876J177366
$$ 446402 -106381 -2044263 -2856778 -1452919 88357 -210317 -1244203 -964327 213039
33651B13039J93029q79128l85917N37630M12668l2782L11458O58291q4641j098725
$$ 213039 406068 -473060 -858977 -321347 91321 58539 369997 1028288 943647 -155078
33641a55078j015233j53466M06326P10704J122344R02549m69532j672578j233822
$$ -155078 -1170311 -1323777 -917451 -206747 915597 1818146 1348614 -323964 -1557786
33632a557786R2968O13241M17600O66644J001441J61978j252702j268074J83406
$$ -1557786 -1464818 -851577 -433977 232667 1234108 1396086 143384 -1124690 -941284
33623i41284R81066K06052n75068j31248N46060K43217m67025m89637q157K47956
$$ -941284 39782 245834 -329234 -460482 85578 328795 -138230 -627867 -636024 -388068
33613c88068L65146O80359Q12958L60882k18726l48270k07679j20180Q5379L74548
$$ -388068 -22922 657437 1470395 1831277 1612551 1264281 1056602 936422 1021801 1396349
33603A396349J60033n36807o64929J63205P21769R0242o66893k25179O80197M77921
$$ 1396349 1556382 1019575 354646 517851 1239620 1329862 662969 437790 1117987 1595908
33593A595908n17022o66547J67506N37154L7759j78768K54465K53474m82650o87665
$$ 1595908 1078886 412339 579845 1116999 1154758 975990 1230455 1483929 1001279 313614
33583C13614J52653O93831Q2218m74557Q9680O82813P833r83026o75230L39751
$$ 313614 466267 1160098 1242316 767759 857439 1540252 1548085 565059 -110171 229580
33573B29580L09284n57181n25390M51057O00981m04113p17781L88485R97599l14112
$$ 229580 538864 -18317 -543707 -92650 508331 104218 -613563 -225078 772521 458409
33563D58409j889734j380405P27992J951793J306161O8395n22611n53213m26422
$$ 458409 -1431325 -2811730 -2083738 -131945 1174216 1242611 720000 166787 -259635
33554b59635p5443M65495P25090M10417k15796o99899p50111l76766n0644l23024
$$ -259635 -335078 130417 855507 1265924 1050128 350229 -399882 -776648 -827292 -1150316
33544a150316q44142m34828J133428K230970J376831n17858j344178p58285k46513
$$ -1150316 -1994458 -2429286 -1295858 935112 2311943 1794085 449907 -308378 -554891
33535e54891m13427j85625R03888J575919Q54449l35727p45419o54145q82372
$$ -554891 -968318 -1153943 -250055 1325864 2180313 1844586 1099167 445022 -437350
33526d37350j072807m40893N13533N81441k31331p23128k80897N44376J149519
$$ -437350 -1510157 -1951050 -1437517 -856076 -1087407 -1810535 -2091432 -1547056 -397537
33517c97537J442065J298418N34583m41731q55128n88910k27529o1826J07308
$$ -397537 1044528 2342946 2877529 2435798 1580670 991760 764231 702405 809713
33508H09713J82704j97997o74726k79499J025564J877061J211529k84776j101374
$$ 809713 992417 794420 119694 -159805 865759 2742820 3954349 3669573 2568199
33499B568199p25759J31773O91847P48890L86087k46519q19405r47304n71660
$$ 2568199 1842440 1974213 2666060 3414950 3801037 3554518 2735113 1787809 1216149
33490A216149n5553J40821j23079m72568l28999L27462O68201j3987j139239j362413
$$ 1216149 1160596 1301417 1178338 705770 376771 704233 1372434 1358447 219208 -1143205
33480a143205l66016O80549P52591J95282j86422l57964n75847m82064K44456
$$ -1143205 -1509221 -828672 -76081 119201 -67221 -425185 -1001032 -1483096 -1238640
33471a238640Q84931N27900m06783p23191l26022j89841m85969k91076N04179
$$ -1238640 -353709 174191 -232592 -955783 -1281805 -1471646 -1957615 -2248691 -1744512
33462a744512O25867m32098j162137j90767J462147J785979P03500o5816K56365
$$ -1744512 -1118645 -1550743 -2712880 -2903647 -1441500 344479 1047979 982163 1238528
33453A238528O14093J12441o50370p94180m74874k72644j82680L0541J65678O27
$$ 1238528 1852621 1965062 1314692 520512 45638 -227006 -409686 -379145 -213467 -212840
33443b12840j62646l6452O3747j53735k31651L04807Q42980L09775j100427j786268
$$ -212840 -375486 -411938 -348191 -501926 -733577 -428770 414210 723985 -376442 -2162710
33433b162710p02101J196600K006108J065702m10976q56968q0029P61736O95715
$$ -2162710 -2864811 -1668211 337897 1403599 992623 135655 55626 817362 1513077
33424A513077L816m00304k49430p8427k56788m74542l04865K16582P33030Q65954
$$ 1513077 1516893 1116589 867159 788732 531944 57402 -247463 -30881 702149 1568103
33414A568103L17040p72649j492182r29021M89528J224583N82056m00784n37220
$$ 1568103 1885143 1112494 -379688 -1308709 -819181 405402 987458 586674 49454
33405D9454l6683K61780K74334L19136K05737j95409k18448N11381R87061K72580
$$ 49454 12771 274551 548885 868021 1073758 878349 659901 1171282 2158343 2430923
$$ [...]
##END NTUPLES=NMR SPECTRUM
##END=
