##TITLE=31Pdec_86-2021
 CDCl3, 24 sc
 31.08.2021
##JCAMPDX= 6.0         $$ Bruker NMR JCAMP-DX V2.0
##DATA TYPE= NMR SPECTRUM
##DATA CLASS= NTUPLES
##ORIGIN= UXNMR, Bruker Analytische Messtechnik GmbH
##OWNER= root
$$ XWIN-NMR		Version 3.5
$$ Tue Aug 31 10:09:26 2021 Russian Standard Time (UT+4h)  she@DPX200
##.OBSERVE FREQUENCY= 81.013821
##.OBSERVE NUCLEUS= ^31P
##.ACQUISITION MODE= SIMULTANEOUS
##.ACQUISITION SCHEME= undefined
##.AVERAGES= 24
##.DIGITISER RES= 16
##SPECTROMETER/DATA SYSTEM= spect
##.PULSE SEQUENCE= zgpg30
##.SOLVENT NAME= CDCl3
##.SHIFT REFERENCE= (INTERNAL, CDCl3, 0, 248.564)
##AUDIT TRAIL= $$ (NUMBER, WHEN, WHO, WHERE, WHAT)
$$ ##TITLE= Audit trail, XWIN-NMR		Version 3.5
$$ ##JCAMPDX= 5.01
$$ ##ORIGIN= Bruker BioSpin GmbH
$$ ##OWNER= she
$$ F:/spectra/data/she/nmr/P31/1/pdata/1/auditp.txt
$$ ##AUDIT TRAIL=  $$ (NUMBER, WHEN, WHO, WHERE, WHAT)
(   1,<2021-08-31 10:08:06.90 +0400>,<she>,<DPX200>,
      <created by zg, POWCHK disabled, PULCHK disabled
       configuration hash MD5:
       00 E9 B6 7A A2 85 ED C7 34 08 36 98 17 FE 4E 26
       data hash MD5: 32K
       F3 17 45 66 74 AE EC F8 5B E9 15 B4 D9 78 DC 43>)
(   2,<2021-08-31 10:08:09.09 +0400>,<she>,<DPX200>,
      <Start of raw data processing
       efp BC_mod = 2 LB = 1 FT_mod = 6 PKNL = 1 PHC0 = -8103.1 PHC1 = 889.0731 SI = 64K 
       data hash MD5: 64K
       C7 13 B3 2C F4 19 09 CA B0 C6 11 0C C0 B9 B4 7C>)
(   3,<2021-08-31 10:08:34.15 +0400>,<she>,<DPX200>,
      <pk PHC0 = 317.8048 PHC1 = -699.9998 
       data hash MD5: 64K
       86 1A B5 4F 17 FA B5 A6 9E 5C C4 82 09 3A 7A A6>)
(   4,<2021-08-31 10:08:37.92 +0400>,<she>,<DPX200>,
      <abs ABSG = 5 
       data hash MD5: 64K
       D7 E4 69 81 83 2A 2F D0 A0 19 D1 71 40 41 5A B0>)
$$ ##END=
$$ 
$$ hash MD5
$$ E5 3F 27 1E F4 E3 30 32 C1 D6 F0 ED 52 99 F7 51
##$RELAX= 
##$RELAX= 
##$RELAX= 
##$RELAX= 
##$RELAX= 
##$RELAX= 
##$RELAX= 
##$RELAX= 
$$ Bruker specific parameters
$$ --------------------------
##$DU= <F:/spectra>
##$EXPNO= 1
##$NAME= <P31>
##$PROCNO= 1
##$TYPE= <nmr>
##$USER= <she>
##$AMP= (0..31)
100 100 100 100 100 100 100 100 100 100 100 100 100 100 100 100 100 100 
100 100 100 100 100 100 100 100 100 100 100 100 100 100 
##$AQSEQ= 0
##$AQ_mod= 1
##$AUNM= <au_zg>
##$AUTOPOS= <>
##$BF1= 81.014009
##$BF2= 200.13
##$BF3= 200.13
##$BF4= 200.13
##$BF5= 200.13
##$BF6= 200.13
##$BF7= 200.13
##$BF8= 200.13
##$BYTORDA= 1
##$CFDGTYP= 0
##$CFRGTYP= 5
##$CHEMSTR= <none>
##$CNST= (0..31)
1 1 145 1 1 1 1 1 1 1 1 1 1 1 1 1 1 1 1 1 1 1 1 1 1 1 1 1 1 1 1 1 
##$CPDPRG= <waltz16>
##$CPDPRG1= <>
##$CPDPRG2= <waltz16>
##$CPDPRG3= <>
##$CPDPRG4= <mlev>
##$CPDPRG5= <mlev>
##$CPDPRG6= <mlev>
##$CPDPRG7= <mlev>
##$CPDPRG8= <mlev>
##$CPDPRGB= <>
##$CPDPRGT= <>
##$D= (0..31)
0 1 0 0 0 0 0 0 0 0 0 0.03 2e-05 3e-06 0 0 0 0 0 0 0 0 0 0 0 0 0 0 0 0 
0 0 
##$DATE= 1630390086
##$DBL= (0..7)
120 120 120 11 120 120 24 19 
##$DBP= (0..7)
150 150 150 150 150 150 150 150 
##$DBP07= 0
##$DBPNAM0= <>
##$DBPNAM1= <>
##$DBPNAM2= <>
$$ [...]
##$SUBNAM3= <"">
##$SUBNAM4= <"">
##$SUBNAM5= <"">
##$SUBNAM6= <"">
##$SUBNAM7= <"">
##$SUBNAM8= <"">
##$SUBNAM9= <"">
##$SW= 501.771253377433
##$SWIBOX= (0..15)
0 1 3 0 0 0 0 0 0 0 0 0 0 0 0 0 
##$SW_h= 40650.406504065
##$TD= 32768
##$TD0= 1
##$TE= 0
##$TE2= 300
##$TE3= 300
##$TEG= 300
##$TL= (0..7)
0 120 53 12 22 120 120 120 
##$TP= (0..7)
150 150 150 150 150 150 150 150 
##$TP07= 0
##$TPNAME0= <>
##$TPNAME1= <>
##$TPNAME2= <>
##$TPNAME3= <>
##$TPNAME4= <>
##$TPNAME5= <>
##$TPNAME6= <>
##$TPNAME7= <>
##$TPOAL= (0..7)
0.5 0.5 0.5 0.5 0.5 0.5 0.5 0.5 
##$TPOFFS= (0..7)
0 0 0 0 0 0 0 0 
##$TUNHIN= 0
##$TUNHOUT= 0
##$TUNXOUT= 0
##$USERA1= <user>
##$USERA2= <user>
##$USERA3= <user>
##$USERA4= <user>
##$USERA5= <user>
##$V9= 5
##$VALIST= <valist>
##$VCLIST= <CCCCCCCCCCCCCCC>
##$VD= 0
##$VDLIST= <DDDDDDDDDDDDDDD>
##$VPLIST= <PPPPPPPPPPPPPPP>
##$VTLIST= <TTTTTTTTTTTTTTT>
##$WBST= 1024
##$WBSW= 4
##$XGAIN= (0..3)
0 0 0 0 
##$XL= 0
##$YL= 0
##$YMAX_a= 5156
##$YMIN_a= -5087
##$ZGOPTNS= <>
##$ZL1= 120
##$ZL2= 120
##$ZL3= 120
##$ZL4= 120
##$ABSF1= 248.5645
##$ABSF2= -253.2056
##$ABSG= 5
##$ABSL= 3
##$ALPHA= 0
##$AQORDER= 0
##$ASSFAC= 0
##$ASSFACI= 0
##$ASSFACX= 0
##$ASSWID= 0
##$AUNMP= <proc_1d>
##$AZFE= 0.1
##$AZFW= 0.5
##$BCFW= 0
##$BC_mod= 2
##$BYTORDP= 0
##$COROFFS= 0
##$CY= -3
##$DATMOD= 1
##$DC= 0
##$DFILT= <>
##$DTYPP= 0
##$F1P= 0
##$F2P= 0
##$FCOR= 1
##$FTSIZE= 65536
##$FT_mod= 6
##$GAMMA= 0
##$GB= 0
##$INTBC= 1
##$INTSCL= 5.30512e-09
##$ISEN= 30
##$LB= 1
##$LEV0= 0
##$LPBIN= 0
##$MAXI= 10000
##$MC2= 0
##$MEAN= 0
##$ME_mod= 0
##$MI= 50
##$NCOEF= 0
##$NC_proc= -5
##$NLEV= 6
##$NOISF1= 182.463
##$NOISF2= 159.3651
##$NSP= 0
##$NTH_PI= 0
##$NZP= 0
##$OFFSET= 248.5645
##$PC= 4
##$PHC0= -7785.295
##$PHC1= 189.0733
##$PH_mod= 1
##$PKNL= yes
##$PPARMOD= 0
##$PSCAL= 0
##$PSIGN= 0
##$REVERSE= no
##$SF= 81.014009
##$SI= 65536
##$SIGF1= 159.3651
##$SIGF2= -187.1042
##$SINO= 113.3802
##$SIOLD= 16384
##$SREGLST= <1H.CDCl3>
##$SSB= 0
##$STSI= 65536
##$STSR= 0
##$SW_p= 40650.406504065
##$SYMM= 0
##$S_DEV= 0
##$TDeff= 32768
##$TDoff= 0
##$TI= <>
##$TILT= no
##$TM1= 0
##$TM2= 0
##$TOPLEV= 0
##$USERP1= <user>
##$USERP2= <user>
##$USERP3= <user>
##$USERP4= <user>
##$USERP5= <user>
##$WDW= 1
##$XDIM= 65536
##$YMAX_p= 267954555
##$YMIN_p= -50682403
$$ End of Bruker specific parameters
$$ ---------------------------------
##NTUPLES= NMR SPECTRUM
##VAR_NAME=  FREQUENCY,     SPECTRUM/REAL,   SPECTRUM/IMAG
##SYMBOL=    X,             R,               I
##VAR_TYPE=  INDEPENDENT,   DEPENDENT,       DEPENDENT
##VAR_FORM=  AFFN,          ASDF,            ASDF
##VAR_DIM=   65536,         65536,           65536
##UNITS=     HZ,            ARBITRARY UNITS, ARBITRARY UNITS
##FACTOR=    0.620285442955139, 1,           1
##FIRST=     20137.2065510759, 0,            0
##LAST=      -20513.1999529892, 0,           0
##MIN=       -20513.1999529892, -50682403,   0
##MAX=       20137.2065510759, 267954555,    0
$$ Real data points
##PAGE= N=1
##DATA TABLE= (X++(R..R)), XYDATA
$$ [...]
$$ plain form
39187 246468 1159285 1476184 678308 -286681 -271180 582030 1200127 968323 205230 -440834
39177 -440834 -558468 -106466 579614 960508 764810 258469 -110424 -205867 -188761 -200138
39167 -200138 -293074 -541452 -961392 -1372673 -1519344 -1299022 -783855 -128605 423241 579734
39157 579734 232537 -388442 -895784 -1054416 -914691 -754901 -870452 -1226935 -1346452 -824829
39147 -824829 24845 424448 131133 -246723 -151550 161139 133477 -207948 -361421 -106221
39137 -106221 323548 668108 834103 811007 770346 1036603 1553619 1667900 983304 153236
39127 153236 127139 786221 1134057 807120 514920 818980 1334024 1480929 1285013 1010255
39117 1010255 660935 302455 275589 597248 688320 203945 -368902 -448779 -186705 -23573
$$ packed form
39187B46468R12817L16899p97876r64989J5501Q53210O18097k31804p63093o46064
39177d40834j17634M52002O86080L80894j95698n06341l68893r5443J7106j1377
39167b00138r2936k48378m19940m11281j46671K20322N15167O55250N51846J56493
39157E79734l47197o20979n07342j58632J39725J59790j15551l56483j19517N21623
39147h24829Q49674L99603k93315l77856R5173L12689k7662l41425j53473K55200
39137a06221M29769L44560J65995k3096m0661K66257N17016J14281o84596q30068
39127A53236k6097O59082L47836l26937k92200L04060N15044J46905j95916k74758
39117A010255l49320l58480k6866L21659R1072m84375n72847p9877K62074J63132
$$ plain form
39107 -23573 46102 155163 41736 -426578 -683830 -247852 320124 144326 -561683 -780741
39097 -780741 -218635 427941 660240 645451 478971 2773 -490563 -379223 209263 415690
39087 415690 53499 -31537 540491 887150 274358 -611755 -714061 -210498 -67029 -472700
39077 -472700 -751731 -590046 -387759 -438257 -566919 -633995 -736477 -837902 -733022 -432012
39067 -432012 -143440 103342 408423 660642 683810 621647 718340 821709 593560 124268
39057 124268 -172432 -210974 -262884 -391439 -401198 -325488 -396586 -508499 -285078 239862 567602
39046 567602 470390 249451 136708 -16431 -280441 -397631 -204217 148231 558519 1092516
39036 1092516 1585348 1654853 1312089 1023326 943699 671146 47449 -420516 -344304 -69735
$$ packed form
39107b3573O9675J09061j13427m68314k57252M35978N67976j75798p06009k19058
39097g80741N62106O46576K32299j4789j66480m76198m93336J11340N88486K06427
39087D15690l62191q5036N72028L46659o12792q86113j02306N03563J43469m05671
39077d72700k79031J61685K02287n0498j28662o7076j02482j01425J04880L01010
39067d32012K88572K46782L05081K52219K3168o2163R6693J03369k28149m69292
39057A24268k96700l8542n1910j28555r759P5710p1098j11913K23421N24940L27740
39046E67602r7212k20939j12743j53139k64010j17190J93414L52448M10288N33997
39036A092516M92832O9505l42764k88763p9627k72553o23697m67965P6212K74569
$$ plain form
39026 -69735 -25550 -13091 280412 567258 438810 166423 293166 700914 821556 590641
39016 590641 439136 429296 167489 -381343 -715577 -589002 -357487 -326997 -293323 30748
39006 30748 571424 1081838 1378464 1248199 572624 -271578 -606945 -297288 52299 12013
38996 12013 -43509 372706 987386 1160665 889377 792050 1150242 1541889 1538250 1289355
38986 1289355 1176172 1201597 1034966 538220 -10392 -236365 -76239 186558 234305 -1927
38976 -1927 -370651 -719088 -973330 -1025475 -715555 -37721 722003 1183329 1200941 933868
38966 933868 618190 348264 78611 -227058 -493293 -592622 -510517 -415145 -509147 -816315
38956 -816315 -1151404 -1271568 -1014685 -374245 423926 961730 939144 499353 107125 52669
$$ packed form
39026f9735M4185J2459K93503K86846j28448k72387J26743M07748J20642k30915
39016E90641j51505r840k61807n48832l34234J26575K31515L0490L3674L24071
39006C0748N40676N10414K96626j30265o75575q44202l35367L09657L49587m0286
38996A2013n5522M16215O14680J73279k71288r7327L58192L91647l639k48895
38986A289355j13183K5425j66631m96746n48612k25973J60126K62797M7747k36232
38976a927l68724l48437k54242n2145L09920O77834P59724M61326J7612k67073
38966I33868l15678k69926k69653l05669k66235r9329Q2105R5372r4002l07168
38956h16315l35089j20164K56883O40440P98171N37804k2586m39791l92228n4456
$$ plain form
38946 52669 205756 298929 274899 244533 253865 250277 193919 65991 -164467 -448775 -588777
38935 -588777 -405911 16089 352146 319966 -68219 -483422 -504964 -4500 623831 773459
38925 773459 300785 -253059 -292013 131104 491079 542272 524605 621898 640759 408931
38915 408931 134540 69896 72512 -140409 -458253 -490441 -154027 240408 487338 659395
38905 659395 725626 475098 26597 -64341 414791 840697 543043 -200424 -557114 -359366
38895 -359366 -230552 -486373 -673504 -445398 -175266 -236995 -282090 125038 574405 282819
38885 282819 -658509 -1257896 -914284 -111619 358729 350393 257784 341745 501395 539260
38875 539260 389076 128366 -115347 -289988 -429007 -473028 -234024 251460 509843 149453
$$ packed form
38946E2669J53087R3173k4030l0366R332l588n6358j27928k30458k84308j40002
38935e88777J82866M22000L36057l2180l88185m15203k1542N00464O28331J49628
38925G73459m72674n53844l8954M23117L59975N1193j7667R7293J8861k31828
38915D08931k74391o4644K616k12921l17844l2188L36414L94435K46930J72057
38905F59395O6231k50528m48501r0938M79132M25906k97654p43467l56690J97748
38895c59366J28814k55821j87131K28106K70132o1729m5095M07128M49367k91586
38885B82819r41328n99387L43612Q02665M70348q336r2609Q3961J59650L7865
38875E39260j50184k60710k43713j74641j39019m4021K39004M85484K58383l60390
$$ plain form
38865 149453 -480592 -596344 15019 736784 971680 785461 510449 180830 -287814 -707097
38855 -707097 -815701 -682183 -572061 -551379 -500256 -390658 -303565 -290237 -411986 -746481
38845 -746481 -1147566 -1210734 -746098 -108251 211513 139417 -99014 -401142 -707857 -721909
38835 -721909 -227369 366151 338234 -372143 -965635 -755793 11699 563001 549576 299648
38825 299648 264396 521701 844775 1050877 1172765 1353787 1671526 2080628 2454864 2615757
38815 2615757 2388547 1783954 1120713 780968 783451 774012 509496 141086 -97407 -241234
38805 -241234 -425826 -556849 -410771 22778 499932 756143 657317 254655 -184231 -378012
38795 -378012 -388277 -521530 -738011 -555978 149406 694859 467590 -83738 -26661 657972
$$ packed form
38865A49453o30045j15752O11363P21765K34896j86219k75012l29619m68644m19283
38855g07097j08604J33518J10122K0682N1123J09598Q7093J3328j21749l34495
38845g46481m01085o3168M64636O37847L19764p2096k38431l02128l06715j4052
38835g21909M94540N93520k7917p10377n93492K09842P67492N51302j3425k49928
38825B99648l5252K57305L23074K06102J21888J81022L17739M09102L74236J60893
38815B615757k27210o04593o63241l39745K483r439k64516l68410k38493j43827
38805b41234j84592j31023J46078M33549M77154K56211r8826m02662m38886j93781
38795c78012j0265j33253k16481J82033P05384N45453k27269n51328N7077O84633
$$ plain form
38785 657972 1042273 659172 147382 202530 569203 562013 124169 -191891 -83042 152433
38775 152433 85510 -349112 -857589 -1106398 -1019140 -823994 -785483 -911945 -1026518 -1052310
38765 -1052310 -1030783 -931793 -720449 -559349 -603949 -625460 -261698 314052 465553 -3056
38755 -3056 -508806 -529442 -322580 -418987 -771283 -885479 -584350 -183333 -8207 -120305
38745 -120305 -462637 -937013 -1324441 -1370311 -989415 -317974 333879 555870 152078 -470697
38735 -470697 -568804 21797 563319 348124 -368316 -791329 -646743 -284889 45372 376917
38725 376917 551550 260573 -316898 -531209 -163735 197259 -19374 -603591 -975295 -993326
38715 -993326 -928679 -874079 -650965 -250184 21022 -95792 -510808 -882971 -876935 -369137
$$ packed form
38785F57972L84301l83101n11790N5148L66673p190m37844l16060J08849K35475
38775A52433o6923m34622n08477k48809Q7258J95146L8511j26462j14573k5792
38765a052310K1527R8990K11344J61100m4600k1511L63762N75750J51501m68609
38755c056n05750k0636K06862r6407l52296j14196L01129M01017J75126j12098
38745a20305l42332m74376l87428m5870L80896O71441O51853K21991m03792o22775
38735d70697r8107N90601N41522k15195p16440m23013J44586L61854L30261L31545
38725C76917J74633k90977n77471k14311L67474L60994k16633n84217l71704j8031
38715i93326O4647N4600K23114M00781K71206j16814m15016l72163O036N07798
$$ plain form
38705 -369137 412000 957519 879426 299533 -265836 -418557 -174195 213068 517893 589063
38695 589063 358947 -7585 -122516 209446 626896 541646 -118081 -772736 -921217 -704896
38685 -704896 -513664 -351976 -27307 242080 9330 -585276 -798119 -324734 177780 1966
38675 1966 -605031 -849838 -517494 -123598 -65652 -176752 -162591 -26300 65309 19781 -168902
38664 -168902 -395434 -402821 -29385 492367 752052 668294 491116 338301 105756 -144429
38654 -144429 -137805 150053 379708 358305 295075 371700 443454 392874 382455 457890 303145
38643 303145 -196340 -500167 -62410 784438 1193723 975374 769309 958835 1056275 520322
38633 520322 -303131 -591569 -184255 237751 134514 -211066 -223642 94802 214809 -112820
$$ packed form
38705c69137P81137N45519p8093n79893n65369j52721K44362L87263L04825P1170
38695E89063k30116l66532j14931L31962M17450q5250o59727o54655j48481K16321
38685g04896J91232J61688L24669K69387k32750n94606k12843M73385N02514j75814
38675A966o06997k44807L32344L93896N7946j11100J4161J36291R1609m5528j88683
38664a68902k26532p387L73436N21752K59685q3758j77178j52815k32545k50185
38654a44429O624K87858K29655k1403o3230P6625P1754n0580j0419P5435j54745
38643C03145m99485l03827M37757Q46848M09285k18349k06065J89526R7440n35953
38633E20322q23453k88438M07314M22006j03237l45580j2576L18444J20007l27629
$$ plain form
38623 -112820 -512615 -548226 -299731 -154440 -257511 -464496 -687352 -938164 -1086264 -943670
38613 -943670 -627226 -478269 -530620 -416058 46984 524218 650825 521299 406317 270396
38603 270396 -65795 -488361 -701883 -660253 -543054 -413846 -252972 -226685 -520609 -927350
38593 -927350 -983279 -552474 40318 457994 605500 463181 68830 -287914 -260561 59178
38583 59178 214370 54698 -61821 127484 417290 570603 688850 856646 837337 511120
38573 511120 265659 488276 914934 969428 608751 364248 593141 1093239 1444564 1384379
38563 1384379 871061 131724 -342987 -186201 403244 854158 872786 670107 568971 647898
38553 647898 776918 777257 555304 259147 205987 448574 597956 375542 109788 245209
$$ packed form
38623a12820l99795l5611K48495J45291j03071k06985k22856k50812j48100J42594
38613i43670L16444J48957n2351J14562M63042M77234J26607j29526j14982j35921
38603B70396l36191m22566k13522M1630J17199J29208J60874K6287k93924m06741
38593i27350n5929M30805N92792M17676J47506j42319l94351l56744K7353L19739
38583E9178J55192j59672j16519J89305K89806J53313J18247J67796j9309l26217
38573E11120k45461K22617M26658N4494l60677k44503K28893N00098L51325o0185
38563A384379n13318p39337m74711J56786N89445M50914J8628k02679j01136P8927
38553F47898J29020L39k21953k96157n3160K42587J49382k22414k65754J35421
$$ plain form
38543 245209 563614 478880 9534 -219263 7841 180735 -47597 -342900 -374668 -377636
38533 -377636 -595496 -723638 -433782 -14718 63822 -116283 -168708 -85214 -103483 -126018
38523 -126018 131794 539551 660079 408145 105544 -80520 -277243 -499785 -562247 -417716
38513 -417716 -189299 133283 629449 1096922 1195205 965002 790804 811151 787747 619047
38503 619047 542149 695182 877875 912639 903204 969177 1020032 942989 754209 456631 28377
38492 28377 -341595 -306609 198107 813709 1181681 1281393 1243432 1073224 710954 215197
38482 215197 -205629 -281680 98038 597505 587399 -84368 -707739 -573731 -10394 92334
38472 92334 -338701 -497339 -92044 147304 -266304 -699706 -428609 167025 236111 -202153
$$ packed form
38543B45209L18405q4734m69346k28797K27104J72894k28332k95303l1768k968
38533c77636k17860j28142K89856M19064P8540j80105n2425Q3494j8269k2535
38523a26018K57812M07757J20528k51934l02601j86064j96723k22542o2462J44531
38513d17716K28417L22582M96166M67473R8283k30203j74198K0347k3404j68700
38503F19047p6898J53033J82693L4764r435O5973N0855p7043j88780k97578m28254
38492B8377l69972L4986N04716O15602L67972R9712l7961j70208l62270m95757
38482B15197m20826p6051L79718M99467j0106o71767o23371J34008N63337J02728
38472I2334m31035j58638M05295K39348m13608m33402K71097N95634O9086m38264
$$ plain form
38462 -202153 -408538 -151056 55775 -121056 -399733 -459674 -372129 -325630 -353628 -436030
38452 -436030 -535533 -503920 -265831 -63488 -168830 -393200 -283763 176948 472073 241328
38442 241328 -270240 -575758 -497506 -248592 -154372 -343396 -578139 -459725 14968 266372
38432 266372 -164619 -868898 -998447 -423763 83849 -23709 -311780 -86429 538270 812665
38422 812665 418100 -160678 -373188 -271015 -223574 -284278 -205479 22971 70753 -171163
38412 -171163 -287801 84510 614189 645011 132982 -287121 -250626 -150065 -406965 -734492
38402 -734492 -583464 -22055 353496 274628 90784 187245 489411 627614 340609 -338939
38392 -338939 -1103621 -1538833 -1411859 -818436 -30744 652141 884148 453888 -292598 -565674
$$ packed form
38462b02153k06385K57482K06831j76831k78677n9941Q7545M6499k7998q2402
38452d36030r9503L1613K38089K02343j05342k24370J09437M60711K95125k30745
38442B41328n11568l05518P8252K48914R4220j89024k34743J18414M74693K51404
38432B66372m30991p04279j29549N74684N07612j07558k88071K25351O24699K74395
38422H12665l94565n78778k12510J02173M7441o0704P8799K28450M7782k41916
38412a71163j16638L72311N29679L0822n12029m20103L6495J00561k56900l27527
38402g34492J51028N61409L75551p8868j83844R6461L02166J38203k87005o79548
38392c38939p64682m35212J26974N93423P87692O82885K32007m30260p46486k73076
$$ plain form
38382 -565674 -36251 661289 753165 367550 208938 426952 517541 306127 255617 593324
38372 593324 820981 481903 -102681 -320640 -121104 102961 233091 493262 859412 915103
38362 915103 480293 50996 281451 1091964 1609097 1164223 160411 -360947 29909
38353 29909 712214 912882 609486 267871 88662 -37348 -98544 4086 144598 162609
38343 162609 225724 528681 807009 714085 509642 669121 909602 477106 -502209 -922912
38333 -922912 -315947 357875 137767 -514518 -547059 26465 295056 -29239 -285564 -59485
38323 -59485 225088 147862 -24719 120008 458245 599788 459291 170592 -259621 -796947
38313 -796947 -1106006 -900954 -477550 -417086 -714535 -679268 73354 937099 1013051 253601
$$ packed form
38382e65674N29423O97540R1876l85615j58612K18014R0589k11414n0510L37707
38372E93324K27657l39078n84584k17959J99536K24065J30130K60171L66150N5691
38362I15103m34810m29297K30455Q10513N17133m44874j003812n21358L90856
38353B9909O82305K00668l03396l41615j79209j26010o1196J02630J40512J8011
38343A62609O3115L02957K78328r2924k04443J59479K40481m32496r79315m20703
38333i22912O06965O73822k20108o52285l2541N73524K68591l24295k56325K26079
38323e9485K84573p7226j72581J44727L38237J41543j40497k88699m30213n37326
38313g96947l09059K05052M23404O0464k97449L5267P52622Q63745P5952p59450
$$ plain form
38303 253601 -545202 -781598 -568440 -204234 286203 842952 1133624 1032412 926671 1078613
38293 1078613 1058509 410183 -415176 -540186 27960 369341 27616 -372899 -172425 365454
38283 365454 586389 388601 117624 -86031 -307431 -486842 -517032 -552818 -813464 -1188466
38273 -1188466 -1369063 -1250328 -925789 -455042 66355 387530 375987 254802 266980 295488
38263 295488 150258 6529 121271 286569 79662 -410111 -632823 -377634 715 240105
38253 240105 493835 767649 593954 -270280 -1185442 -1237745 -398166 422271 490330 -22917
38243 -22917 -530867 -781079 -827588 -630507 -159649 261085 234640 -56312 17522 580343
38233 580343 928836 491754 -315240 -657232 -373120 53111 360112 658286 804127 405051
$$ packed form
38303B53601p98803k36396K13158L64206M90437N56749K90672j01212j05741J51942
38293A078613k0104o48326q25359j25010N68146L41381l41725m00515K00474N37879
38283C65454K20935j97788k70977k03655k21400j79411l0190l5786k60646l75002
38273a188466j80597J18735L24539M70747N21397L21175j1543j21185J2178K8508
38263B95488j45230j43729J14742J65298k06907m89773k22712K55189L78349K39390
38253B40105K53730K73814j73695q64234r15162n2303Q39579Q20437O8059n13247
38243b2917n07950k50212m6509J97081M70858M20734k6445k90952P3834N62821
38233E80343L48493m37082q06994l41992K84112M26231L07001K98174J45841l99076
$$ plain form
38223 405051 -403685 -901399 -785419 -588962 -736238 -826496 -390374 203552 294306 -6109
38213 -6109 -62876 178776 151966 -289185 -586176 -422407 -232023 -395197 -523358 -94962
38203 -94962 579540 686549 106391 -353797 -95682 422317 380313 -173097 -372252 181300
38193 181300 793767 660658 -6538 -390064 -313066 -351417 -726831 -887029 -473104 6917
38183 6917 -15349 -248449 -98129 243145 70726 -602845 -930154 -476077 159361 294957
38173 294957 125785 222612 514776 424993 -138206 -577900 -500652 -250791 -253130 -262283 226698
38162 226698 1027370 1333498 822036 125568 -82068 4398 -210152 -690815 -833148 -435917
38152 -435917 27295 190214 279039 604245 1023097 1181331 974603 557602 165104 58769
$$ packed form
38223D05051q08736m97714J15980J96457j47276r0258M36122N93926R0754l00415
38213f109n6767K41652k6810m41151k96991J63769J90384j63174j28161M28396
38203i4962O74502J07009n80158m60188K58115N17999m2004n53410j99155N53552
38193A81300O12467j33109o67196l83526P6998l8351l75414j60198M13925M80021
38183F917k2266k33100J50320L41274j72419o73571l27309M54077O35438J35596
38173B94957j69172R6827K92164q9783n63199m39694P7248K49861k339r153M88981
38162B26698Q00672L06128n11462o96468k07636Q6466k14550m80663j42333L97231
38152d35917M63212J62919Q8825L25206M18852J58234k06728m17001l92498j06335
$$ plain form
38142 58769 344407 735691 843188 752689 853900 1034212 700939 -145484 -595311 -84120
38132 -84120 679887 697409 68726 -340008 -214339 46532 217730 438379 624968 519599
38122 519599 312548 440302 737873 590847 32670 -151137 331315 738014 415085 -239688
38112 -239688 -463915 -218954 10466 98209 317970 714000 1006722 1058144 977746 796779
38102 796779 432798 -7252 -231530 -142638 40212 114532 145358 281503 474886 536454
38092 536454 429966 355488 458902 562388 377137 -21935 -211426 -50031 7370 -455487
38082 -455487 -1094306 -1174482 -588103 -4641 54850 -195450 -322245 -310222 -360661 -403418
38072 -403418 -222707 94698 200566 -73073 -562031 -1005375 -1218241 -1085778 -610284 16725
$$ packed form
38142E8769K85638L91284J07497r0499J01211J80312l33273q46423m49827N11191
38132h4120P64007J7522o28683m08734J25669K60871J71198K20649J86589j05369
38122E19599k07051J27754K97571j47026n58177j83807M82452M06699l22929o54773
38112b39688k24227K44961K29420Q7743K19761L96030K92722N1422q0398j80967
38102G96779l63981m40050k24278Q8892J82850P4320L0826J36145J93383O1568
38092E36454j06488p4478J03414J03486j85251l99072j89491J61395N7401m62857
38082d55487o38819q0176N86379N83462N9491k50300j26795J2023n0439m2757
38072d03418J80711L17405J05868k73639m88958m43344k12866J32463M75494O27009
$$ plain form
38062 16725 527274 772861 753499 542917 297000 239595 470225 809305 963624 834564
38052 834564 568771 340432 197178 109536 68480 112971 300667 617290 868923 757585
38042 757585 208414 -412463 -591789 -239214 186677 211251 -157215 -613279 -1044144 -1490973
38032 -1490973 -1695389 -1204859 -162427 490570 107423 -661208 -613664 338939 1011213
38023 1011213 625897 -99871 -30489 820411 1481310 1436145 1093714 941577 948836 931721
38013 931721 923314 927400 730788 252381 -202095 -303421 -134444 -29681 -95691 -110437 111346
38002 111346 406125 406996 5555 -423941 -419621 -45548 142028 -138860 -454227 -256325
37992 -256325 302456 554699 227392 -246004 -363224 -145436 41620 2821 -131580 -161679
$$ packed form
38062A6725N10549K45587j9362k10582k45917n7405K30630L39080J54319j29060
38052H34564k65793k28339j43254q7642m1056M4491J87696L16623K51633j11338
38042G57585n49171o20877j79326L52575M25891K4574l68466m56064m30865m46829
38032a490973k04416M90530J042432O52997l83147p68631M7544R52603O72274
38023A011213l85316p25768O9382Q50900O60899m5165l42431j52137P259j7115
38013I31721q407M086j96612m78407m54476j01326J68977J04763o6010j4746K21783
38002A11346K94779Q71m01441m29496M320L74073J87576k80888l15367J97902
37992b56325N58781K52243l27307m73396j17220K17788J87056l8799j34401l0099
$$ plain form
37982 -161679 -103064 -198068 -615460 -1158581 -1420847 -1268919 -962304 -722074 -475094 -178665
37972 -178665 -45685 -173893 -284815 -167543 -51507 -147262 -177276 129768 416300 197789
37962 197789 -268883 -334043 -18009 47996 -288004 -461907 -156266 236072 302151 109083
37952 109083 -175786 -528434 -741192 -517274 -129553 -298227 -1092090 -1619484 -1207502 -275625
37942 -275625 375987 538715 406081 39263 -419914 -555329 -296826 -237995 -726296 -1154300
37932 -1154300 -868933 -288623 -241420 -567505 -404596 281564 537219 -60915 -718066 -647418
37922 -647418 -182944 -108978 -445158 -550900 -161999 287027 350632 131082 29765 201332
37912 201332 421931 409454 136122 -200025 -426552 -521810 -515519 -406261 -232384 -106294
$$ packed form
37982a61679N8615r5004m17392n43121k62266J51928L06615K40230K46980K96429
37972a78665J32980j28208j10922J17272J16036r5755l0014L07044K86532k18511
37962A97789m66672o5160L16034O6005l36000j73903L05641L92338O6079j93068
37952A09083k84869l52648k12758K23918L87721j68674p93863n27394M11982R31877
37942b75625O51612J62728j32634l66818m59177j35415K58503N8831m88301m28004
37932a154300K85367N80310M7203l26085J62909O86160K55655n98134o57151P0648
37922f47418M64474P3966l36180j05742L88901M49026O3605k19550j01317J71567
37912B01332K20599j2477k73332l36147k26527r5258O291J09258J73877J26090
$$ plain form
37902 -106294 -87788 -93619 3931 241054 530563 682037 498892 18262 -386759 -374547
37892 -374547 -97987 -37374 -358403 -734587 -834620 -638536 -224091 335258 741475 616012
37882 616012 90833 -205679 -15444 188188 36315 -95585 202106 529156 245727 -431718
37872 -431718 -671673 -244623 223670 226470 -53388 -251111 -309390 -267003 -41805 321277
37862 321277 517004 319724 -143084 -567127 -747744 -655974 -428048 -271021 -221296 -99091
37852 -99091 125063 151771 -161682 -421654 -259229 -14279 -254922 -778093 -817349 -244228
37842 -244228 212220 111958 -89052 95992 406415 393662 197699 212000 382828 397771
37832 397771 274808 231455 191217 -65175 -412433 -522557 -373912 -169941 129589 707610
$$ packed form
37902a06294J8506n831R7550K37123K89509J51474j83145m80630m05021J2212
37892c74547K76560O0613l21029l76184j00033J96084M14445N59349M06217j25463
37882F16012n25179k96512J90235K03632j51873j31900K97691L27050k83429o77445
37872d31718k39955M27050M68293K800k79858j97723n8279M2387K25198L63082
37862C21277J95727j97280m62808m24043j80617R1770K27926J57027M9725J22205
37852i9091K24154K6708l13453k59972J62425K44950k40643n23171l9256N73121
37842b44228M56448j00262k01010J85044L10423j2753j95963J4301J70828J4943
37832C97771j22963m3353m0238k56392l47258j10124J48645K03971K99530N78021
$$ plain form
37822 707610 1377221 1669833 1465092 1082910 711499 233412 -263829 -331245 190939 769234
37812 769234 796469 347075 -55325 -215651 -393726 -747544 -1081684 -1201916 -1166825 -1068791
37802 -1068791 -858722 -558228 -405664 -558959 -792959 -729384 -321832 77600 136529 -102080
37792 -102080 -291933 -145384 246254 431474 66417 -569897 -742641 -135707 652538 800979
37782 800979 296123 -145555 -115583 51575 -9708 -99226 98891 388032 346751 18914
37772 18914 -145706 41311 293783 293692 23660 -350508 -644841 -680750 -393862 37113 352221
37761 352221 493466 557553 540760 368749 123317 -28351 -93927 -171814 -166641 67162 330339
37750 330339 254224 -73881 -133594 214607 429234 102920 -391630 -529551 -518603 -923580
$$ packed form
37822G07610O69611K92612k04741l82182l71411m78087m97241o7416N22184N78295
37812G69234K7235m49394m02400j60326j78075l53818l34140j20232L5091R8034
37802a068791K10069L00494J52564j53295k34000O3575M07552L99432N8929k38609
37792a02080j89853J46549L91638J85220l65057o36314j72744O06934P88245J48441
37782H00979n04856m41678K9972J67158o1283q9518J98117K89141m1281l27837
37772A8914j64620J87017K52472r1k70032l74168k94333l5909K86888M30975L15108
37761C52221J41245O4087j6793j72011k45432j51668o5576p7887N173K33803K63177
37750C30339p6115l28105n9713L48201K14627l26314m94550j37921J0948m04977
$$ plain form
37740 -923580 -1600290 -1735851 -1039564 -233074 -58323 -316649 -319952 67368 351174 199546
37730 199546 -198744 -559773 -830801 -971653 -787954 -213528 463645 872352 923661 759593
37720 759593 491703 174380 -74086 -126309 6934 206263 373606 450964 410440 328220
37710 328220 346962 447573 413770 178207 10222 116139 231023 -53210 -647266 -1019852
37700 -1019852 -876442 -428325 22931 374953 516755 248375 -371161 -897847 -958947 -624338
37690 -624338 -168853 265462 579075 594305 328412 161055 391400 780038 869273 642620
37680 642620 486347 530186 443456 14909 -404739 -304775 290633 783785 655089 -14401
37670 -14401 -706512 -1006474 -878861 -522508 -164366 -9605 -165266 -480571 -633327 -528097
$$ packed form
37740i23580o76710j35561O96287Q06490J74751k58326l303L87320K83806j51628
37730A99546l98290l61029k71028j40852J83699N74426O77173M08707N1309j64068
37720G59593k67890l17323k48466n2223J33243J99329J67343P7358m0524q2220
37710C28220J8742J00611l3803k35563j67985J05917J14884k84233n94056l72586
37700a019852J43410M48117M51256L52022J41802k68380o19536n26686o1100L34609
37690f24338M55485M34315L13613J5230k65893j67357K30345L88638Q9235k26653
37680F42620j56273M3839q6730m28547m19648R9964N95408M93152j28696o69490
37670a4401o92111k99962J27613L56353L58142J54761j55661l15305j52756J05230
$$ plain form
37660 -528097 -431633 -521045 -523458 -138423 346620 313382 -326865 -964840 -1064733 -718564 -331660
37649 -331660 -145740 -217342 -476664 -599601 -184412 682859 1340051 1291736 788253 428563
37639 428563 451801 679699 901474 1012278 956279 799860 711614 686361 506102 150124
37629 150124 -55919 53678 153972 -59587 -326607 -210855 174559 292218 -55504 -505599
37619 -505599 -679752 -615490 -599103 -786829 -1039316 -1041579 -628223 -9371 472681 776813
37609 776813 1049678 1115766 615981 -196316 -443732 193760 879019 753422 146270 -38899
37599 -38899 297297 516938 399096 306936 299942 12588 -490729 -615741 -224359 69784
37589 69784 -84509 -197615 181952 644586 547605 18414 -279177 -123422 88236 24416
$$ packed form
37660e28097R6464q9412k413L85035M85043l3238o40247o37975r9893L46169L86904
37649c31660J85920p1602k59322j22937M15189Q67271O57192m8315n03483l59690
37639D28563K3238K27898K21775J10804n5999j56419q8246k5253j80259l55978
37629A50124k06043J09597J00294k13559k67020J15752L85414J17659l47722m50095
37619e05599j74153O4262J6387j87726k52487k263M13356O18852M82052L04132
37609G76813K72865O6088m99785q12297k47416O37492O85259j25597o07152j85169
37599c8899L36196K19641j17842r2160o994k87354n03317j25012L91382K94143
37589F9784j54293j13106L79567M62634r6981n29191k97591J55755K11658o3820
$$ plain form
37579 24416 -223079 -464191 -651220 -682904 -323721 438618 1138820 1224753 696895 111836
37569 111836 -130544 -221604 -439214 -530019 -116916 427441 254744 -653489 -1227886 -790200
37559 -790200 -73521 -103097 -679922 -881371 -650405 -794377 -1498226 -1938330 -1583551 -930470
37549 -930470 -576132 -366431 52926 487456 540945 254151 -94235 -465713 -899639 -1179936
37539 -1179936 -1092394 -792253 -556566 -376748 -120917 112841 158675 140010 301109 541713
37529 541713 442697 -188953 -991889 -1358392 -1031124 -354659 103818 161158 94301 85157
37519 85157 -89825 -581220 -1018211 -972699 -625295 -440902 -373437 -41584 400115 338781
37509 338781 -250303 -612905 -342436 20738 -89596 -395319 -342871 -12597 145106 117650
$$ packed form
37579B4416k47495k41112j87029l1684L59183P62339P00202Q5933n27858n85059
37569A11836k42380r1060k17610r0805M13103N44357j72697r08233n74397M37686
37559g90200P16679k9576n76825k01449K30966j43972p03849m40104L54779O53081
37549i30470L54338K09701M19357M34530N3489k86794l48386l71478m33926k80297
37539a179936Q7542L00141K35687J79818K55831K33758M5834j8665J61099K40604
37529E41713r9016o31650q02936l66503L27268O76465M58477N7340o6857r144
37519H5157j74982m91395m36991M5512L47404J84393O7465L31853M41699o1334
37509C38781n89084l62602K70469L63174j10334l05723N2448L30274J57703k7456
$$ plain form
37499 117650 252829 561874 652868 316499 -223113 -631370 -761707 -661536 -469603 -276498
37489 -276498 -44204 199265 160368 -350555 -850275 -533285 607229 1562003 1544135 926249
37479 926249 520132 442337 284954 9185 -44101 146885 230014 74409 -113920 -235761
37469 -235761 -379976 -502135 -480438 -451093 -628882 -829347 -651050 -128211 297939 485103
37459 485103 721337 1040628 991996 380208 -244638 -229907 369848 991711 1297298 1311800
37449 1311800 1060025 549871 49128 -93140 41167 18924 -239112 -257479 253068 849963
37439 849963 939293 599214 325001 161248 -253899 -783485 -690434 247282 1170994 1203907
37429 1203907 594451 206564 265911 326967 221154 199687 179417 -291055 -1125797 -1530332
$$ packed form
37499A17650J35179L09045R0994l36369n39612m08257j30337J00171J91933J93105
37489b76498K32294K43469l8897n10923m99720L16990J140514R54774j7868o17886
37479I26249m06117p7795j57383k75769n3286J90986Q3129j55605j88329j21841
37469b35761j44215j22159K1697K9345j77789k00465J78297N22839M26150J87164
37459D85103K36234L19291m8632o11788o24846J4731N99755O21863L05587J4502
37449A311800k51775n10154n00743j42268J34307k2243k58036j8367N10547N96895
37439H49963Q9330l40079k74213j63753m15147n29586R3051R37716R23712L2913
37429A203907o09456l87887N9347O1056j05813k1467k0270m70472q34742m04535
$$ plain form
37419 -1530332 -1074776 -300311 144489 386395 820958 1199489 912780 12280 -683374
37410 -683374 -571402 68259 517601 453393 171182 116577 380425 709853 907536 1009965
37400 1009965 1025575 788745 320637 76662 421192 986579 1026293 395425 -271411 -404322
37390 -404322 -90844 241483 306193 20329 -502290 -887727 -788731 -335265 29198 176765
37380 176765 368358 714971 1047091 1336656 1720202 2060317 2053680 1839329 1886722 2190540
37370 2190540 2232519 1847701 1412108 1057145 537588 73033 342974 1250541 1678805 1051505
37360 1051505 215618 106630 451472 599346 734286 1226586 1517033 849182 -324481
37351 -324481 -811107 -311089 401540 713225 656711 358266 -97737 -382896 -294065 -217909
$$ packed form
37419a530332M55556P74465M44800K41906M34563L78531k86709r00500o95654
37410f83374J11972O39661M49342o4208k82211n4605K63848L29428J97683J02429
37400A009965J5610k36830m68108k43975L44530N65387L9714o30868o66836j32911
37390d04322L13478L32327O4710k85864n22619l85437R8996M53466L64463J47567
37380A76765J91593L46613L32120K89565L83546L40115o637k14351M7393L03818
37370B190540M1979l84818m35593l54963n19557m64555K69941R07567M28264o27300
37360A051505q35887j08988L44842J47874J34940M92300K90447o67851j173663
37351c24481m86626N00018P12629L11685n6514k98445m56003k85159Q8831P6156
$$ plain form
37341 -217909 -490876 -637815 -117980 542981 408134 -355103 -736203 -489403 -305099 -439012
37331 -439012 -396593 -71732 2357 -261823 -312905 -83939 -158465 -532556 -423648 261054
37321 261054 496887 -193721 -792843 -303381 747651 1189218 803716 193844 -267214
37312 -267214 -507970 -356133 128543 401552 208910 87942 435402 723402 432533 93163
37302 93163 422004 1000474 937139 419122 365721 762291 649788 -177703 -723333 -329924
37292 -329924 417708 753517 746732 751731 667906 349079 94892 121729 77526 -320526 -650317
37281 -650317 -436271 -34223 -139660 -665615 -867895 -502505 -113060 -86448 -130603 40457
37271 40457 108478 -306221 -893272 -979108 -465217 42517 74491 -131843 -76907 254444
$$ packed form
37341b17909k72967j46939N19835O60961j34847p63237l81100K46800J84304j33913
37331d39012M2419L24861P4089k64180n1082K28966p4526l74091J08908O84702
37321B61054K35833o90608n99122M89462J051032M41567l85502o09872m61058
37312b67214k40756J51837M84676K73009j92642j20968L47460K88000k90869l39370
37302I3163L28841N78470o3335n18017n3401L96570j12503q27491n45630L93409
37292c29924P47632L35809o785M999q3825l18827k54187K6837m4203l98052l29791
37281f50317K14046M02048j05437n25955k02280L65390L89445K6612m4155J71060
37271D0457O8021m14699n87051q5836N13891N07734L1974k06334N4936L31351
$$ plain form
37261 254444 373240 -40682 -680565 -929522 -543851 99888 434572 257265 -209691 -677480
37251 -677480 -1010068 -1116434 -899595 -460919 -166306 -296784 -724510 -1105650 -1277579 -1259826
37241 -1259826 -1006055 -474342 118963 473542 636518 880291 1112020 884746 196813
37232 196813 -210141 240288 1093476 1396972 913403 304301 175222 437374 685182 757669
37222 757669 720456 601949 403211 218025 139699 111350 4223 -176057 -249771 -64059
37212 -64059 264600 360584 -33295 -659792 -908987 -517103 42989 74722 -529953 -1223465
37202 -1223465 -1505793 -1423068 -1291030 -1162794 -800167 -133456 475979 604780 339233 222324
37192 222324 511293 761492 469314 -72083 -69638 620438 1210497 1056289 517549 444175
$$ packed form
37261B54444J18796m13922o39883k48957L85671O43739L34684j77307m66956m67789
37251f77480l32588j06366K16839M38676K94613j30478m27726l81140j71929J7753
37241a259826K53771N31713N93305L54579J62976K43773K31729k27274o87933
37232A96813m06954M50429Q53188L03496m83569o09102j29079K62152K47808P2487
37222G57669l7213j18507j98738j85186p8326k8349j07127j80280p3714J85712
37212f4059L28659R5984l93879o26497k49195L91884N60092L1733o04675o93512
37202a223465k82328Q2725J32038J28236L62627O66711O09435J28801k65547j16909
37192B22324K88969K50199k92178n41397K445O90076N90059j54208n38740p3374
$$ plain form
37182 444175 1247423 2814716 4828208 6612453 7090119 5678160 3169428 1101424 234990
37173 234990 160961 310650 627456 1082728 1254676 878106 411928 543708 1259536 1794737
37163 1794737 1509487 557448 -363934 -751969 -670361 -448425 -198491 205481 739063 1089854
37153 1089854 1017459 646406 265781 29633 -3587 234367 674558 1043755 1144300 1024890
37143 1024890 737858 233656 -289478 -334413 197670 608861 231731 -579379 -863068 -324859
37133 -324859 403873 737502 730524 599058 269867 -282064 -679835 -531163 3082 332826
37123 332826 116043 -353660 -499847 -163021 193702 117002 -172903 -133756 165172 68250
37113 68250 -571210 -1039825 -894883 -713235 -1084281 -1537651 -1342121 -833832 -888799 -1392202
$$ packed form
37182D44175Q03248J567293K013492J784245M77666j411959k508732k068004q66434
37173B34990p4029J49689L16806M55272J71948l76570m66178J31780P15828N35201
37163A794737k85250r52039r21382l88035Q1608K21936K49934M03972N33582L50791
37153A089854p2395l71053l80625k36148l3220K37954M40191L69197J00545j19410
37143A024890k87032n04202n23134m4935N32083M11191l77130q11110k83689N38209
37133c24859P28732L33629o978j31466l29191n51931l97771J48672N34245L29744
37123C32826k16783m69703j46187L36826L56723p6700k89905L9147K98928r6922
37113F8250o39460m68615J44942J81648l71046m53370J95530N08289n4967n03403
$$ plain form
37103 -1392202 -1392613 -703301 -184574 -290256 -440420 -162943 151757 102814 5769 198428
37093 198428 341703 34628 -425603 -511745 -294942 -250303 -512346 -792690 -859839 -754140
37083 -754140 -646415 -671899 -775924 -709214 -411992 -292399 -697881 -1227949 -1177213 -630061
37073 -630061 -398716 -789963 -1203517 -1150689 -884736 -727092 -557234 -356293 -475242 -878433
37063 -878433 -866842 -130325 602696 591398 133041 -77476 -39771 -140450 -261161 -35054
37053 -35054 339887 344392 -17674 -308446 -375313 -328364 -40970 615278 1207311 1139295 543004
37042 543004 96413 -6143 -221002 -745348 -1111325 -904224 -376953 -64013 -91209 -119097
37032 -119097 161654 631075 846651 575588 155326 101777 384864 469299 133034 -243975
$$ packed form
37103a392202m11O89312N18727j05682j50164K77477L14700m8943r7045J92659
37093A98428J43275l07075m60231q6142K16803M4639k62043k80344o7149J05699
37083g54140J07725k5484j04025O6710K97222J19593m05482n30068N0736N47152
37073f30061K31345l91247m13554N2828K65953J57644J69858K00941j18949m03191
37063h78433J1591P36517P33021j1298m58357k10517L7705j00679j20711K26107
37053c5054L74941M505l62066k90772o6867M6949K87394O56248N92033o8016n96291
37042E43004m46591j02556k14859n24346l65977K07101N27271L12940k7196k7888
37032a19097K80751M69421K15576k71063m20262n3549K83087Q4435l36265l77009
$$ plain form
37022 -243975 -364591 -403790 -425920 -76482 649071 962833 305896 -667940 -889628 -296751
37012 -296751 307688 500434 497882 385029 -1006 -434864 -392903 110049 472492 398940
37002 398940 207900 166289 139729 9746 -139987 -333229 -627987 -700849 -141295 769236
36992 769236 1242331 1053467 726454 517338 34406 -815471 -1326110 -972714 -234173 172281
36982 172281 336040 755789 1313055 1407594 940639 464079 354518 413176 367573 291003
36972 291003 352183 488202 534629 495349 511917 635678 732385 622121 312593 65373
36962 65373 132654 403502 440330 -49786 -867005 -1500599 -1571984 -1077703 -352635 122938
36952 122938 30868 -522197 -1095544 -1323517 -1167457 -776783 -292084 142502 380538 445971
$$ packed form
37022b43975j20616l9199k2130L49438P25553L13762o56937r73836k21688N92877
37012b96751O04439J92746k552j12853l86035m33858M1961N02952L62443p3552
37002C98940j91040m1611k6560j29983j49733j93242k94758p2862N59554R10531
36992G69236M73095j88864l27013k09116m82932q49877n10639L53396P38541M06454
36982A72281J63759M19749N57266R4539m66955m76560j09561N8658m5603p6570
36972B91003O1180J36019M6427l9280J6568J23761R6707j10264l09528k47220
36962F5373O7281K70848L6828m90116q17219o33594p1385M94281P25068M75573
36952A22938r2070n53065n73347k27973J56060L90674M84699M34586K38036O5433
$$ plain form
36942 445971 556340 809476 983459 842415 521239 355564 387103 328749 59447 -145667
36932 -145667 -45464 141996 19927 -385763 -618874 -420973 -78678 1050 -172760 -293494
36922 -293494 -244805 -166364 -102329 62661 258408 173115 -255731 -569144 -311086 318838
36912 318838 669866 466994 99027 -1975 58619 -75788 -369651 -423456 -125149 136470
36902 136470 86013 16852 259981 464326 -20212 -1058071 -1644810 -1144760 -99231 547217
36892 547217 571921 379945 204171 5626 -92987 56978 171098 -146747 -658202 -712773
36882 -712773 -254495 53346 -159760 -487576 -508399 -420486 -583988 -934220 -1208131 -1336944
36872 -1336944 -1287579 -913225 -292005 158993 232981 236896 430363 548408 262480 -232534
$$ packed form
36942D45971J10369K53136J73983j41044l21176j65675L1539n8354k69302k05114
36932a45667J00203J87460j22069m05690k33111J97901L42295P9728j73810j20734
36922b93494M8689P8441O4035J64990J95747q5293m28846l13413K58058O29924
36912C18838L51028k02872l67967j01002O0594j34407k93863n3805K98307K61619
36902A36470n0457o9161K43129K04345m84538j037859n86739N00050J045529O46448
36892E47217K4704j91976j75774j98545r8613J49965J14120l17845n11455n4571
36882g12773M58278L07841k13106l27816k0823Q7913j63502l50232k73911j28813
36872a336944M9365L74354O21220M50998P3988L915J93467J18045k85928m95014
$$ plain form
36862 -232534 -520751 -584462 -691364 -857970 -841602 -579631 -316780 -320331 -626144 -984356
36852 -984356 -1008833 -564734 2805 310068 521004 1015935 1535275 1373621 590051 224514
36842 224514 888027 1841230 2024062 1399124 661948 163102 -171361 -268236 -18153 276127
36832 276127 217743 -81077 -243583 -268762 -423265 -706709 -890680 -866707 -564982 137258
36822 137258 1009972 1399738 1063531 623364 643660 763841 400048 -217204 -482697 -409293
36812 -409293 -332188 -89867 543230 1030019 751372 182561 238340 701323 570994 -154108
36802 -154108 -431408 17736 289257 -13772 -91893 500511 930235 480824 -247067 -417424
36792 -417424 -294278 -516457 -806578 -483339 236979 508153 173861 -109574 19351 193883
$$ packed form
36862b32534k88217o3711j06902j66606J6368K61971K62851l551l05813l58212
36852i84356k4477M44099N67539L07263K10936M94931N19340j61654p83570l65537
36842B24514O63513R53203J82832o24938p37176m98846l34463r6875K50083K94280
36832B76127n8384k98820j62506k5179j54503k83444j83971K3973L01725P02240
36822A37258Q72714L89766l36207m40167K0296J20181l63793o17252k65493P3404
36812d09293P7105K42321O33097M86789k78647n68811N5779M62983j30329p25102
36802a54108k77300M49144K71521l03029p8121N92404M29724m49411p27891j70357
36792d17424J23146k22179k90121L23239P20318K71174l34292k83435J28925J74532
$$ plain form
36782 193883 35277 -320113 -524985 -437621 -158935 77633 62515 -148218 -231695 9609
36772 9609 412280 741928 983824 1186311 1303556 1410089 1773823 2433082 2944410 2849518
36762 2849518 2225288 1537406 1124283 1031273 1151530 1285828 1204392 862320 471523 248322
36752 248322 192750 146675 -91266 -681031 -1516629 -2106040 -1986822 -1269685 -472112 107298
36742 107298 444285 360604 -314377 -1119014 -1221810 -540782 64473 20085 -219099 -67302
36732 -67302 227677 123979 -229850 -241637 209285 731156 1077224 1293535 1390213 1361522
36722 1361522 1371296 1485314 1430966 1060858 783923 1003385 1374043 1247904 703267 447160
36712 447160 729879 1054627 1061542 1016809 1171608 1242413 940696 584410 683654 1127838
$$ packed form
36782A93883j58606l55390k04872Q7364K78686K36568j5118k10733q3477K41304
36772I609M02671L29648K41896K02487J17245J06533L63734O59259N11328r4892
36762B849518o24230o87882m13123r3010J20257J34298q1436l42072l90797k23201
36752B48322n5572m6075k37941n89765q35598n89411J19218P17137P97573N79410
36742A07298L36987q3681o74981q04637j02796O81028O05255m4388k39184J51797
36732f7302K94979j03698l53829j1787M50922N21871L46068K16311R6678k8691
36722A361522R774J14018n4348l70108k76935K19462L70658j26139n44637k56107
36712D47160K82719L24748O915m4733J54799P0805l01717l56286R9244M44184
$$ plain form
36702 1127838 1257141 732615 -19803 -336683 -59771 411476 684545 751269 759740 663824
36692 663824 353022 11029 -4067 331549 657262 778440 893254 1096160 1086106 714670
36682 714670 435613 699176 1156420 1067670 397496 -136543 -153524 -98768 -420707 -851626
36672 -851626 -915895 -715689 -702904 -922223 -996210 -767019 -490972 -392445 -415792 -460006 -507488
36661 -507488 -471710 -281525 -188444 -561693 -1200462 -1314351 -543172 396922 581564 119962
36651 119962 -71946 376668 841612 708245 188539 -163282 -241628 -284771 -334674 -257296
36641 -257296 -116951 -126495 -290993 -388821 -262981 48695 370975 446967 127792 -336384
36631 -336384 -441154 -69031 285935 179292 -209561 -479832 -638718 -876961 -1010985 -724752
$$ packed form
36702A127838J29303n24526p52418l16880K76912M71247K73069O6724Q471r5916
36692F63824l10802l41993j5096L35616L25713J21178J14814K02906j0054l71436
36682G14670k79057K63563M57244q8750o70174n34039j6981N4756l21939m30919
36672h51626o4269K00206J2785k19319p3987K29191K76047R8527k3347m4214m7482
36661e07488L5778J90185R3081l73249o38769j13889P71179R40094J84642m61602
36651A19962j91908M48614M64944j33367n19706l51821p8346m3143m9903P7378
36641b57296J40345r544j64498r7828J25840L11676L22280P5992l19175m64176
36631c36384j04770L72123L54966j06643l88853k70271j58886k38243j34024K86233
$$ plain form
36621 -724752 -213644 9446 -88966 -29975 386458 812420 967122 982487 973634 783464
36611 783464 402359 176952 281404 372155 137129 -141388 -20429 318778 233897 -434148
36601 -434148 -1034670 -896544 -142840 512618 593902 226953 -210894 -466800 -405562 18185
36591 18185 587382 898409 853905 820379 1013366 1062389 636356 154952 199633 454430
36581 454430 109320 -730610 -1055227 -561595 -180495 -528937 -883045 -421865 415691 718795
36571 718795 497890 295838 44664 -575401 -1108261 -844028 -100443 169863 -108274 -154271
36561 -154271 215658 347708 49853 -29498 413169 806520 709105 441331 352783 281981
36551 281981 117259 135032 397023 497359 262537 53669 62526 -18143 -293424 -319267
$$ packed form
36621g24752N11108K23090r8412N8991M16433M25962J54702J5365q853j90170
36611G83464l81105k25407J04452R0751k35026k78517J20959L39207q4881o68045
36601d34148o00522J38126P53704O55458Q1284l66949m37847k55906O1238M23747
36591A8185N69197L11027m4504l3526J92987M9023m26033m81404M4681K54797
36581D54430l45110q39930l24617M93632L81100l48442l54108M61180Q37556L03104
36571G18795k20905k02052k51174o20065n32860K64233P43585K70306k78137m5997
36561a54271L69929J32050k97855p9351M42667L93351r7415k67774q8548p0802
36551B81981j64722J7773K61991J00336k34822k08868Q857q0669k75281k5843
$$ plain form
36541 -319267 156458 722071 947230 924331 829686 543606 65986 -271568 -360093 -497726
36531 -497726 -693794 -443406 393845 1138030 1188536 778891 356437 -141733 -803348 -1167682
36521 -1167682 -894890 -529055 -772720 -1326412 -1305779 -656094 -272120 -616361 -997325 -570044
36511 -570044 461840 1098795 784889 -18278 -512704 -487900 -335277 -323608 -276965 -60188
36501 -60188 47166 -223579 -647811 -834644 -778323 -676002 -472822 -83090 200673 107649
36491 107649 -25163 277065 756057 753188 286564 -9902 22274 -98501 -502761 -704549
36481 -704549 -527304 -452652 -741872 -957664 -709770 -242855 30118 22831 -206408 -553851
36471 -553851 -649627 -186437 412462 372142 -270507 -679735 -522466 -336830 -395809 -244518
$$ packed form
36541c19267M75725N65613K25159k2899r4645k86080m77620l37554q8525j37633
36531d97726j96068K50388Q37251P44185N0506m09645m22454m98170o61615l64334
36521a167682K72792L65835k43665n53692K0633O49685L83974l44241l80964M27281
36511e70044J031884O36955l13906q03167m94426K4804J52623J1669M6643K16777
36501f0188J07354k70745m24232j86833N6321J02321K03180L89732K83763r3024
36491A07649j32812L02228M78992k869m66624k96466L2176j20775m04260k01788
36481g04549J77245P4652k89220k15792K47894M66915K72973p287k29239l47443
36471e53851r5776M63190N98899m0320o42649m09228J57269J85636n8979J51291
$$ plain form
36461 -244518 247131 437585 77142 -109190 296760 533369 -35733 -618317 -116182 1029460
36451 1029460 1315572 289069 -882704 -1011126 -233570 439152 360096 -236572 -694015
36442 -694015 -698372 -549973 -642375 -835130 -648472 8816 719530 1125654 1162800 793734
36432 793734 74773 -523789 -484746 23414 378106 448850 628719 958163 1036098 854187
36422 854187 855589 1055722 995152 695948 708210 1020014 931671 278190 -248938 -306093 -357620
36411 -357620 -570909 -387125 298519 641675 173160 -386894 -312526 52494 73916 -177884
36401 -177884 -361265 -490820 -561111 -350399 -77509 -349521 -1005332 -1052512 -260580 338202
36391 338202 139186 -100992 220033 414952 -121807 -644677 -341953 177228 -45778 -650305
$$ packed form
36461b44518M91649J90454l60443j86332M05950K36609n69102n82584N02135J145642
36451A029460K86112j026503j171773j28422P77556O72722p9056n96668m57443
36442f94015m357J48399r2402j92755J86658O57288P10714M06124L7146l69066
36432G93734p18961n98562L9043N08160L54692P0744J79869L29444P7935j81911
36422H54187J402K00133o0570k99204J2262L11804q8343o53481n27128n7155n1527
36411c57620k13289J83784O85644L43156m68515n60054P4368L65020K1422k51800
36401a77884j83381j29555p0291K10712K72890k72012o55811m7180P91932N98782
36391C38202j99016k40178L21025J94919n36759n22870L02724N19181k23006o04527
$$ plain form
36381 -650305 -652702 -90515 280967 349163 531501 790810 811709 714249 696993 494363 18703
36370 18703 -104361 470022 959666 566804 -205526 -341051 175841 633036 845712 1137838
36360 1137838 1488459 1604792 1516981 1395011 1175746 927887 1015558 1362312 1260295 490396
36350 490396 -146877 -32178 353311 322629 -47640 -426337 -798262 -977773 -553993 161414
36340 161414 262509 -187989 -63693 814073 1152398 418799 -129304 363234 898528 580721
36330 580721 250932 723038 1077155 357359 -549474 -438651 193980 326786 231882 450003
36320 450003 367234 -424130 -765734 205974 1229438 878507 -25898 14059 560008 363807
36310 363807 -154438 178712 984236 1157068 988599 1325659 1642188 1073454 320900 429928
$$ packed form
36381f50305k397N62187L71482O8196J82338K59309K0899r7460j7256k02630m75660
36370A8703j23064N74383M89644l92862p72330j35525N16892M57195K12676K92126
36360A137838L50621J16333q7811j21970k19265k47859Q7671L46754j02017p69899
36350D90396o37273J14699L85489l0682l70269l78697l71925j79511M23780P15407
36340A61414J01095m50498J24296Q77766L38325p33599n48103M92538N35294l17807
36330E80721l29789M72106L54117p19796r06833J10823O32631J32806r4904K18121
36320D50003q2769p91364l41604R71708J023464l50931r04405L9957N45949j96201
36310C63807n18245L33150Q05524J72832j68469L37060L16529n68734p52554J09028
$$ plain form
36300 429928 800954 511441 316283 1086599 1668029 783225 -314307 224084 1545392
36291 1545392 1558066 500115 119109 394376 118103 -244623 577102 1750819 1440843
36282 1440843 141808 -137506 645026 911909 577964 761589 1114171 537798 -170563
36273 -170563 465434 1537649 1144456 9362 311947 1692337 1941961 982490 596720
36264 596720 853545 385565 -428561 -145440 608333 256963 -394384 354809 1434126
36255 1434126 789972 -433977 229208 1860599 1874990 1009660 1683345 2874016 1974470
36246 1974470 286269 923416 2678754 2120145 347648 1023743 3082098 2577045 471480
36237 471480 871861 2811170 2149982 346722 2121403 5620215 5124235 2478850 4448324
$$ packed form
36300D29928L71026k89513j95158P70316N81430q84804j097532N38391J321308
36291A545392J2674j057951l81006K75267k76273l62726Q21725J173717l09976
36282A440843j299035k79314P82532K66883l33945J83625L52582n76373p08361
36273a70563O35997J072215l93193j135094L02585J380390K49624r59471l85770
36264E96720K56825m67980q14126K83121P53773l51370o51347P49193J079317
36255A434126o44154j223949O63185J631391J4391q65330O73685J190671q99546
36246A974470j688201O37147J755338n58609j772497O76095K058355n05053k105565
36237D71480M00381J939309o61188j803260J774681L498812m95980k645385J969474
$$ plain form
36228 4448324 9584021 10578943 9058691 13194444 20746437 22099792 21165652 31871707
36220 31871707 50586018 59227031 65709601 108426137 195627674 267954555 258580275
36213 258580275 177403491 98118903 67145018 63674331 52088854 32929591 24566781
36206 24566781 25992067 23468326 16524211 14284068 15946257 13724899 8616853 7565257
36198 7565257 9681713 8598212 4777969 3834766 5634388 5420720 3271212 3122235 4512923
36189 4512923 3749531 1468918 1354919 2958953 2863914 1457854 1911756 3779895 3857174
36180 3857174 2245229 1784294 2523667 2153804 904256 928680 1813120 1465352 425399
36171 425399 736667 1665170 1035387 -299037 210833 2026173 2455833 1486663 1407839
$$ packed form
36228D448324N135697R94922j520252M135753P551993J353355r34140J0706055
36220C1871707J8714311Q641013O482570M2716536Q7201537P2326881r374280
36213B58580275q1176784p9284588l0973885l470687j1585477j9159263q362810
36206B4566781J425286k523741o944115k240143J662189k221358n108046j051596
36198G565257K116456j083501l820243r43203J799622k13668k149508j48977J390688
36189D512923p63392k280613j13999J604034r5039j406060M53902J868139P7279
36180C857174j611945m60935P39373l69863j249548K4424Q84440l47768j039953
36171D25399L11268R28503o29783j334424N09870J815340M29660r69170p8824
$$ plain form
36162 1407839 2366916 2460965 1686629 1846605 2960904 3434302 3338349 4090810 5417439
36153 5417439 5933435 6146808 7794713 11023257 15169510 20916747 28106691 32814575
36145 32814575 30877293 23775913 17063903 13377941 10872073 8108662 6145352 5412486
36137 5412486 4536933 3175611 2742787 3520327 3944230 3403557 3039320 3237910 2933854
36128 2933854 1885336 1183231 1107355 819173 410417 875109 1877206 1977077 1247827
36119 1247827 1205823 1963896 1995186 1012578 516376 1031169 1286385 706058 328382 607683
36109 607683 587178 -18456 -81278 803546 1424521 1005340 352683 218336 208945 18705
36099 18705 136878 648216 804369 395338 193097 557599 907604 924259 969956 1052037
$$ packed form
36162A407839R59077R4049p74336J59976J114299M73398r5953P52461J326629
36153E417439N15996K13373J647905L228544M146253N747237P189944M707884
36145C2814575j937282p101380o712010l685962k505868k763411j963310p32866
36137E412486q75553j361322m32824P77540M23903n40673l64237J98590l04056
36128B933854j048518p02105p5876k88182m08756M64692J002097R9871p29250
36119A247827m2004P58073L1290r82608m96202N14793K55216n80327l77676K79301
36109F07683k0505o05634o2822Q84824O20975m19181o52657j34347r391j90240
36099A8705J18173N11338J56153m09031k02241L64502L50005J6655M5697Q2081
$$ plain form
36089 1052037 694304 33660 -268254 -283524 -616568 -971060 -440655 748609 1369954
36080 1369954 1142124 964122 1147675 1057867 623712 541351 811755 715456 379753 680133
36070 680133 1430438 1441680 618383 193735 552755 646570 21834 -371165 15142 408837
36060 408837 276240 232741 701450 1088461 964421 767172 765651 596132 291045 440169
36050 440169 884813 639480 -392557 -1010283 -553683 191526 456154 511330 669979 591928
36040 591928 213082 148009 572669 855704 799629 1048447 1760052 2102526 1631623 1012332
36030 1012332 839467 856807 815583 973630 1298882 1312800 1111833 1366156 1972350 1996159
36020 1996159 1310317 903918 1132874 1114241 404056 -183413 -85050 94115 -112903 -171236
$$ packed form
36089A052037l57733o60644l01914j5270l33044l54492N30405J189264O21345
36080A369954k27830j78002J83553q9808m34155q2361K70404r6299l35703L00380
36070F80133P50305J1242q23297m24648L59020R3815o24736l92999L86307L93695
36060D08837j32597m3499M68709L87011j24040j97249j521j69519l05087J49124
36050D40169M44644k45333j032037o17726M56600P45209K64628N5176J58649p8051
36040E91928l78846o5073M24660K83035n6075K48818P11605L42474m70903o19291
36030A012332j72865J7340m1224J58047L25252J3918k00967K54323O06194K3809
36020A996159o85842m06399K28956j8633p10185n87469R8363J79165k07018n8333
$$ plain form
36010 -171236 261495 586177 470492 523631 995238 1090317 399665 -248814 -208358 -34052
36000 -34052 -230393 -254783 282656 664360 335671 -27553 231695 537129 184005 -386772
35990 -386772 -500037 -435837 -626699 -642082 -101277 308611 -121768 -868329 -1055656 -816740
35980 -816740 -729273 -694097 -425017 -252390 -377911 -152907 793241 1535991 1149668 230052
35970 230052 -102429 52004 -63746 -290286 2092 467757 296298 -227140 -157996 386013
35960 386013 421094 -120462 -276945 219939 493196 23114 -609106 -801371 -719133 -657099
35950 -657099 -508505 -241376 -160728 -341202 -395278 -94830 274392 386585 257953 11696
35940 11696 -311446 -576351 -561725 -265089 78602 317139 471700 541880 476833 314028
$$ packed form
36010a71236M32731L24682j15685N3139M71607R5079o90652o48479M0456J74306
36000c4052j96341k4390N37439L81704l28689l63224K59248L05434l53124n70777
35990c86772j13265O4200j90862j5383N40805M09888m30379p46561j87327K38916
35980h16740Q7467L5176K69080J72627j25521K25004R46148P42750l86323r19616
35970B30052l32481J54433j15750k26540K92378M65665j71459n23438O9144N44009
35960C86013L5081n41556j56483M96884K73257m70082o32220j92265Q2238O2034
35950f57099J48594K67129Q0648j80474n4076L00448L69222J12193j28632k46257
35940A1696l23142k64905J4626K96636L43691K38537J54561P0180o5047j62805
$$ plain form
35930 314028 162402 111593 240220 524147 687514 470060 108095 108071 449468 596514
35920 596514 481911 749326 1631244 2324911 2070155 1226388 623139 386167 128904 -144072
35910 -144072 -103806 215611 476085 572533 574439 408212 97481 -15822 210724 365725
35900 365725 152632 -42658 180906 503753 475077 334915 488590 630852 263381 -288527
35890 -288527 -309495 106998 225032 -119836 -377674 -275892 -78616 120896 503372 865477
35880 865477 693901 53616 -338336 -134809 182867 88176 -298045 -527048 -393016 10474
35870 10474 458757 685618 567554 268446 20088 -132154 -183600 -52172 118970 -56775
35860 -56775 -515672 -522162 255371 951322 622509 -235118 -321037 515244 1108220 840000
$$ packed form
35930C14028j51626n0809J28627K83927J63367k17454l61965k4L41397J47046
35920E96514j14603K67415Q81918O93667k54756q43767o03249k36972k57263k72976
35910a44072M0266L19417K60474R6448J906j66227l10731j13303K26546J55001
35900C65725k13093j95290K23564L22847k8676j40162J53675J42262l67471n51908
35890b88527k0968M16493J18034l44868k57838J01782J97276J99512L82476L62105
35880H65477j71576o40285l91952K03527L17676r4691l86221k29003J34032M03490
35870A0474M48283K26861j18064k99108k48358j52242n1446J31428J71142j75745
35860e6775m58897o490P77533O95951l28813q57627q5919Q36281N92976k68220
$$ plain form
35850 840000 504445 921039 1685247 1911765 1507867 1055131 888521 876264 835123 713303
35840 713303 528596 388494 386097 363006 87511 -249665 -170551 286105 413439 -185611
35830 -185611 -937988 -1062875 -633020 -352256 -491422 -612031 -336828 106795 288920 196168
35820 196168 184101 425434 644695 461025 -135169 -773440 -1116405 -1109170 -817017 -279541
35810 -279541 312376 537082 155009 -488594 -783866 -573544 -268381 -210478 -215033 98185
35800 98185 708381 1142712 1003323 426946 -33702 19596 421439 659094 460572 38396
35790 38396 -263102 -382943 -497408 -693082 -846005 -803676 -595905 -432585 -455450 -490333
35780 -490333 -211756 320166 528314 40505 -660121 -787150 -351692 -101269 -306949 -315804
$$ packed form
35850H40000l35555M16594P64208K26518m03898m52736j66610j2257m1141j21820
35840G13303j84707j40102k397k3091k75495l37176P9114M56656J27334n99050
35830a85611p52377j24887M29855K80764j39166j20609K75203M43623J82125r2752
35820A96168j2067K41333K19261j83670n96194o38271l42965P235K92153N37476
35810b79541N91917K24706l82073o43603k95272K10322L05163N7903m555L13218
35800I8185O10196M34331j39389n76377m60648N3298M01843K37655j98522m22176
35790C8396l01498j19841j14465j95674j52923M2329K07771J63320k2865l4883
35780d90333K78577N31922K08148m87809p00626j27029M35458K50423k05680q855
$$ plain form
35770 -315804 390292 1330090 1693784 1390310 895377 452024 28523 -188484 84130 647652
35760 647652 893109 537120 -37932 -227159 208844 955411 1399095 1186569 623514 305156
35750 305156 298312 86124 -527927 -992823 -826256 -339965 -77826 -10425 128784 145672
35740 145672 -252057 -705619 -613872 -132665 28786 -238344 -294692 152502 581257 538704
35730 538704 344699 540132 1088043 1506701 1525463 1297242 1096169 1002437 852796 480635
35720 480635 24192 -171278 -68674 -60682 -329999 -456723 -81586 405568 418455 108470
35710 108470 43528 198348 126643 28753 612977 1714203 2106924 1207870 89923 81569
35700 81569 990518 1533465 1136690 455064 214641 311830 217412 -245455 -767734 -936274
$$ packed form
35770c15804P06096R39798L63694l03474m94933m43353m23501k17007K72614N63522
35760F47652K45457l55989n75052j89227M36003P46567M43684k12526n63055l18358
35750C05156o844k12188o14051m64896J66567M86291K62139O7401J39209J6888
35740A45672l97729m53562R1747M81207J61451k67130n6348M47194M28755m2553
35730E38704j94005J95433N47911M18658J8762k28221k01073r3732j49641l72161
35720D80635m56443j95470J02604P992k69317j26724L75137M87154J2887l09985
35710A08470o4942J54820p1705r7890N84224J101226L92721q99054j117947q354
35700H1569R08949N42947l96775o81626k40423R7189r4418m62867n22279j68540
$$ plain form
35690 -936274 -594220 40899 552536 696365 584726 459252 399931 362761 353625 384519
35680 384519 362073 213646 58203 63820 175390 167943 -41837 -314504 -526075 -693615
35670 -693615 -793098 -644750 -156025 432394 776157 878546 1035390 1260295 1116633 394788
35660 394788 -356907 -455455 -69421 29606 -289458 -250372 558774 1343683 1120872 93917
35650 93917 -697181 -819817 -770966 -937517 -1032550 -761916 -400506 -327372 -392196 -143681
35640 -143681 490843 1052978 1044636 449840 -197846 -261851 387784 1217062 1553823 1199017
35630 1199017 449828 -286819 -727728 -785502 -679495 -791399 -1142098 -1254550 -867106 -460766
35620 -460766 -571952 -875741 -644891 37554 343123 16573 -224831 127497 586573 513669
$$ packed form
35690i36274L42054O35119N11637J43829j11639j25474n9321l7170r136L0894
35680C84519k2446j48427j55443N617J11570p447k09780k72667k11571j67540
35670f93615r9483J48348M88725N88419L43763J02389J56844K24905j43662p21845
35660C94788p51695r8548L86034R9027l19064L9086Q09146P84909k22811j026955
35650I3917p91098j22636M8851j66551r5033K70634L61410P3134o4824K48515
35640a43681O34524N62135q342n94796o47686o4005O49635Q29278L36761l54806
35630A199017p49189p36647m40909n7774J06007j11904l50699j12452L87444M06340
35620d60766j11186l03789K30850O82445L05569l26550k41404L52328M59076p2904
$$ plain form
35610 513669 98444 -57723 147420 386067 506487 525203 333403 -31089 -99310 423002
35600 423002 961536 673442 -300663 -883392 -488689 255920 518645 403818 540130 892093
35590 892093 709412 -278002 -1231555 -1160700 -194924 584623 519953 79830 24738 339790
35580 339790 433183 132900 -79863 166258 645748 970899 1098521 1158310 1100329 820497
35570 820497 442371 194255 105080 2285 -290155 -835872 -1460370 -1666654 -1035411 79172
35560 79172 665734 247433 -429099 -427977 5994 -113668 -858240 -1142615 -389346 482718
35550 482718 334433 -596588 -1151757 -903376 -503457 -510512 -675669 -515083 27786 662728
35540 662728 1019275 747991 -134388 -929196 -883280 -269825 -166674 -916625 -1579687 -1353219
$$ packed form
35610E13669m15225j56167K05143K38647J20420J8716j91800l64492o8221N22312
35600D23002N38534k88094r74105n82729L94703P44609K62725j14827J36312L51963
35590H92093j82681r87414r53553P0855R65776P79547o4670m40123n5092L15052
35580C39790R3393l00283k12763K46121M79490L25151J27622N9789n7981k79832
35570H20497l78126k48116q9175j02795k92440n45717o24498k06284O31243J114583
35560G9172N86562m18301o76532J122M33971j19662p44572k84375P53269Q72064
35550D82718j48285r31021n55169K48381L99919p055j65157J60586N42869O34942
35540F62728L56547k71284q82379p94808M5916O13455J03151p49951o63062K26468
$$ plain form
35530 -1353219 -731852 -562133 -669956 -369824 196266 334646 111560 213992 587973
35521 587973 428089 -345884 -813353 -589558 -457280 -912750 -1195944 -564314 406254 739362
35511 739362 531064 476778 510324 53562 -711809 -968212 -569557 -195755 -170853 -94075
35501 -94075 194871 194735 -378642 -1018347 -1124676 -737439 -230892 243907 660073 860000
35491 860000 781761 679957 793362 954225 781230 173099 -548315 -947707 -895661 -727822
35481 -727822 -901232 -1384509 -1569183 -1005811 -22858 701780 972867 1058821 1033822 716315
35471 716315 233535 42058 255313 476323 481610 565769 933040 1205017 939580 356754
35461 356754 123618 510861 1094897 1320239 1142835 1012183 1273177 1704251 1762724 1250423
$$ packed form
35530a353219O21367J69719j07823L00132N66090J38380k23086J02432L73981
35521E87973j59884p73973m67469K23795J32278m55470k83194O31630R70568L33108
35511G39362k08298n4286L3546m56762p65371k56403L98655L73802K4902P6778
35501i4075K88946j36n73377o39705j06329L87237N06547M74799M16166J99927
35491H60000p8239j01804J13405J60863j72995o08131p21414l99392N2046J67839
35481g27822j73410m83277j84674N63372R82953P24638K71087Q5954k4999l17507
35471G16315m82780j91477K13255K21010N287Q4159L67271K71977k65437n82826
35461C56754k33136L87243N84036K25342j77404j30652K60994M31074N8473n12301
$$ plain form
35451 1250423 527241 25747 -164824 -123732 115757 365682 273195 -124830 -243812 187009
35441 187009 548555 255105 -178758 128562 911110 1050706 361875 -79380 337173 832587
35431 832587 608505 155056 376795 1123430 1500349 1217070 769562 527301 435036 518728
35421 518728 951440 1549743 1780287 1410533 766437 256988 -38374 -239595 -389804 -402085
35411 -402085 -162045 298302 666284 563417 44915 -331882 -162894 294045 538319 525232
35401 525232 569375 711745 648533 294706 -5962 34374 257156 318354 141526 -47298
35391 -47298 -22317 224244 501676 582213 392510 101636 -11400 177507 506272 673772
35381 673772 516018 128325 -276254 -576756 -763132 -808265 -660568 -368355 -63186 192792
$$ packed form
35451A250423p23182n01494j90571M1092K39489K49925r2487l98025j18982M30821
35441A87009L61546k93450m33863L07320P82548J39596o88831m41255M16553M95414
35431H32587k24082m53449K21739P46635L76919k83279m47508k42261r2265Q3692
35421E18728M32712N98303K30544l69754o44096n09449k95362k01221j50209j2281
35411d02085K40040M60347L67982j02867n18502l76797J68988M56939K44274j3087
35401E25232M4143J42370o3212l53827l00668M0336K22782O1198j76828j88824
35391d7298K4981K46561K77432Q0537j89703k90874j13036J88907L28765J67500
35381F73772j57754l87693m04579l00502j86376m5133J47697K92213L05169K55978
$$ plain form
35371 192792 366703 292934 -124908 -513706 -310386 339878 510536 -242825 -1072581 -949049
35361 -949049 -144305 248036 -6529 -110346 305650 666692 635482 717088 1196285 1461230
35351 1461230 1077769 689054 988712 1467635 1166888 242761 -241084 113655 634810
35342 634810 720611 506929 276526 -21384 -403415 -589782 -384194 91737 691671 1346727
35332 1346727 1747870 1414216 346423 -743709 -1131383 -779530 -187147 180014 129894
35323 129894 -281630 -745256 -866423 -603595 -405905 -673639 -1187663 -1338182 -889349 -258889
35313 -258889 18585 -113355 -308787 -323762 -217579 -100845 44506 196200 180859 -59219
35303 -59219 -255015 -142439 84648 -25060 -517066 -880017 -650752 71728 805580 1160430
$$ packed form
35371A92792J73911p3769m17842l88798K03320O50264J70658p53361q29756J23532
35361i49049Q04744L92341k54565j03817M15996L61042l1210Q1606M79197K64945
35351A461230l83461l88715K99658M78923l00747r24127m83845L54739N21155
35342F34810Q5801k13682k30403k97910l82031j86367K05588M75931N99934O55056
35332A346727M01143l33654j067793j090132l87674L51853N92383L67161n0120
35323A29894m11524m63626j21167K62828J97690k67734n14024j50519M48833O30460
35313b58889K77474j31940j95432j4975J06183J16734J45351J51694j5341k40078
35303e9219j95796J12576K27087j09708m92006l62951K29265P22480P33852L54850
$$ plain form
35293 1160430 1061684 734708 555211 708524 944288 890807 604253 474788 569707 519306
35283 519306 199557 39069 337087 683639 465649 -312749 -1080721 -1356624 -1039175 -292668
35273 -292668 493383 836020 630684 346481 423956 659929 556653 111675 -167234 37401
35263 37401 522993 915421 1027549 888064 678017 603314 624181 425225 -123812 -648433
35253 -648433 -689496 -281146 177228 442400 515851 441080 386383 687937 1351033 1731322
35243 1731322 1267181 369542 -47678 154601 238974 -177964 -549119 -322230 217135 451955
35233 451955 301954 132911 135949 216006 248287 82988 -461490 -1238260 -1640043 -1265564
35223 -1265564 -561509 -320237 -598556 -662687 -96010 587054 743281 555983 648392 989484
$$ packed form
35293A160430r8746l26976j79497J53313K35764n3481k86554j29465R4919n0401
35283E19306l19749j60488K98018L46552k17990p78398p67972k75903L17449P46507
35273b92668P86051L42637k05336k84203P7475K35973j03276m44978k78909K04635
35263C7401M85592L92428J12128j39485k10047p4703K0867j98956n49037n24621
35253f48433m1063M08350M58374K65172P3451p4771n4697L01554O63096L80289
35243A731322m64141q97639m17220K02279Q4373m16938l71155K26889N39365K34820
35233D51955j50001j69043L038Q0057L2281j65299n44478p76770m01783L74479
35223a265564P04055K41272k78319o4131N66677O83064J56227j87298R2409L41092
$$ plain form
35213 989484 894159 192060 -335315 -98424 335938 116219 -485701 -476996 179350 386133
35203 386133 -338859 -1017614 -730192 -48892 -61068 -653593 -846656 -418585 -54495 -41250
35193 -41250 50840 339337 362589 48270 -50568 200937 192900 -297412 -574517 -188394 225499
35182 225499 -18879 -515820 -494218 -112307 -99059 -464003 -507382 12226 549350 611806
35172 611806 260262 -227888 -594946 -536889 -7911 427096 163847 -513660 -733708 -316135
35162 -316135 -21894 -335629 -748496 -643822 -249767 -165369 -403156 -504913 -335096 -191677
35152 -191677 -260755 -441666 -640298 -819674 -815826 -505773 -140855 -124775 -430961 -603376
35142 -603376 -398082 -65912 119191 263825 578992 972363 1175951 1112972 897092 589524
$$ packed form
35213I89484r5325p02099n27375K36891M34362k19719o01920Q705O56346K06783
35203C86133p24992o78755K87422O81300j2176n92525j93063M28071L64090J3245
35193d1250R2090K88497K3252l14319r8838K51505q037m90312k77105L86123M13893
35182B25499k44378m96941K1602L81911J3248l64944m3379N19608N37124O2456
35172F11806l51544m88150l67058N8057N28978M35007k63249o77507k20048M17573
35162c16135K94241l13735m12867J04674L94055Q4398k37787j01757J69817J43419
35152a91677o9078j80911j98632j79376L848L10053L64918J6080l06186j72415
35142f03376K05294L32170J85103J44634L15167L93371K03588o2979k15880l07568
$$ plain form
35132 589524 205067 -107200 -143456 74873 291088 324001 245181 221620 336306 611881
35122 611881 1041060 1472560 1590347 1183483 427333 -218270 -405310 -141683 307990 657878
35112 657878 773299 756787 870527 1213635 1458573 1151479 401941 -16006 422357 1172797
35102 1172797 1202811 384092 -264847 36519 749328 811450 129208 -401128 -228154 220445
35092 220445 351720 197839 88246 59599 14297 98128 459153 840442 818265 326035
35082 326035 -356978 -976947 -1373611 -1374355 -971235 -469220 -150488 51631 263460 324987
35072 324987 133623 49273 405930 818833 621251 -97605 -578466 -523121 -411504 -565599
35062 -565599 -659897 -456315 -300829 -434685 -434172 84286 666732 565279 -198571 -892448
$$ packed form
35132E89524l84457l12267l6256K18329K16215L2913p8820k3561J14686K75575
35122F11881M29179M31500J17787m06864p56150o45603j87040K63627M49673L49888
35112F57878J15421j6512J13740L43108K44938l07094p49538m17947M38363P50440
35102A172797L0014q18719o48939L01366P12809O2122o82242n30336J72974M48599
35092B20445J31275j53881j09593k8647m5302Q3831L61025L81289k2177m92230
35082C26035o83013o19969l96664p44M03120N02015L18732K02119K11829O1527
35072C24987j91364q4350L56657M12903j97582p18856m80861N5345J11617j54095
35062e65599r4298K03582J55486j33856N13N18458N82446j01453p63850o93877
$$ plain form
35052 -892448 -1028129 -762808 -472378 -373182 -491212 -634182 -475027 23641 403281 251912
35042 251912 -204203 -407215 -216701 31184 87550 8216 -107449 -192975 -88768 264766
35032 264766 557038 439724 95049 25155 265209 309177 -56341 -352754 -127014 338844
35022 338844 434741 96363 -167206 -52775 150641 68739 -197432 -291895 -212689 -327895
35012 -327895 -749706 -1074495 -978327 -752404 -854865 -1142846 -1057258 -489586 105589 494724
35002 494724 929317 1449051 1580120 1084329 422744 36795 -266053 -680059 -741793 -50389
34992 -50389 788747 823477 148526 -232870 124256 638553 772924 727727 801357 777425
34982 777425 361271 -242260 -555344 -351901 226515 799311 929727 532937 124380 249230
$$ packed form
35052h92448j35681K65321K90430R9196j18030j42970J59155M98668L79640j51369
35042B51912m56115k03012J90514K47885N6366p9334j15665q5526J04207L53534
35032B64766K92272j17314l44675o9894K40054M3968l65518k96413K25740M65858
35022C38844R5897l38378k63569J14431K03416q1902k66171r4463P9206j15206
35012c27895m21811l24789R6168K25923j02461k87981Q5588N67672N95175L89135
35002D94724M34593N19734J31069m95791o61585l85949l02848m14006o1734O91404
34992e0389Q39136L4730o74951l81396L57126N14297J34371m5197P3630k3932
34982G77425m16154o03531l13084K03443N78416N72796J30416l96790m08557J24850
$$ plain form
34972 249230 683771 733759 331067 153055 490161 726658 311415 -399901 -748655 -683002
34962 -683002 -539824 -380781 -141512 -91849 -504248 -1063849 -1218898 -1021362 -1045988 -1477548
34952 -1477548 -1810969 -1574459 -939672 -448971 -412691 -709451 -983800 -943989 -608171 -304096
34942 -304096 -309022 -505025 -540375 -307006 -69908 -107602 -405364 -749889 -957155 -926768
34932 -926768 -631719 -203924 66000 7398 -162034 -58387 302962 414608 -13588 -475153
34922 -475153 -247739 488576 693219 -144679 -1204396 -1376101 -681020 -51113 21516 -109434
34912 -109434 -102780 -123595 -309321 -387904 -147593 156415 164170 -142537 -571376 -988106 -1265297
34901 -1265297 -1253919 -979904 -638058 -332173 -102752 -165103 -657945 -1142367 -930375 -58372
$$ packed form
34972B49230M34541M9988m02692j78012L37106K36497m15243p11316l48754O5653
34962f83002J43178J59043K39269M9663m12399n59601j55049J97536k4626m31560
34952a477548l33421K36510O34787M90701L6280k96760k74349L9811L35818L04075
34942c04096m926j96003l5350K33369K37098l7694k97762l44525k07266L0387
34932i26768K95049M27795K69924n8602j69432J03647L61349J11646m28196m61565
34922d75153K27414P36315K04643q37898j059717j71705O95081O29907P2629j30950
34912a09434O654k0815j85726p8583K40311L04008P755l06707m28839m16730k77191
34901a265297J1378K74015L41846L05885K29421o2351m92842m84422K11992Q72003
$$ plain form
34891 -58372 643348 650651 312951 83113 -122084 -389172 -337673 214429 676697 462124
34881 462124 -83086 -207198 136600 400905 382597 333086 320144 182656 20278 89283
34871 89283 284269 294585 154308 62939 -146639 -677802 -1093125 -790475 -87667 68514
34861 68514 -448519 -726292 -280266 209719 76926 -289949 -235864 21097 -163728 -703802
34851 -703802 -871949 -374233 327487 702673 633589 256744 -198112 -404245 -183617 196851
34841 196851 291739 63394 -80715 148989 598553 950796 1085237 1069268 959870 724968
34831 724968 326818 -127812 -342922 -80276 485939 850320 761414 544881 628464 895562
34821 895562 794589 48837 -977113 -1613431 -1431946 -539229 471841 934773 703573
$$ packed form
34891e8372P01720P303l37700k29838k05197k67088N1499N52102M62268k14573
34881D62124n45210j24112L43798K64305j8308m9511j2942j37488j62378O9005
34871H9283J94986J0316j40277r1369k09578n31163m15323L02650P02808J56181
34861F8514n17033k77773M46026M89985j32793l66875N4085K56961j84825n40074
34851g03802j68147M97716P01720L75186o9084l76845m54856k06133K20628L80468
34841A96851R4888k28345j44109K29704M49564L52243J34441j5969j09398k34902
34831G24968l98150m54630k15110K62646N66215L64381q8906k16533Q3583K67098
34821H95562j00973p45752j025950o36318J81485Q92717J011070M62932k31200
$$ plain form
34812 703573 293235 228440 367335 181642 -380001 -752975 -559392 -106084 146663 229124
34802 229124 423507 665490 641978 375594 244152 373144 426048 149447 -238718 -446615
34792 -446615 -580025 -864403 -1116238 -957982 -512038 -371228 -723845 -971045 -548760 219371
34782 219371 555140 317825 121842 372698 739380 773332 569854 469215 446282 227700
34772 227700 -164003 -398638 -304966 -4759 369566 751158 957698 797854 408586 163770
34762 163770 183989 251113 262006 375982 561513 410308 -288586 -1080111 -1294813 -800876
34752 -800876 -30180 563427 781115 606387 226297 31226 242587 581881 614555 359038
34742 359038 219006 358023 522405 504243 392821 274708 45734 -320912 -610871 -644609
$$ packed form
34812G03573m10338o4795J38895j85693n61643l72974J93583M53308K52747Q2461
34802B29124J94383K41983k3512k66384j31442J28992N2904k76601l88165k07897
34792d46615j33410k84378k51835J58256M45944J40810l52617k47200M22285P68131
34782B19371L35769k37315j95983K50856L66682L3952k03478j00639k2933k18582
34772B27700l91703k34635R3672L00207L74325L81592K06540j59844l89268k44816
34762A63770K0219O7124J0893J13976J85531j51205o98894p91525k14702M93937
34752h00876P70696N93607K17688j74728l80090j95071K11361L39294L2674k55517
34742C59038j40032J39017J64382j8162j11422j18113k28974l66646k89959l3738
$$ plain form
34732 -644609 -498363 -324927 -166759 -47973 -31234 -93010 -164252 -340435 -754210 -1173349
34722 -1173349 -1107524 -489731 122168 269864 162041 201268 292771 82574 -328568 -438925
34712 -438925 -114966 131086 -222664 -1052006 -1713919 -1706845 -1117566 -474484 -222282 -367846
34702 -367846 -632586 -808833 -806619 -491679 193106 953964 1332765 1220116 887142 535004
34692 535004 222240 199339 722899 1441636 1633640 1261969 1065187 1295005 1227071 464991
34682 464991 -170329 124199 807484 933902 745440 1085035 1704959 1589279 769213 329424
34672 329424 536988 467861 -175833 -379754 392153 1069553 587177 -426815 -646268 25594
34662 25594 596249 527447 122935 -279091 -568164 -531263 -83819 307805 137447 -355388
$$ packed form
34732f44609J46246J73436J58168J18786J6739o1776p1242j76183m13775m19139
34722a173349O5825O17793O11899J47696j07823L9227R1503k10197m11142j10357
34712d38925L23959K46052l53750q29342o61913P074N89279O43082K52202j45564
34702c67846k64740j76247K214L14940O84785P60858L78801j12649l32974l52138
34692E35004l12764k2901N23560P18737J92004l71671j96782K29818o7934p62080
34682D64991o35320K94528O83285J26418j88462L39595O19924j15680q20066m39789
34672C29424K07564o9127o43694k03921P71907O77400m82376j013992k19453O71862
34662B5594N70655o8802m04512m02026k89073L6901M47444L91624j70358m92835
$$ plain form
34652 -355388 -555724 -433229 -436142 -587020 -457584 -31221 167273 -45908 -140941 357302
34642 357302 1186924 1697197 1578937 1056073 569794 419078 580332 793331 848299 729209
34632 729209 483641 185173 79859 407774 916604 997282 583862 394144 811508 1084093
34622 1084093 379317 -767349 -1007300 -73395 843461 751767 3687 -546208 -726479
34613 -726479 -852297 -931643 -735959 -382049 -250735 -404152 -524827 -422430 -253299 -198301
34603 -198301 -196312 -94022 109303 280462 348430 389127 498834 627397 605546 362318
34593 362318 51095 -100390 -21275 180099 374713 507999 545881 404256 8913 -515942
34583 -515942 -770658 -410600 327638 686984 265851 -390752 -501997 -158218 -96189 -434877
$$ packed form
34652c55388k00336J22495k913j50878J29436M26363J98494k13181r5033M98243
34642C57302Q29622N10273j18260n22864m86279j50716J61254K12999N4968j19090
34632G29209k45568k98468j05314L27915N08830Q0678m13420j89718M17364K72585
34622A084093p04776j146666k39951R33905R16856r1694p48080n49895j80271
34613g26479j25818p9346J95684L53910J31314j53417j20675J02397J69131N4998
34603a98301J989J02290K03325J71159O7968M0697J09707J28563k1851k43228
34593C62318l11223j51485P9115K01374J94614J33286L7882j41625l95343n24855
34583e15942k54716L60058P38238L59346m21133o56603j11245L43779O2029l38688
$$ plain form
34573 -434877 -453276 151164 641257 409081 35737 418179 1333157 1731119 1215678 419932
34563 419932 5254 24766 276554 602134 741557 476168 49934 -15116 383140 810578
34553 810578 903810 705377 418708 237387 364025 762483 964206 589924 -24301 -227999
34543 -227999 31302 274575 344410 483994 606096 291657 -357645 -650783 -325025 88494
34533 88494 180673 228936 520971 817684 890005 933213 1012652 749275 64241 -389370 -137689
34522 -137689 316431 255823 -156848 -236398 143884 527943 659856 623995 422752 59129
34512 59129 -135778 119015 495879 478246 185781 145202 362457 330072 -42522 -209927
34502 -209927 153466 666740 816771 569087 229171 50295 83474 109220 -274388 -1139128
$$ packed form
34573d34877j8399O04440M90093k32176l73344L82442R14978L97962n15441p95746
34563D19932m14678J9512K51788L25580J39423k65389m26234o5050L98256M27438
34553H10578R3232j98433k86669j81321J26638L98458K01723l74282o14225k03698
34543b27999K59301K43273O9835J39584J22102l14439o49302k93138L25758M13519
34533H8494R2179M8263K92035K96713P2321M3208P9439k63377o85034m53611K51681
34522a37689M54120o0608m12671p9550L80282L84059J31913l5861k01243l63623
34512E9129j94907K54793L76864j7633k92465m0579K17255l2385l72594j67405
34502b09927L63393N13274J50031k47684l39916j78876L3179K5746l83608q64740
$$ plain form
34492 -1139128 -1878626 -1831156 -1182246 -706956 -659055 -562203 -141832 274553 470794 699654
34482 699654 999519 881121 160738 -541929 -676698 -537509 -567300 -497289 46388 593083
34472 593083 435301 -128039 -181032 300439 411599 -104489 -341252 301027 1078858 984461
34462 984461 179203 -365185 -215472 219462 470914 472296 337359 155529 -1857 -134520
34452 -134520 -278067 -295141 895 367434 253370 -311923 -512500 106094 861016 946613
34442 946613 666856 800242 1182176 982373 191644 -290064 -77886 247138 249272 162813
34432 162813 88458 -270526 -732978 -580967 160015 477965 16910 -177980 596545 1328126
34422 1328126 823538 -290128 -502586 240794 654259 297561 115014 700780 1407214
$$ packed form
34492a139128p39498M7470O48910M75290M7901R6852M20371M16385J96241K28860
34482F99654K99865j18398p20383p02667j34769J39189k9791P0011N43677N46695
34472E93083j57782n63340n2993M81471J11160n16088k36763O42279P77831r4397
34462I84461q05258n44388J49713M34934K51452J382j34937j81830j57386j32663
34452a34520j43547j7074K96036L66539j14064n65293k00577O18594P54922Q5597
34442I46613k79757J33386L81934j99803p90729m81708K12178L25024K134q6459
34432A62813p4355l58984m62452J52011P40982L17950m61055j94890P74525P31581
34422A328126n04588j113666k12458P43380M13465l56698j82547N85766P06434
$$ plain form
34413 1407214 1529859 1239206 894704 404090 -232635 -555054 -351122 -93481 -200634
34404 -200634 -438800 -497633 -598141 -1020147 -1476201 -1485724 -1080088 -693933 -570761 -629445
34394 -629445 -736379 -811425 -789629 -672114 -508686 -279226 14255 156896 -69563 -492598
34384 -492598 -735136 -798465 -1015613 -1381546 -1448628 -1040761 -571899 -430110 -486132 -447240
34374 -447240 -285965 -82219 157889 281046 -20364 -724977 -1343283 -1511803 -1390644 -1250285
34364 -1250285 -1046686 -691452 -395580 -403215 -604210 -677082 -464668 -76198 200305 62538
34354 62538 -456189 -827716 -582745 29386 385003 394296 458193 587428 364184 -124778
34344 -124778 -201403 292670 682189 622892 645058 996391 903183 -194685 -1442783 -1572106
$$ packed form
34413A407214J22645k90653l44502m90614o36725l22419K03932K57641j07153
34404b00634k38166n8833j00508m22006m56054r523M05636L86155J23172n8684
34394f29445j06934p5046K1796J17515J63428K29460K93481J42641k26459m23035
34384d92598k42538o3329k17148l65933o7082M07867M68862J41789n6022L8892
34374d47240J61275K03746K40108J23157l01410p04613o18306j68520J21159J40359
34364a250285K03599L55234K95872p635k00995p2872K12414L88470K76503j37767
34354F2538n18727l71527K44971O12131L55617R293O3897J29235k23244m88962
34344a24778p6625M94073L89519n9297K2166L51333r3208j097868j248098j29323
$$ plain form
34334 -1572106 -605501 322121 470888 21903 -538390 -758199 -257686 793866 1502631
34325 1502631 1259865 614197 440137 659953 632871 387743 433571 624473 351186 -222516
34315 -222516 -256336 346122 696429 323141 -184890 -261165 -181274 -383914 -737362 -925176
34305 -925176 -945802 -851996 -549004 -164909 -77437 -301327 -400961 -241068 -206719 -424209
34295 -424209 -447837 -66828 270024 276186 395428 986742 1540391 1378579 694877 213236
34285 213236 136957 109704 -6759 6786 177913 254067 170729 117959 110441 -71494 -433585
34274 -433585 -628053 -394128 107669 513052 638942 564707 435543 269256 -29815 -452822
34264 -452822 -750010 -658165 -253127 108884 219869 187475 158823 139451 157109 321711
$$ packed form
34334a572106R66605R27622J48767m48985n60293k19809N00513J051552P08765
34325A502631k42766o45668j74060K19816k7082k45128M5828J90902k73287n73702
34315b22516l3820O02458L50307l73288n08031p6275P9891k02640l53448j87814
34305i25176k0626R3806L02992L84095Q7472k23890r9634J59893L4349k17490
34295d24209k3628L81009L36852O162J19242N91314N53649j61812o83702m81641
34285B13236p6279k7253j16463J3545J71127P6154q3338n2770p518j81935l62091
34274d33585j94468K33925N01797M05383J25890p4235j29164j66287k99071m23007
34264d52822k97188R1845M05038L62011J10985l2394k8652j9372J7658J64602
$$ plain form
34254 321711 578397 641024 344426 -107809 -381989 -365791 -214689 -188388 -434042 -751450
34244 -751450 -668926 -52226 492550 287630 -421255 -747302 -471534 -320270 -704721 -1009802
34234 -1009802 -660536 -161533 -305503 -856260 -894578 -209157 509628 763547 733318 654235
34224 654235 459349 192284 131586 308866 450261 551157 915020 1401533 1294211 352489
34214 352489 -547816 -423213 493806 1074696 806452 338264 411650 805959 717434 -93852
34204 -93852 -974294 -1205620 -836862 -500566 -563879 -734124 -533374 64705 620202 735903
34194 735903 439890 113308 127206 485450 767958 546140 -73557 -498062 -366126 445
34184 445 79250 -147190 -301116 -252520 -213880 -236069 -80272 303429 578115 484702 183444
$$ packed form
34254C21711K56686O2627k96598m52235k74180J6198J51102K6301k45654l17408
34244g51450Q2524O16700N44776k04920p08885l26047K75768J51264l84451l05081
34234a009802L49266M99003j43970n50757l8318O85421P18785K53919l0229p9083
34224F54235j94886k67065o0698J77280J41395J00896L63863M86513j07322r41722
34214C52489r00305J24603R17019N80890k68244m68188P3386L94309q8525q11286
34204i3852q80442k31326L68758L36296o3313j70245K00750N98079N55497J15701
34194G35903k96013l26582J3898L58244K82508k21818o19697m24505J31936L66571
34184D45P8805k26440j53926M8596L8640k2189J55797L83701K74686r3413l01258
$$ plain form
34173 183444 -57229 -222214 -392589 -494584 -450371 -369340 -347541 -253537 45545 388292
34163 388292 478383 234502 -187776 -578134 -714466 -428799 137008 518503 427198 119220
34153 119220 41690 293617 678027 1046910 1271550 1126957 621933 207689 169909 64483
34143 64483 -598373 -1309755 -1066138 49693 750257 330955 -333285 -157461 564843 738587
34133 738587 95457 -640894 -931458 -910224 -796866 -589392 -370337 -286554 -187997 157057
34123 157057 505649 398543 -24050 -121618 243296 466905 158346 -294200 -374866 -97711
34113 -97711 268971 602169 745060 468005 -23125 -59346 565731 1115498 874374 186900
34103 186900 -60182 308860 678763 664115 543290 633907 808412 816580 679251 520240
$$ packed form
34173A83444k40673j64985j70375j01995M4213Q1031K1799R4004K99082L42747
34163C88292R0091k43881m22278l90358j36332K85667N65807L81495r1305l07978
34153A19220p7530K51927L84410L68883K24640j44593n05024m14244l7780j05426
34143F4483o62856p11382K43617J115831P00564m19302o64240J75824P22304J73744
34133G38587o43130p36351k90564K1234J13358K07474K19055Q3783R8557L45054
34123A57057L48592j07106m22593r7568L64914K23609l08559m52546q0666K77155
34113i7711L66682L33198J42891k77055m91130l6221O25077N49767k41124o87474
34103A86900k47082L69042L69903j4648j20825R0617J74505Q168j37329j59011
$$ plain form
34093 520240 265490 -222544 -785739 -965223 -470808 389584 926097 824000 514248 574701
34083 574701 951997 1137117 955739 682519 450147 169199 65012 553725 1371977 1598424
34073 1598424 928131 190456 88089 151030 -353556 -1097556 -1149425 -371459 470605 748360
34063 748360 405855 -362351 -1131814 -1230770 -491441 220142 21887 -696954 -883863 -451597
34053 -451597 -244549 -511793 -601111 -273653 -119959 -336132 -215872 602581 1346805 1213332
34043 1213332 499650 6929 -37179 141100 452225 780978 749735 287502 26376 521263
34033 521263 1395887 1803992 1456030 720466 11954 -450175 -550185 -394253 -303696 -360023
34023 -360023 -253135 128019 384939 276231 216451 583461 956975 694928 -22944 -408439
$$ packed form
34093E20240k54750m88034n63195j79484M94415Q60392N36513j02097l09752O0453
34083E74701L77296J85120j81378k73220k32372k80948j04187M88713Q18252K26447
34073A598424o70293p37675j02367O2941n04586p44000n1869P77966Q42064K77755
34063G48360l42505p68206p69463r8956P39329P11583j98255p18841j86909M32266
34053d51597K07048k67244q9318L27458J53694k16173J20260Q18453P44224j33473
34043A213332p13682m92721m4108J78279L11125L28753l1243m62233k61126M94887
34033E21263Q74624M08105l47962p35564p08512m62129j00010J55932R0557n6327
34023c60023J06888L81154K56920j08708n9780L67010L73514k62047p17872l85495
$$ plain form
34013 -408439 -183010 143969 91530 -224822 -392190 -189659 256444 562017 390761 -142732
34003 -142732 -539036 -552570 -480057 -592950 -676860 -496701 -324697 -515768 -865264 -914072
33993 -914072 -646469 -353591 -33534 479136 941309 897435 433658 152833 303720 421068
33983 421068 14726 -700060 -959173 -265693 962902 1615725 1013882 -181117 -636660
33974 -636660 -27402 605672 466042 143330 478489 1059483 879424 27085 -432197 -90783
33964 -90783 392068 508531 464122 388525 10420 -585632 -782537 -388768 -6301 -75781
33954 -75781 -272401 -233479 -184860 -375688 -490397 -137801 503474 943040 937307 544636
33944 544636 43080 -38786 639517 1556415 1723736 1014357 388481 452441 596488 119282
$$ packed form
34013d08439K25429L26979n2439l16352j67368K02531M46103L05573j71256n33493
34003a42732l96304j3534P2513j12893q3910J80159J72004j91071l49496m8808
33993i14072K67603K92878L20057N12670M62173m3874m63777k80825J50887J17348
33983D21068m06342p14786k59113O93480J228595O52823o01843j194999m55543
33974f36660O09258O33074j39630l22712L35159N80994j80059q52339m59282L41414
33964i0783M82851J16463m4409p5597l78105n96052j96905L93769L82467o9480
33954g5781j96620L8922M8619j90828j14709L52596O41275M39566n733l92671
33944E44636n01556q1866O78303R16898J67321p09379o25876O3960J44047m77206
$$ plain form
33934 119282 -570287 -659380 -248192 -72939 -276413 -331647 -28491 245507 189635 -59645
33924 -59645 -272389 -352685 -264516 -111003 -169922 -506601 -752542 -618473 -344697 -245651
33914 -245651 -161144 149626 453262 484686 563837 1028574 1368371 824255 -271713 -696840
33904 -696840 35017 1080329 1465331 1115120 479357 -114936 -412346 -182067 385137
33895 385137 709724 548242 248506 95272 -56156 -265052 -231735 114838 322890 130270
33885 130270 -39043 238503 653341 643281 258570 9379 85034 219501 192743 65459
33875 65459 12410 188276 606954 985047 980394 730137 724780 950432 752313 -63733 -657034
33864 -657034 -302759 474333 715097 478999 502845 737252 379818 -637364 -1325747 -1078510
$$ packed form
33934A19282o89569q9093M11188J75253k03474n5234L03156K73998n5872k49280
33924e9645k12744q0296Q8169J53513n8919l36679k45941J34069K73776R9046
33914b45651Q4507L10770L03636L1424P9151M64737L39797n44116j095968m25127
33904f96840P31857J045312L85002l50211o35763n94293k97410K30279N67204
33895C85137L24587j61482k99736j53234j51428k08896L3317L46573K08052j92620
33885A30270j69313K77546M14838j0060l84711k49191P5655J34467k6758j27284
33875F5459n3049J75866M18678L78093m653k50257n357K25652j98119q16046n93301
33864f57034L54275P77092K40764k36098K3846K34407l57434j017182o88383K47237
$$ plain form
33854 -1078510 -468501 -220428 -233754 -120682 15498 -70749 -202177 -153441 -153433 -448555 -723531
33843 -723531 -517224 47898 460634 528933 434730 297226 147335 156096 420225 655170
33833 655170 547893 295231 338694 658989 812615 634361 413570 326496 175286 -152974
33823 -152974 -386181 -287014 -88170 -202339 -621630 -886638 -677088 -229148 -15693 -95354
33813 -95354 -34333 421127 885269 876771 608205 700498 1155595 1273743 762789 223348
33803 223348 138509 72152 -494553 -1106482 -961375 -253179 30877 -439690 -952723 -868958
33793 -868958 -343591 193625 550540 580682 178632 -278656 -139874 562866 974681 587039
33783 587039 -40123 -140763 227005 521718 611994 718264 772708 463657 -195121 -833318
$$ packed form
33854a078510O10009K48073j3326J13072J36180q6247j31428M8736Qk95122k74976
33843g23531K06307N65122M12736O8299r4203j37504j49891Q761K64129K34945
33833F55170j07277k52662M3463L20295J53626j78254k20791q7074j51210l28260
33823a52974k33207R9167J98844j14169m19291k65008K09550M47940K13455p9661
33813i5354O1021M55460M64142q498k68566R2293M55097J18148n10954n39441
33803B23348q4839o6357n66705o11929J45107P08196K84056m70567n13033Q3765
33793h68958N25367N37216L56915L0142m02050m57288J38782P02740M11815l87642
33783E87039o27162j00640L67768K94713R0276J06270N4444l09051o58778o38197
$$ plain form
33773 -833318 -1204235 -1314757 -1165190 -746744 -272878 -73561 -209917 -402933 -369339 -110236
33763 -110236 105961 -6286 -424024 -740379 -603022 -209154 -58730 -198301 -128666 411334
33753 411334 1027622 1261649 1143624 863062 364140 -308757 -681726 -400459 161711 348077
33743 348077 69357 -241268 -310612 -191492 59341 370858 471427 205316 -80085 56146
33733 56146 461674 609991 414874 296489 462875 648954 605025 365781 -21319 -585353
33723 -585353 -1175046 -1515960 -1586807 -1572206 -1432456 -932578 -133203 555386 856316 799331
33713 799331 448820 -92047 -438352 -227619 275260 422511 129712 329 338311 643103
33703 643103 392934 -192300 -538766 -457871 -160634 98292 86275 -323923 -826900 -813903
$$ packed form
33773h33318l70917j10522J49567M18446M73866J99317j36356j93016L3594K59103
33763a10236K16197j12247m17738l16355J37357L93868J50424j39571O9635N40000
33753D11334O16288K34027j18025k80562m98922o72897l72969K81267N62170J86366
33743C48077k78720l10625o9344J19120K50833L11517J00569k66111k85401J36231
33733E6146M05528J48317j95117j18385J66386J86079m3929k39244l87100n64034
33723e85353n89693l40914p0847J4601J39750M99878P99375O88589L00930n6985
33713G99331l50511n40867l46305K10733N02879J47251k92799j29383L37982L04792
33703F43103k50169n85234l46466Q0895K97237K58926j2017m10198n02977J2997
$$ plain form
33693 -813903 -152680 527507 649526 386214 193514 109193 -989 59752 444202 707425
33683 707425 345967 -286068 -351219 208201 533872 115815 -509074 -618828 -274374 -13684
33673 -13684 -31993 -154051 -324710 -603448 -796375 -589056 -71893 275737 233890 134712
33663 134712 334945 686228 797739 634203 515325 573828 560295 274541 -93483 -228707
33653 -228707 -101107 84423 205761 278264 282811 161649 -31425 -145089 -100532 43032
33643 43032 146316 58178 -239187 -472476 -279962 278062 682075 662650 617147 926645
33633 926645 1187256 728831 -272655 -910903 -788353 -423719 -283354 -151788 205016
33624 205016 443401 221301 -155743 -240043 -198640 -477897 -1001859 -1295123 -1214417 -998755
$$ packed form
33693h13903O61223O80187J22019k63312j92700q4321j10182O0741L84450K63223
33683G07425l61458o32035o5151N59420L25671m18057o24889j09754L44454K60690
33673a3684j8309j22058j70659k78738j92927K07319N17163L47630m1847r9178
33663A34712K00233L51283J11511j63536j18878N8503j3533k85754l68024j35224
33653b28707J27600J85530J21338P2503M547j21162j93074j13664M4557J43564
33643D3032J03284q8138k97365k33289J92514N58024M04013j9425m5503L09498
33633I26645K60611m58425j001486o38248J22550L64634J40365J31566L56804
33624B05016K38385k22100l77044q4300M1403k79257n23962k93264Q0706K15662
$$ plain form
33614 -998755 -732480 -322534 63142 107253 -72925 26263 540683 958595 754968 -12694
33604 -12694 -866812 -1391445 -1449528 -1176704 -877809 -755909 -700397 -500858 -214492 -72528
33594 -72528 -78198 -22901 103620 86042 -74145 -78709 150973 247922 -51642 -427666 -387684
33583 -387684 1494 162802 -204752 -692164 -674427 -74703 562113 740638 555101 424051
33573 424051 443656 307114 -125226 -534724 -606215 -472088 -417028 -409453 -293051 -218977 -414951
33562 -414951 -642974 -414073 246041 750686 753999 515079 336410 145677 -141912 -329139
33552 -329139 -315690 -349533 -545342 -538901 -45133 554360 650960 226237 -205536 -298453 -107822
33541 -107822 197115 415167 274185 -217588 -525509 -206441 352068 393071 -86405 -347934
$$ packed form
33614i98755K66275M09946L85676M4111j80178R9188N14420M17912k03627p67662
33604a2694q54118n24633n8083K72824K98895J21900N5512J99539K86366J41964
33594g2528n670N5297J26521j7578j60187m564K29682R6949k99564l76024L9982
33583c87684L89178J61308l67554m87412J7737N99724O36816J78525j85537j31050
33573D24051J9605j36542m32340m09498p1491J34127N5060P575J16402P4074j95974
33562d14951k28023K28901O60114N04645L313k38920j78669j90733k87589j87227
33552c29139J3449l3843j95809O441M93768N99493R6600m24723m31773r2917J90631
33541a07822L04937K18052j40982m91773l07921L19068N58509M1003m79476k61529
$$ plain form
33531 -347934 -76895 215215 148944 71800 302519 465512 125175 -459045 -805180 -966162
33521 -966162 -1159338 -1065544 -304853 640884 852715 272795 -242379 -220730 -111325 -346239
33511 -346239 -666067 -709746 -568149 -355093 99954 655573 628615 -193223 -888137 -555527
33501 -555527 276770 317117 -616858 -1357909 -1074561 -277845 138218 73388 -18448 50578
33491 50578 170664 351683 651726 887547 826745 528742 185522 -187293 -574655 -696779
33481 -696779 -351203 105709 100022 -338355 -571003 -275440 95655 34591 -255543 -238326
33471 -238326 76414 170302 -121782 -362558 -285047 -263039 -625464 -958418 -695545 -135589
33461 -135589 -105330 -619649 -719872 62199 879318 776872 67021 -294119 -228360 -440234
$$ packed form
33531c47934K71039K92110o6271p7144K30719J62993l40337n84220l46135j60982
33521i66162j93176R3794P60691R45737K11831n79920n15174K1649J09405k34914
33511c46239l19828m3679J41597K13056M55047N55619k6958q21838o94914L32610
33501e55527Q32297M0347r33975p41051K83348P96716M16063o4830r1836O9026
33491E0578J20086J81019L00043K35821o0802k98003l43220l72815l87362j22124
33481f96779L45576M56912n687m38377k32648K95563L71095o1064k90134J7217
33471b38326L14740R3888k92084k40776P7511K2008l62425l32954K62873N59956
33461a35589L0259n14319j00223P82071Q17119j02446p09851l61140O5759k11874
$$ plain form
33451 -440234 -983214 -1026149 -261035 450205 342366 -104190 56568 829642 1375777 1230473
33441 1230473 727804 286529 -113587 -642755 -1234291 -1637518 -1633635 -1163419 -435975 110056
33431 110056 164675 -144877 -468996 -678006 -863483 -970120 -736143 -82072 642962 926502
33421 926502 562016 -143303 -592641 -419247 133191 453254 269904 -50900 -62383 131297
33411 131297 86624 -278869 -569420 -500597 -268851 -213243 -340813 -348068 -14226 526005
33401 526005 878645 775787 407328 266204 552517 876748 760577 296819 11748 147060
33391 147060 443951 646532 799024 904277 702993 87474 -565470 -821527 -741734 -658068
33381 -658068 -588238 -322775 2404 -28908 -377807 -423842 133060 699142 563019 -68469
$$ packed form
33451d40234n42980m2935P65114P11240j07839m46556J60758P73074N46135j45304
33441A230473n02669m41275m00116n29168n91536m03227L883M70216P27444N46031
33431A10056N4619l09552l24119k09010j85477j06637K33977O54071P25034K83540
33421I26502l64486p05319m49338J73394N52438L20063j83350l20804j1483J93680
33411A31297m4673l65493k90551O8823K31746N5608j27570p255L33842N40231
33401E26005L52640j02858l68459j41124K86313L24231j16171m63758k85071J35312
33391A47060K96891K02581J52492J05253k01284o15519o52944k56057P9793Q3666
33381f58068O9830K65463L25179l1312l48899m6035N56902N66082j36123o31488
$$ plain form
33371 -68469 -355722 7090 506091 696353 759775 964822 1106446 854097 290098 -273551
33361 -273551 -724124 -1028824 -980007 -508310 -37752 -45320 -395638 -582475 -511647 -510704 -618871
33350 -618871 -485226 -83734 51074 -443602 -1230527 -1732631 -1753404 -1405677 -799984 -112753
33340 -112753 320557 301003 -1712 -300129 -480781 -515674 -352990 -72117 112746 174965
33330 174965 325574 571753 550925 49553 -602340 -923827 -825803 -521751 -162504 166436
33320 166436 321546 263878 169573 163467 149123 87690 185284 600495 1237364 2011513 3002265
33309 3002265 4180651 5422926 6997839 9421988 12359153 14241711 13723219 11232788
33301 11232788 8449604 6475849 5173176 4061492 3046371 2198813 1492216 952219
$$ packed form
33371f8469k87253L62812M99001J90262O3422K05047J41624k52349n63999n63649
33361b73551m50573l04700M8817M71697M70558p568l50318j86837P0828R43j08167
33350f18871J33645M01492J34808m94676p86925n02104k0773L47727O05693O87231
33340a12753M33310j9554l02715k98417j80652l4893J62684K80873J84863O2219
33330A74965J50609K46179k0828n01372o51893l21487R8024L04052L59247L28940
33320A66436J55110n7668r4305o106j4344o1433R7594M15211O36869P74149R90752
33309C002265J178386J242275J574913K424149K937165J882558n18492k490431
33301A1232788k783184j973755j302673j111684j015121q47558p06597n39997
$$ plain form
33293 952219 643054 439715 195072 97388 415802 916473 1015474 555347 2093 -176385
33283 -176385 42688 400452 591624 379461 -136875 -438376 -161816 367587 613314 621739
33273 621739 749325 812157 319107 -475255 -657078 -1422 621183 555645 283293 495204
33263 495204 939217 927877 551116 559590 1159284 1646712 1389247 672618 297556 574133
33253 574133 1015882 1035254 692433 500584 566142 365476 -394283 -1113916 -983831 -82721
$$ packed form
33293I52219l09165k03339k44643r7684L18414N00671R9001m60127n53254j78478
33283a76385K19073L57764J91172k12163n16336l01501K76560N29403K45727Q425
33273F21739J27586O2832m93050p94362j81823O55656O22605o5538k72352K11911
33263D95204M44013j1340l76761Q474N99694M87428k57465p16629l75062K76577
33253E74133M41749J9372l42821j91849O5558k00666p59759p19633J30085R01110
$$ [...]
##END NTUPLES=NMR SPECTRUM
##END=
