##TITLE=31Pdec_85-2025-Bay
CDCl3, 24 sc
 28.7.2025
##JCAMPDX= 6.0         $$ Bruker NMR JCAMP-DX V2.0
##DATA TYPE= NMR SPECTRUM
##DATA CLASS= NTUPLES
##ORIGIN= UXNMR, Bruker Analytische Messtechnik GmbH
##OWNER= root
$$ XWIN-NMR		Version 3.5
$$ Mon Jul 28 15:14:15 2025 Russian Standard Time (UT+4h)  she@DPX200
##.OBSERVE FREQUENCY= 81.013821
##.OBSERVE NUCLEUS= ^31P
##.ACQUISITION MODE= SIMULTANEOUS
##.ACQUISITION SCHEME= undefined
##.AVERAGES= 24
##.DIGITISER RES= 17
##SPECTROMETER/DATA SYSTEM= spect
##.PULSE SEQUENCE= zgpg30
##.SOLVENT NAME= CDCl3
##.SHIFT REFERENCE= (INTERNAL, CDCl3, 0, 198.062)
##AUDIT TRAIL= $$ (NUMBER, WHEN, WHO, WHERE, WHAT)
$$ ##TITLE= Audit trail, XWIN-NMR		Version 3.5
$$ ##JCAMPDX= 5.01
$$ ##ORIGIN= Bruker BioSpin GmbH
$$ ##OWNER= she
$$ F:/spectra/data/she/nmr/P31/2/pdata/1/auditp.txt
$$ ##AUDIT TRAIL=  $$ (NUMBER, WHEN, WHO, WHERE, WHAT)
(   1,<2025-07-28 15:12:35.82 +0400>,<she>,<DPX200>,
      <created by zg, POWCHK disabled, PULCHK disabled
       configuration hash MD5:
       00 E9 B6 7A A2 85 ED C7 34 08 36 98 17 FE 4E 26
       data hash MD5: 32K
       7F 56 B9 37 C3 F6 85 5B 6A 1D 8F 60 63 1D 35 0D>)
(   2,<2025-07-28 15:12:38.48 +0400>,<she>,<DPX200>,
      <Start of raw data processing
       efp BC_mod = 2 LB = 1.5 FT_mod = 6 PKNL = 1 PHC0 = 1461.057 PHC1 = -124.9013 SI = 64K 
       data hash MD5: 64K
       BC 0C 6C B2 BA 85 BE 9A F2 19 8A 45 6A 95 80 49>)
(   3,<2025-07-28 15:13:39.21 +0400>,<she>,<DPX200>,
      <pk PHC0 = -358.5291 PHC1 = 993.2 
       data hash MD5: 64K
       C8 53 FB 44 D2 E1 1B D9 6D BB 1D B2 A3 66 7D 14>)
$$ ##END=
$$ 
$$ hash MD5
$$ 0B 65 22 F5 12 09 5C 43 7D A4 4D 78 BF 49 70 1D
##$RELAX= 
##$RELAX= 
##$RELAX= 
##$RELAX= 
##$RELAX= 
##$RELAX= 
##$RELAX= 
##$RELAX= 
$$ Bruker specific parameters
$$ --------------------------
##$DU= <F:/spectra>
##$EXPNO= 2
##$NAME= <P31>
##$PROCNO= 1
##$TYPE= <nmr>
##$USER= <she>
##$AMP= (0..31)
100 100 100 100 100 100 100 100 100 100 100 100 100 100 100 100 100 100 
100 100 100 100 100 100 100 100 100 100 100 100 100 100 
##$AQSEQ= 0
##$AQ_mod= 1
##$AUNM= <au_zg>
##$AUTOPOS= <>
##$BF1= 81.014009
##$BF2= 200.13
##$BF3= 200.13
##$BF4= 200.13
##$BF5= 200.13
##$BF6= 200.13
##$BF7= 200.13
##$BF8= 200.13
##$BYTORDA= 1
##$CFDGTYP= 0
##$CFRGTYP= 5
##$CHEMSTR= <none>
##$CNST= (0..31)
1 1 145 1 1 1 1 1 1 1 1 1 1 1 1 1 1 1 1 1 1 1 1 1 1 1 1 1 1 1 1 1 
##$CPDPRG= <waltz16>
##$CPDPRG1= <>
##$CPDPRG2= <waltz16>
##$CPDPRG3= <>
##$CPDPRG4= <mlev>
##$CPDPRG5= <mlev>
##$CPDPRG6= <mlev>
##$CPDPRG7= <mlev>
##$CPDPRG8= <mlev>
##$CPDPRGB= <>
##$CPDPRGT= <>
##$D= (0..31)
0 1 0 0 0 0 0 0 0 0.06 0 0.03 2e-05 3e-06 0 0 0.0002 0 0 0 0 0 0 0 0 0 
0 0 0 0 0 0 
##$DATE= 1753701155
##$DBL= (0..7)
120 120 120 11 120 120 24 19 
##$DBP= (0..7)
150 150 150 150 150 150 150 150 
##$DBP07= 0
##$DBPNAM0= <>
##$DBPNAM1= <>
##$DBPNAM2= <>
##$DBPNAM3= <>
##$DBPNAM4= <>
##$DBPNAM5= <>
##$DBPNAM6= <>
##$DBPNAM7= <>
##$DBPOAL= (0..7)
0.5 0.5 0.5 0.5 0.5 0.5 0.5 0.5 
##$DBPOFFS= (0..7)
$$ [...]
##$SUBNAM2= <"">
##$SUBNAM3= <"">
##$SUBNAM4= <"">
##$SUBNAM5= <"">
##$SUBNAM6= <"">
##$SUBNAM7= <"">
##$SUBNAM8= <"">
##$SUBNAM9= <"">
##$SW= 400.765351723535
##$SWIBOX= (0..15)
0 1 3 0 0 0 0 0 0 0 0 0 0 0 0 0 
##$SW_h= 32467.5324675325
##$TD= 32768
##$TD0= 1
##$TE= 0
##$TE2= 300
##$TE3= 300
##$TEG= 300
##$TL= (0..7)
0 120 53 12 22 120 120 120 
##$TP= (0..7)
150 150 150 150 150 150 150 150 
##$TP07= 0
##$TPNAME0= <>
##$TPNAME1= <>
##$TPNAME2= <>
##$TPNAME3= <>
##$TPNAME4= <>
##$TPNAME5= <>
##$TPNAME6= <>
##$TPNAME7= <>
##$TPOAL= (0..7)
0.5 0.5 0.5 0.5 0.5 0.5 0.5 0.5 
##$TPOFFS= (0..7)
0 0 0 0 0 0 0 0 
##$TUNHIN= 0
##$TUNHOUT= 0
##$TUNXOUT= 0
##$USERA1= <user>
##$USERA2= <user>
##$USERA3= <user>
##$USERA4= <user>
##$USERA5= <user>
##$V9= 5
##$VALIST= <valist>
##$VCLIST= <CCCCCCCCCCCCCCC>
##$VD= 0
##$VDLIST= <DDDDDDDDDDDDDDD>
##$VPLIST= <PPPPPPPPPPPPPPP>
##$VTLIST= <TTTTTTTTTTTTTTT>
##$WBST= 1024
##$WBSW= 4
##$XGAIN= (0..3)
0 0 0 0 
##$XL= 0
##$YL= 0
##$YMAX_a= 13558
##$YMIN_a= -3874
##$ZGOPTNS= <>
##$ZL1= 120
##$ZL2= 120
##$ZL3= 120
##$ZL4= 120
##$ABSF1= 0
##$ABSF2= 0
##$ABSG= 0
##$ABSL= 0
##$ALPHA= 0
##$AQORDER= 0
##$ASSFAC= 0
##$ASSFACI= 0
##$ASSFACX= 0
##$ASSWID= 0
##$AUNMP= <proc_1d>
##$AZFE= 0.1
##$AZFW= 0.5
##$BCFW= 0
##$BC_mod= 2
##$BYTORDP= 0
##$COROFFS= 0
##$CY= -3
##$DATMOD= 1
##$DC= 0
##$DFILT= <>
##$DTYPP= 0
##$F1P= 0
##$F2P= 0
##$FCOR= 1
##$FTSIZE= 65536
##$FT_mod= 6
##$GAMMA= 0
##$GB= 0
##$INTBC= 1
##$INTSCL= 9.790993e-09
##$ISEN= 30
##$LB= 1.5
##$LEV0= 0
##$LPBIN= 0
##$MAXI= 10000
##$MC2= 0
##$MEAN= 0
##$ME_mod= 0
##$MI= 50
##$NCOEF= 0
##$NC_proc= -9
##$NLEV= 6
##$NOISF1= 182.463
##$NOISF2= 159.3651
##$NSP= 0
##$NTH_PI= 0
##$NZP= 0
##$OFFSET= 198.0616
##$PC= 4
##$PHC0= 1102.528
##$PHC1= 868.2987
##$PH_mod= 1
##$PKNL= yes
##$PPARMOD= 0
##$PSCAL= 0
##$PSIGN= 0
##$REVERSE= no
##$SF= 81.0140089999434
##$SI= 65536
##$SIGF1= 159.3651
##$SIGF2= -187.1042
##$SINO= 113.3802
##$SIOLD= 16384
##$SREGLST= <1H.CDCl3>
##$SSB= 0
##$STSI= 65536
##$STSR= 0
##$SW_p= 32467.5324675325
##$SYMM= 0
##$S_DEV= 0
##$TDeff= 32768
##$TDoff= 0
##$TI= <>
##$TILT= no
##$TM1= 0
##$TM2= 0
##$TOPLEV= 0
##$USERP1= <user>
##$USERP2= <user>
##$USERP3= <user>
##$USERP4= <user>
##$USERP5= <user>
##$WDW= 1
##$XDIM= 65536
##$YMAX_p= 307703353
##$YMIN_p= -80844814
$$ End of Bruker specific parameters
$$ ---------------------------------
##NTUPLES= NMR SPECTRUM
##VAR_NAME=  FREQUENCY,     SPECTRUM/REAL,   SPECTRUM/IMAG
##SYMBOL=    X,             R,               I
##VAR_TYPE=  INDEPENDENT,   DEPENDENT,       DEPENDENT
##VAR_FORM=  AFFN,          ASDF,            ASDF
##VAR_DIM=   65536,         65536,           65536
##UNITS=     HZ,            ARBITRARY UNITS, ARBITRARY UNITS
##FACTOR=    0.49542278885378, 1,            1
##FIRST=     16045.7642231865, 0,            0
##LAST=      -16421.768244346, 0,            0
##MIN=       -16421.768244346, -80844814,    0
##MAX=       16045.7642231865, 307703353,    0
$$ Real data points
##PAGE= N=1
##DATA TABLE= (X++(R..R)), XYDATA
$$ [...]
43669B916715M152683L259685L818809J565040l822997o453042k919215K159354
43661D677032K951049L75885r59587j15936O74824J033052J893331J960923k41815
43652A2248758k313156j072212J448254N12141l438534n116986k795539n97349
43644a124623j267110k201674p55765J407592J943649J709655K190014K486311
43636D388049J670810J113502J735596J751533p7001j596008o71173R30309L71879
43627I617496j404441j180455J302114L017863K224759M22449m04227j32979L48070
43618A3810649N47388K72293p71247k590406m366013m579794k130465K082049
43610B274454N149646M887034K264038k21884j981135m054379n897998n421114
$$ y = [2916715, 7069398, 10329083, 14147892, 15712932, 11889935, 5436893, 2517678, 4677032, 7628081, 8003966, 7044379, 6928443, 7603267, 8636319, 10529650, 12490573, 12248758, 9935602, 8863390, 10311644, 10823785, 7385251, 2268265, -527274, -1124623, -2391733, -4593407, -5349172, -3941580, -1997931, -288276, 1901738, 4388049, 6058859, 7172361, 8907957, 10659490, 10582489, 8986481, 8315308, 9245617, 9617496, 8213055, 7032600, 8334714, 11352577, 13577336, 13999785, 13595558, 13462579, 13810649, 14358037, 14630330, 13859083, 11268677, 6902664, 2322870, 192405, 2274454, 7424100, 12311134, 14575172, 14353288, 12372153, 8317774, 2419776, -3001338]
43602c001338k616381j29203O82511J295591K564381K968130J933650J622629
43594E319970L180980M233159K671950J33536j021357j329433j797107r31647
43586A0460051J949283L311457Q8918m372660m441106r34978J62054k565498l804270
43577a46749l11805M085053M931548L546939L383169L868562K131863j497215
43569A9991365l808334l427502j902989p02135J32283P02968R09605J080410J162402
43560A4138073r831k678758m319505k426653J272582K282074p05456m127962m612528
43551a187964k888424j212172L09057K355989L572046K423971O89882J372484
43543E434869L391033K428630k010553m588322j583209L275028M081201J180290
$$ y = [-3001338, -5617719, -5746922, -5064411, -3768820, -1204439, 1763691, 3697341, 5319970, 8500950, 12734109, 15406059, 15539595, 14518238, 13188805, 11391698, 10460051, 12409334, 15720791, 15809709, 11437049, 6995943, 6060965, 6223019, 3657521, -146749, -458554, 3626499, 8558047, 12104986, 15488155, 19356717, 21488580, 19991365, 16183031, 12755529, 10852540, 10150405, 10282688, 10985656, 11895261, 12975671, 14138073, 14128242, 11449484, 7129979, 4703326, 5975908, 8257982, 7552526, 3424564, -1187964, -4076388, -5288560, -4979503, -2623514, 948532, 3372503, 4062385, 5434869, 8825902, 11254532, 9243979, 4655657, 3072448, 6347476, 10428677, 11608967]
43535A1608967l43850P98562M98794l291510o579617n055868j07027L594377L911290
43526E034118K084491j43988j634318j555050l07894L21500m10324j065706p42413
43517A580416p72231j737283j326951J880573M721320L272380j044588l125149
43509C448487j168883J861827L264809L029605J382697j731480m128209k694718
43501C264135J483326L363963R82012j740320j315456L04839J25884l33145J774544
43492G909782M543609L500851j099747l975858k181774J247186K182034P33914
43484A2859997r4603R50097K007697P33788k721165n358376m273641m16444J732610
43475E419960l60504l527633l166691j75412K46423l052902m600955l25017N806771
$$ y = [11608967, 11265117, 12063679, 12562473, 9270963, 2691346, -2364522, -2471549, 1122828, 5034118, 7118609, 6974621, 5340303, 3785253, 3477359, 3798859, 3388535, 2322829, 1580416, 808185, -929098, -2256049, -375476, 4345844, 7618224, 6573636, 3448487, 2279604, 4141431, 7406240, 10435845, 11818542, 10087062, 5958853, 3264135, 4747461, 8111424, 9093436, 7353116, 6037660, 6342499, 6468383, 6135238, 7909782, 12453391, 15954242, 14854495, 10878637, 8696863, 9944049, 12126083, 12859997, 12765394, 13715491, 15723188, 16456976, 13735811, 8377435, 4103794, 3687350, 5419960, 5059456, 1531823, -1634868, -1810280, -1563857, -4616759, -9217714, -9542731, -3735960]
43466c735960P011846L008851m54746k13396J095489P33163n8290M02985O13882
43457H403824j133552k880409j627225J680859L228643J746157l48391j175530
43449G894376j678767k916909l650017k115917J210326L886104L911254J431033
43441G971483j317842j799230K18997K146952J672503l30741j474925j394173
43433E693024j261042o80373J599443M015520L154770o75397k751333o08774K274146
43424A0759984J961672k19115p13376M28151P02790P2823M48027J353001L28467
43415A5122424k486316l830226j817661J797553M130226L688691N63817l586754
43407A3581754n907363m810109j793825Q02264K571980L526183K033646k197450
$$ y = [-3735960, 3275886, 6284737, 5829991, 5616595, 6712084, 7445247, 7386957, 7789942, 8403824, 7270272, 4389863, 2762638, 4443497, 7672140, 9418297, 9069906, 7894376, 6215609, 3298700, -351317, -2467234, -1256908, 2629196, 6540450, 7971483, 6653641, 4854411, 5073408, 7220360, 8892863, 8562122, 7087197, 5693024, 4431982, 3751609, 5351052, 9366572, 12521342, 11845945, 9094612, 8485838, 10759984, 12721656, 12502541, 11789165, 12217316, 12920106, 12992929, 13440956, 14793957, 15122424, 12636108, 8805882, 6988221, 8785774, 12916000, 16604691, 17168508, 13581754, 7674391, 2864282, 1070457, 1872721, 4444701, 7970884, 10004530, 7807080]
43399G807080n024369k464536K600359L470928q01067m319556l392439r51367
43391c074967l02837j28240J428889K582458J340116p50596j653797k121893k723828
43382e404695j369487K416090M379128J272106l201446l111582J146717L988786
43374A15617K808436Q9216j639560k095892j003727J771308L967014L120575Q29010
43365G961997M82788J186864r09478n123280o013912k039186J508284P93893j009680
43356c161710j68914R24545j332586m371895l280253N92562J623576n64562o15125
43347a0354362K939792M625694J239873k138571J15043N089926N732541J540573
43339H790509j429037l73574P98614j080957l303246k416154J4530N89578j84915
$$ y = [7807080, 2782711, 318175, 2918534, 6389462, 5588395, 1268839, -2123600, -3074967, -3377804, -3506044, -2077155, 505303, 1845419, 1094823, -558974, -2680867, -5404695, -6774182, -4358092, 21036, 1293142, -1908304, -5019886, -3873169, 115617, 2924053, 3013269, 1373709, -722183, -1725910, 45398, 4012412, 7132987, 7961997, 8444785, 9631649, 8722171, 3598891, -2415021, -4454207, -2945923, -2152030, -3161710, -3330624, -2406079, -3738665, -8110560, -11390813, -10798251, -9174675, -9739237, -10354362, -7414570, -2788876, -1549003, -3687574, -3572531, 1517395, 7249936, 8790509, 7361472, 6987898, 7786512, 6705555, 3402309, 986155, 1000685, 1590263, 1405348]
43330A405348L74478J759051J211061r42310j502654L2518N64928j045637j746782
43321A10001N16654L006681K206352j050370l240811k983110j508906J44279J679567
43312a119663K314897J580161P21977J142305K066836J810081O41256K03168O71568
43303A0032586P89736L54328L31223O22757J4028j526511k603978k661566k505148
43294B847455k374107j518813k6956R22950J054125J322604J895505J861425J384315
43285G368503J823474K999710K870345J051783j2903R01283J325717q22618l184585
43276A4320709k479380l24838j132724m589009n060506M8697N539180M934011
43268A1256140r96976n601357m687945j64639L895708N367455M030201O45097
$$ y = [1405348, 1779826, 3538877, 4749938, 3807628, 2304974, 2337492, 2902420, 1856783, 110001, 626655, 3633336, 5839688, 4789318, 1548507, -1434603, -2943509, -2799230, -1119663, 1195234, 2775395, 3497372, 4639677, 6706513, 8516594, 9157850, 9361018, 10032586, 10822322, 11176650, 11507873, 12130630, 12144658, 10618147, 8014169, 5352603, 2847455, 473348, -1045465, -1072421, -149471, 904654, 2227258, 4122763, 5984188, 7368503, 9191977, 12191687, 15062032, 16113815, 16100912, 17002195, 18327912, 17505294, 14320709, 11841329, 11516491, 10383767, 5794758, 734252, 782949, 6322129, 11256140, 10259164, 4657807, -30138, -194777, 3700931, 9068386, 13098587, 13743684]
43260A3743684k661192l337901j153006J433868K430466K182475J444302j52707
43252A3929989k384714l419806k399230j151802j322072j677385o16701N57575
43244A515854k04171j890799k077333j048811o85337m54643J278643K832881J077919
43235C44203k345399k161648K143584M617571J662084k689953l342463j206204
43227b978225M6746J26011O84546J087082J49413m77840R89489K608503J735432
43218C971157k10927k29098J087117J208295M49674M24300k32705l285528n700185
43209b517900k980306L083450O069376M217733J956813J730631P86356k284925
43201A0061228m029477j976018J123480K018361J590612J603063P49709k459103
$$ y = [13743684, 11082492, 7744591, 6591585, 8025453, 10455919, 12638394, 14082696, 13929989, 11545275, 8125469, 5726239, 4574437, 3252365, 1574980, 958279, 1515854, 1311683, -579116, -2656449, -3705260, -4390597, -4845240, -3566597, -733716, 344203, -2001196, -4162844, -2019260, 2598311, 4260395, 1570442, -1772021, -2978225, -2931479, -2805468, -2120922, -1033840, -884427, -1362267, -372778, 2235725, 3971157, 3760230, 3531132, 4618249, 5826544, 6276218, 6700518, 6467813, 3182285, -2517900, -5498206, -2414756, 3654620, 7872353, 9829166, 11559797, 12346153, 10061228, 6031751, 4055733, 5179213, 7197574, 8788186, 10391249, 11140958, 8681855]
43193H681855n866667o247853l707420p71001J081883J736923J198863J54342
43185c739075J48858J483720K451034J789918J35183j617495l076037l091525
43177e515419p62639J801481J406129p52844P4501M443088O760012L581716j152557
43168I883468k715681k615088m380647o464812n000594q98011J539726J442888
43160i208751J519230K523337K681734J972104K095744K459543Q78140j679416
43152C241665j731784P09987J308710j974176n292526m113278O92231M219910
43144b939261L555348O14502o84314Q00032J988583l47390m491153n155843p52102
43135g411598L829182L846156J003257j20565R19325J336948R46601J964179L786216
$$ y = [8681855, 2815188, -3432665, -7140085, -7911086, -6829203, -5092280, -3893417, -3739075, -3590217, -2106497, 344537, 2134455, 2269638, 652143, -2423894, -5515419, -6278058, -4476577, -3070448, -3823292, -3748791, 694297, 7454309, 11036025, 9883468, 7167787, 4552699, 172052, -6292760, -11293354, -12191365, -10651639, -9208751, -7689521, -5166184, -2484450, -512346, 1583398, 4042941, 4921081, 3241665, 1509881, 2219868, 3528578, 1554402, -3738124, -7851402, -7159171, -2939261, 616087, 1230589, 546275, 1346307, 3334890, 2987500, -1503653, -6659496, -7411598, -3582416, 263740, 1266997, 1146432, 2065757, 3402705, 4349306, 6313485, 10099701]
43126A0099701L061680o89732l840998l689997j197963J537176L088583K091684
43118A0460134j362921l791873j854908K174771K956173K34830p79953J870637
43110I906890L542974P03950l337879l943482k050315j409627k091663j135359
43102A85489K078014M857452M821434K016277j657136l483899j904630J131638
43094H044639J746745o25065k227442q89581L78630j511268m192734l342603M03475
43085b215204K335699N47376k001133k161212p8170K213626L100477K097408K68981
43076D107848j41922J771149L913454L740152J602120m22385j881979l527855
43068I160582m450865k843941M69380K364382J740327P49460J038230J529708
$$ y = [10099701, 13161381, 12471649, 8630651, 4940654, 3742691, 5279867, 8368450, 10460134, 9097213, 5305340, 3450432, 5625203, 8581376, 8816206, 8036253, 9906890, 13449864, 14153814, 10815935, 6872453, 4822138, 3412511, 1320848, 185489, 2263503, 7120955, 11942389, 13958666, 12301530, 8817631, 6913001, 8044639, 9791384, 9166319, 6938877, 6049296, 6427926, 4916658, 723924, -2618679, -2215204, 120495, 667871, -1333262, -3494474, -3572644, -1359018, 1741459, 3838867, 4107848, 3965926, 5737075, 9650529, 13390681, 14992801, 14570416, 12688437, 9160582, 4709717, 1865776, 2335156, 4699538, 6439865, 7189325, 8227555, 9757263]
43060I757263J142814J121463K665265M020630K335864k165407n865888n789534
43052G222470k614883P52569K542147L118723L146255K240040J40582j887877
43044A4660026k307040j544485j340679j907419j666840k63587L06997j259313
43036D677660l300062l541956k144261n63247J166513L670156N649367M737130
43028A0351300J061181k166917k214596L62504K835488L127287J266847j000572
43020A3622522j704815l53852J646476K507131J762017K37937j131335k023250
43012A4562831k711996l630187m543030m372796k710726r74677m77737N5033K535705
43003b267580N370387M771595Q30169j793962q97041m8035k059003l664676j113173
$$ y = [9757263, 10900077, 12021540, 14686805, 18707435, 21043299, 18877892, 13012004, 7222470, 4607587, 5360156, 7902303, 11021026, 14167281, 16407321, 16547903, 14660026, 12352986, 10808501, 9467822, 7560403, 5893563, 5629976, 5936973, 4677660, 1377598, -2164358, -4308619, -4871866, -3705353, -35197, 5614170, 10351300, 11412481, 9245564, 7030968, 7393472, 10228960, 13356247, 14623094, 13622522, 11917707, 11563855, 13210331, 15717462, 17479479, 17717416, 16586081, 14562831, 11850835, 8220648, 3677618, -695178, -3405904, -4380581, -4858318, -4803285, -2267580, 3102807, 7874402, 8704571, 6910609, 6013568, 5965533, 3906530, 241854, -871319]
42994h71319K777674K757857l95955j778181r05708j519985l484691k228213K726746
42985b921775N686130L495821Q1851n67793p2850p78296q18702J377719K513728
42976G995833k51909l216092j274607L505318M600135R09414k101078r68845J538796
42967A0736965J694522j67898j481957j188212k11060p8597j530532l084918j832535
42958B855778K294044M649929J531844l772040m884877j391262J201302N62233
42950C046951N33017L262746M469944M59020m917559n450105j739956J96394j981327
42941b120875m444199l682127q75195J202292K009100K385224K415921J814888
42933a294971R20003J43914n08171q45145o35754o21250j807457l305202k712079
$$ y = [-871319, 1906355, 4664212, 4268257, 2490076, 1584368, 64383, -3420308, -5648521, -2921775, 2764355, 6260176, 6342027, 5774234, 5701384, 4923088, 4104386, 5482105, 7995833, 7743924, 4527832, 3253225, 6758543, 11358678, 12268092, 10167014, 9198169, 10736965, 12431487, 12263589, 10781632, 9593420, 9382360, 9303763, 7773231, 4688313, 2855778, 5149822, 9799751, 11331595, 7559555, 2674678, 1283416, 2484718, 3046951, 3579968, 6842714, 11312658, 11771678, 6854119, 1404014, -335942, -139548, -2120875, -6565074, -10247201, -11122396, -9920104, -7911004, -5525780, -3109859, -1294971, -374968, -231054, -739225, -1584370, -2220124, -2841374, -4648831, -7954033, -10666112]
42924a0666112M04965L118413K647345k4908j631065p75943J143105K569710L303167
42915H8677L286885J881872p23468k742149k667982j217585k85979m56655p38985
42906c575369n35613m88512j066361j483664o59071J533411M417489O955728P501399
42897A2599437M525304j004557n028083m194534j3849K672020J403007j626878
42889I331867l240527k951062j978033p23708R52967K216656J889726J25722j761247
42880C862361k609631j811550M72081K510599J882902j326050l588273k061884
42872b669445J532677L183175J576455j361218l587841l936558j351576L408494
42864c205837O242619L907363o78731j809287L81979J00379m244675o596130k760429
$$ y = [-10666112, -10261147, -7142734, -4495389, -4520297, -6151362, -6927305, -5784200, -3214490, 88677, 3375562, 5257434, 4533966, 1791817, -876165, -2093750, -2379729, -2836384, -3575369, -4110982, -4599494, -5665855, -7149519, -7808590, -6275179, -1857690, 5098038, 12599437, 17124741, 16120184, 11092101, 6897567, 6883718, 9555738, 10958745, 9331867, 6091340, 3140278, 1162245, 438537, 1391504, 3608160, 5497886, 5623608, 3862361, 1252730, -558820, -86739, 2423860, 4306762, 2980712, -607561, -2669445, -1136768, 2046407, 3622862, 2261644, -1326197, -5262755, -6614331, -3205837, 3036782, 6944145, 6265414, 4456127, 4838106, 4938485, 693810, -5902320, -8662749]
42855h662749K489640K693784o13136j487457O01874J379817K29313O89383K686272
42846F741J554277l527676o533906l084317K982249N056931K176638j449121k604735
42837e422919j454949M03699J500980J296589J128907K758464M860261L685448
42829H756480j011834l920892r74752M528330O209873K948294j044051k993363
42821A2498085l926898m672829m032924j837881r7592L51676J344191L849090
42813C474918N524753L991278P54518n88863P04508J630032l42737l804518n028354
42804F315535k394843J709750L538541J919145r98621k575637k300521j391451
42796C821898p84681k84113O81220K023741K691995J535096j066308k859002k074808
$$ y = [-8662749, -6173109, -3479325, -4092461, -5579918, -4978044, -3598227, -3368914, -2679531, 6741, 1561018, -1966658, -8500564, -11584881, -8602632, -3545701, -1369063, -2818184, -5422919, -6877868, -6474169, -4973189, -3676600, -2547693, 210771, 5071032, 8756480, 7744646, 3823754, 2849002, 7377332, 13587205, 16535499, 15491448, 12498085, 8571187, 3898358, -134566, -1972447, -2070039, -1718363, -374172, 3474918, 8999671, 12990949, 13745467, 13156604, 13861112, 15491144, 15148407, 11343889, 6315535, 3920692, 5630442, 9168983, 11088128, 10089507, 7513870, 5213349, 3821898, 3037217, 2753104, 3434324, 5458065, 8150060, 9685156, 8618848, 5759846, 3685038]
42787C685038J83907J375819J070091J017569J633683J138340q59522j758329
42779G486596K10903K943634L491617K105845P73791m39084k647321n019560n451593
42770C454828l749634j534109M19975K252108L114486J886540n38244k043684
42762C262266j978345j000755P84550L059333L795856J526952j775608l169906
42754D504343l036114l421293l380586n08988L519798M163980J116151j073911
42746A883380m60238k95145k329837l116385r2207L517920L639335J172271q64936
42737C054158k189991l189362j746780K964680O541967M593491j88566j640088
42729H199509P18561J839226l03377k307633j962335j561929k913503l842964
$$ y = [3685038, 3868945, 5244764, 6314855, 7332424, 8966107, 10104447, 9244925, 7486596, 7697499, 10641133, 14132750, 16238595, 17012386, 16573302, 13925981, 8906421, 3454828, -294806, -1828915, -1408940, 843168, 3957654, 5844194, 5305950, 3262266, 1283921, 283166, 1067716, 4127049, 7922905, 9449857, 7674249, 4504343, 1468229, -1953064, -5333650, -5842638, -2322840, 1841140, 2957291, 1883380, 1423142, 1127997, -1201840, -4318225, -4410432, -892512, 2746823, 3919094, 3054158, 864167, -2325195, -4071975, -1107295, 5434672, 10028163, 9839597, 8199509, 8918070, 10757296, 10453919, 8146286, 6183951, 4622022, 1708519, -2134445]
42721b134445k145421N90381J627996Q95812j705l80902k44213N32207J122124
42712a38166j12589k676850l153030N22929N567494P386789N042340J538224n23545
42703A3453596j230574j509698j299193k89941R62890J544325J075953l41481
42695A2365877k307092l740269l198436n63998K077822K492997J148336N38511
42687H813748J299206Q82164k435969n883300n127683l01574L774094L704043
42679D724729J099943p92044j232678j172091q11804j77384j98169r35463m49538
42670E5501K088965L793203J607186k599501l835979o60534L113226L737236J701140
42661I000443k67633r46853r91334j102224j233846j163032j162934j927348l349083
$$ y = [-2134445, -4279866, -3689485, -2061489, -1165677, -1167382, -1548284, -1792497, -1260290, -138166, -250755, -2927605, -6080635, -5557706, 9788, 7396577, 12438917, 13977141, 13453596, 12223022, 10713324, 9414131, 9124190, 10087080, 11631405, 12707358, 12365877, 10058785, 6318516, 3120080, 2556082, 4633904, 7126901, 8275237, 8813748, 10112954, 10995118, 8559149, 2675849, -2451834, -2753408, 1020686, 4724729, 5824672, 5032628, 3799950, 2627859, 1816055, 1638671, 1440502, 505039, 55501, 2144466, 5937669, 7544855, 4945354, 1109375, 448841, 3562067, 7299303, 9000443, 8732810, 7785957, 6794623, 5692399, 4458553, 3295521, 2132587, 205239, -3143844]
42652c143844l542760p84278L067989L759487R41834L7668M417188Q837950O108084
42643A9699318j501036m395970L85559M649632J255564n788323q275229n619395
42635D10120l378317l256230j820886J702725L456034K048751J484295M086247
42627D732739N534670J427000m495758m318417K579635P601637M252749l048353
42619A4265902n128943l78773L929892K234763k455740m188550k345735o52714
42611E280102n61447j57833J178379J465248J9253j057468m77762K55442q6196
42602E857718k65878O85663J034198r96574l837701m262664j537242K049130M098483
42593B825133L936768K191122J09305r90854p49452j12709j43515r67021k074776
$$ y = [-3143844, -6686604, -7470882, -4402893, -643406, 298428, 336096, 4753284, 13591234, 19699318, 18198282, 13802312, 14187871, 18837503, 20093067, 14304744, 6029515, 410120, -2968197, -6224427, -8045313, -6342588, -2886554, -837803, 646492, 4732739, 10267409, 11694409, 7198651, 2880234, 5459869, 13061506, 17314255, 14265902, 9136959, 8758186, 12688078, 14922841, 12467101, 8278551, 5932816, 5280102, 4718655, 4560822, 5739201, 7204449, 7223702, 6166234, 5688472, 5943914, 5857718, 5591840, 6277503, 7311701, 6315127, 2477426, -1785238, -3322480, -1273350, 2825133, 6761901, 8953023, 9062328, 8071474, 7322022, 7209313, 7065798, 6098777, 4024001]
42584D024001k713115j881896N85909K725413K118771o15231k175539j166945
42576I01368K10420J85505P5190R23781P36514j707342l079130P3527M804340
42567C124173M714716p77197n083096l481524R40004K573341Q44486o76207k92265
42558A886431L57481L3802k39084M59139J153019P86973L59822J579848L786839
42549A0164270L965867O53134l331220l684965M3499L699677L605633O71644j605610
42540A4181929j545147K0957K036974L880484M502920L492865K793617M585664
42532C3950263P022245N087416k685172j0822859j2759610q628721m367775l613423
42524C182364l783567j172353L067663M664590K451548l51653j080944p14263
$$ y = [4024001, 1310886, -571010, 14899, 2740312, 4859083, 4243852, 2068313, 901368, 1111788, 1297293, 1372483, 2296264, 3032778, 1325436, -1753694, -1680167, 3124173, 7838889, 7061692, 1978596, -1502928, -562924, 2010417, 2854903, 2178696, 1886431, 2243912, 2277714, 2038630, 2497769, 3650788, 4437761, 4797583, 6377431, 10164270, 14130137, 14783271, 11452051, 7767086, 7810585, 11510262, 15115895, 15787539, 14181929, 12636782, 12657739, 14694713, 18575197, 23078117, 26570982, 29364599, 33950263, 40972508, 46059924, 43374752, 32551893, 19792283, 11163562, 6795787, 3182364, -601203, -1773556, 1294107, 5958697, 8410245, 8058592, 6977648, 6263385]
42516F263385q30699m27121J697970L494400K089613j222017k220359j33035J144057
42507I856194o66428k628914j608318N79873M61701j170408q00687J604064K337798
42498G964875k5791k431101k324047j414474k377894m196425l457742O24955M850989
42489b786655N884194L903070J661635P75646K04936j356383k851475k052920
42481C382048R78059L402059L048178Q06853j187493k269833l025075l595478
42473A539318l482568k270735J82473L214570M603426K220063k599929n398115
42465a991497l709891J26284K630714L184222K589587O49148j970678k286364
42457g78475Q74322L592746J892346j874141k374996M64777J965177P47956L81869
$$ y = [6263385, 5432686, 5005565, 6703535, 10197935, 12287548, 11065531, 8845172, 8712137, 9856194, 9189766, 6560852, 4952534, 5532407, 5994108, 4823700, 4023013, 5627077, 7964875, 7939084, 5507983, 3183936, 1769462, -608432, -4804857, -8262599, -7637644, -2786655, 3097539, 7000609, 8662244, 9437890, 9642826, 8286443, 5434968, 3382048, 4360107, 7762166, 10810344, 11617197, 10429704, 8159871, 5134796, 1539318, -1943250, -4213985, -4031512, -816942, 3786484, 6006547, 3406618, -1991497, -5701388, -5575104, -2944390, 239832, 2829419, 3478567, 1507889, -778475, 95847, 3688593, 5580939, 3706798, 1331802, 1796579, 3761756, 4509712, 4891581]
42448D891581K367829L242835N54629l101188m304621l109531j040178J465749
42440I67105L495086L091794M55620j500560j624053k014579l194023j995961
42432b319571K890934P261336O865170L239660L71802j368219l777696n895692
42424G267724n179482k086519P38995K705301M748518N663682L232522j251264
42416A5839477l511637j768928J326302K550050J381883o62223j715456n94740
42408A2844728K012424L848155M124518M883508P198302Q000268M067487k315927
42400D4663463n777153n179851m151483m467525l851924j464089o36001l415524
42392A5719913o209107m559701K4326J951472n20365k951596j146210K884200
$$ y = [4891581, 7259410, 10502245, 11056874, 7955686, 3651065, 541534, -498644, 967105, 4462191, 7553985, 8009605, 6509045, 4884992, 2870413, -323610, -2319571, 571363, 7832699, 14697869, 17937529, 18309331, 16941112, 13163416, 7267724, 2088242, 1723, 740718, 3446019, 8194537, 13858219, 17090741, 15839477, 12327840, 10558912, 11885214, 14435264, 15817147, 15154924, 13439468, 12844728, 14857152, 18705307, 22829825, 27713333, 34911635, 42911903, 46979390, 44663463, 38886310, 33706459, 29554976, 25087451, 21235527, 19771438, 19135437, 15719913, 9510806, 4951105, 4975431, 6926903, 6406538, 3454942, 2308732, 5192932]
42384E192932L571643o25415m882275m125478M79189L367678J989612o13148r58359
42375C396379L69011R27322L39838l23021r42925j627136j346433J98951J054030
42366B046016n4662j081419O5527J458794k8248l244444m089564j514519J730151
42357d712368L739604M752146M150538O50091m031294n833012l594398j27695
42349e006388K390516M196182M612316J623557l540253n701177k172047L344513
42341b52781N653954M007091R63945j742191l496336l239983n78253K582308L531366
42332G429120J353713k657863n974501o016833k316607K164723L916269L095042
42324I93063K471527K620564J622189n05317j223845K9121R57279Q57932J469289
$$ y = [5192932, 8764575, 8139160, 3256885, -868593, -389404, 2978274, 4967886, 4354738, 3396379, 3765390, 4692712, 5032550, 4709529, 3766604, 2139468, 793035, 991986, 2046016, 1991354, 909935, 975462, 2434256, 2406008, -838436, -4928000, -6442519, -4712368, -972764, 3779382, 7929920, 8580011, 4548717, -1284295, -4878693, -5006388, -2615872, 1580310, 6192626, 7816183, 4275930, -1425247, -3597294, -252781, 5401173, 9408264, 10372209, 8630018, 5133682, 1893699, 1315446, 3897754, 7429120, 8782833, 6124970, 150469, -5866364, -8182971, -6018248, -2101979, 993063, 3464590, 6085154, 7707343, 7202026, 5978181, 6007302, 6964581, 7822513, 9291802]
42315I291802K379363P58502k653648k911990J187885M182277K312515q57081
42307A3689625j344196j496334m424124o935799m636628p7776J138816o30829
42299d717245r25762M18755j1000j692387o92212K926606N059604M684313M531807
42290I582479M792142K785574q03435k034375q27278j405253m448461n387368
42282B254025k321636P25042P96753K43342J287138K095084J343959J262713K678834
42273A0365254K182604j856173n123575l544247L26409J512510r7785j064546
42265B700451k88976O21812Q41698N71328l64063j231913O6953L391161M894568
42256A1203019K150295j989469l787416l893559m608430m893721k554286Q33403
$$ y = [9291802, 11671165, 12429667, 9776019, 6864029, 8051914, 12234191, 14546706, 13689625, 12345429, 10849095, 6424971, -510828, -5147456, -5225232, -4086416, -4717245, -5643007, -5224252, -5235252, -6927639, -7619851, -4693245, 366359, 5050672, 9582479, 14374621, 17160195, 16356760, 14322385, 13495107, 12089854, 7641393, 2254025, -67611, 657431, 1454184, 1697526, 2984664, 5079748, 6423707, 7686420, 10365254, 12547858, 10691685, 5568110, 2023863, 2350272, 3862782, 3764997, 2700451, 2411475, 3033287, 3874985, 4446313, 4082250, 2850337, 2917290, 6308451, 11203019, 13353314, 11363845, 7576429, 3682870, -925560, -5819281, -8373567, -7540164]
42248g540164J734396o2815j937468k633187k183511L33643M601280O561357L163305
42239B036836j740576j702645K789343M870967J676840j725160m29209L434331
42231I210727M647928J989533j512594k936101j670653J010927K732725J593668
42223A5066160j773271m591385m862543k991330p31009K25341p17189j808286
42215b183512P8192M975253P874090M555604j916732m711762k471487j10578m32555
42206E656513p36685P80136J194906j378276l260715p65479L473443M371157J844319
42197A1179319l04729q80985j693555k613790j372196J602368K767856Q54897
42189I539185j288001j654566k257997n067570p599746n692938N22438O235404
$$ y = [-7540164, -5805768, -5868583, -7806051, -10439238, -12622749, -12289106, -7687826, -1126469, 2036836, 296260, -1406385, 1382958, 6253925, 7930765, 6205605, 5776396, 9210727, 13858655, 15848188, 14335594, 11399493, 9728840, 10739767, 13472492, 15066160, 13292889, 8701504, 3838961, 847631, 116622, 341963, -375226, -2183512, -2105320, 2869933, 10744023, 15299627, 13382895, 8671133, 6199646, 6089068, 5656513, 4919828, 5699964, 6894870, 5516594, 2255879, 1490400, 4963843, 9335000, 11179319, 10874590, 9993605, 8300050, 5686260, 4314064, 5916432, 8684288, 9539185, 8251184, 6596618, 4338621, -728949, -8328695, -14021633, -13499195, -7263791]
42181g263791P435154M727842J442795k35476l49551K46959P91395M41324j180006
42172F056645k788714k128269J107827L999144L474203K01535k129716j351323
42164F441332Q82921J591558j54879k873841m527845m119737k260823n68607J16522
42155e473399P88360K562098M329462L885714J365605o37087r31355j370818l417195
42146A101385n233811m098127k44677L560246N165871M120327R39213k608230
42138B702197l537176n29467L505382M153257R74753j920553j291794J360127
42130E416726K431858R60509r89868j697536j529369j310418p86321L28546R75215
42121C799342k7297j787312k119364p84990p2148j148633j774045L74895L556482
$$ y = [-7263791, 171363, 4899205, 6342000, 6106524, 5756973, 6003932, 6795327, 7236651, 6056645, 3267931, 1139662, 2247489, 6246633, 9720836, 9922371, 7792655, 6441332, 7324253, 8915811, 8760932, 5887091, 1359246, -2760491, -5021314, -5589921, -5473399, -4685039, -2122941, 2206521, 6092235, 7457840, 6820753, 5889398, 4518580, 1101385, -4132426, -8230553, -8475230, -4914984, 250887, 4371214, 5310427, 2702197, -834979, -1364446, 2140936, 6294193, 7268946, 5348393, 4056599, 5416726, 7848584, 8809093, 7819225, 6121689, 4592320, 3281902, 2495581, 2824127, 3799342, 3772045, 1984733, -134631, -919621, -991769, -2140402, -3914447, -3539552, 16930]
42112A6930L877510P53759k471640l384731k883987k085799j89627K838014M324762
42103G95191K265464j126049j863606P27185L517450L539664O94407k882789m578716
42094A088201l018947N05035K781703J952334n97817k389247k642767j889003
42086d210508m06388J326203K060112J514398J366092K546669K977941M63490
42078G638009l266229m193012j224989K750066M691280L884072R85534k697662
42070H567069m876646l804137o80516J438876J421725Q65330J115928J693238
42062E740867J957431K091358J843821L73256j886470l010930k049423k07663
42054D852247J062558J714856K263676K647513K573198J995863R59777j74722
$$ y = [16930, 3894440, 4648199, 2176559, -1208172, -4092159, -6177958, -6367585, -3529571, 795191, 3060655, 1934606, 71000, 798185, 4315635, 7855299, 8549706, 5666917, 1088201, -1930746, -1425711, 1355992, 3308326, 2710509, 321262, -2321505, -4210508, -4616896, -3290693, -1230581, 283817, 1649909, 4196578, 7174519, 7638009, 4371780, 178768, -1046221, 1703845, 6395125, 10279197, 11264731, 8567069, 3690423, -113714, -794230, 644646, 2066371, 2931701, 4047629, 5740867, 7698298, 9789656, 11633477, 12006733, 10120263, 7109333, 5059910, 4852247, 5914805, 7629661, 9893337, 12540850, 15114048, 17109911, 18069688, 17894966]
42046A7894966n60157m1380J7296j379522k739398j830259Q35241K436170J593157
42037A6226114m82733k366511l559357l415708j604949K19952j08816j908718
42029B999274k439155j142788p141M58390J857236L773259L189857k21849k272844
42020F194239k99454K542719K226300L7929k5207K095675K671971J61601k711569
42011A2894204l053587j256801J85075l61693k274507l415027k411622m46272
42003a40230J80522o49953q21820L71836J005310K3293o72680O32795K653752
41994B582825L433848L260812L134867K511085Q65945n08114n10171L4238O62635
41985A5467970K545211M922478L604392l070848r504985q776271j677493M656050
$$ y = [17894966, 17334809, 17293429, 17310725, 15931203, 13191805, 11361546, 12196787, 14632957, 16226114, 15743381, 13376870, 9817513, 6401805, 4796856, 5016808, 4907992, 2999274, 560119, -582669, -589810, -131420, 1725816, 5499075, 8688932, 8467083, 6194239, 5894785, 8437504, 10663804, 10701733, 10676526, 12772201, 15444172, 15605773, 12894204, 9840617, 8583816, 8768891, 8407198, 6132691, 2717664, 306042, -140230, 40292, -609661, -1431481, -1059645, -54335, -31042, -703722, -70927, 2582825, 6016673, 9277485, 12412352, 14923437, 15789382, 15281268, 14771097, 14805335, 15467970, 18013181, 22935659, 26540051, 23469203, 13964218, 5187947, 3510454, 8166504]
41977H166504N753576K884002j420120n437037o315882j903543M496905O270222
41969A2494627J979299k607708k560181L90249K094973J950735J657500J162773
41961A6562267o79956l073217l911513k860095j724944j874728k503395j642411
41953a707992J249931L829726L059239m89062k362501j4772L222456K784577n18096
41944I053506k468975k448666l396779n231002m033208J009299N083883M378465
41936A946523R53999j312981j787545j608578p10332R53189K046732K035708K090070
41927D606785K119359K17846l033747l587851L3922L443674K425162j076056k635556
41918B513538j967781j744959k215249j385065Q28829K486058K774754K273641
$$ y = [8166504, 13920080, 16804082, 15383962, 9946925, 3631043, 1727500, 6224405, 12494627, 14473926, 11866218, 9306037, 9696286, 11791259, 13741994, 15399494, 16562267, 15882311, 12809094, 8897581, 6037486, 4312542, 2437814, -65581, -1707992, -458061, 3371665, 6430904, 5941842, 3579341, 3564569, 6787025, 9571602, 9053506, 6584531, 4135865, 739086, -4491916, -8525124, -7515825, -2431942, 1946523, 2900522, 1587541, -200004, -1808582, -2518914, -1565725, 481007, 2516715, 4606785, 6726144, 6943990, 3910243, 322392, 356314, 3799988, 6225150, 5149094, 2513538, 545757, -1199202, -3414451, -4799516, -3970687, -1484629, 1290125, 3563766]
41910C563766J184519j33219m05062L57386p3705k335560l300454p52272K570097
41901F75496L235328K510586L139034L569266P37330l492259m505280k276291
41893C593210o26964l6099K416850N966644N769143R22355l306591l412038k253392
41884I033118l102368m208515k691040K85144J850732J844649J602678R21583
41876E535981o98866j880567j205871L89442J188490J008628L20056q71071j614493
41867B171729J06859M051888O536242M874070J135791p40350L6849J013246m4857
41858A9141467l269938o788249p478941l698838J533875K783626p16085l387176
41850a880259j095289K857845L093216L86493k86699J926880K813381L08056k304293
$$ y = [3563766, 4748285, 4615066, 4210004, 4567390, 4493685, 2158125, -1142329, -1894601, 675496, 3910824, 6421410, 9560444, 13129710, 13867040, 10374781, 5869501, 3593210, 2966246, 2930147, 5346997, 11313641, 17082784, 18005139, 14698548, 11286510, 9033118, 5930750, 1722235, -968805, -683661, 1167071, 3011720, 4614398, 5535981, 4837115, 2956548, 1750677, 2140119, 3328609, 4337237, 4657293, 3786222, 2171729, 2278588, 6330476, 12866718, 17740788, 18876579, 18136229, 18173078, 19186324, 19141467, 15871529, 9083280, 1604339, -2094499, -560624, 2223002, 1506917, -1880259, -2975548, -117703, 2975513, 3362006, 3075307, 5002187, 7815568, 8123624, 5819331]
41841E819331j567172J548939L807892L742126K015926k57094k175779l163881
41833I770288l165964k179000p2386K105787J936373j151180l666936k009770
41825A567212K091098L553347J203813q75833M2200J535819O63090j410288k168036
41816F202422k078852k897325l880149l174690j403402l85354M65979K694072
41808d457299M582055K747889j815539l772492r21593K451398J964718q42959
41800f3822k078285j822580k492200k978475J55893N748723P639285K995756l105296
41791C998999m139864k42249L145216K692026N7010j621929j124472Q40332K723217
41782F328286K973153J274407r56109k205319k506638k590393k419739j814910
$$ y = [5819331, 4252159, 5801098, 9608990, 13351116, 15367042, 15109948, 12934169, 9770288, 6604324, 4425324, 4352938, 6458725, 8395098, 7243918, 3576982, 1567212, 3658310, 7211657, 8415470, 7539637, 7581837, 9117656, 9780746, 8370458, 6202422, 4123570, 1226245, -2653904, -5828594, -7231996, -7617350, -7151371, -4457299, 124756, 2872645, 1057106, -2715386, -3636979, -1185581, 779137, -63822, -2142107, -3964687, -6456887, -9435362, -9279469, -3530746, 4108539, 7104295, 3998999, -140865, -383114, 2762102, 5454128, 5511138, 3889209, 2764737, 3605069, 6328286, 9301439, 10575846, 9619737, 7414418, 4907780, 2317387, -102352, -1917262]
41774a917262j385659j327170n20536J396949K447455J046634r56034o64030J424828
41765d54825K336680J291407K67809K79380M20787N58138J527504K431403J255881
41756I914164j313099k217740q40367J31536n42454r27084q2066J60351p47817
41747C535424l85957K122518L960092L396660K595395K884192J654172k452207
41739A7310289n632276m633403k365166k709178l460123n48826L653415L277586
41731D892318j333138l942294k050599O16046J551866K552094M048330K982704
41723I317327j204376m185540l268941j321432j140280p59855J831430L578922
41715B847255P40691m350479n659431j399927M150174O218789M060971L07498
$$ y = [-1917262, -3302921, -4630091, -5150627, -3753678, -1306223, -259589, -1215623, -1879653, -454825, 1881855, 3173262, 3441071, 3720451, 4141238, 4699376, 6226880, 8658283, 9914164, 8601065, 6383325, 5542958, 5674494, 5132040, 4204956, 4122890, 4283241, 3535424, 3149467, 5271985, 9232077, 12628737, 15224132, 18108324, 19762496, 17310289, 11678013, 7044610, 4679444, 1970266, -1489857, -2038683, 1614732, 4892318, 3559180, -383114, -2433713, -1817667, -265801, 2286293, 6334623, 9317327, 8112951, 3927411, 658470, -662962, -1803242, -2563097, -731667, 2847255, 3587946, -762533, -6421964, -7821891, -3671717, 2547072, 6608043, 6915541]
41707F915541j939383j444002M43322J640757K002850K711467L204050J562694
41699A5097296j446030k301453l29775L80833k661933n662169l984255N23734
41691c83752K197971j49423k357468j700478J02272J065632J914946L491591M439534
41682H620825L387125J381737M34188Q03927R23966n94195l352029n065477l398367
41673C141700J115874M571844L679346j31940k464075j640311l72578j260995
41665F638865k996163k596239P4809K043035J241068p87508q73403J723840M226306
41656H694610L686554O95992j424447r82444K20361N3310p09104P435J922418
41647A2164685K552186P80330j671751k641314j919345q43810o35194j533487
$$ y = [6915541, 4976158, 3532156, 3975478, 5616235, 7619085, 10330552, 13534602, 15097296, 13651266, 11349813, 11020038, 11400871, 8738938, 3076769, -907486, -383752, 1814219, 1664796, -692672, -2393150, -2290878, -1225246, 689700, 4181291, 8620825, 12007950, 13389687, 13823875, 14627802, 15551768, 14957573, 11605544, 6540067, 3141700, 4257574, 8829418, 12508764, 12376824, 9912749, 8272438, 7899860, 6638865, 3642702, 1046463, 1121272, 3164307, 4405375, 3617867, 2744464, 4468304, 8694610, 12381164, 13077156, 11652709, 10670265, 10890626, 10943936, 10234832, 10242267, 12164685, 14716871, 15497201, 13825450, 11184136, 9264791, 8420981, 7785787, 6252300]
41639F252300k738439k939165j567610M23825J636864J849569J800112J739964
41631F457420J293954N09591k09723j117120k667206l949144l187440m27509J766125
41622a531052J416020j58616j93489J586504K683950J636569K20294O46936K018530
41613H325646J762453O4521l5045K200133L031855l29125m575802m285029K75248
41604F434855L709250L609385L095931M098381L462503j092775n670186n446131
41596A2201213k164674j273432l423795m221812j862246L58346o6022j083859
41588a536281Q4067K814733M579500M022446J225566k737199n407063m460371
41580a414602p71776K150503K618439K328065K751051K838578J679112O27185
$$ y = [6252300, 3513861, 574696, -992914, -569089, 1067775, 2917344, 4717456, 6457420, 7751374, 8260965, 8051242, 6934122, 4266916, 317772, -2869668, -3297177, -1531052, -115032, -273648, -467137, 1119367, 3803317, 5439886, 5660180, 6307116, 8325646, 10088099, 10152620, 10117575, 12317708, 15349563, 15020438, 10444636, 6159607, 6434855, 10144105, 13753490, 16849421, 20947802, 24410305, 23317530, 17647344, 12201213, 10036539, 8763107, 5339312, 1117500, -744746, -386400, -452422, -1536281, -1452214, 1362519, 5942019, 9964465, 11190031, 8452832, 3045769, -1414602, -2186378, -35875, 2582564, 4910629, 7661680, 10500258, 12179370, 12806555]
41572A2806555Q55541J137928J20597j250553j638019j689953k247421j966670
41564F128005O22148L891764M654781K403338k68156j258883j080184j386958
41556A3705855k828225m454182m519755k228743R21223K489151K174474J993043
41548G252841K750866K580463M18800j481721q90484N98145J33615j482677j008418
41539H871430J704036L079090J183213j535653k071621q89742n22393j785489
41531H032871l043987k598342p16336P13365M08443n22330J23931K193842K698779
41522G290236K01495k176782p62874K909684L745371K10324l733107m366817k491668
41513H25862p54067J47660P05121O05423k63013n66874O73081K306360K637598
$$ y = [12806555, 13662096, 14800024, 14920621, 13670068, 12032049, 10342096, 8094675, 6128005, 6750153, 10641917, 15296698, 17700036, 17431880, 16172997, 15092813, 13705855, 10877630, 6423448, 1903693, -325050, 596173, 3085324, 5259798, 7252841, 10003707, 12584170, 13002970, 11521249, 10630765, 11228910, 11362525, 9879848, 8871430, 10575466, 13654556, 14837769, 13302116, 11230495, 10340753, 9818360, 8032871, 4988884, 2390542, 1674206, 2387571, 2796014, 2273684, 2397615, 4591457, 7290236, 7491731, 5314949, 4552075, 7461759, 11207130, 11417454, 7684347, 3317530, 825862, 71795, 219455, 924576, 1529999, 1266986, 700112, 1373193, 3679553, 6317151]
41504F317151J538368j81589j866527k355563m38796K430529K421757j290971
41496F574359l930835j183384M153377N616834J978839j811225k337958j537504
41488G522503j724727j429300J213428M299145M611846K329332L99638L14856
41480A7536721Q77755N30846r15038k412380k394938k36479K177989J915662q67972
41471A6212166k407766p04611J101282m18409l121321k402733J249987K739448
41463A2248043L38679j902488r65967P60690K79567j162214j315361j445648l538573
41454C296728n597728m243444m70738J677895J418003J743557L722688M700492
41446F247453K969123K26279j861496l831947n562997m880904j368705J543565
$$ y = [6317151, 7855519, 7673930, 5807403, 3451840, 3013044, 5443573, 7865330, 6574359, 2643524, 1460140, 5613517, 11230351, 13209190, 11397965, 9060007, 7522503, 5797776, 4368476, 5581904, 9881049, 14492895, 16822227, 17221865, 17536721, 18414476, 18945322, 18030284, 15617904, 13222966, 12986487, 15164476, 17080138, 16212166, 13804400, 13099789, 14201071, 13782662, 10661341, 8258608, 9508595, 12248043, 12586722, 10684234, 9718267, 10478957, 10758524, 9596310, 8280949, 6835301, 3296728, -2301000, -6544444, -7015182, -5337287, -3919284, -2175727, 1546961, 6247453, 9216576, 9442855, 7581359, 3749412, -1813585, -6694489, -8063194, -6519629]
41438f519629J073596q41666q72007N91918J021942O12249J585363L565461L856926
41429D074153K430009K439218M593965M908253N05326n219204o471824k597370
41421D662526J537099K244043Q58273K13188K74247o33724k096266j966079j17500
41412D975807Q72471m41793k129230j910920n34434m4862j45684R74925K918233
41403D534513L325398J961278J285365K074918J784212r80194l424370k616145
41395G944975q6091P54982j13883k25726M76699k96655k480690l066847r47309
41386A959455J237699J371498P60746J006815Q66296j336408m246069n082729
41378c462697l463345j216882O79963K491974L522595K211162j018614l119057
$$ y = [-6519629, -5446033, -6287699, -7159706, -6567788, -5545846, -4933597, -3348234, 217227, 4074153, 6504162, 8943380, 13537345, 18445598, 18950924, 13731720, 7259896, 4662526, 6199625, 8443668, 9301941, 9515129, 9789376, 9155652, 7059386, 5093307, 4975807, 5848278, 5406485, 3277255, 1366335, 831901, 787039, 641355, 1616280, 4534513, 7859911, 9821189, 11106554, 13181472, 14965684, 13985490, 10561120, 7944975, 7858884, 8613866, 8499983, 8274257, 8750956, 8454301, 5973611, 2906764, 1959455, 3197154, 4568652, 5329398, 6336213, 7202509, 5866101, 1620032, -3462697, -6926042, -8142924, -7462961, -4970987, -1448392, 762770, -255844, -3374901]
41370c374901j806780J611254L909868L651367K029723M53477j135900k949934
41362B388174l619072j328427L386579P348706P793820M875187P74565k574447
41354A9045085m233526l944697k241210k47644J371806K492061K308272r1449
41346A4458698l039514k760687J321698M241365J686087l449314m770215j328239
41338F359879J861675J767806N90485N04012M96223N7815R17378K776174K203696
41329A7535143j331932l186488q60777J258884r60182m150832l139931j600m43577
41320D718708l700301l692859O63431L957237L463298K483287L078165K506445
41312A3477411n19995k435180j130894j05669k330005m814867l745442r43961
$$ y = [-3374901, -5181681, -3570427, 339441, 3990808, 6020531, 6474008, 5338108, 2388174, -1230898, -2559325, 827254, 8175960, 15969780, 20844967, 21619532, 19045085, 14811559, 10866862, 8625652, 8378008, 9749814, 12241875, 14550147, 14458698, 11419184, 8658497, 9980195, 14221560, 15907647, 12458333, 7688118, 6359879, 8221554, 9989360, 10579845, 11083857, 11580080, 11637895, 12555273, 15331447, 17535143, 16203211, 13016723, 12155946, 13414830, 12454648, 8303816, 5163885, 5162285, 4718708, 1018407, -2674452, -2011021, 1946216, 5409514, 7892801, 10970966, 13477411, 12957416, 10522236, 9391342, 9285673, 6955668, 2140801, -1604641, -2548602]
41304b548602m16708j720099j698915l23072J55767L9944J313250L138135K893643
41295H33343J035074N14123J659694J858223M01455l79391O89173J912189J883913
41286A0407796J164109K82144q00752q56408J522226M326555L349641j678048
41278A7717263n733547n110614k066102n95858p10007M5149J769425K451683J745180
41269I512572J185076J120254L07022j399189k357984j602920k50679O4396r40306
41260E638242k127152j963800K64191L525575N594423N167775L002167N27276
41252A9628697j637873l025752k592961j57274K469504L421990L005011K412932
41244B3524274J408404n84347k186117j707526n03309j401007l720011l508739
$$ y = [-2548602, -2965310, -4685409, -6384324, -6707396, -6551629, -6511685, -5198435, -2060300, 833343, 1868417, 2382540, 4042234, 5900457, 6301912, 5922521, 6611694, 8523883, 10407796, 11571905, 11854049, 11053297, 10196889, 11719115, 16045670, 19395311, 17717263, 11983716, 6873102, 4807000, 4211142, 3501135, 3546284, 5315709, 7767392, 9512572, 10697648, 11817902, 12124924, 10725735, 8367751, 6764831, 6514152, 6578548, 5638242, 3511090, 1547290, 1811481, 5337056, 10931479, 16099254, 19101421, 19628697, 17990824, 14965072, 12372111, 12214837, 14684341, 18106331, 21111342, 23524274, 24932678, 24348331, 22162214, 20454688, 19951379, 18550372, 14830361, 11321622]
41236A1321622K43313L294638K123446r28537j326373J231676L340960L232685
41228B2533430K100484R44661m00854j237017l20855J376990J257958q37676j965392
41219B3451729m52462J749468K311092J512895N12823p23142j861247j213189
41211B5287967J204986K082413n95703l465366k074429K276974M380223K997019
41203C2094084J829540K270379Q11073m006317p145242l773395K910053N376126
41195C0366301J731573k635248l035618q11500K16071q38115j934046j538081
41187B1521337j90318O49792K79184n57337n39545M12692Q21252j03838r08911
41178B1384308o4629J224209N36851j766042k505385j35327K824036K774750p95350
$$ y = [11321622, 11564935, 14859573, 16983019, 16054482, 14728109, 15959785, 19300745, 22533430, 24633914, 25578575, 25177721, 23940704, 23619849, 24996839, 26254797, 25417121, 23451729, 22999267, 24748735, 27059827, 28572722, 29085545, 28362403, 26501156, 25287967, 26492953, 28575366, 27979663, 24514297, 22439868, 24716842, 29097065, 32094084, 33923624, 36194003, 37005076, 32998759, 25853517, 22080122, 24990175, 30366301, 32097874, 29462626, 26427008, 25615508, 25831579, 24993464, 23059418, 21521337, 21331019, 21980811, 22259995, 21702658, 21163113, 21575805, 22397057, 22293219, 21384308, 21319679, 22543888, 23080739, 21314697, 18809312, 18673985, 21498021, 24272771, 23477421]
41169B3477421m821201n570210k088013K371202L038079q32022m249708k619763
41161H705785J721888K703361m42107k162071O12708L937183L612371J586089
41153B0275207J708497L114915K717992J364464K027721L606378K213040j897271
41145C5130943m058225k065193J593940M835612Q441654J2689269J6483564K0723671
41137I3775235K6791456K9997770K1460586Q82462j8463530k3674583j7059562
41130A13709834j0571305r015200p051539j323168M003618N645238O674803R846367
41122A11918648J2972400J6203133K6345091M4813858N5915769L9534454k460173
41115C05243180m2394869n4760869m1541778k4202925j6864202j6113444j3860084
$$ y = [23477421, 18656220, 13086010, 10997997, 13369199, 16407278, 15575256, 11325548, 8705785, 10427673, 13131034, 12688927, 10526856, 11139564, 15076747, 18689118, 20275207, 21983704, 25098619, 27816611, 29181075, 31208796, 34815174, 37028214, 35130943, 31072718, 29007525, 30601465, 35437077, 43878731, 56568000, 73051564, 93775235, 120566691, 150564461, 172025047, 172907509, 154443979, 130769396, 113709834, 103138529, 94123329, 87071790, 85748622, 89752240, 95397478, 102072281, 111918648, 124891048, 141094181, 167439272, 212253130, 268168899, 307703353, 305243180, 262848311, 208087442, 166545664, 142342739, 125478537, 109365093, 95505009]
41108I5505009q916322l504993K525438Q583296J0706143Q284326Q661178J7328934
41100A39173009K6041620J9628619m064510k8452157l5853114k5777292j2045844
41093G8650331o120082q137381j1829801j2602404j0075163o123042k273435J350629
41085B2839652M669560N866529K985168k330647n464668m567345k818032l014284
41077A8165933l159023o03677K412833J839636j410439k702619r77218J82699
41069A3748125j012488j986335q97086J57778q63318k359147j948938j63459J095136
41060E770268J564500J892926J772813Q60450K1053r0787k52167j052599j682569
41051H803888j666255j925141k676763k372791m61375R63778L34737o94905p7459
$$ y = [95505009, 86588687, 83083694, 85609132, 94192428, 104898571, 113182897, 121844075, 139173009, 165214629, 184843248, 180778738, 152326581, 116473467, 90696175, 78650331, 72530249, 64392868, 52563067, 39960663, 29885500, 23762458, 21489023, 22839652, 27509212, 33375741, 36360909, 34030262, 28565594, 23998249, 21180217, 18165933, 15006910, 14403233, 16816066, 18655702, 17245263, 14542644, 13565426, 13748125, 12735637, 10749302, 9852216, 10009994, 9146676, 6787529, 4838591, 4675132, 5770268, 7334768, 9227694, 11000507, 11860957, 11882010, 11791223, 11539056, 10486457, 8803888, 7137633, 5212492, 2535729, 162938, -298437, 665341, 1000078, 305173, 227714]
41042B27714J182460J128887M50850Q29697J392874M29538o43648Q75399L755583
41033I629354L804521L53419k442334j798678J42634N38260p6414j66610l66789
41024I617363j388609j425997R49920L189839J816596j924295l406938j556334
41016E871545l51236k199750l711455r22224M027576N493579K610435M98343K299256
41007A3616069M285102J783933l197634m648810j413732J605006J352650N79417
40999A3962001J894661K689759j69910m155283m494135j711737m63446j651361
40991E900549j231190K510648N742218N020191K005138k18439j621113k968248
40983A5139754k549519Q56339M102040L109657r29524k926522j162330P96147
$$ y = [227714, 1410174, 2539061, 2989911, 3819608, 5212482, 5642020, 4998372, 5873771, 9629354, 13433875, 13787294, 11344960, 9546282, 9688916, 10227176, 10150762, 9984152, 9617363, 8228754, 6802757, 7752677, 10942516, 12759112, 10834817, 7427879, 5871545, 5520309, 3320559, -390896, -1313120, 2714456, 8208035, 10818470, 11316813, 13616069, 17901171, 19685104, 16487470, 11838660, 10424928, 12029934, 13382584, 13962001, 15856662, 18546421, 18376511, 14221228, 9727093, 8015356, 7551910, 5900549, 4669359, 7180007, 12922225, 17942416, 19947554, 19729115, 18108002, 15139754, 12590235, 13446574, 17548614, 20658271, 19728747, 16802225, 15639895, 16436042]
40975A6436042K55j806356j686139j77506N0251j327933j836734j10218J835806
40966A1377468J184665j827762l913489k662938M98627J985742J87652k948235
40958C881730m273466k496844J005511L498656L070861M51728j539126j348458
40950B250592p93148k085191l625692j780661L077773N932240L832781j78485
40942F630209j895418j406050r68980n76050O73512J254067m75499k384984j423494
40933e72687J001402J289735K75086J991545N844736O158465J066303l940991
40925A3113594m027833j397494k51837j61677J035093J638784j097739m887936
40917C962955m757075n93155K691606K446247J089957J079030J373561L61909
$$ y = [16436042, 16436297, 14629941, 12943802, 12766296, 12816547, 11488614, 9651880, 9541662, 11377468, 12562133, 10734371, 6820882, 4157944, 4656571, 6642313, 6829965, 3881730, -391736, -2888580, -1883069, 1615587, 4686448, 5138176, 3599050, 2250592, 1457444, -627747, -4253439, -6034100, -2956327, 2975913, 6808694, 6630209, 4734791, 3328741, 2359761, 1783711, 2457223, 3711290, 3235791, 850807, -572687, 428715, 1718450, 1993536, 3985081, 9829817, 15988282, 17054585, 13113594, 9085761, 7688267, 7436430, 7274753, 8309846, 9948630, 8850891, 3962955, -794120, -1387275, 1304331, 3750578, 4840535, 5919565, 7293126, 7655035]
40909G655035j167430j859122k039036k252840j500763J101700M033222M491328
40901H462094J565433k579150m589766k864436R93933L685812L467768J411888
40893I553576q15852k954924m744935m319761n40112L971682N019037J991131
40885G159842j705054l307738l029950j635545R73354L710750L995002J275881
40877G436542j544918j946760p79651K71578J584582L479136L609324m7221m865541
40868G197071n889285k338674J356204J475709p91964j993459q55303J462780
40860c76921L867834N980801O721046M281199j406689o970091p990966l788951
40852C17262J279334K553768K89136j575832j070697J47396P60657J850240L612537
$$ y = [7655035, 6487605, 4628483, 2589447, 336607, -1164156, -62456, 3970766, 8462094, 10027527, 7448377, 2858611, -5825, 988108, 4673920, 8141688, 9553576, 8737724, 5782800, 1037865, -3281896, -3822008, 149674, 5168711, 7159842, 5454788, 2147050, -882900, -2518445, -1545091, 2165659, 6160661, 7436542, 5891624, 3944864, 3165213, 3436791, 5021373, 8500509, 12109833, 12062612, 7197071, 1307786, -1030888, 325316, 1801025, 1009061, -984398, -1839701, -376921, 3490913, 9471714, 16192760, 20473959, 19067270, 12097179, 4106213, 317262, 1596596, 4150364, 4439500, 2863668, 1792971, 1940367, 2701024, 4551264, 8163801]
40843H163801L523324L92713k611856k250272j90104R063j102671l77148J625246
40834G182096R88106k797534n431899m267977j638608j42484J045285K983208
40826b079807M192068L858530M092595N704531N151928k35024o630349p889829
40818F164643l795468K92853J061225P2394p13133j691936l023211l062131r61494
40809e656258J645590K727614J827943l36152k223486j583739K166359N774894
40801D342765N392377K009017J08431O40596j52207l534369m970545j260879L298558
40792E873744K477222k915537o424426m716225l70819L076600M309991K917289
40784D227839m76409k597720n46283L050539K595230j737473l053850K087028
$$ y = [8163801, 11687125, 12079838, 9467982, 7217710, 7027606, 7036669, 5933998, 5556850, 7182096, 8170202, 5372668, -59231, -4327208, -5965816, -6108300, -5063015, -2079807, 2112261, 5970791, 10063386, 15767917, 20919845, 20684821, 14054472, 6164643, 2369175, 2662028, 3723253, 3795647, 3082514, 1390578, -1632633, -4694764, -5656258, -4010668, -1283054, 544889, 208737, -2014749, -3598488, -1432129, 4342765, 9735142, 11744159, 11852590, 12493186, 12340979, 8806610, 3836065, 2575186, 5873744, 8350966, 5435429, -988997, -5705222, -6076041, -2999441, 1310550, 4227839, 3751430, 1153710, 607427, 3657966, 6253196, 4515723, 1461873, 3548901]
40776C548901P716120O687054P06699l016864k295126j155973j719292j227059
40768I244460J821460M039257K233921j654507l566010k728381j373401q74550
40760G142249p01243p4346J393275L734243N629813M657135N08056l243513k982980
40751A6062689O6212J318105j078438m130284m219674j089822K977884N761537
40743A5668209N872012K961962j209704l257888j553592J409821J587725j788477
40735A9690068n257404n218552j878811J537651K780410K570793K459019K017758
40727A8700932l93591m435032p190400o416571k971528P84921L447222M328716
40719E854669K732876m95832k344314j206115K24020j226146l620596k260718
$$ y = [3548901, 11265021, 17952075, 18658774, 15641910, 13346784, 12190811, 10471519, 9244460, 11065920, 15105177, 17339098, 15684591, 12118581, 9390200, 8016799, 7142249, 6441006, 6366660, 7759935, 11494178, 17123991, 21781126, 22289182, 19045669, 16062689, 16128901, 17447006, 16368568, 12238284, 8018610, 6928788, 9906672, 15668209, 21540221, 24502183, 23292479, 20034591, 18480999, 19890820, 21478545, 19690068, 14432664, 9214112, 7335301, 8872952, 11653362, 14224155, 16683174, 18700932, 18307341, 13872309, 6681909, 265338, -2706190, -1921269, 1525953, 5854669, 8587545, 8091713, 5747399, 4541284, 4765304, 3539158, -81438, -2342156]
40711b342156K662499N569752L682319Q31220Q23895J674862J3697k681712k835829
40702G398547r87311k90738o12255O61218K728924J671933k858848o069515m568386
40693b926431o12237J848299K096208J772737J745113J811911J715673J011201
40685H462474o29018k253004k426201j474540q56271k65449J831180M482195M554132
40676A1425498J810307Q9957J602434L433652K136669j200085l218768l025268
40668A3054396j740916L68585L169101M917179M340262K903969K176067P89007
40660B9977650k708847n788595m683807j77195L252163L506250K373629J407940
40652B7159188K25786j048209j460049j694534l199759m473818k205170L001937
$$ y = [-2342156, 320343, 5890095, 9572414, 10403634, 11227529, 12902391, 12916088, 10234376, 7398547, 6411236, 6120498, 5508243, 6169461, 8898385, 10570318, 7711470, 1641955, -2926431, -3538668, -1690369, 405839, 2178576, 3923689, 5735600, 7451273, 8462474, 7833456, 5580452, 3154251, 1679711, 823440, 557991, 2389171, 6871366, 11425498, 13235805, 13325762, 14928196, 18361848, 20498517, 19298432, 16079664, 13054396, 11313480, 11682065, 14851166, 19768345, 24108607, 27012576, 29188643, 29977650, 27268803, 21480208, 16796401, 16619206, 19871369, 23377619, 25751248, 27159188, 27384974, 26336765, 24876716, 23182182, 19982423, 15508605, 13303435, 16305372]
40644A6305372O131140M552731J496395P00412J247031M24025j465178k463125
40636B6928803k766599l696561m447851l264577r29208N3587p45365j525804j547882
40627H058543j742806k064715j151725P43916J158976r80697l260160k908324
40619b146992n52925R58336N47620k87639m18437p52671k234533l758666l450928
40610a2096835j206750J496797L834004N956561P161801N844580K111519j364446
40602A1737231k396648j755365j280063j136148p13526o20293j360870j334772
40594A139546R29213L416424K836992j20602j379408L16325J569881p5161k305846
40585F327364j857638P33210K557946K327995P66659j054789j756340K420L079753
$$ y = [16305372, 22436512, 26989243, 28485638, 29186050, 30433081, 30857106, 29391928, 26928803, 24162204, 20465643, 16017792, 12753215, 11824007, 11877594, 11132229, 9606425, 8058543, 6315737, 4251022, 3099297, 3843213, 5002189, 4021492, 761332, -2146992, -2699917, -1741581, -1193961, -1481600, -1900037, -2652708, -4887241, -8645907, -12096835, -13303585, -11806788, -7972784, -2016223, 5145578, 10990158, 13101677, 11737231, 9340583, 7585218, 6305155, 5169007, 4455481, 3835188, 2474318, 1139546, 2068759, 5485183, 8322175, 8201573, 6822165, 7138490, 8708371, 8633210, 6327364, 4469726, 5202936, 7760882, 10088877, 10855536, 9800747, 8044407, 8046827, 11126580]
40576A1126580L712303K10927l948042m271361r69038K076337K623673J502640
40568A2064019r1181j594042j960074n35675J134648R84918k90845j82607J558561
40559A1087722K416010Q55714j813015l598298l668064j829775J590259M876186
40551I916739N870257M325194J887869k19222j915274l050453l486821m063908
40543I264381n282081n391003k381215K262046M636083L423399R72958p61286
40535F743282k037002k553729p38541K595461L478081J41510l653361l342513
40527F33188N46044L794815L897710J480014j899909m448278l910709K40151M791938
40518E124964N534598J997617k353885m245541l167655m56348K113055K979478
$$ y = [11126580, 14838883, 15049810, 11101768, 6830407, 5861369, 7937706, 10561379, 12064019, 11972838, 10378796, 8418722, 7883047, 9017695, 10002613, 9711768, 9529161, 11087722, 13503732, 14359446, 12546431, 8948133, 5280069, 3450294, 5040553, 9916739, 15786996, 20112190, 22000059, 21780837, 19865563, 16815110, 13328289, 9264381, 3982300, -1408703, -3789918, -1527872, 3108211, 6531610, 7504568, 6743282, 4706280, 2152551, 1414010, 4009471, 7487552, 7629062, 3975701, 633188, 1179232, 4974047, 8871757, 10351771, 8451862, 4003584, 92875, 333026, 5124964, 10659562, 12657179, 10303294, 6057753, 2890098, 2433750, 4546805, 7526283]
40510G526283J822844r332j184642j873813k384619j582494J252160L943471L431258
40501A0941116J03711k322743j496126J135631K893890K800859J458297l2561
40493A5482074l76665Q84966J997748N09647l048274n052939l613582j404689
40485E378286j643774k959237j266381L692997O921073M398696j607439n379323
40477G534898m492408j528407K61339M20512R2220q9367L68877K124877M075048
40468H767589L141686j316487m566338j768348M518737O674414K513390j491633
40460A6473010K16599M222624L820700p56640l260586j000186K145469K425257
40452B4286247Q08245m82036j652494l204852l370586n94022L211083M433598
$$ y = [7526283, 9349127, 9339795, 8155153, 6281340, 3896721, 2314227, 3566387, 7509858, 10941116, 11044827, 8722084, 7225958, 8361589, 11255479, 14056338, 15514635, 15482074, 15105409, 15990375, 17988123, 18497770, 15449496, 10396557, 6782975, 5378286, 3734512, 775275, -491106, 3201891, 10122964, 14521660, 12914221, 7534898, 3042490, 1514083, 1775422, 2195934, 2288154, 2198787, 2567664, 4692541, 8767589, 11909275, 10592788, 6026450, 4258102, 8776839, 15451253, 17964643, 16473010, 16689609, 20912233, 24732933, 23976293, 20715707, 19715521, 21860990, 24286247, 25094492, 24612456, 22959962, 19755110, 16384524, 15790502, 19001585, 23435183]
40444B3435183K029186j611576l422244k204707Q38822L170398L034460J001722
40436B6271244j070427k317996k909512k352885k5990K447575K044289j360387
40428B0725911l971028k951399k34358M97475j096786k243365j230786R99085
40420A0494749K919506L962784M050744L298255K437451K371851L031778L325727
40412C5892845K326821K81240j345989r90453J068389K210417M04163k565228
40404C7282205l013223p40455M26081j387875k871740o53710L252855M412567
40396C6706705K179532p38978l165436n645145o874513m754549r82363J98904
40388A6924157j417441j444016J609081L273519L78940l164608k089226J972264
$$ y = [23435183, 25464369, 23852793, 20430549, 18225842, 19064664, 22235062, 25269522, 26271244, 25200817, 22882821, 19973309, 17620424, 17594434, 20042009, 22086298, 20725911, 16754883, 13803484, 13569126, 14066601, 12969815, 10726450, 9495664, 10494749, 13414255, 17377039, 21427783, 24726038, 27163489, 29535340, 32567118, 35892845, 38219666, 38500906, 37154917, 36164464, 37232853, 39443270, 39847433, 37282205, 34268982, 33528527, 33954608, 32566733, 29694993, 29041283, 32294138, 36706705, 38886237, 38147259, 34981823, 29336678, 22462165, 17707616, 16725253, 16924157, 15506716, 14062700, 15671781, 18945300, 19324240, 16159632, 14070406, 16042670]
40380A6042670K987739l87479l389208k653880l85385J40449p07713q61287m69172
40371A0316734j171144k715494k752280k8483L645812N092620L055806l77852
40363A5065719j848182m54777J149819K41780k114949k453226J5509K119091J403033
40354A3123817m14530o86726m20316k396448n683299n922537j745752K661021
40346a484770L165754R00022n39791m68393l97302L8739K177825M169760K468226
40337A0030070j946369l550366l18628K613533M05726m065939m443076j09765
40329a384814L513465K846773j71598k186121k125140l10741K438603L881565
40321F501992J803083k399509m385579k300978J040744K420506J903548J069449
$$ y = [16042670, 19030409, 18642930, 15253722, 12599842, 12214457, 12354906, 11647193, 10785906, 10316734, 9145590, 6430096, 3677816, 3649333, 7295145, 12387765, 15443571, 15065719, 13217537, 12762760, 13912579, 14154359, 12039410, 9586184, 9601693, 11720784, 13123817, 12709287, 12022561, 11602245, 9205797, 3522498, -2400039, -4145791, -1484770, 1680984, 2581006, 2041215, 1572822, 1175520, 1214259, 3392084, 7561844, 10030070, 8083701, 4533335, 4214707, 6828240, 7233966, 3168027, -1275049, -1384814, 2128651, 4975424, 4803826, 2617705, 492565, 181824, 2620427, 6501992, 8305075, 5905566, 1519987, -780991, 259753, 2680259, 4583807, 5653256]
40313E653256M23128J72695R23610J852988P76798k113763l249637n58319L267371
40304G148127M716241L993043K968258J514680p08779j589598Q7070Q99445k629120
40295A6399367p257592o514619o31909K920304o5232m957386n446867j632094
40287g186028K039136L220024K628288J144452o29858j392281n04252O04746L69392
40278B93619o72588j186582j170844j082005l40857J359838K568189J887381K31072
40269A887223n59319l54278k77699o54250j134175j795373k367440j515536J132950
40260e637897L328459K757174M43308o13362M33061J696573J601797L38901j270367
40251C077647k148456o49374L607197P619027P273735K262959l302677n612886
$$ y = [5653256, 6076384, 6249079, 7172689, 9025677, 9802475, 7688712, 4439075, 3880756, 7148127, 11864368, 15857411, 18825669, 20340349, 19631570, 18041972, 18129042, 19028487, 16399367, 9141775, 2627156, 1995247, 4915551, 4850319, -107067, -5553934, -7186028, -5146892, -1926868, 701420, 1845872, 1216014, -176267, -680519, -75773, 293619, -378969, -1565551, -2736395, -3818400, -4159257, -2799419, -231230, 1656151, 1887223, 1327904, 973626, 695927, 41677, -1092498, -2887871, -5255311, -6770847, -5637897, -2309438, 447736, 891044, 277682, 710743, 2407316, 4009113, 4348014, 3077647, 929191, 279817, 3887014, 11506041, 18779776, 21042735, 17740058, 12127172]
40243A2127172m626052k596902j290561j261835j950194j757382K86797K475366
40235A406409K013622p59307k083113P9258K888143K535682m55462k270186j227291
40226B127755L85416K0545j702086k276915r07121M74263j44539k011538k320707
40217f354927J56852L242335M083809K845447K006167K284169J471578j833150
40209G902280n209117m935918q78221K855797K497641j066088l299723j230910
40201c364259L136553N365722L954865J403091k75971k373367n880356p674883
40193e708605m155760K373727N428816K889839n08688o13501O36231j63450j746597
40184a567988q62532J541037J725954k85505m68902K462397M442136J861156l254471
$$ y = [12127172, 7501120, 4904218, 3613657, 2351822, 401628, -1355754, -1068957, 1406409, 3420031, 2660724, 577611, 656869, 3545012, 6080694, 5625232, 3355046, 2127755, 2513171, 2533716, 831630, -1445285, -2352406, -1878143, -2022682, -4034220, -6354927, -6198075, -2955740, 1128069, 3973516, 5979683, 8263852, 9735430, 7902280, 2693163, -2242755, -3120976, -265179, 2232462, 1166374, -2133349, -3364259, -227706, 5138016, 9092881, 10495972, 10220001, 7846634, 1966278, -5708605, -9864365, -7490638, -2061822, 828017, 319329, -294172, 342059, 178609, -1567988, -2430520, -889483, 836471, 550966, 82064, 2544461, 6986597, 8847753, 5593282]
40175E593282o109646n016387k076032N80739K616941L852936L312436R71804
40167C726073j036008p09277P19179n9950l521815n601649k836784K286336M121845
40158b912050J487168j105648m23635J231413O93121q41221n03549J103797J380997
40149A10393N51532Q82604K065584J521688q93447k333256j296194R78128L597318
40140E184350O834127R509635R567512Q210691R356078J3272275J4697217R778606
40132H6410491J585534m082115n524275m764201k924320L48288M377239Q028898
40124H3455539J2275220J9149139K7976472L4601396L4447495K5574817J0085778
40117B47565856o024977j6116829j8260078j6382044j4557049j2085938o392383
$$ y = [5593282, -516364, -5532751, -7608783, -7028044, -4411103, -558167, 2754269, 3726073, 2690065, 1980788, 2699967, 2640017, -881798, -6483447, -9320231, -7033895, -2912050, -1424882, -2530530, -2954165, -1722752, -1029631, -1870852, -2374401, -1270604, 110393, 661925, 1544529, 3610113, 5131801, 4238354, 1905098, 608904, 1587032, 5184350, 12018477, 21528112, 31095624, 39306315, 48662393, 61934668, 76631885, 86410491, 87996025, 83913910, 78389635, 73625434, 70701114, 71049402, 75426641, 83455539, 95730759, 114879898, 142856370, 177457766, 211905261, 237480078, 247565856, 241540879, 225424050, 207163972, 190781928, 176224879, 164138941, 157746558]
40110A57746558J729869R404039J6401255K4087726L0244580K9578463K0075354
40103B89267844N181713j0671030k4628912l3013571l1738833k2061180j1911402
40096A60424629p701301p294592m552660J438801N786496N112766J066102l501268
40088A50778973p781603j1233339j1956162r260382o085144o322261r957154j2550774
40080G5632154j0014919l201381K679857L088914j522333o371692p163639m013078
40072D9113883o19444q8066k071980l864544l653345k219236j466127j843905
40064C3287236j976410q80460M79324O14690l39003j099772j271041j339791r65909
40055B6508864P44804K982161L294244P53712k704242n038021o284882o745697
$$ y = [157746558, 159476427, 168880466, 185281721, 209369447, 239614027, 269192490, 289267844, 294449557, 283778527, 259149615, 226136044, 194397211, 172336031, 160424629, 152723328, 145428736, 140876076, 142314877, 148101373, 153214139, 154280241, 150778973, 142997370, 131764031, 119807869, 110547487, 104462343, 98140082, 88182928, 75632154, 65617235, 62415854, 65095711, 68184625, 66662292, 60290600, 53126961, 49113883, 48494439, 48406373, 46334393, 42469849, 38816504, 36597268, 35131141, 33287236, 31310826, 30430366, 30909690, 31524380, 31185377, 30085605, 28814564, 27474773, 26508864, 27253668, 30235829, 33530073, 34283785, 31579543, 26541522, 20256640, 13510943]
40047A3510943n208872j246046K394433K608144M40812j01950K316078M657022
40039A9370564L926554Q68294j662777k041068n82581J363126J932468j28651
40031B3045929l589103n096520k617891K209703N877200O205147L265718j311666
40023B7988517m829857m844149j730170R62431L69816k147257k915960p45756
40015A2107615K027397K921225J739818l97240k411673l122360j632436J091331
40007A2323677K427771J103594j006095j287442K12812J218016O20152j77759
39999A5434726L96067J762700K096215Q09015q63481j474139n65765J681166M688794
39990B3965298O717821N193725m62783o681345q425702m712144R5587J520528
$$ y = [13510943, 8302071, 7056025, 9450458, 12058602, 12499414, 12397464, 14713542, 19370564, 23297118, 24165412, 22502635, 20461567, 19878986, 21242112, 23174580, 23045929, 19456826, 14360306, 11742415, 13952118, 19829318, 26034465, 29300183, 27988517, 23158660, 18314511, 16584341, 17546772, 17916588, 15769331, 12853371, 12107615, 14135012, 17056237, 18796055, 18398815, 15987142, 12864782, 11232346, 12323677, 14751448, 15855042, 14848947, 13561505, 13774317, 14992333, 15612485, 15434726, 15830793, 17593493, 19689708, 20498723, 19635242, 18161103, 17595338, 19276504, 23965298, 30683119, 35876844, 35414061, 28732716, 20307014, 15594870, 15690457, 17210985]
39982A7210985R8728k84149J846554L678956K153593j950867m911893m224733
39974A3617174j105855R73480J3511k312590k645498l03158J491579j40458l334956
39965F253229l430679Q03428N139583M967518P38573k977850k939645l85552J060967
39956I229572l18585k596243k786148p89804L70220j173783l134170k116336J383673
39947a931604L559010K572805M78779m53452m36184k84799K74480R57742L09976
39938E046753j397047j323454J476318L293138O71628l813293m436241j00718
39930e82916M416574M881323J931827j369724l251919l530808k578434j244245
39922a328322m19317k3413N23939R03521M13590k77157M20605K740981N095358
$$ y = [17210985, 17309713, 17025564, 18872118, 22551074, 24704667, 22753800, 17841907, 13617174, 12511319, 13484799, 13498310, 11185720, 8540222, 8237064, 9728643, 9588185, 6253229, 2822550, 3625978, 8765561, 13733079, 14471652, 11493802, 8554157, 8168605, 9229572, 8910987, 6314744, 3528596, 2738792, 3109012, 1935229, -1198941, -3315277, -1931604, 1627406, 4200211, 4678990, 4225538, 3789354, 3504555, 3779035, 4736777, 5046753, 3649706, 2326252, 3802570, 7095708, 7767336, 3954043, -482198, -582916, 3833658, 8714981, 10646808, 9277084, 6025165, 2494357, -84077, -1328322, -1747639, -1771052, -1247113, -343592, 69998, -207159, 213446, 2954427, 8049785]
39913H049785N666132L334883j919097p710048r667484n923337l16155J862713
39905f622608M86550m85031K05428J6728j618881j652917R43059K809308J889919
39896d028445J012233K661957M261153K577181m62342q05516J180955J718498
39888H115674k21723k008068j918500q92434l1293M80113K46241q00345j262002
39879A707663k52828M18788j080493k844976j577524K044829M101529L193990
39871E710978J560959M23342j448222l662827l134810Q76776M326707L637094
39863H289997N60616j052343r81207j678314k963970j668869K887040O268508
39855I661458L879291k793502p199452n249121j572K476119O64739j340133j07413
$$ y = [8049785, 13715917, 17050800, 15131703, 7421655, -2245829, -8169166, -8485321, -6622608, -6136058, -6621089, -6415661, -6398933, -8017814, -9670731, -8727672, -5918364, -4028445, -3016212, -354255, 3906898, 6484079, 6021737, 5216221, 6397176, 8115674, 7893951, 5885883, 3967383, 3074949, 3043656, 3523769, 3770010, 2969665, 1707663, 1454835, 1873623, 793130, -2051846, -3629370, -1584541, 2516988, 5710978, 7271937, 7695279, 6247057, 2584230, -550580, 326196, 4652903, 8289997, 8850613, 7798270, 6817063, 5138749, 2174779, 505910, 3392950, 9661458, 13540749, 10747247, 3547795, -1701326, -1702898, 773221, 1437960, 97827, -9586]
39846i586K745688L726013K416540R55023L53972J9787o3876P25845J931657K302524
39836A5103587J451412k71298k624486m669281m605595k331339m08540l13301
39828A331159n1806J659883J810048k012492n861047m310899O57278K296204q8214
39819d569886l99382L427638N758592L046525j25216J011007L733811L196825
39811A5079914K77370j451140k310157m206079n063514j709676L714666N853394
39803A0184778L401689m30847l240721m582367l419060M67327L513969J871310
39795G766078k625924m666057l129856j695240k026608j601538R63812L321439
39787c693894L583705L033344L033972K675377J105700o19324j347156j126887
$$ y = [-9586, 2736102, 6462115, 8878655, 9833678, 10187650, 10207437, 10143561, 10869406, 12801063, 15103587, 16554999, 16283701, 13659215, 8989934, 4384339, 2053000, 1644460, 1331159, 1279353, 2939236, 4749284, 2736792, -3124255, -7435154, -6777876, -4481672, -4569886, -4969268, -1541630, 4216962, 7263487, 7138271, 8149278, 11883089, 15079914, 15357284, 13906144, 11595987, 7389908, 2326394, 616718, 4331384, 10184778, 13586467, 13155620, 9914899, 5332532, 1913472, 2380799, 5894768, 7766078, 5140154, 474097, -2655759, -4350999, -6377607, -7979145, -7015333, -3693894, -110189, 2923155, 5957127, 8632504, 9738204, 9118880, 7771724, 6644837]
39779F644837L238K030846L391329K196566n07039j600798m22583O18630L29400
39770A2684426J87456P89807M92437j122048j869942o95186L62478k98561j244762
39761I286105q34915J6550j39038q74261j347321j924083k589582k003816M7376
39752c62985J447622Q26786k89493k65134j40919j512463l403536l383721o06235
39743g690078L638098O975755O804541K407469k782281l860076p73666J252594
39735E972356o04007k533175m72398L149713L362997M40745j242037l37579N42525
39726H279140O4079o25434j594577m086684o416812m761476P05136M792770M238255
39717E94397J931559J988646L823532L910361J269900j582788k073414N0649K962610
$$ y = [6644837, 6648075, 8678921, 12070250, 14266816, 13759777, 12158979, 11736396, 12355026, 12684426, 12871882, 13661689, 14154126, 13032078, 11162136, 10466950, 10829428, 10530867, 9286105, 8451190, 8467740, 8328702, 7454441, 6107120, 4183037, 1593455, -410361, -362985, 1084637, 1911423, 1621930, 1356796, 1215877, -296586, -3700122, -7083843, -7690078, -4051980, 2923775, 9728316, 12135785, 9353504, 5493428, 4719762, 5972356, 5368349, 2835174, 2362776, 5512489, 8875486, 9316231, 8074194, 7736615, 8279140, 8343219, 7717785, 6123208, 2036524, -4380288, -9141764, -8436628, -3643858, 594397, 2525956, 4514602, 8338134, 12248495, 13518395, 11935607, 9862193, 9912842, 12875452]
39708A2875452L999668J608971k750600n549389m941910k547001q03591q4687
39700A806913M91443J039934J341674K013727L351447L835817J782443j851621
39692A3811777m142596l707395j953688o77844k5871N84863R52979O00611k2807
39683E420029j8309N52749P16611L4625q49496j278937j392549j465286j177443
39674E41994k11710R78847J842641K743421M220013N419633M602715J531636j813968
39665A9855222l448367l287158k295252r69923K81758L45883j396266l446381
39657E639516l364398p76746K025726K917744K307424J942952K184873J768152
39649A4645243K94050m78557J000325L181187K822035m19996k959915k218391
$$ y = [12875452, 16875120, 18484091, 15733491, 10184102, 5242192, 2695191, 1891600, 1806913, 2298356, 3338290, 4679964, 6693691, 10045138, 13880955, 15663398, 13811777, 9669181, 5961786, 4008098, 3330254, 3304383, 3889246, 4842225, 5442836, 5420029, 5401720, 5954469, 6671080, 6705705, 5856209, 4577272, 3184723, 1719437, 541994, 330284, 1309131, 3151772, 5895193, 10115206, 15534839, 20137554, 21669190, 19855222, 16406855, 13119697, 10824445, 9854522, 10136280, 10482163, 9085897, 5639516, 2275118, 1498372, 3524098, 6441842, 8749266, 10692218, 12877091, 14645243, 14939293, 14460736, 15461061, 18642248, 21464283, 21044287, 18084372, 15865981]
39641A5865981n49925j747390n053183o080000l337219o1664J075823J194622
39633A307045J571709O74195k402026m743598l426514k28905J167328Q85354J745389
39624c450023L716448L912947J817911J87334L30019M90962k38072k56467J006319
39615G517378J517540L26199n08688L01059P32940q08553k113937o41440J905314
39606H227812K010694q2952r02490P27281K177361J285528q51227k089435j833629
39597H668943n31029J351712K768835K290604J68557j187603k18765J426512J186289
39588A5924055o08060j333966l67637l19380k843660n273582l785989R54076M127729
39579F473586L101232O71649N26832J931020J592825o75019j588496L65654K555032
$$ y = [15865981, 15316056, 13568666, 8515483, 2435483, -901736, -963400, 112423, 1307045, 2878754, 3552949, 1150923, -3592675, -7019189, -7248094, -6080766, -5195412, -3450023, 266425, 4179372, 5997283, 6184617, 6514636, 7005598, 6767526, 6511059, 7517378, 9034918, 9361117, 8852429, 9153488, 9886428, 9077875, 6963938, 6322498, 8227812, 10238506, 10155554, 9253064, 9980345, 12157706, 13443234, 12592007, 10502572, 8668943, 8137914, 9489626, 12258461, 14549065, 14717622, 13530019, 13311254, 14737766, 15924055, 15315995, 13982029, 13614392, 13295012, 10451352, 5177770, 1391781, 2345857, 6473586, 9574818, 10246467, 10773299, 12704319, 14297144, 13622125, 12033629, 12399283, 14954315]
39570A4954315K126027k50131k124610k795390l154266l305170k419365n33252
39562B498158J119944J504394N24066j276008k822575k833011j122213P59386
39554a647859J230728O38442M04728O98886M92454j95216M5598J541713K434973
39545E644447J276206n66322q07941J44779l95517l190897n421579m412188j386710
39536i115722L16197j80070o57955N24000K405444L454601L479605K702985R94163
39527C923248p84997p21085J183227J918402m33160l206413k595471O17687K147982
39518B049420N94564r16597j5996J574643J565690R14829J690262L152877K764514
39509A3374206K87494j614296j013493P80375R90565j235778l908664m514358
$$ y = [14954315, 17080342, 16830211, 14705601, 11910211, 8755945, 5450775, 3031410, 2498158, 3618102, 5122496, 5646562, 4370554, 1547979, -1285032, -2407245, -1647859, -417131, 221311, 626039, 1324925, 1817379, 1622163, 1667761, 3209474, 5644447, 6920653, 6354331, 5546390, 5691169, 5295652, 2104755, -3316824, -7729012, -9115722, -8799525, -8979595, -9637550, -9113550, -6708106, -3253505, 226100, 2929085, 3923248, 3138251, 2417166, 3600393, 5518795, 5085635, 1879222, -716249, -98562, 2049420, 2643984, 1727387, 1711391, 3286034, 4851724, 5766553, 7456815, 10609692, 13374206, 13661700, 12047404, 11033911, 11814286, 12804851, 11569073, 7660409, 3146051]
39501C146051k655271J29010K723531N174959O740228N321540O31048l727824
39493A7483272l936698q23081J628479J834100J482929J310311p3508k530311
39485A6375493l449468j902782l73107o65108j261638n88497K58522J72244K54506
39476H820165R21334J067l253378n318780l256824J72525M25108j790753j961386
39467e240922Q98961L039731J998882k63298p62317J137573M021659N419462K817744
39458A3067475l362076q219423p085149j538022K616118K985182K289740K509320
39450C263165K031189j54510j807645j148351K62102N91796O61206J511499J888372
39441G098823P77101N4055J678913L899809L164823r80202n187090o087103l312262
$$ y = [3146051, 490780, 619790, 3343321, 8518280, 15258508, 20580048, 21211096, 17483272, 13546574, 12723493, 14351972, 16186072, 17669001, 18979312, 18905804, 16375493, 12926025, 11023243, 10650136, 9985028, 8723390, 8134893, 8393415, 8565659, 8820165, 9741499, 9742566, 6489188, 1170408, -2086416, -1913891, -1488783, -3279536, -5240922, -4341961, -1302230, 696652, 433354, -328963, 808610, 4830269, 10249731, 13067475, 9705399, 1485976, -5599173, -7137195, -4521077, -1535895, 753845, 3263165, 5294354, 5139844, 3332199, 2183848, 2445950, 3037746, 3698952, 5210451, 7098823, 7875924, 7929979, 9608892, 13508701, 16673524, 15693322, 10506232, 4419129, 1106867]
39432A106867O00556K234783J88584l115213l713018r40948J728561J596243J66197
39423a47388K4031P32908M65042j76549P13908K334861J816760r63471k399539
39414B400563j32739L362314L869822P40153k696566l537297k348070j253573
39406D04607m18749J738193M935723O009915L157705n40074o43263K281238L175643
39397B0100938j88029l917386l671690n13792J496170J191826N69110N39757j23653
39388A5483251j748537k608479j478912O06914J837391J540722J74457j549118
39380A2257689l064592m009309m052064k684632J18294K833919L263763J245928
39372E908996p62008p67052M45208J138909J055099M74297j233924l824181m569343
$$ y = [1106867, 1707423, 3942206, 4130790, 1015577, -2697441, -3638389, -1909828, -313585, -147388, -123357, 609551, 1074593, 898044, 1611952, 3946813, 5763573, 4800102, 2400563, 2267824, 5630138, 9499960, 10240113, 7543547, 4006250, 1658180, 404607, -14142, 1724051, 6659774, 12669689, 15827394, 15287320, 14644057, 16925295, 20100938, 19912909, 15995523, 12323833, 11810041, 13306211, 14498037, 15067147, 15606904, 15483251, 13734714, 11126235, 9647323, 10254237, 12091628, 13632350, 13806807, 12257689, 9193097, 5183788, 1131724, -1552908, -1434614, 1399305, 4663068, 5908996, 5146988, 4379936, 4825144, 5964053, 7019152, 7493449, 6259525, 2435344, -2133999]
39363b133999j357835L574375N976701M992151L212551J980825L01474j571542
39355A4974701j552317K33789O92605j192035k171306n6512K094774N05551l167270
39346A0361980m312494k518416j716169l300819l644764J2646M796365N920867
39338E599196L048059J60973P6277J660390K437117J766504P04322J23610l432
39329A5573016n5159k51531n31882o68620p21892j326964k908386m533381m447016
39320A28185k199042O05893K286057K892796L193815K914570J443832m74101j584272
39311I207733k257484l671782m900574l374061R36391M294311L816377J322948
39303E373859M41978J393059J351803o14417j878357j69452K975870M037759J828538
$$ y = [-2133999, -3491834, 82541, 6059242, 11051393, 14263944, 16244769, 16546243, 14974701, 13422384, 13656173, 14348778, 13156743, 10985437, 10928925, 13023699, 13529250, 10361980, 6049486, 3531070, 1814901, -1485918, -5130682, -5118036, -321671, 5599196, 8647255, 8808228, 8884505, 10544895, 12982012, 14748516, 15452838, 15576448, 15573016, 15517857, 15266326, 14734444, 14065824, 13343932, 12016968, 9108582, 4575201, 128185, -2070857, -1464964, 821093, 3713889, 6907704, 9822274, 11266106, 10792005, 9207733, 6950249, 3278467, -1622107, -4996168, -4059777, 234534, 4050911, 5373859, 5815837, 7208896, 8560699, 7946282, 6067925, 5898473, 8874343, 12912102, 14740640]
39294A4740640j261427k273982j131945l79836j425205k181405Q1221M079915
39286A0247976N182801J498068l151681m134193j872740l35199j106055k014386
39278D314591j207091M42709J418097J559472J180093J48302j172346j503997
39270E179830j44811J936098L015238K131152j63663j905498j228619J140513
39262I960240J811790j213801n306668o138182l177178J36380J160387K18449
39254b548583j626540l621467l913809p30275M015711N747932L290158N30414
39246A143541L25032M88253j449022l138965j127857K827020L803319J001201
39238C872522j436989p75100J197566K025805J947698K005476J662284K10182
$$ y = [14740640, 13479213, 11205231, 10073286, 9693450, 8268245, 6086840, 6168061, 10247976, 15430777, 16928845, 13777164, 9642971, 7770231, 7435032, 6328977, 4314591, 3107500, 3550209, 4968306, 6527778, 7707871, 7856173, 6683827, 5179830, 5035019, 6971117, 9986355, 12117507, 11953844, 10048346, 8819727, 9960240, 11772030, 10558229, 5251561, -886621, -4063799, -3927419, -2767032, -2548583, -4175123, -7796590, -11710399, -12440674, -8424963, -2677031, 613127, 1143541, 1468573, 1956826, 507804, -2631161, -3759018, -931998, 2871321, 3872522, 2435533, 1660433, 2857999, 4883804, 6831502, 8836978, 10499262, 10709444]
39230A0709444j247365j052880O66172K197799K244901R25909p03732j489487
39222A2250761r53875J78332L91163j215648l706614m658267k382987J692192
39214A595057L689560J647093j435120j066255K451142M262657K172954j61702
39206A3155386N43028J622961q56243m711950m373337J16787K718943P00014j336040
39197G579549Q75173M269427L006832k801433o994570n026222J322981O592376
39189H824113O832422K360539k929325m903681k768617P31482K711661K591039
39181A3449633R52993j941310n163804o423604m355518o39359J704814J390892
39173a025263q16903l468487m598329k111871L684166Q825733R306948N573355
$$ y = [10709444, 9462079, 8409199, 9075371, 11273170, 13518071, 14443980, 13740248, 12250761, 11296886, 11475218, 11866381, 10650733, 6944119, 2285852, -97135, 1595057, 5284617, 6931710, 5496590, 4430335, 6881477, 11144134, 13317088, 13155386, 13698414, 15321375, 14465132, 9753182, 5379845, 5496632, 8215575, 8915589, 7579549, 8454722, 12724149, 15730981, 12929548, 5934978, 908756, 2231737, 8824113, 15656535, 18017074, 15087749, 10184068, 7415451, 8146933, 10858594, 13449633, 14402626, 12461316, 7297512, 873908, -3481610, -4120969, -2416155, -1025263, -1842166, -5310653, -9908982, -12020853, -8336687, 489046, 9795994, 15369349]
39165A5369349J484982n50508j168400j370758j104315p72040j512880l114069
39157G261361l742208k623684j086588j01243J120933K794173K884253j44257
39149F362740m099658m854864j217161L608274N542507L486297m26736l318002
39141E083397l769600k130865N32568L243270M861072L931007r492m939480p366419
39132e64542n512445j014673K786449L680558J755865j161710k817096k192410
39124e040004l59197R47412J513318K221767K671340J375481j080881j645601
39116F03635P84426K869467J276192k143053k819517j56192J886867R86944m27114
39107B861655M59034K421467K335989j39277k313549k079069j4576J823202K048716
$$ y = [15369349, 16854331, 16303823, 15135423, 13764665, 12660350, 11888310, 10375430, 7261361, 3519153, 895469, -191119, -292362, 828571, 3622744, 6506997, 6362740, 2263082, -2591782, -3808943, -200669, 5341838, 8828135, 8401399, 5083397, 1313797, -817068, -284500, 2958770, 7819842, 11750849, 11741357, 6801877, -564542, -6076987, -7091660, -4305211, -624653, 1131212, -30498, -2847594, -5040004, -5399201, -4451789, -2938471, -716704, 1954636, 3330117, 2249236, 603635, 1388061, 4257528, 5533720, 3390667, 571150, 414958, 2301825, 3288769, 2861655, 3320689, 5742156, 8078145, 7938868, 5625319, 3546250, 3531674, 5354876, 7403592]
39098G403592R74980k2260l38173r88001k626445l373529q67409L453168N074608
39089H690531K551457j42017M69467K071051N42108l029280l746475n28611K240015
39080I118246J238548j664134l076912k277557m7559L199313N691852L880050
39072A6061847k842284r158933r332844m400684j09528J341947K896309N784193
39064B40023O363334K317066k272896k162766J304094K322411o49137l230435
39056D231694k486465r43883j289974j558732Q46498L648136K808874o63836j946708
39047B645604J13128J688263O16834o36777k29666k46385j968470k311335R81600
39038F52796M138679K315079k506875l847659M5400M343874M802686K081596j288602
$$ y = [7403592, 8378572, 8356312, 8018139, 7030138, 4403693, 1030164, 162755, 3615923, 8690531, 11241988, 11099971, 11569438, 13640489, 14182597, 11153317, 7406842, 6878231, 9118246, 10356794, 8692660, 5615748, 3338191, 3290632, 6489945, 12181797, 16061847, 13219563, 4060630, -5272214, -9672898, -9782426, -8440479, -5544170, 240023, 6603357, 8920423, 6647527, 4484761, 5788855, 8111266, 7462129, 4231694, 1745229, 801346, -488628, -2047360, -1200862, 2447274, 5256148, 4592312, 2645604, 2758732, 4446995, 5063829, 4427052, 4197386, 3951001, 1982531, -328804, 652796, 4791475, 7106554, 4599679, 752020, 797420, 5141294, 9943980, 12025576, 10736974]
39029A0736974l659355l413892J2024L226901J626194l481554n214965o81359
39021h49032M599032M782953J589169J48307J057271J500301J266706K164379
39013A6259086L138549J378339k259200l730886j794366N65965Q82922l15420
39005A4124989j944522l689418m515003l171885o35233R24546J662448L368529
38997F124451N366939M825000J479822j737637l312086m399386m855241k653823
38989H38039J227818K196489j031356l259332m3794N521047P174181L794076p26694
38980A5690474l600388m832032m386376k047508N74512J666685K263439M117352
38972I446158N281105K048059m568646q571452o406260j167574K128422K382896
$$ y = [10736974, 7077619, 3663727, 3675751, 6902652, 8528846, 5047292, -167673, -849032, 3750000, 8532953, 10122122, 10270429, 11327700, 12828001, 14094707, 16259086, 19397635, 20775974, 18516774, 14785888, 12991522, 13557487, 14440409, 14124989, 12180467, 8491049, 3976046, 804161, 168928, 1093474, 2755922, 6124451, 11491390, 16316390, 17796212, 16058575, 12746489, 8347103, 3491862, 838039, 2065857, 4262346, 3230990, -28342, -72136, 5448911, 12623092, 16417168, 15690474, 12090086, 7258054, 2871678, 824170, 1398682, 3065367, 5328806, 9446158, 14727263, 16775322, 12206676, 3635224, -2771036, -3938610, -1810188, 572708]
38964E72708J596010Q70106j00688r25638m48098J344343K857066K548011N07660
38955H821480j524244j656770J53953J725849J089383r01092j638098l94713P82767
38946F458515K98784o56226j94414J231697J581238L42473q78620q75377l15750
38937F992320j34456J61569J349673K445883J505192j435537l899984m227273
38929B757387l653014l678972k973103M58675M744567N255530J034158l048338
38921H96890k372760J679909M283705L423946R86549q75372j549958r41297O09700
38912F141312J652962J123510J39998K49896N86115p58540l093447l685441j837630
38903E18735L26819J247131J405592J243257L48393q58215j233652j080414j615200
$$ y = [572708, 2168718, 3038824, 2938136, 2012498, 1564400, 2908743, 5765809, 8313820, 8821480, 7297236, 5640466, 5794419, 7520268, 8609651, 7708559, 6070461, 5675748, 6458515, 6757299, 6101073, 5906659, 7138356, 8719594, 9062067, 8183447, 7308070, 6992320, 6857864, 7019433, 8369106, 10814989, 12320181, 10884644, 6984660, 2757387, -895627, -4574599, -7547702, -7089027, -2344460, 2911070, 3945228, 896890, -1475870, 204039, 4487744, 7911690, 8898239, 8022867, 6472909, 5531612, 6141312, 7794274, 8917784, 9057782, 9307678, 9893793, 9135253, 6041806, 2356365, 518735, 845554, 2092685, 3498277, 4741534, 5089927, 4231712, 2998060, 1917646, 302446]
38894C02446k168861r89787R72171P68423j411638j952911L4883Q41703j256847
38885d860418k223593J242456N450959M712143k26846l770989l623797k210425
38877e510510j075749P88440L005468L231325J495685Q85682K531056L568426
38869H919823J737591j144857k191713j430990q55416j244815j601467p34643
38861A453513J427387L284735K565318o40897k669244o18102K880926K755893
38853A0439529r27056k903342q96048J165331J10601j416446l64137Q96719r59185
38844E145966l448238j848128K548165L974299J285895p17478M09169J281920
38836H631570o01026k393813j430045m01350k542428n129714l099913K573345
$$ y = [302446, -1866415, -2856202, -1884031, -1115608, -2527246, -4480157, -4445274, -3603571, -4860418, -7084011, -5841555, -390596, 4321547, 4094701, 323712, -3300085, -5510510, -6586259, -5797819, -2792351, 438974, 1934659, 2820341, 5351397, 8919823, 10657414, 9512557, 7320844, 5889854, 5034438, 3789623, 2188156, 1453513, 2880900, 6165635, 8730953, 8090056, 5420812, 4802710, 7683636, 10439529, 9512473, 6609131, 5713083, 6878414, 6989015, 5572569, 5208432, 6105151, 5145966, 1697728, -150400, 2397765, 6372064, 7657959, 6940481, 7349650, 8631570, 8030544, 5636731, 4206686, 3805336, 1262908, -3866806, -6966719, -4393374]
38828d393374N529604L010452o28596n92585K181859L615160K189854n28519k959022
38819G424833m273015l382461o1967L375397M154372K741718J993663K520843
38811A4493383J812796j206441l872736l891851k924489l268092l303770j12234
38803b273434M600080N659473J787933k344480k678296o59944L59652K70107R62501
38794E683592K397934K985357K378083J220037n99435k918249l857443k124717
38786E165159L45922Q26001j88149l41714K54384m39597k160768k506665j318897
38777c64324r84605j902510j662673K83292J235962J14184l55144J437098K765016
38768E66296J243720q14220l52906J134401N00835j213206o08966J798489K139057
$$ y = [-4393374, 1136230, 4146682, 3518086, 2925501, 5107360, 8722520, 10912374, 10383855, 7424833, 3151818, -230643, -292610, 3082787, 7237159, 9978877, 11972540, 14493383, 16306179, 15099738, 11227002, 7335151, 4410662, 1142570, -2161200, -2273434, 2326646, 7986119, 9774052, 7429572, 4751276, 4091332, 4450984, 4721091, 5683592, 8081526, 11066883, 13444966, 14665003, 14065568, 11147319, 7289876, 5165159, 5511081, 6337082, 6148933, 5807219, 6061603, 5622006, 3461238, 954573, -364324, -1348929, -3251439, -4914112, -4630820, -3394858, -3280674, -3635818, -2198720, 566296, 1810016, 995796, 642890, 1777291, 2278126, 1064920, 455954, 2254443, 4393500]
38759D393500l37599k178638j578743p28833j124077q44671J398448L161274J951132
38750D111793o91205j679314r60752o47918r20986Q4573K637870M353845L249928
38741I537834J43606k454615k721636o60677K092759L448598K649471R08183l03329
38732A2640194j091881k218744k912237j457967J732935L563897J992403r94957
38724A1253643j817325J9288J608264Q82476r69714j959143k035431j904739r64678
38715D112641J264284K844304J449519j658788k742388r45970P12123N88631R55530
38706F579886L233698M400120J742249j661390r67255K377124J918315m162710
38698A3460037r638193q212885j149299N248382O873831M324806N60377j515532
$$ y = [4393500, 4055901, 1877263, 298520, -430313, -1554390, -2399061, -1000613, 2160661, 4111793, 3420588, 1741274, 780522, 132604, -788382, -703809, 1934061, 6287906, 9537834, 9681440, 7226825, 4505189, 3844512, 5937271, 9385869, 12035340, 12943523, 12640194, 11548313, 9329569, 6417332, 4959365, 6692300, 10256197, 12248600, 11253643, 9436318, 9455606, 11063870, 11946346, 10976632, 9017489, 6982058, 5077319, 4112641, 5376925, 8221229, 9670748, 8011960, 5269572, 4323602, 5035725, 5624356, 6579886, 9813584, 14213704, 15955953, 14294563, 13327308, 15704432, 17622747, 13460037, 3821844, -4391041, -5540340, -291958, 6581873, 10906679, 11467056, 9951524]
38690I951524o63880J476454J828791k95471k338645k445087k016603k702768
38682B794315l230618j674299R80886K298939K072585J759868J323168l49344
38674E975500k427431k605254o17468J444535K533937L634647M792136L954875
38666A6685477J69902m178079o020303n115748l339407j573099P86881L502339
38658I17963M561761K499389j162496l042904j748094L89041L62097j416789j766327
38649d06359N47363K897445K565025M35630p43434k11542P83759J589779K319737
38640I777403K157163J85661k193338k316230j49309J315174L49020j122020p33614
38631G269910O48931M20368j592629k500216j27005L817293N224810K217264k387531
$$ y = [9951524, 9287644, 10764098, 12592889, 12297418, 9958773, 7513686, 5497083, 2794315, -436303, -2110602, -1129716, 1169223, 3241808, 5001676, 6324844, 5975500, 3548069, 942815, 325347, 1769882, 4303819, 7938466, 12730602, 16685477, 16855379, 12677300, 6656997, 1541249, -1798158, -3371257, -2584376, 917963, 5479724, 7979113, 6816617, 3773713, 2025619, 2414660, 2776757, 1359968, -406359, 141004, 3038449, 5603474, 6039104, 5295670, 5084128, 5867887, 7457666, 9777403, 11934566, 12120227, 9926889, 7610659, 7461350, 8776524, 9125544, 8003524, 7269910, 7918841, 8339209, 6746580, 4246364, 4119359, 7936652, 13161462, 15378726, 12991195]
38622A2991195m082043k011569J27399q04179l090854k740632Q14216M016791
38614E220324L967431J629378j46654j778J135468J395837k44938k658951l347241
38605F948876j638696k53688j741725m128979k949768K250357O422423N140819
38597A0049619q8203m043657l652665l60071K142175J504393j254961k991795
38589A304835k293139j272632k034970k790174n05191L488843M618929J907942
38581B424443p48700j018281r89839j768360m74122L917321O495970K999055l057511
38572G779976n139250k952466j261884j392362l64660K018351J971679j124406
38564d65022k459063P13334M289955L429533m10833k393455j456039l89016l94088
$$ y = [12991195, 8909152, 6897583, 7024982, 6220803, 3129949, 389317, 1203533, 5220324, 9187755, 10817133, 10670479, 10668701, 11804169, 13200006, 12955068, 10296117, 6948876, 5310180, 5056492, 3314767, -814212, -3763980, -1513623, 4908800, 10049619, 9961416, 5917759, 2265094, 1905023, 4047198, 5551591, 4296630, 1304835, -988304, -2260936, -4295906, -7086080, -7591271, -4102428, 516501, 2424443, 1675743, 657462, -332377, -2100737, -2574859, 1342462, 7838432, 10837487, 7779976, 2640726, -311740, -1573624, -2965986, -3330646, -1312295, 659384, -465022, -2924085, -2210751, 2079204, 5508737, 5097904, 2704449, 1248410, 859394, 465306]
$$ [...]
##END NTUPLES=NMR SPECTRUM
##END=
