##TITLE=31Pdec_85-2023
 CDCl3 24 sc
 25.9.2023
##JCAMPDX= 6.0         $$ Bruker NMR JCAMP-DX V2.0
##DATA TYPE= NMR SPECTRUM
##DATA CLASS= NTUPLES
##ORIGIN= UXNMR, Bruker Analytische Messtechnik GmbH
##OWNER= root
$$ XWIN-NMR		Version 3.5
$$ Mon Sep 25 14:34:36 2023 Russian Standard Time (UT+4h)  she@DPX200
##.OBSERVE FREQUENCY= 81.013821
##.OBSERVE NUCLEUS= ^31P
##.ACQUISITION MODE= SIMULTANEOUS
##.ACQUISITION SCHEME= undefined
##.AVERAGES= 24
##.DIGITISER RES= 16
##SPECTROMETER/DATA SYSTEM= spect
##.PULSE SEQUENCE= zgpg30
##.SOLVENT NAME= DMSO
##.SHIFT REFERENCE= (INTERNAL, DMSO, 0, 248.564)
##AUDIT TRAIL= $$ (NUMBER, WHEN, WHO, WHERE, WHAT)
$$ ##TITLE= Audit trail, XWIN-NMR		Version 3.5
$$ ##JCAMPDX= 5.01
$$ ##ORIGIN= Bruker BioSpin GmbH
$$ ##OWNER= she
$$ F:/spectra/data/she/nmr/P31/1/pdata/1/auditp.txt
$$ ##AUDIT TRAIL=  $$ (NUMBER, WHEN, WHO, WHERE, WHAT)
(   1,<2023-09-25 14:33:37.29 +0400>,<she>,<DPX200>,
      <created by zg, POWCHK disabled, PULCHK disabled
       configuration hash MD5:
       00 E9 B6 7A A2 85 ED C7 34 08 36 98 17 FE 4E 26
       data hash MD5: 32K
       81 D6 23 3D 7E 21 7D 59 E7 CE 4E 96 2A 43 50 4F>)
(   2,<2023-09-25 14:33:39.59 +0400>,<she>,<DPX200>,
      <Start of raw data processing
       efp BC_mod = 2 LB = 5 FT_mod = 6 PKNL = 1 PHC0 = -10704.35 PHC1 = 195.8863 SI = 64K 
       data hash MD5: 64K
       99 C5 3B 4C 57 E8 4F 93 50 A6 CB 1D 36 7F BE B5>)
(   3,<2023-09-25 14:33:59.42 +0400>,<she>,<DPX200>,
      <pk PHC0 = 78.6302 PHC1 = -170.2 
       data hash MD5: 64K
       AA C2 D5 14 82 F9 8D AC 51 ED 4E 7D 35 18 8B A3>)
$$ ##END=
$$ 
$$ hash MD5
$$ E8 0E 20 E8 3D 14 8B 8E 3E 0A 10 A1 42 53 9A 9C
##$RELAX= 
##$RELAX= 
##$RELAX= 
##$RELAX= 
##$RELAX= 
##$RELAX= 
##$RELAX= 
##$RELAX= 
##$RELAX= 
$$ Bruker specific parameters
$$ --------------------------
##$DU= <F:/spectra>
##$EXPNO= 1
##$NAME= <P31>
##$PROCNO= 1
##$TYPE= <nmr>
##$USER= <she>
##$AMP= (0..31)
100 100 100 100 100 100 100 100 100 100 100 100 100 100 100 100 100 100 
100 100 100 100 100 100 100 100 100 100 100 100 100 100 
##$AQSEQ= 0
##$AQ_mod= 1
##$AUNM= <au_zg>
##$AUTOPOS= <>
##$BF1= 81.014009
##$BF2= 200.13
##$BF3= 200.13
##$BF4= 200.13
##$BF5= 200.13
##$BF6= 200.13
##$BF7= 200.13
##$BF8= 200.13
##$BYTORDA= 1
##$CFDGTYP= 0
##$CFRGTYP= 5
##$CHEMSTR= <none>
##$CNST= (0..31)
1 1 145 1 1 1 1 1 1 1 1 1 1 1 1 1 1 1 1 1 1 1 1 1 1 1 1 1 1 1 1 1 
##$CPDPRG= <waltz16>
##$CPDPRG1= <>
##$CPDPRG2= <waltz16>
##$CPDPRG3= <>
##$CPDPRG4= <mlev>
##$CPDPRG5= <mlev>
##$CPDPRG6= <mlev>
##$CPDPRG7= <mlev>
##$CPDPRG8= <mlev>
##$CPDPRGB= <>
##$CPDPRGT= <>
##$D= (0..31)
0 1 0 0 0 0 0 0 0 0 0 0.03 2e-05 3e-06 0 0 0 0 0 0 0 0 0 0 0 0 0 0 0 0 
0 0 
##$DATE= 1695638016
##$DBL= (0..7)
120 120 120 11 120 120 24 19 
##$DBP= (0..7)
150 150 150 150 150 150 150 150 
##$DBP07= 0
##$DBPNAM0= <>
##$DBPNAM1= <>
##$DBPNAM2= <>
##$DBPNAM3= <>
##$DBPNAM4= <>
##$DBPNAM5= <>
##$DBPNAM6= <>
##$DBPNAM7= <>
##$DBPOAL= (0..7)
0.5 0.5 0.5 0.5 0.5 0.5 0.5 0.5 
##$DBPOFFS= (0..7)
$$ [...]
##$SUBNAM2= <"">
##$SUBNAM3= <"">
##$SUBNAM4= <"">
##$SUBNAM5= <"">
##$SUBNAM6= <"">
##$SUBNAM7= <"">
##$SUBNAM8= <"">
##$SUBNAM9= <"">
##$SW= 501.771253377433
##$SWIBOX= (0..15)
0 1 3 0 0 0 0 0 0 0 0 0 0 0 0 0 
##$SW_h= 40650.406504065
##$TD= 32768
##$TD0= 1
##$TE= 0
##$TE2= 300
##$TE3= 300
##$TEG= 300
##$TL= (0..7)
0 120 53 12 22 120 120 120 
##$TP= (0..7)
150 150 150 150 150 150 150 150 
##$TP07= 0
##$TPNAME0= <>
##$TPNAME1= <>
##$TPNAME2= <>
##$TPNAME3= <>
##$TPNAME4= <>
##$TPNAME5= <>
##$TPNAME6= <>
##$TPNAME7= <>
##$TPOAL= (0..7)
0.5 0.5 0.5 0.5 0.5 0.5 0.5 0.5 
##$TPOFFS= (0..7)
0 0 0 0 0 0 0 0 
##$TUNHIN= 0
##$TUNHOUT= 0
##$TUNXOUT= 0
##$USERA1= <user>
##$USERA2= <user>
##$USERA3= <user>
##$USERA4= <user>
##$USERA5= <user>
##$V9= 5
##$VALIST= <valist>
##$VCLIST= <CCCCCCCCCCCCCCC>
##$VD= 0
##$VDLIST= <DDDDDDDDDDDDDDD>
##$VPLIST= <PPPPPPPPPPPPPPP>
##$VTLIST= <TTTTTTTTTTTTTTT>
##$WBST= 1024
##$WBSW= 4
##$XGAIN= (0..3)
0 0 0 0 
##$XL= 0
##$YL= 0
##$YMAX_a= 8340
##$YMIN_a= -8181
##$ZGOPTNS= <>
##$ZL1= 120
##$ZL2= 120
##$ZL3= 120
##$ZL4= 120
##$ABSF1= 0
##$ABSF2= 0
##$ABSG= 0
##$ABSL= 0
##$ALPHA= 0
##$AQORDER= 0
##$ASSFAC= 0
##$ASSFACI= 0
##$ASSFACX= 0
##$ASSWID= 0
##$AUNMP= <proc_1d>
##$AZFE= 0.1
##$AZFW= 0.5
##$BCFW= 0
##$BC_mod= 2
##$BYTORDP= 0
##$COROFFS= 0
##$CY= -3
##$DATMOD= 1
##$DC= 0
##$DFILT= <>
##$DTYPP= 0
##$F1P= 0
##$F2P= 0
##$FCOR= 1
##$FTSIZE= 65536
##$FT_mod= 6
##$GAMMA= 0
##$GB= 0
##$INTBC= 1
##$INTSCL= 6.047779e-11
##$ISEN= 30
##$LB= 5
##$LEV0= 0
##$LPBIN= 0
##$MAXI= 10000
##$MC2= 0
##$MEAN= 0
##$ME_mod= 0
##$MI= 50
##$NCOEF= 0
##$NC_proc= -6
##$NLEV= 6
##$NOISF1= 182.463
##$NOISF2= 159.3651
##$NSP= 0
##$NTH_PI= 0
##$NZP= 0
##$OFFSET= 248.5645
##$PC= 4
##$PHC0= -10625.72
##$PHC1= 25.68631
##$PH_mod= 1
##$PKNL= yes
##$PPARMOD= 0
##$PSCAL= 0
##$PSIGN= 0
##$REVERSE= no
##$SF= 81.0140089999694
##$SI= 65536
##$SIGF1= 159.3651
##$SIGF2= -187.1042
##$SINO= 113.3802
##$SIOLD= 16384
##$SREGLST= <1H.CDCl3>
##$SSB= 0
##$STSI= 65536
##$STSR= 0
##$SW_p= 40650.406504065
##$SYMM= 0
##$S_DEV= 0
##$TDeff= 32768
##$TDoff= 0
##$TI= <>
##$TILT= no
##$TM1= 0
##$TM2= 0
##$TOPLEV= 0
##$USERP1= <user>
##$USERP2= <user>
##$USERP3= <user>
##$USERP4= <user>
##$USERP5= <user>
##$WDW= 1
##$XDIM= 65536
##$YMAX_p= 377571844
##$YMIN_p= -20635836
$$ End of Bruker specific parameters
$$ ---------------------------------
##NTUPLES= NMR SPECTRUM
##VAR_NAME=  FREQUENCY,     SPECTRUM/REAL,   SPECTRUM/IMAG
##SYMBOL=    X,             R,               I
##VAR_TYPE=  INDEPENDENT,   DEPENDENT,       DEPENDENT
##VAR_FORM=  AFFN,          ASDF,            ASDF
##VAR_DIM=   65536,         65536,           65536
##UNITS=     HZ,            ARBITRARY UNITS, ARBITRARY UNITS
##FACTOR=    0.620285442955139, 1,           1
##FIRST=     20137.2065510682, 0,            0
##LAST=      -20513.1999529968, 0,           0
##MIN=       -20513.1999529968, -20635836,   0
##MAX=       20137.2065510682, 377571844,    0
$$ Real data points
##PAGE= N=1
##DATA TABLE= (X++(R..R)), XYDATA
$$ [...]
39834B95148o5384q2047j09470j42496j49853j07709l4604K2782M0326L9355N2500
39823b41452P9290Q9178O2320J1634l4083n2181k9680L3515J11457J58375J49374
39812C37747J10723R2155J09782J31338J17809O4538n56m3560m5255j2423K1084
39801H83382J7003l0933q9169j20648j20925j09940r9087q2820n9391m2483m6180
39790I8809o6785q5117q3540n8953k2549J0633L2115M0852L7676K6066J9052L4761
39778a6980P6300J21180J40112J25141R2245N7431J7773m1597j24010k04509k38850
39767D236j99929j12568m2789l8661q3258j16540j00749n1041l471K7634N1136
39756f66000P3396Q8942R4687R9116J10804J22360J11994O4247r584p3313r2910
$$ y = [295148, 229764, 147717, 38247, -104249, -254102, -361811, -396415, -373633, -333307, -293952, -241452, -162162, -72984, -10664, 970, -33113, -85294, -114974, -81459, 29998, 188373, 337747, 448470, 540625, 650407, 781745, 899554, 964092, 963536, 919976, 874721, 862298, 883382, 900385, 869452, 780283, 659635, 538710, 428770, 329683, 246863, 187472, 144989, 98809, 32024, -53093, -136633, -195586, -218135, -207502, -175387, -134535, -96859, -70793, -51741, -16980, 59320, 180500, 320612, 445753, 537998, 595429, 613202, 571605, 447595, 243086, 4236, -195693, -308261, -351050, -389711, -472969, -589509, -690258, -741299, -744770, -717136, -666000, -592604, -503662, -408975, -309859, -199055, -76695, 35299, 99546, 89962, 16649, -76261]
39745g6261o5520k1780K087m419k1065k1401j311J7809J4250j0066l5803n1583
39733b75063o0755o1957m1073L624M0454L0268k5997q2891r8232p2008l2579P13
39721f75496K8679N4090O7684N5281J2682m9099j11364j59057j84918j84852j55284
39710a301654r9094k9255M0258J03669J56482J85303J78404J46264J17682J11013
39700c90928J19062J23848J13408Q1296K6875l3343o8482o2232l2378j0377q022
39689a41273j4145j5734q782O043K4210L6492L9118M0958M8116M6104J3643m6251
39677B8499j04106j33102j25444q1845p992P0112J09638Q8757L0842k4015o2398
39666b11054r6583j29602j44897j32659j05848q0902n6252j9990L1942R6302J71426
$$ y = [-76261, -141781, -163561, -161474, -165893, -186958, -208359, -209670, -191861, -177611, -187677, -223480, -275063, -335818, -397775, -438848, -435224, -394770, -364502, -390499, -473390, -571622, -643630, -676209, -675496, -646817, -592727, -525043, -469762, -457080, -506179, -617543, -776600, -961518, -1146370, -1301654, -1400748, -1430003, -1389745, -1286076, -1129594, -944291, -765887, -619623, -501941, -390928, -271866, -148018, -34610, 46686, 73561, 40218, -28264, -90496, -122874, -133251, -141273, -155418, -171152, -179934, -173891, -149681, -113189, -74071, -33113, 15003, 61107, 74750, 28499, -75607, -208709, -334153, -415998, -423990, -353878, -244240, -155483, -124641, -148656, -211054, -307637, -437239, -582136, -714795, -820643, -901545, -957797, -977787, -945845, -849543, -678117]
39655f78117K49081L00794K91236K13823J03882R403m5532o4500n7897l2590J100
39644B90683K7566L6889K9882Q771k8198p6200j15723j26848j11702r3903r2469
39633b51252j02056j03719r1316p8946p9222q1001n9269q931M1734O0846N0472
39622g02660M1650N2272O4134M8195J508n0882q3767r0590p8171n4108k1243K1472
39610h52190P3303J23724J54058J53836J32027J03309O6569J0306n9463j12637
39600b07158j26609j14412j08113j18826j27706j16617r1689o8664m8573k3822
39590a152189k641p650m4078q4034r3359o6589k6499K784J1310J088j4465j1766
39578a488088K4429Q1381J31307J64238J90908K11706K06326J65279J10393O6885
$$ y = [-678117, -429036, -128242, 162994, 376817, 480699, 490102, 444570, 380070, 322173, 289583, 290683, 318249, 355138, 385020, 393791, 365593, 289393, 173670, 46822, -64880, -158783, -251252, -353308, -457027, -548343, -627289, -706511, -787512, -846781, -855712, -813978, -753132, -702660, -661010, -608738, -544604, -496409, -494901, -545783, -629550, -720140, -798311, -852419, -873662, -852190, -778887, -655163, -501105, -347269, -215242, -111933, -45364, -35058, -94521, -207158, -333767, -448179, -556292, -675118, -802824, -919441, -1011130, -1079794, -1128367, -1152189, -1154830, -1162480, -1206558, -1290592, -1383951, -1450540, -1477039, -1474255, -1462945, -1461857, -1476322, -1488088, -1463659, -1382278, -1250971, -1086733, -895825, -684119, -477793, -312514, -202121, -135236]
39568a35236L1923q937m8872o9543p5836r1651j18638j25671r0068l0079J8033
39557g44575M3574O6952J04739J41071J39594Q3904K696n2898n9868m2573l5970
39546c53354m2905m2788l1883l0976n2087p9060q9324q0904p0049p1172q3274
39535a027776q8413o4154q847M6952O8771N7622M4652M6593M6824K4078k2183
39524h75881q1407j42097j79971j61206p9347K5725J03723J35796J27924Q6955
39514a039786L0462J306L2601R7900J28379Q7788Q586n1148o4693m4070j3374
39503h26049J0587K4534L8871O5022R6064J08450Q8624M8965J2171r808j4479
39492c57048J682L8607Q1306J05915J01424Q1089O8653P2511P4529M7748j2260
$$ y = [-135236, -103313, -112250, -161122, -230665, -306501, -398152, -516790, -642461, -732529, -762608, -744575, -701001, -634049, -529310, -388239, -248645, -164741, -162045, -214943, -274811, -317384, -353354, -396259, -439047, -470930, -501906, -553993, -633053, -722377, -803281, -873330, -944502, -1027776, -1116189, -1180343, -1189190, -1142238, -1073467, -1015845, -971193, -924600, -877776, -853698, -875881, -957288, -1099385, -1279356, -1440562, -1519909, -1494184, -1390461, -1254665, -1126741, -1039786, -1009324, -1008018, -975417, -877517, -749138, -661350, -652764, -703912, -768605, -812675, -826049, -815462, -790928, -752057, -687035, -590971, -482521, -393897, -344932, -332761, -342569, -357048, -355366, -316759, -235453, -129538, -28114, 52975, 121628, 194139, 268668, 316416, 304156]
39481C04156p6355j05148q0985j5744O4353J33491J73553J81081J67660J44138
39471H90200J05831M3957k9319q0760q5912n2047r889J1015J224k2717l1117j1516
39459G28950J3052Q329k8147o3471p1939o4566o8961r5716j35173j73931k01898
39448a53471k13917k16945k25890k39148k28101j66814o5806L9015J24625J90586
39438a155866K35448K46340K17206J60394R3237K7389k1736l1286P333O9269J13097
39427c9175J17688R5110O8938M9074K9426J672l5085p5115j09732j28799j23037
39416a49035q9639l6627J9864O3052Q0570O6267K3966k8146o2001n5655r220N2220
39404a24384R0853P8266J7342n4430r2412q3009n0583k3942o566J0666J9618j51
$$ y = [304156, 227801, 122653, 41668, 25924, 90277, 223768, 397321, 578402, 746062, 890200, 996031, 1039988, 1010669, 929909, 843997, 791950, 782061, 793076, 794300, 771583, 740466, 728950, 742002, 750331, 722184, 658713, 586774, 522208, 453247, 357531, 222358, 48427, -153471, -367388, -584333, -810223, -1049371, -1277472, -1444286, -1510092, -1471077, -1346452, -1155866, -920418, -674078, -456872, -296478, -203241, -175852, -197588, -228874, -221541, -152272, -39175, 78513, 173623, 242561, 291635, 321061, 322733, 287648, 212533, 102801, -25998, -149035, -238674, -275301, -255437, -192385, -111815, -45548, -21582, -49728, -111729, -167384, -176604, -124384, -33531, 44735, 62077, 7647, -84765, -167774, -218357, -242299, -248865, -238199, -218581, -218732]
39392b18732m5490q0210p4067l8840j1625j0416k3418l9913p0206j22936j74736
39381i10589j81492j23842l2136M0340O6581O5460P4760J08051J38559J25869
39371f28439O0542j8830n8347l9909O201M0793N5774O6364P7946Q3121Q8021J12910
39359a53853J55087J74931J41105P5822K9433J5670m56m7256j05830j38319j37005
39348I329j26855j30444j48394j67728j70276j34303m8672O5439J59065J93272
39338d99567J70529J24977Q6766O0573L3719k150l7129m7315j6509M0431P8652
39327g023N7962j8178j01658j41718j27367q8381n9993n2023n0006l8350j7566
39316f44301n33M341L481R970K5440L4551K1816q642l6670m9706n5329o6436q0159
$$ y = [-218732, -264222, -344432, -418499, -457339, -468964, -479380, -502798, -542711, -612917, -735853, -910589, -1092081, -1215923, -1248059, -1207719, -1141138, -1075678, -1000918, -892867, -754308, -628439, -567897, -586727, -645074, -684983, -678782, -637989, -582215, -515851, -437905, -354784, -266763, -153853, 1234, 176165, 317270, 393092, 422525, 438195, 437739, 390483, 284653, 146334, 9329, -117526, -247970, -396364, -564092, -734368, -868671, -917343, -851904, -692839, -499567, -329038, -204061, -117295, -56722, -23003, -25153, -62282, -109597, -126106, -85675, -7023, 50939, 32761, -68897, -210615, -337982, -426363, -486356, -538379, -588385, -626735, -644301, -644834, -640493, -637012, -627042, -601602, -567051, -545235, -553877, -590547, -640253, -695582, -762018, -842177]
39303h42177p8935n1062m806L7726N7166M9357K7588J3946K4051N6388R5204J21703
39291d93851J22033R0269L1116m0338j07065j58428j86576j78990j26581m2983
39281a091394L4528P3303P2946O0503O1266P8177R4857R1174N7352O21n9052j02393
39269f28112j21015j15042q6743m2860L75K5408L1291L8359O8759J20739J63263
39258e45578J58479R4024l617q8982j32297j33137j03366m9623J9279P9420J04583
39247f00815R2206O2780L2595J497k9878m8548m4830k6027l102K4020N4169O9909
39235d16024N5081K2657M489J1959K4928K3444J2421O759Q444J1896K0590M1454
39223a71902O6139P3074N1379J4212j4858k3543j7470j0444j1109j5824j0931
$$ y = [-842177, -921112, -972174, -976980, -939254, -882088, -832731, -805143, -791197, -767146, -710758, -615554, -493851, -371818, -281549, -250433, -290771, -397836, -556264, -742840, -921830, -1048411, -1091394, -1056866, -983563, -910617, -850114, -788848, -710671, -615814, -524640, -467288, -466667, -525719, -628112, -749127, -864169, -950912, -993772, -993397, -967989, -936698, -898339, -829580, -708841, -545578, -387099, -293075, -296692, -385674, -517971, -651108, -754474, -804097, -784818, -705398, -600815, -508609, -445829, -413234, -411737, -441615, -490163, -534993, -561020, -564122, -540102, -485933, -416024, -360943, -338286, -333797, -321838, -296910, -273466, -261045, -254286, -245842, -233946, -213356, -171902, -105763, -32689, 18690, 32902, 18044, -5499, -22969, -33413, -44522, -60346, -71277]
39212g1277J6647O6134J17363J41487J24198Q0634M1996K3481J1224j2819l9858
39201D99210m0774k869N2167Q9957R2818O4933K1378j9484m2733m7825m9513o0648
39189E56617p8551r4959j12287j38851j71057j92233j90524j69824j41556j12547
39179h45772q3286n3088k3801N76J8409L4813N7104Q2916R8240R3170P5411O1636
39167d83672N9420O5346P6580R2824J06571J02434P1083J8697l9180q7564j14857
39156a32318j13977q7509m9699j7885Q16J4249L4069N6840N9288K1520m2276q5675
39144c42557p0407j074Q3849J47257J74075J68671J45030J13881O8725q252j14389
39133C64809k10677k56139k51867k30297k06270j66503j09678o4778n2790n3156
$$ y = [-71277, -54630, 11504, 128867, 270354, 394552, 475186, 517182, 540663, 551887, 539068, 499210, 458436, 455567, 507734, 597691, 690509, 755442, 776820, 757336, 714603, 666778, 617265, 556617, 478066, 383107, 270820, 131969, -39088, -231321, -421845, -591669, -733225, -845772, -929058, -982146, -1005947, -1005371, -986962, -952149, -895045, -812129, -713889, -620719, -545308, -483672, -424252, -358906, -282326, -189502, -82931, 19503, 90586, 109283, 70103, -17461, -132318, -246295, -333804, -383503, -401388, -400572, -386323, -352254, -295414, -236126, -214606, -256882, -342557, -412964, -414038, -330189, -182932, -8857, 159814, 304844, 418725, 487450, 479198, 364809, 154132, -102007, -353874, -584171, -790441, -956944, -1066622, -1131400, -1184190, -1237346]
39123a237346l0598J7067N7680O4685M2913J9899K4756P0047J39502J94023K00836
39112d36536J59594R8042M7436K4584K5966K9539J2010k2486l7531k869O4434
39101c7817J10142R5221L0158m0619p8601p6382n4099l6336l0144k4141o519K2649
39089a26488N6773Q9210J09775J06928Q2302N3163L2111J5659J907L238K4200
39078D48778M0687K4659j7650n6107q1389j13767j65234k16349k36643k09358
39068e82373j33439k4312P9397J32780J23229P8744L0016j7895o7338j05433j20286
39057f06910j24525j40804j72356k05187k28473k32572j98553j18990k7828K0589
39047b035609J2803m537K1004R0573J64005K10706K30491K31594K11562J66643
$$ y = [-1237346, -1267944, -1250877, -1193197, -1128512, -1085599, -1065700, -1040944, -970897, -831395, -637372, -436536, -276942, -178900, -131464, -106880, -80914, -51375, -39365, -61851, -99382, -102251, -37817, 72325, 167546, 197704, 157085, 78484, 2102, -51997, -88333, -118477, -142618, -149137, -126488, -69715, 19495, 129270, 236198, 318500, 371663, 403774, 419433, 421340, 424578, 448778, 489465, 514124, 496474, 440367, 358978, 245211, 79977, -136372, -373015, -582373, -715812, -740124, -660727, -527947, -404718, -325974, -295958, -313853, -381191, -486624, -606910, -731435, -872239, -1044595, -1249782, -1478255, -1710827, -1909380, -2028370, -2056198, -2035609, -2022806, -2027343, -2006339, -1915766, -1751761, -1541055, -1310564, -1078970, -867408, -700765]
39037g00765J06478N0059J2579J051J5497M4893O5238N3858J0855l9626p4040
39026d53923r0342r9584j03434r0715n5263o563M0771Q0265J11939J34146J43651
39015c89052J40746J29152J12185R2015P0344M6929K0240p881l1793m9902o8174
39004F4809q8941r8763p8030k8276J5630J0064n6655j50641k21294k40299k09908
38993a082304j42555m9441M7625J12798J24108J00529Q5025R9994J31552J55890
38983d16779J63805J55676J30839R3559N7627L2787J3537r604l5257n6119p0195
38972E9876p7358p3382n8688m4377l5837j8295K4268Q0655J21673J35626J33667
38961B47828J18456P3471k805p2633r1972o0962k1994q830j5116j6184l362J6862
$$ y = [-700765, -594287, -544228, -531649, -530598, -515101, -470208, -404970, -351112, -340257, -379883, -453923, -544265, -643849, -747283, -837998, -893261, -899824, -859053, -778788, -666849, -532703, -389052, -248306, -119154, -6969, 85046, 155390, 202319, 222559, 214678, 182885, 132983, 64809, -24132, -122895, -200925, -229201, -213571, -203507, -260162, -410803, -632097, -872396, -1082304, -1224859, -1274300, -1226675, -1113877, -989769, -889240, -804215, -704221, -572669, -416779, -252974, -97298, 33541, 127100, 184727, 217514, 231051, 221447, 186190, 130071, 59876, -17482, -90864, -149552, -193929, -229766, -248061, -223793, -143138, -21465, 114161, 247828, 366284, 439755, 436950, 364317, 272345, 211383, 189389, 180559, 165443, 149259, 145897, 162759]
38949A62759M7383J03373J83649K50123K49268J57590M034j50245k50665k74929
38939D82340k36954j74072j22568r4523p6879n4353k8098q829l77Q61m645k0521
38927c38618m6865p8936j09567j25694j10469o2554q288K1993K8079L3291M5542
38916g52086M8171L4303K3963L1583L8981K3515k734r859J187l295m0066q3282
38904f89619r8258q0997n1566k3546M013L2774N8739P8448R1891R9596J02136
38893d76389J00630R4409Q2782P2549P6108R4925J11900J09832R1769P1490M9620
38882D79625J6948j7871k4651J1763O4133Q7620O6639K3485j5339m4456o9570
38871E78326r0238j03910j16343j33194j43831j26428p2742j386N6172P8935O6386
$$ y = [162759, 210142, 313515, 497164, 747287, 996555, 1154145, 1158179, 1007934, 757269, 482340, 245386, 71314, -51254, -145777, -222656, -277009, -305107, -313936, -314313, -313452, -318097, -338618, -385483, -464419, -573986, -699680, -810149, -872703, -880991, -858998, -830919, -797628, -752086, -703915, -669612, -645649, -614066, -575085, -551570, -554304, -564163, -562976, -566271, -606337, -689619, -787877, -868874, -920440, -943986, -939973, -907199, -848460, -770012, -678121, -578525, -476389, -375759, -281350, -198568, -126019, -49911, 45014, 156914, 266746, 358515, 430005, 479625, 496573, 478702, 454051, 465814, 529947, 617567, 684206, 707691, 692352, 647896, 578326, 488088, 384178, 267835, 134641, -9190, -135618, -208360, -209746, -153574, -74639, -8253]
38860h253L2669n081l6068n7382o7314o1059l9014j7332j9329n0787r0003j08288
38848e27241r6327o6371l5912j7788k0495m4193p3575q4890o7227l4245j1217
38837a079481j0627j9899j1995K8429Q5308J21916J18733R7202R5782J24387J55389
38826b94856J60194J38793J07333P3340L6241q06l7315q5657j54365k22274k48979
38815e28351k16715j47490p3536o231N5680J01240J09215P3567J4281l9534o9928
38804g27802p3588n5658k6930j668J2022K2772N0504J03171J60041J85809J64017
38793a87310J10724N3404N950k9307m7179m3260k6872j2177M076L6957Q0069R7519
38781D2594O3714o80m8046n2779k8121l61J8161L1128M6896O8372Q7200Q8100
$$ y = [-8253, 24416, 19335, -16733, -74115, -141429, -202488, -241502, -258834, -278163, -328950, -418953, -527241, -623568, -689939, -725851, -743639, -764134, -808327, -881902, -966792, -1034019, -1068264, -1079481, -1090108, -1110007, -1122002, -1093573, -1008265, -886349, -767616, -670414, -574632, -450245, -294856, -134662, 4131, 111464, 184804, 221045, 220239, 182924, 97267, -57098, -279372, -528351, -745066, -892556, -966092, -972323, -916643, -815403, -706188, -632621, -618340, -657874, -727802, -801390, -857048, -883978, -885646, -873624, -850852, -800348, -697177, -537136, -351327, -187310, -76586, -23182, -17232, -46539, -93718, -136978, -163850, -176027, -171951, -134994, -54925, 42594, 106308, 105628, 57582, 4803, -23318, -23679, -5518, 25610, 72506, 140878, 228078, 316178]
38769C16178O5600L4043J2614K743r641l0919n0950n9327n8929n7078n1112l1650
38757H1572p35J6791j4393j07004k26115l07392l12710k63455k07318j58913r1666
38746a591338J3042J32005K24967K76067K97146L01222K87520K48430J80919R3554
38736D63534Q209n0700p5529q0246q2671q8817r7195j05428j04004p6944k3778
38725c13569K6714M0267J2193l1566o2235o5873m3600j3772q832m6339r9869j19463
38713g25944q8510m2936k5366l7280m8877m1545k3168r133n391r515j6036j8898
38701a092599j5485q560r44Q179J8154K4939L0268M4294O8914Q5751P4509M0016
38689g22564O654j2709k6080l8421l6381p572L6825P1384Q2088P2026M7281J0555
$$ y = [316178, 381778, 415821, 428435, 431178, 421537, 390618, 339668, 280341, 221412, 164334, 113222, 81572, 80837, 97628, 83235, -23769, -249884, -557276, -869986, -1133441, -1340759, -1499672, -1591338, -1578296, -1446291, -1221324, -945257, -648111, -346889, -59369, 189061, 369980, 463534, 471743, 421043, 345514, 265268, 182597, 93780, -3415, -108843, -212847, -289791, -313569, -286855, -246588, -234395, -265961, -328196, -394069, -437669, -451441, -460273, -506612, -606481, -725944, -814454, -857390, -882756, -920036, -968913, -1010458, -1033626, -1042759, -1048150, -1057665, -1073701, -1092599, -1108084, -1116644, -1117588, -1109409, -1091255, -1066316, -1036048, -991754, -922840, -837089, -762580, -722564, -715910, -728619, -754699, -793120, -829501, -837073, -800248, -728864, -646776, -574750, -527469, -516914]
38677e16914l1040o2688p0067m6845L647O5863J12623J21002R3897N7653L1890
38666b40979Q975k8008p3540r9344q6447m6897j0847j888k8749q7590j57831k00653
38654a053798j80022r4962J3641R3615J18555R7908O1122L7596M3898P8193J23845
38643f60409J61853J80814J75536J43412Q9925L3708n014k3294l4635m6576m7765
38632c2445k3842J9286N5527O0939L2355j3290n3766p7709q9260r4246q1177k6136
38620c23764P3054J73015K10800J59841N4736m0961q5340p7818m2395k687K9133
38609A27614M7867M6471J7353l3421p9116r2740p7553o4958p4082q3183n3198
38598c18946K4425J13559J64560J50891P9611j8645j04312j44707j28917p2986
$$ y = [-516914, -547954, -610642, -680709, -727554, -723907, -658044, -545421, -424419, -330522, -272869, -240979, -232004, -260012, -333552, -432896, -519343, -566240, -577087, -578975, -607724, -695314, -853145, -1053798, -1233820, -1328782, -1315141, -1221526, -1102971, -1005063, -943941, -906345, -862447, -784254, -660409, -498556, -317742, -142206, 1206, 91131, 124839, 119825, 96531, 61896, 15320, -32445, -56287, -37001, 18526, 79465, 111820, 98530, 44764, -32945, -122205, -216451, -297628, -323764, -250710, -77695, 133105, 292946, 347682, 306721, 221381, 143563, 101168, 98481, 127614, 175481, 221952, 239305, 205884, 126768, 34028, -43525, -108483, -182565, -265748, -318946, -294521, -180962, -16402, 134489, 214100, 195455, 91143, -53564, -182481, -255467]
38588b55467j0932K2968J3105k6094n8365n3588j2000M0234P7491R3548R7671
38577g1429R8718R2755O2962l563r1661j56058j56501r5974j3813N7838J14895
38566a61831J55388J54267Q5163l6978j52173j99716j61923o8151L2158R7616
38556b56180J09094P1112M753o4332j18039j52258j72731j81810j68978j19312
38546a048681l4933N5807J17305J37001J34457J39096J60575J82470J83143J57866
38536A84106J17674P1887K1866k6270n4411m8690j9138O386O968j8386n7182r1682
38524I3128j04064q8466o1000m6231n0359n8576o0640o4056p5610q4761p6140
38513f76775m7225l602N0651J04218J32329J19141Q2493N9024O4597Q2022Q5058
$$ y = [-255467, -266399, -243431, -230326, -256420, -314785, -368373, -380373, -340139, -262648, -169100, -71429, 27289, 120044, 183006, 179443, 87782, -68276, -224777, -320751, -334564, -276726, -161831, -6443, 147824, 232987, 196009, 43836, -155880, -317803, -385954, -353796, -256180, -147086, -75974, -71221, -135553, -253592, -405850, -578581, -760391, -929369, -1048681, -1083614, -1027807, -910502, -773501, -639044, -499948, -339373, -156903, 26240, 184106, 301780, 373667, 395533, 369263, 314852, 266162, 247024, 253410, 260378, 241992, 184810, 93128, -10936, -99402, -160402, -206633, -256992, -315568, -376208, -440264, -515874, -600635, -676775, -724000, -727602, -676951, -572733, -440404, -321263, -238770, -179746, -115149, -33127, 51931]
38502E1931N9990O526o3151j22023j41554j15992o4640p767M7079R2878J16545
38491a40178J16459J12206J20572J29617J12725O4706Q325l5215o7283r8369j24970
38480A98595j29082r7675l8374K2305N5851N2823L0732J6936K0692K6517J7935
38469A77255k94j2384j7836l2682o2059q5722q0985n2563k8342k8422m7883o8209
38457c40126p4938o3000l5537l491J8929K3554J2275o967k4218l0828k8165l3128
38445e85640o3906j15296j55581j53038j02188k5966L7965N5118J7725l9536o1207
38434a191550k2305M8594J04894J28638J31243J23626J07380Q8902P9277P8351
38424c22950P6199P2293P6738Q9147R2493P4728M3589J2977j3894l9455n9624
$$ y = [51931, 111921, 118447, 55296, -66727, -208281, -324273, -388913, -396680, -349601, -256723, -140178, -23719, 88487, 209059, 338676, 451401, 516107, 524432, 489217, 421934, 323565, 198595, 69513, -28162, -66536, -44231, 11620, 64443, 95175, 112111, 132803, 159320, 177255, 176961, 164577, 146741, 114059, 52000, -33722, -114707, -167270, -195612, -224034, -271917, -340126, -415064, -478064, -513601, -517092, -498163, -474609, -462334, -469301, -493519, -524347, -552512, -585640, -649546, -764842, -920423, -1073461, -1175649, -1201615, -1163650, -1108532, -1090807, -1130343, -1191550, -1213855, -1165261, -1060367, -931729, -800486, -676860, -569480, -480578, -401301, -322950, -246751, -174458, -97720, -8573, 83920, 158648, 202237, 215214, 201320, 161865, 102241]
38413A02241o6876o0894m8331l4614k1727j1751o562k351J2464M8494R9478J37851
38401A47422J36901J00928O1323L5293K988n9151j34893j80767j76793j41298
38391b08047r7185n0509p438J5828J5409J1872K3183M0153M3602L1651J3691r256
38379a77046l8379o0854o1366m6606l8988m5540m8319k6820K2587Q8642J51785
38368b80904J87120J76274J24600N9166M625l3681o0965p6135p0377l9452P481
38357b248N2314Q1489R5997J06649J18780J25125J15607Q9048N1424P936l7930
38346H04191q2619j25585j67724j98575j92781j34240m3713L1178N8078M4281
38336g509J7992l667k3039m8529q2026j15267j31363j13359n9281J0951O8571
$$ y = [102241, 35365, -25529, -73860, -108474, -130201, -141952, -148514, -150865, -138401, -89907, 9571, 147422, 284323, 385251, 446574, 481867, 484855, 425704, 290811, 110044, -66749, -208047, -305232, -355741, -363179, -347351, -331942, -320070, -296887, -256734, -213132, -181481, -167790, -177046, -215425, -276279, -337645, -384251, -423239, -468779, -517098, -543918, -521331, -432689, -280904, -93784, 82490, 207090, 266256, 270881, 237200, 176235, 100100, 29723, -9729, -2248, 50066, 131555, 227552, 334201, 452981, 578106, 693713, 782761, 834185, 842121, 804191, 721572, 595987, 428263, 229688, 36907, -97333, -141046, -109868, -51790, -7509, 10483, 6816, -16223, -64752, -146778, -262045, -393408, -506767, -566048, -555097, -486526]
38325d86526R6682R6287P6207M5620J6393J503K495M056q567k8357l3513j6608
38313b34328N959J9329L2059O0852J02518J35708J45232J29155Q5417J0696q3946
38302D08651j72360k34053k64192k62347k29166j79407j38110j11768p8960k2455
38292a284167M3909R3769J18967J26624J21618J11935J16451J40608J52601J12462
38282a45223K3909o7487j26530j52357j51680j23654q3678o9176r6754j33590
38272a126220j35901j01488n9791k2048K8153R5826J55466J81275J77086J63333
38262f44309J46837J17108O6330J336o1689j04904j13020q1276k4343K9065N7507
38251f11358O2510O0444O1230N9895M8205K7592O986p858j7732k3725k1866o211
$$ y = [-486526, -389844, -293557, -217350, -171730, -155337, -153834, -151339, -147283, -155850, -184207, -217720, -234328, -228369, -209040, -176981, -116129, -13611, 122097, 267329, 396484, 481901, 492597, 408651, 236291, 2238, -261954, -524301, -753467, -932874, -1070984, -1182752, -1261712, -1284167, -1240258, -1146489, -1027522, -900898, -779280, -667345, -550894, -410286, -257685, -145223, -121314, -188801, -315331, -467688, -619368, -743022, -826700, -895876, -992630, -1126220, -1262121, -1363609, -1423400, -1445448, -1417295, -1321469, -1166003, -984728, -807642, -644309, -497472, -380364, -314034, -312698, -374387, -479291, -592311, -673587, -697930, -668865, -611358, -548848, -488404, -427174, -367279, -319074, -291482, -284496, -292354, -310086, -333811, -355677, -361888]
38239c61888K2235M9521N4934K8634j6934n9003q8360j13430j38563j49437j29201
38228i01492q2006l0121Q603L1313M2785M9364N9031P6158R4943J07154J16396
38217d27872J34057J58971J71819J55106J11466N8320J1773j9739l3972l5790
38207B84139l6884m6960o3129p0504n5387j8897K2511N2178O8781Q2836R7240
38196C15924R8791P2888J8877n3898j33562j98372k14281j60223n4782N7024J41489
38185a10125J87698J90204J46363P3133Q60n9193j20076j82656k17829k02481
38175b94102j53378j04123o3816k2645J3362K3032N089j3327r968R137K6685L8892
38163e45162N3665P4378R4810J04933R6316O7662L0959Q103J4669M5614P7832
$$ y = [-361888, -339653, -290132, -235198, -206564, -223498, -282501, -370861, -484291, -622854, -772291, -901492, -983498, -1013619, -1005016, -973703, -930918, -881554, -822523, -746365, -651422, -544268, -427872, -293815, -134844, 36975, 192081, 303547, 361867, 373640, 353901, 319929, 284139, 247255, 200295, 137166, 66662, 11275, -7622, 14889, 67067, 135848, 218684, 315924, 414715, 487603, 506480, 452582, 319020, 120648, -93633, -253856, -308638, -251614, -110125, 77573, 267777, 414140, 487273, 488133, 428940, 308864, 126208, -91621, -294102, -447480, -551603, -615419, -638064, -624702, -601670, -596581, -609908, -619876, -610739, -584054, -545162, -491497, -417119, -322309, -217376, -121060, -53398, -22439, -14336, 333, 45947, 123779]
38152A23779Q7026O4907K4787q192j5290L066K7926L2314l744p7493j59053k10769
38140a10736k17020j91570j56006j21234r2244p4833o5874m8737j3210K7045M9917
38129a014502N0045L5051O799l3659o9298q0404p5457q3821j10724j22816r1810
38118a590596l4579O423J1095m414j1818O666N2812J12154J58850J73178J58146
38107i62083J34184J17812J09161R7662P4953M3823J7194N736O259Q702J4507
38096c32090L5687P0011R0450P1791J9957l6310p4576q6753o8718k4301K1438
38085c13414L6024J5933n585L347L7477O4516O0963K9197j1365l8418l8338j6607
38073a76270M613R034N093J2433L0304L2041l005n9891r8402r0572m3972Q270
$$ y = [123779, 210805, 275712, 300499, 292307, 277017, 280083, 308009, 340323, 336579, 259086, 100033, -110736, -327756, -519326, -675332, -796566, -888810, -963643, -1029517, -1078254, -1091464, -1064419, -1014502, -964457, -929406, -922607, -956266, -1025564, -1105968, -1181425, -1265246, -1375970, -1498786, -1590596, -1625175, -1618752, -1607657, -1612071, -1623889, -1617223, -1564411, -1452257, -1293407, -1120229, -962083, -827899, -710087, -600926, -503264, -428311, -384488, -367294, -361558, -355299, -346597, -332090, -296403, -226392, -135942, -64151, -44194, -80504, -155080, -241833, -310551, -334852, -313414, -277390, -261457, -267042, -263695, -226218, -161702, -100739, -71542, -82907, -121325, -159663, -176270, -171657, -162623, -157530, -145097, -114793, -82752, -85757, -145648, -244050, -334622, -378594, -370324]
38061c70324L4724K6837L154m968J9671O0324P7282M5480k0308q2952j21165j40364
38049d72609j48953j42332j19291r8083r7482j07476r7083n1746J1943O8262J01162
38038a153688R9301N6827o263m3548k4452L0341P3452Q3256P2200N1177J5430
38027g45967k8593n0071k5356L1241Q2150J01500Q5171M1340j0812m2269l5150
38016e96816k064K9657M9972O6810P8599O8454L1606j1151l9592n9556q7291j17026
38004e88398j21463q4940k4520K5400M3899L8414L4356N1175Q4769J11753J11622
37993c17933Q3214L9377p980n0851p7467p3699l8488O665L1216K1839o290k7026
37981d17423l2218l9216o5668j00778j11692q2188l6422j4914k9015m7006k5966
$$ y = [-370324, -335600, -308763, -305609, -310577, -290906, -230582, -153300, -107820, -128128, -211080, -332245, -472609, -621562, -763894, -883185, -981268, -1078750, -1186226, -1283309, -1335055, -1323112, -1254850, -1153688, -1054387, -997560, -1003823, -1047371, -1071823, -1041482, -968030, -884774, -812574, -761397, -745967, -774560, -824631, -849987, -818746, -736596, -635096, -549925, -508585, -519397, -561666, -596816, -598880, -569223, -519251, -452441, -373842, -305388, -273782, -284933, -324525, -384081, -471372, -588398, -709861, -794801, -819321, -793921, -750022, -711608, -677252, -626077, -541308, -429555, -317933, -234719, -195342, -203322, -254173, -331640, -405339, -443827, -437162, -405946, -384107, -390397, -417423, -449641, -488857, -554525, -655303, -766995, -849183, -885605, -900519, -929534, -976540, -1002506]
37970a002506M7849J49362K36584K77646K62299J97842J00959o563j01237j66345
37960d110j99682k07526j88238j29412k9153Q4969J69745K00504J84337J40685
37950B2119Q1087J2476n1794r6807j19047j25867j23575j13575r9062q6151p5144
37939g75340n7054k4032J8817N4537O5512M3253o842o3923r6883q0855j6813O5010
37927h74613J26221J49020J45921J43368J58457J90044K25120K48795K52649K41329
37917A006311K30624K32519K42418K48158K51577K72343L29750M30783N73209
37908C817692P34288Q41240P81672M90857L9985l91934o56561p40470p30382p01563
37898C484824o61541n84441m64730l30309k21984j67092j61266j71102j63557
$$ y = [-1002506, -954657, -805295, -568711, -291065, -28766, 169076, 270035, 263472, 162235, -4110, -203792, -411318, -599556, -728968, -758121, -673152, -503407, -302903, -118566, 22119, 103206, 115682, 63888, -32919, -151966, -277833, -401408, -514983, -614045, -700196, -775340, -832394, -856426, -837609, -783072, -717560, -674307, -681149, -745072, -841955, -922810, -939623, -874613, -748392, -599372, -453451, -310083, -151626, 38418, 263538, 512333, 764982, 1006311, 1236935, 1469454, 1711872, 1960030, 2211607, 2483950, 2813700, 3244483, 3817692, 4551980, 5393220, 6174892, 6665749, 6705734, 6313800, 5657239, 4916769, 4186387, 3484824, 2823283, 2238842, 1774112, 1443803, 1221819, 1054727, 893461, 722359, 558802]
37889E58802j35185j06625r2871r1017r2485q8923o5571r987O4419J20608J34334
37878A95499J15890Q8385O1200L7327L0404N4697J06302J71056K44259L26120
37868A431139M04798M65770N20058O05081P46133R15546J024394R56439O40025
37859G709383J23130m21349p96801r14824q34043o80048n42682m41804l58266
37850B842696k76419k03755j59351j43462j27042q6331m0112k6109m0546l4507
37840A705062J6668P1616P3623J9341m9972j06578j52380j86834j94794j71086
37830A024666j31348r1055n2617j9228l909j5069m2785o4868o0772k1882L9929
37819E61062R3854J12393R4243N7688J6390k4773n5182o0488m2117j7814M27J2870
$$ y = [558802, 423617, 316992, 224121, 133104, 40619, -48304, -113875, -123862, -59443, 61165, 195499, 311389, 399774, 460974, 498301, 528705, 583402, 689704, 860760, 1105019, 1431139, 1835937, 2301707, 2821765, 3426846, 4172979, 5088525, 6112919, 7069358, 7709383, 7832513, 7411164, 6614363, 5699539, 4865496, 4185448, 3642766, 3200962, 2842696, 2566277, 2362522, 2203171, 2059709, 1932667, 1846336, 1806224, 1780115, 1739569, 1705062, 1721730, 1793346, 1866969, 1886310, 1836338, 1729760, 1577380, 1390546, 1195752, 1024666, 893318, 802263, 749646, 730418, 726509, 711440, 668655, 603787, 543015, 521133, 561062, 654916, 767309, 861552, 919240, 935630, 910857, 855675, 795187, 753070, 735256, 735683, 748553]
37807G48553J5236k281l0530l7331l989M7379P7337O9317L4164j2505n9645r4357
37795G51348j04067q6359m9105o169J9976L977n5738j21253j46412j27512j09054
37784c0368j34379j99839k59628k66309k05607j03811p598N1346P9227J06637
37774i70329J52078K03631K35126K31246J95090J41621Q9489N1329K4297n560
37764C48018m4307q0739j02267j14502j35291j70380k03285k09670j74855r8458
37754i85736O004J09518J75438J83429J48231J07503Q7714Q5102P9152N6333J6735
37743F9423l3663q6394j28569j48878j49120j42226j34064j13025o4430O756P3215
37732h50975J05466R2240M4279j3741n2123m5670J1610R4373J55173J58973J13748
$$ y = [748553, 763789, 761508, 730978, 693647, 689658, 737037, 814374, 883691, 917855, 905350, 845705, 751348, 647281, 560922, 511817, 505648, 525624, 529601, 473863, 352610, 206198, 78686, -30368, -164747, -364586, -624214, -890523, -1096130, -1199941, -1207539, -1156193, -1076966, -970329, -818251, -614620, -379494, -148248, 46842, 188463, 277952, 329281, 353578, 348018, 303711, 222972, 120705, 6203, -129088, -299468, -502753, -712423, -887278, -985736, -979732, -870214, -694776, -511347, -363116, -255613, -167899, -82797, -3645, 52688, 69423, 35760, -50634, -179203, -328081, -477201, -619427, -753491, -866516, -930946, -924190, -850975, -745509, -653269, -608990, -622731, -674854, -720524, -708914, -614541, -459368, -300395, -186647]
37721a86647O0940L1863K0623M393k2395m8802p2636j00264j18749r5105k0401
37710e47180O2802R9056P8662L9249J6595J7431L8218Q0069J31124J56909J32330
37699C05265P6601L6267L2210L7299J0820n3739j20061j43400j10425m7785N483
37688B8535L3066M7933O5006P4610N1634q958p4219r7584o0534J2784Q0707J17999
37676B70979J22418R5018K8481p6496j90696k67451k79714k39515j77995j15609
37666h30580n8961j6796k364j7469m5251o4474o5097m6395p951M7730J04861J36323
37654h66424J24183Q0589M5163N4448J07611J63303J76394J39073Q1603L4530
37644A40473J263k7797m7885m3301j5399J0037J0059j0977l1365l8210l5013k9723
$$ y = [-186647, -125707, -93844, -73221, -68828, -91223, -140025, -212661, -312925, -431674, -526779, -547180, -484378, -385322, -306660, -267411, -250816, -233385, -195167, -115098, 16026, 172935, 305265, 381866, 418133, 450343, 487642, 498462, 444723, 324662, 181262, 70837, 23052, 28535, 61601, 109534, 174540, 249150, 300784, 291826, 217607, 120023, 59489, 72273, 152980, 270979, 393397, 488415, 516896, 440400, 249704, -17747, -297461, -536976, -714971, -830580, -889541, -906337, -908701, -926170, -971421, -1035895, -1100992, -1147387, -1155338, -1107608, -1002747, -866424, -742241, -661652, -616489, -562041, -454430, -291127, -114733, 24340, 105943, 140473, 141736, 113939, 66054, 22753, 7354, 17391, 27450, 16473, -14892, -53102, -88115, -117838]
37632a17838k6977l0627m2965n8618o6800o2396m8789k8130K737M1391P2505Q0419
37620b86088O6606M6782L1445J6618n761l6221o9837j03391j34506j56777j61790
37609g92920j45862j11112o1165j389N6038R4688J07907J07372J10067J15423
37599e20953J02305N3845j8052p8618j00056q2234m6134j3082R667L0238O3351
37588e99723J15921J76549K20381K26570J90630J21905L5547n1201j22628j70646
37578A43305j93909j88533j48059p9824j3171K1205J8571j459j8669k2777o874
37567d90194K8618O2271O2758K5308j7460l4059l1337l8703o6116r7015j17567
37556g13496j32087j48024j63790j76006j82566j71511j22776l3853O5438J36719
$$ y = [-117838, -144815, -175442, -218407, -277025, -343825, -406221, -455010, -483140, -480403, -439012, -366507, -286088, -219482, -172700, -141255, -124637, -130398, -166619, -236456, -339847, -474353, -631130, -792920, -938782, -1049894, -1111059, -1112448, -1056410, -961722, -853815, -746443, -636376, -520953, -418648, -364803, -382855, -461473, -561529, -643763, -689897, -702979, -693312, -663074, -599723, -483802, -307253, -86872, 139698, 330328, 452233, 487780, 436579, 313951, 143305, -50604, -239137, -387196, -467020, -480191, -458986, -440415, -441874, -460543, -483320, -490194, -461576, -399305, -336547, -311239, -328699, -362758, -394095, -432798, -498914, -595929, -713496, -845583, -993607, -1157397, -1333403, -1515969, -1687480, -1810256, -1844109, -1778671, -1641952]
37546a641952J67806J75556J80344J89370K01603K14692K22245K12821J76852
37537I9337J10929J5096j03953k20156k87833k71787j84424q3473k1849n98K1449
37526i27262P3077J35822J66274J43489Q7529L7745K0747L4381N2470M5910P533
37515a22285m2525p9181r4880r3412p1847k7711J7164K3036k5105r3607j30874
37504g41227j15465o7112k0796l51p785k3808k2355L592L2464L8389K0025m179
37492i08608k1707l1737k9865p134L0706N8032N2076J2868m3307r9441j39729
37481a127846j46420j08862l7080M0197R4084J12150R8838O3832J4841l5630o2509
37470a094405m1058K6178J05301J63190J95475K12663K10780J76182J14674N2511
$$ y = [-1641952, -1474146, -1298590, -1118246, -928876, -727273, -512581, -290336, -77515, 99337, 210266, 225362, 121409, -98747, -386580, -658367, -842791, -926264, -948113, -948711, -927262, -854185, -718363, -552089, -408600, -321071, -283326, -262579, -228198, -175728, -129818, -122285, -164810, -243991, -338871, -432283, -504130, -531841, -514677, -491641, -516746, -610353, -741227, -856692, -923804, -944600, -944951, -952736, -976544, -998899, -995307, -962843, -924454, -904429, -908608, -930315, -962052, -991917, -999051, -968345, -910313, -858237, -845369, -888676, -988117, -1127846, -1274266, -1383128, -1420208, -1380011, -1285927, -1173777, -1074939, -1011107, -996266, -1031896, -1094405, -1135463, -1109285, -1003984, -840794, -645319, -432656, -221876, -45694, 68980, 121491]
37460A21491N315l3069o4768p2915m6190k905K5349K6396J3573Q103K4635O3035
37448F8050J01662J06643O0748k0195j05115j72215k09909k10875j82011j47937
37438g11154j24405r5857l9844L1920P9422Q0687N1896K0656J62o655R42J5296
37426f96934K1252J2888q27j1272j8177j9302r215M641K815j7502l0779j4840
37414g77252J8985M3888N4234O4027P5377P1568M4778J3475M248K4086N4329O6799
37402b41458M6693P264j8625r359K3418N1138O4287Q0204J13752J52828J69557
37391D39699J47434R2117K4819k5688l1954J6633J03930J99985K86773L66437
37381A620185M42750N02727N25683N10421M85951M89831N36703O09417O77405
$$ y = [121491, 126806, 93737, 28969, -43946, -90136, -93041, -67692, -41296, -27723, -19620, 5015, 68050, 169712, 276355, 337103, 316908, 211793, 39578, -170331, -381206, -563217, -711154, -835559, -931416, -971260, -939340, -859918, -779231, -727335, -706679, -706517, -713172, -712230, -696934, -675682, -662794, -663621, -674893, -693070, -712372, -721587, -716946, -714131, -731633, -762412, -777252, -758267, -714379, -660145, -596118, -520741, -449173, -404395, -390920, -386672, -362586, -308257, -241458, -194765, -187501, -206126, -215485, -192067, -140929, -76642, 3562, 117314, 270142, 439699, 587133, 679250, 704069, 678381, 646427, 663060, 766990, 966975, 1253748, 1620185, 2062935, 2565662, 3091345, 3601766, 4087717, 4577548, 5114251, 5723668, 6401073]
37372F401073P18922P27276P04239O54305N84720N06085M29104L58597K89779
37363A1374100K10919J10709j6647j70550l40903n02155o17834o61455o32995
37354H753189n50569m34635l15330k47761k87320m29633n90945o72838o45988
37345D578170n58228m69551m01210l45301k95267k52804k20876k03993k05271
37336A625669k12499j99094j54358j05074q9253j09791j30089j17799p8395m0003
37326C89314j8659j0155q738j8790m4712p7769r9919r9819q1289n5721l0600r333
37314a66190J147p414l0299m5740l5818j0238L35k3171o9217j09377j21068r4243
37302g11293l0586M9780J07892J10629O1470r03l7161l4996n314L5432P3655J00047
$$ y = [6401073, 7119995, 7847271, 8551510, 9205815, 9790535, 10296620, 10725724, 11084321, 11374100, 11585019, 11695728, 11679081, 11508531, 11167628, 10665473, 10047639, 9386184, 8753189, 8202620, 7767985, 7452655, 7204894, 6917574, 6487941, 5896996, 5224158, 4578170, 4019942, 3550391, 3149181, 2803880, 2508613, 2255809, 2034933, 1830940, 1625669, 1413170, 1214076, 1059718, 954644, 865391, 755600, 625511, 507712, 429317, 389314, 370655, 360500, 351762, 332972, 288260, 210491, 110572, 10753, -70536, -126257, -156857, -166190, -165043, -172457, -202756, -248496, -284314, -294552, -294217, -317388, -386605, -495982, -617050, -711293, -741879, -692099, -584207, -473578, -412108, -413011, -450172, -485168, -490482, -455050, -381395, -281348]
37290b81348J11530J07177P8743J5552p2608j47849j74805j56126j24722j03882
37280g48338r0724p8035p0448o8206n2192m385O2033J09577J14739Q8898O0240
37269f76841M4908L9257L2867K3145J8371K7728M7782O2081N8340M2775L0655
37258b48932K5497J7871N139l40J0346K5673K6218J0404k974K045K1966M2772
37246f4315N6867O4916O5872N4368K9704J510j8038k5626k6580k4785j8971j1236
37234H3686j2742l2655o2173p8494o9861n1881n2076p9089j13129j27540j13529
37223g09483q0640l9930L909M5453P5387R1121J03537J23665J44928J47383J19100
37212B4430O5033l319p2920j20823j18819o1133K2373R5623J50663J95272K16093
$$ y = [-281348, -169818, -62641, 16102, 31654, -40954, -188803, -363608, -519734, -644456, -748338, -839062, -917097, -987545, -1055751, -1107943, -1112328, -1050295, -940718, -825979, -737081, -676841, -631933, -592676, -559809, -536664, -518293, -490565, -442783, -380702, -322362, -279587, -248932, -223435, -205564, -200425, -200765, -190419, -164746, -138528, -128124, -131098, -129053, -107087, -64315, -7448, 57468, 123340, 177708, 207412, 208922, 190884, 165258, 138678, 113893, 94922, 83686, 70944, 38289, -23884, -102378, -172239, -224120, -276196, -355285, -468414, -595954, -709483, -790123, -830053, -826144, -780691, -705304, -614183, -510646, -386981, -242053, -94670, 24430, 89463, 86144, 13224, -107599, -226418, -287551, -265178, -169555, -18892, 176380, 392473]
37201C92473J84759J07281L8829K9084O7918J03907J05184Q2179N9098M7093M5515
37190A263320M8110M1897J5032k7993o9288r7510j13506j17653j09954j05494
37180G26961j26776j68299j88951j58777r9360n5414l5071l704O3088J43634J93853
37169B91184J89975J41661P8814L4273K4974L6664L5324N819k6375k2787K2979
37158H12505P8623J07799R8533N7743n855q2480j52479j90834j85381j46465r5123
37147B96586m4075N317M8278O7582M8122l89m4499n6018l5667m236K3890N1015
37135C55906Q3620J19255J47319J55931J37251R5206N3017M4954Q9895J72814
37125A455168K57573L16693L43767L41887L13910K69378K29797K14559K22937
$$ y = [392473, 577232, 684513, 723342, 752426, 820344, 924251, 1029435, 1111614, 1170712, 1217805, 1263320, 1311430, 1353327, 1368359, 1340366, 1271078, 1173568, 1060062, 942409, 832455, 726961, 600185, 431886, 242935, 84158, -15202, -70616, -105687, -109391, -46303, 97331, 291184, 481159, 622820, 701634, 735907, 760881, 797545, 832869, 838688, 812313, 789526, 812505, 891128, 998927, 1097460, 1155203, 1149348, 1066868, 914389, 723555, 538174, 391709, 296586, 252511, 257828, 306106, 373688, 421810, 421421, 376922, 320904, 285237, 281001, 304891, 355906, 439526, 558781, 706100, 862031, 999282, 1094488, 1147505, 1192459, 1282354, 1455168, 1712741, 2029434, 2373201, 2715088, 3028998, 3298376, 3528173, 3742732, 3965669]
37116C965669K38433K50353K62704K80537K97225L01938K94187K82811K72416
37107F446273K59609K45507K44113K68999L11309L39425L27501K81811K31963
37098H956510J97366J72154J45132J20630J08239J01153Q0565L6849l1792j40005
37088I746801l09089n26960p31203q50299q57270p76383o52213n26917m31656
37079D084811l72243l23249k57020j79672j20183q5472n1919p949K2085J4436
37069B723625j3712k4845j2444o652k9074o3944q2266p9721p8237r5281j21944
37058B115505j33050j14088p4640l5803q279J3655L9240O9738J01271J31239J55586
37047B260374J64201J47848J12295Q1758Q3268J22470J72028J87998J45829O2409
$$ y = [3965669, 4204102, 4454455, 4717159, 4997696, 5294921, 5596859, 5891046, 6173857, 6446273, 6705882, 6951389, 7195502, 7464501, 7775810, 8115235, 8442736, 8724547, 8956510, 9153876, 9326030, 9471162, 9591792, 9700031, 9801184, 9881749, 9918598, 9886806, 9746801, 9437712, 8910752, 8179549, 7329250, 6471980, 5695597, 5043384, 4516467, 4084811, 3712568, 3389319, 3132299, 2952627, 2832444, 2746972, 2695053, 2687104, 2709189, 2723625, 2709913, 2685068, 2672624, 2665972, 2636898, 2572954, 2490688, 2410967, 2332730, 2237449, 2115505, 1982455, 1868367, 1793727, 1757924, 1749645, 1763300, 1802540, 1872278, 1973549, 2104788, 2260374, 2424575, 2572423, 2684718, 2766476, 2849744, 2972214, 3144242, 3332240, 3478069, 3540478]
37037C540478k1098p6425j01265r9388o5939k944O2535R3204P5319K9016j3010
37026C420483k7391l047O1070J51145K38740K97558L21861L24532L18630L06145
37016E409726K83743K52137K17738J91331J86729K10598K46963K62818K43263
37007G505046K15530K23140K80370L68765M71574N84356O91471P67792Q19014
36998A1927058Q90642J017848J194376J410023J682373K020838K394729K765820
36990B5303707L085950L187289K748454J543914k15927j908848k963711l270088
36982B7510740l107484k779066k419425k079391j815186j640826j493705j314625
36974A0861032j118235r49122q14218o97526o05468n55568n39206n27423n01138
$$ y = [3540478, 3519380, 3442955, 3341690, 3242302, 3176363, 3173419, 3235954, 3329158, 3404477, 3433493, 3420483, 3393092, 3390045, 3451115, 3602260, 3841000, 4138558, 4460419, 4784951, 5103581, 5409726, 5693469, 5945606, 6163344, 6354675, 6541404, 6752002, 6998965, 7261783, 7505046, 7720576, 7943716, 8224086, 8592851, 9064425, 9648781, 10340252, 11108044, 11927058, 12817700, 13835548, 15029924, 16439947, 18122320, 20143158, 22537887, 25303707, 28389657, 31576946, 34325400, 35869314, 35653387, 33744539, 30780828, 27510740, 24403256, 21624190, 19204765, 17125374, 15310188, 13669362, 12175657, 10861032, 9742797, 8793675, 7979457, 7281931, 6676463, 6120895, 5581689, 5054266, 4553128]
36965D553128m54234l81956k87867j91991j16761p3943p0423j05003j47897j49764
36955B573289r4596k6810k030k1879l8229j3006M5417R7160J04308N9313J628
36944B684565R6R4805K53210L99244M86352N29111N69263O34082P27942Q31080
36934G209750Q83582P93009M99923N0441m13682p52694r15169r32852q59002p35718
36924D827588o03557m98893m26732l62261k96068k55828k62468k84439k64055
36915A573287j80141n9305O5738J77804K57369K78632K38317J67566J01361M9238
36905B669866M383l3923n9464p0478o8695m9246M35Q8269K01903L06740L69972
36894C359762L93871M17062M75362N68988O67901P24062O68381M37394M9563l60728
$$ y = [4553128, 4098894, 3716938, 3429071, 3237080, 3120319, 3046376, 2975953, 2870950, 2723053, 2573289, 2478693, 2451883, 2449853, 2427974, 2389745, 2376739, 2422156, 2519316, 2623624, 2682937, 2684565, 2684661, 2779466, 3032676, 3431920, 3918272, 4447383, 5016646, 5650728, 6378670, 7209750, 8093332, 8886341, 9386264, 9436705, 9023023, 8270329, 7355160, 6422308, 5563306, 4827588, 4224031, 3725138, 3298406, 2936145, 2640077, 2384249, 2121781, 1837342, 1573287, 1393146, 1333841, 1399579, 1577383, 1834752, 2113384, 2351701, 2519267, 2620628, 2669866, 2674249, 2640326, 2580862, 2510384, 2441689, 2392443, 2392878, 2481147, 2683050, 2989790, 3359762, 3753633, 4170695, 4646057, 5215045, 5882946, 6607008, 7275389, 7712783, 7762346, 7401618]
36884G401618o34770p20517o83693o02767n04688m04204l39505l31108l44153
36875B836213l30680k88596k49423k26418k04250j68940j23704q1139n4570m7794
36865A060699m2323q431N9484J32931J85230K20797K58420L05786L65043M42505
36855B980141N32750O08138O42586O32655N79747M69062K90610P4955j10947k04544
36845F495153j81790o5163R0260K28573L23142L75261L91650L83541L84933M39174
36835H864734N51617O73307P39592P06375N49339K65664j01499m63880p36154
36826A1049095q77011q87608q01096o78934n77753m99396m01682k71286j51286
36817E903043q1831n4124m4524n0455o1717l8328M0706J35822J94015K15208K38317
$$ y = [7401618, 6766848, 6046331, 5362638, 4759871, 4255183, 3850979, 3511474, 3180366, 2836213, 2505533, 2216937, 1967514, 1741096, 1536846, 1367906, 1244202, 1163063, 1108493, 1060699, 1018376, 1009945, 1069429, 1202360, 1387590, 1608387, 1866807, 2172593, 2537636, 2980141, 3512891, 4121029, 4763615, 5396270, 5976017, 6445079, 6735689, 6810644, 6699697, 6495153, 6313363, 6248200, 6338460, 6567033, 6890175, 7265436, 7657086, 8040627, 8425560, 8864734, 9416351, 10089658, 10829250, 11535625, 12084964, 12350628, 12249129, 11785249, 11049095, 10172084, 9284476, 8483380, 7804446, 7226693, 6727297, 6325615, 6054329, 5903043, 5821212, 5767088, 5722564, 5672109, 5610392, 5572064, 5612770, 5748592, 5942607, 6157815, 6396132]
36806F396132K85040L50365M25580M98833N55840O09424P02572Q52037J015051
36797A1690874J141168J230321J315780J426367J593262J849595K184441K537737
36789B4969545K880942L264460L751688M356600N084761N973201P034217Q216603
36781F5532017R477697J0834070J2294999J3841225J5551061J7654819K0369491
36774A65555379K3764182K7809021L2218649L5854756L6430987L1477657K0161738
36767C73272369M299475j2423118k6247945l4774457l7483784l5557199l1145870
36760A99939471k6288530k2099201j8768888j6114200j3959419j2143432j0498846
36753H0066955q963160p600803o460305n500761m685319m040546l573736l212169
$$ y = [6396132, 6681172, 7031537, 7457117, 7955950, 8511790, 9121214, 9823786, 10675823, 11690874, 12832042, 14062363, 15378143, 16804510, 18397772, 20247367, 22431808, 24969545, 27850487, 31114947, 34866635, 39223235, 44307996, 50281197, 57315414, 65532017, 75009714, 85843784, 98138783, 111980008, 127531069, 145185888, 165555379, 189319561, 217128582, 249347231, 285201987, 321632974, 353110631, 373272369, 377571844, 365148726, 338900781, 304126324, 266642540, 231085341, 199939471, 173650941, 151551740, 132782852, 116668652, 102709233, 90565801, 80066955, 71103795, 63502992, 57042687, 51541926, 46856607, 42816061, 39242325, 36030156]
36745C6030156k873854k542033k237530j972634j760763j619133j531082j445804
36737B0047323j335749j216486j099392r71002q33956p21980o53918o10979n75093
36728A2028768n51342n37054n07335m50600l86977l36593k99911k80277k90955
36719H387724l23499l40416l17903k71814k27866j90374j53328j19860r7502r0418
36709F254744j01340j23289j30113r9606m5942j892L1305Q4544J66504K40640
36699F275555K66502K37851J73228R6885L6800J1822Q555m100k7639k6416K3050
36688G072093J00199J66198J93362J58781M3139j38138l22921m47255m95041m91351
36678E839066m60612m07335l29273k34561j45491q6693o4422o1166o0196o7793
$$ y = [36030156, 33156302, 30614269, 28376739, 26404105, 24643342, 23024209, 21493127, 20047323, 18711574, 17495088, 16395696, 15424694, 14590738, 13868758, 13214840, 12603861, 12028768, 11477426, 10940372, 10433037, 9982437, 9595460, 9258867, 8958956, 8678679, 8387724, 8064225, 7723809, 7405906, 7134092, 6906226, 6715852, 6562524, 6442664, 6345162, 6254744, 6153404, 6030115, 5900002, 5800396, 5754454, 5752562, 5783867, 5868411, 6034915, 6275555, 6542057, 6779908, 6953136, 7050021, 7086821, 7098643, 7107198, 7103098, 7075459, 7049043, 7072093, 7172292, 7338490, 7531852, 7690633, 7733772, 7595634, 7272713, 6825458, 6330417, 5839066, 5378454, 4971119, 4641846, 4407285, 4261794, 4175101, 4110679, 4049513, 3989317, 3921524]
36668C921524r5587j31297j52129j61439j81632k10533k17890j92416j60206j43008
36658B275387j26221q5302k0861M9301J12472J57438J66392J30600O5038m655
36648B719589n9966q7850p9432m4324j2850r152k8999n1789o3999o4142n7544
36637B159542n5224o6894q7175r8947r5581q7693q3439p7075o3405m7482l1299
36626A365328o681K6991N1855N2102L5895K3435J8476K908m1532j11464j81001
36615A236312k22508k30753k21810k03047j56023o5622M2149J15000J27622J00072
36605E21392O2898K7487m867k9922m8851p0651r3485r8746p6008m2038k4020l1694
36593I1495n1583n9823l8821O202M5445N3247L9504L6659N6385Q0601R7106J16972
$$ y = [3921524, 3825937, 3694640, 3542511, 3381072, 3199440, 2988907, 2771017, 2578601, 2418395, 2275387, 2149166, 2063864, 2043003, 2092304, 2204776, 2362214, 2528606, 2659206, 2724244, 2719589, 2659623, 2571773, 2492341, 2448017, 2435167, 2426015, 2397016, 2345227, 2281228, 2217086, 2159542, 2104318, 2037424, 1950249, 1851302, 1755721, 1668028, 1584589, 1507514, 1444109, 1396627, 1365328, 1358647, 1385638, 1437493, 1489595, 1525490, 1548925, 1567401, 1570309, 1528777, 1417313, 1236312, 1013804, 783051, 561241, 358194, 202171, 136549, 178698, 293698, 421320, 521392, 584290, 611777, 606910, 576988, 528137, 457486, 364001, 265255, 189247, 147209, 123189, 91495, 39912, -19911, -58732, -52530, -7085, 46162, 85666, 122325, 178710, 259311, 356417, 473389]
36581D73389J45875J62352J41380Q4194J2409n2170r1254r1407n6741q317L9548
36570G59258Q8848J35260J55095J31189P9382L4143J6523K5116M4483M9453J5042
36559A533792n9537j41469j90636j92118j58918j13520p3649m4182j3916L0722
36549E76569Q3109J18490J21827R8196N1469k5320j25721k14919k56407k42637
36539A84656j88390j09938k5421M0869P6419R5294J18168J43278J50545J27582
36529F13062P9488K1634k3970l5307j2466R564j2257q3750j61088j85717j32807
36518G6386l2382N4192Q5357P0034M2818J5377k8995r2807j42745j45297j06301
36507b04363n7742j6421K7041Q2895J39089J64168J32158N0974l5295q4374r4216
$$ y = [473389, 619264, 781616, 922996, 1007190, 1019599, 967429, 876175, 784768, 728027, 719710, 759258, 848106, 983366, 1138461, 1269650, 1349032, 1383175, 1399698, 1424814, 1469297, 1518750, 1533792, 1474255, 1332786, 1142150, 950032, 791114, 677594, 603945, 559763, 545847, 576569, 659678, 778168, 899995, 998191, 1049660, 1024340, 898619, 683700, 427293, 184656, -3734, -113672, -139093, -98224, -21805, 73489, 191657, 334935, 485480, 613062, 692550, 714184, 690214, 654907, 642441, 652005, 639748, 555998, 394910, 209193, 76386, 44004, 98196, 183553, 253587, 296405, 311782, 282787, 189980, 47235, -98062, -204363, -262105, -278526, -251485, -168590, -29501, 134667, 266825, 317799, 282504, 198130, 103914]
36496A03914q8453o9916j8356O1554J24686J36461J12533Q6133N9403J3430n0913
36485D70476j10002j45597j53426j33168r1906n0392k5768j2240O347L2021N3896
36474a59759O4151N9965M1851K3359K6689N1336O2898L3958j7014m8177m2318
36463I6939j1602K8959O4986P3043M1378k297j2930K0437O7825J00765J16935
36452E84438J22287J14443R1792O2856M0506L5023M8372O3992N1965K590n3035
36441A165229p6021o6562n6679o3324p3265p0600n3879k7107J456J1806j0996
36430F80058n0389p3266p4752q3715j18161j58484j72616j47011q5971k565P8473
36419b08399J26370J25961Q5895K4373l9027p9470p8615m7085j4809Q381M1244
$$ y = [103914, 15461, -54455, -72811, -11257, 113429, 249890, 362423, 448556, 507959, 521389, 470476, 360474, 214877, 61451, -71717, -163623, -214015, -239783, -252023, -245676, -213655, -159759, -95608, -35643, 6208, 29567, 56256, 107592, 170490, 204448, 187434, 139257, 96939, 85337, 114296, 179282, 252325, 293703, 291406, 278476, 298913, 366738, 467503, 584438, 706725, 821168, 912960, 975816, 1016322, 1051345, 1099717, 1163709, 1215674, 1218264, 1165229, 1089208, 1022646, 965967, 902643, 829378, 758778, 704899, 677792, 679248, 691054, 680058, 629669, 556403, 481651, 397936, 279775, 121291, -51325, -198336, -284307, -286872, -208399, -82029, 43932, 129827, 154200, 115173, 35703, -42912, -89997, -104806, -96425, -55181]
36408e5181R0143J22142R8297K2768n6435r0054o4078m377M6735O7340P5108J00416
36396C52824J39263J51233J12326N0201J0924N084O748l095j5656j8674k0952
36385G70226l9268o9094q4497p2746n8853q1177j42091j98004k06388j69899j22578
36374d74369q6078n7835l2828j3277J660J4594J7545J020k2778k6581k506K9132
36362f52301M9944O2304P1919P3196O3034N0652M0904K3536q388m4102p1897r5909
36350d37108j21811j39012j33732j10100q1429m7075O152Q2732J70579K50339
36340e60465L01727L06568K59742J76895Q2247r150q9637j45513j59477j28891
36330C4046p3437k1284J0136K1477K4694K9945L8909N1279P1811J00480J17865
$$ y = [-55181, 34962, 157104, 255401, 278169, 221734, 131680, 67602, 63225, 109960, 177300, 252408, 352824, 492087, 643320, 755646, 805847, 816771, 821855, 828603, 825508, 809852, 791178, 770226, 730958, 661864, 577367, 504621, 445768, 364591, 222500, 24496, -181892, -351791, -474369, -560447, -618282, -651110, -664387, -662727, -648133, -630588, -629568, -652346, -678927, -681433, -652301, -602357, -540053, -468134, -394938, -331904, -281252, -240348, -216812, -225200, -269302, -341199, -437108, -558919, -697931, -831663, -941763, -1023192, -1070267, -1064115, -981383, -810804, -560465, -258738, 47830, 307572, 484467, 566714, 557564, 467927, 322414, 162937, 34046, -39391, -60675, -50539, -29062, -4368, 25577, 64486, 115765, 187576, 288056, 405921]
36319D05921R7246L8540k3780n7832o8486q1273j01540j07220q0067k8174K5500
36308A8835O5757R2024J10171J21760J18799Q9592L3835k9615p5388r2069q6900
36297C66801p2798n6114l5995j0595J5865K9984J7770j7203m7875m5483q059L9948
36285A76246P6538J01076J20912J29288J07816M9949k6574r3507j33731j47059
36275C60954j40633j20904r4047o5633l5491J712M4728P9086R1863R3132J11171
36264C25938J58522K08406K14852J57057N7940m1223j16372j67627k00909k15959
36254C80625k12389j94522j63566j14718n2084J430K4119K3643K9604N5141Q1004
36243a41713Q4534P0236O0254O5327P8739R1700R9920R8054Q1780N6401L4199
$$ y = [405921, 503167, 541707, 517927, 460095, 391609, 310336, 208796, 101576, 21509, -6665, 18835, 84592, 176616, 286787, 408547, 527346, 616938, 650773, 621158, 545770, 453701, 366801, 294003, 237889, 201894, 191299, 207164, 237148, 254918, 237715, 189840, 144357, 136298, 176246, 252784, 353860, 474772, 604060, 711876, 761825, 735251, 641744, 508013, 360954, 220321, 99417, 5370, -60263, -95754, -94042, -49314, 29772, 121635, 214767, 325938, 484460, 692866, 907718, 1064775, 1122715, 1081492, 965120, 797493, 596584, 380625, 168236, -26286, -189852, -304570, -356654, -355224, -331105, -307462, -277858, -222717, -141713, -57179, 13057, 73311, 138638, 217377, 309077, 408997, 507051, 588831, 645232, 679431]
36232F79431K3805K9436N5150R6653J31359J33496J04623P7325Q1641J15646J54787
36221A683352J82640K04956K37763K89516L55885M28918N10085O13438P53821
36212E260374R28975J106553J220088J181263R21239M49066j24167o35851r65669
36203I341871j092594j074413r85986q76415p66174o64097n78364n14101m68396
36194B321331m35197m14922m11036m13541l95755l37567k47471j52263o8645M767
36184e50299P0798J22940J53725J63272J55002J29785Q8753L8486q184l4367k5707
36173C04204J7259P2999J12154J19257R9005O4090K3742j6935n4492q6624j10198
36162E44461j19657j11419q9438o2875l9260k2329j3088r169o332l901m484o341
$$ y = [679431, 703236, 732672, 787822, 884475, 1015834, 1149330, 1253953, 1331278, 1412919, 1528565, 1683352, 1865992, 2070948, 2308711, 2598227, 2954112, 3383030, 3893115, 4506553, 5260374, 6189349, 7295902, 8515990, 9697253, 10618492, 11067558, 10943391, 10307540, 9341871, 8249277, 7174864, 6188878, 5312463, 4546289, 3882192, 3303828, 2789727, 2321331, 1886134, 1471212, 1060176, 646635, 250880, -86687, -334158, -486421, -555066, -550299, -479501, -356561, -202836, -39564, 115438, 245223, 333976, 372462, 364278, 329911, 304204, 321463, 394462, 506616, 625873, 724878, 788968, 812710, 795775, 741283, 654659, 544461, 424804, 313385, 223947, 161072, 121812, 99483, 86395, 77226, 70894, 66993, 62509, 56168]
36150E6168m075o11p062k2288k4564K980M7276Q0187R0995Q7589P2309L8717o485
36137D11136l9092m3354l0107k2647l3459n8781q7254j09197j22297j30121j33280
36126c98453j27320j14392j06756j06805r3965n0182P687M3194M7055M5388N7883
36115g96666P1828O7913N0902L9322M0145N0806P5639J20318J71488J98467J81461
36104B71623J31355P6454L2151j0888o5813j21524j45437j17461n2616J5285O2546
36093G5675Q0965O8325L0842j0617l3348l0824q362L0312P6237J04190R2056N0278
36081E25729J0810j3983m0738q1986j26142j56193j67884j61862j37283j03555
36071d53087q1744q2084r0596q5968o0221j9256K4066N3242N8507M9080M3132
$$ y = [56168, 52093, 51482, 44420, 22132, -2432, 548, 47824, 128011, 219006, 306595, 378904, 417621, 411136, 372044, 328690, 298583, 275936, 242477, 183696, 96442, -12755, -135052, -265173, -398453, -525773, -640165, -746921, -853726, -947691, -997873, -990186, -946992, -899937, -854549, -796666, -724838, -656925, -606023, -566701, -526556, -475750, -400111, -279793, -108305, 90162, 271623, 402978, 479432, 511583, 500695, 434882, 313358, 167921, 50460, -2156, 13129, 75675, 156640, 224965, 255807, 245190, 211842, 181018, 172656, 202968, 279205, 383395, 475451, 525729, 536539, 522556, 481818, 399832, 273690, 117497, -50387, -212249, -349532, -453087, -534831, -616915, -707511, -793479, -853700, -872956, -848890, -795648, -737141, -688061, -644929]
36060f44929M4192M2354L7835M1205M7158L5025O618l059K7005O5536O1952P883
36048b31225n4165p7315m9070J0179O9457J07166J20591J19725J11474R4561O9361
36037B90739M1077R447l2270q1806j22587j39974j31641r7868l8040L3716Q5068
36026a84139R2208O1578J6443k5254m8775l4333K7222J13368J80505J98397J69048
36015E66268J16082O3812K4654M40o962P891L9194N7945L2892l3479j04846j49654
36003F14237j63485j51811j15564o6063l2072l2241n2916o8720p2817p1166n9509
35992b72127k5912K8996Q9304J37160J59291J49727J19495R5511R4695J03426
35982F79566R4478N9442J3162k8243o0466q3795r3894q3042m9465q198J0572j3987
$$ y = [-644929, -600737, -558383, -520548, -479343, -432185, -397160, -390542, -393601, -366596, -301060, -239108, -231225, -285390, -362705, -411775, -401596, -332139, -224973, -104382, 15343, 126817, 221378, 290739, 331816, 341263, 308993, 227187, 104600, -35374, -167015, -264883, -302923, -269207, -184139, -91931, -30353, -13910, -39164, -87939, -122272, -95050, 18318, 198823, 397220, 566268, 682350, 746162, 770816, 771256, 764294, 772185, 811379, 869324, 902216, 868737, 763891, 614237, 450752, 298941, 183377, 117314, 85242, 53001, 85, -68635, -141452, -212618, -272127, -298039, -269043, -179739, -42579, 116712, 266439, 385934, 481445, 576140, 679566, 774044, 833486, 846648, 818405, 757939, 674144, 580250, 497208, 447743, 439545, 450117, 436130]
35970D36130o8281j16070j37203j39715j32177j07378o3873k0336J0110M2591
35960b96202R6230J58932J97204J94503J63170J25352R8095R0650R9080J04895
35950A031909R0246N2064m066p3202j44973k00991k31521k44276k44465k18362
35940a87637j51629n3233N2940J48270K16511K36885K03906J46787J07589J03066
35930H23455J21719J47317J65210J56162J10846M9415O328k271K1171P8294J69452
35919A847098K67180L26748L34963L27900L49113M05829M73892N27017N47073
35910E406813N19681M39560L19590J83427M6830q9492k28967l65101m79784n54633
35900E197924n82132n65110n10247m28950l41628k68672k12821j59599r9627m2131
$$ y = [436130, 367849, 251779, 114576, -25139, -157316, -264694, -328567, -348903, -338793, -296202, -199972, -41040, 156164, 350667, 513837, 639189, 737284, 827934, 927014, 1031909, 1122155, 1174219, 1170153, 1096951, 951978, 750987, 519466, 275190, 30725, -187637, -339266, -392499, -339559, -191289, 25222, 262107, 466013, 612800, 720389, 823455, 945174, 1092491, 1257701, 1413863, 1524709, 1574124, 1580452, 1578181, 1599352, 1677646, 1847098, 2114278, 2441026, 2775989, 3103889, 3453002, 3858831, 4332723, 4859740, 5406813, 5926494, 6366054, 6685644, 6869071, 6915901, 6826409, 6597442, 6232341, 5752557, 5197924, 4615792, 4050682, 3540435, 3111485, 2769857, 2501185, 2288364, 2128765, 2029138, 1987007]
35890A987007l304P751j2251o1309j22132j64764j72318j57036j42619j40632
35880A018393j52564j80040k16085k35549k14253j58362j02738p8423q6913j03510
35870e10044j01575p7497n3676n0357n6561m3160n365K7480L0389R846j7252m8071
35858h95843p9797r1635o4733r119M8539R4566J29400J50581J52642J35374R8369
35847c31656L9810k5163o2668n8032m0476m5702o6845o9841m7296k5210j8204
35836g51283q651K3121P0610J10880J26673J13638P9429M1529J7477J3529K5028
35825a38020M2480N2421M2300J4665j1174k0901k1004k6731m5314p5857j08113
35814b95248j13503o1129M0015J34272J72801J55432J04808K8625o3123j29771
$$ y = [1987007, 1983703, 1991454, 1979203, 1917894, 1795762, 1630998, 1458680, 1301644, 1159025, 1018393, 865829, 685789, 469704, 234155, 19902, -138460, -241198, -319621, -406534, -510044, -611619, -689116, -742792, -793149, -849710, -892870, -898235, -870755, -840366, -830520, -847772, -895843, -975640, -1067275, -1132008, -1141127, -1092588, -998022, -868622, -718041, -565399, -430025, -331656, -291846, -317009, -379677, -437709, -478185, -523887, -590732, -660573, -707869, -733079, -751283, -759934, -736813, -666203, -555323, -428650, -315012, -235583, -194054, -176577, -163048, -138020, -95540, -43119, -819, 13846, 2672, -18229, -39233, -65964, -111278, -187135, -295248, -408751, -469880, -429865, -295593, -122792, 32640, 137448, 166073, 102950, -26821]
35804b6821j31235p9041k2261J0776K6798L4505L3841L4634M9825O7208N8709
35793E6938K1938j4515l0443l3410l6424m1975n2586p3026r5154j00088q0862
35782d79607m7424q615L3287P0145Q8478Q4510O5268L6938N258j9293l2794m6636
35770b50485o8073q2238p3307n1881l7665k6666l759K1617K5104J0190J0063M3669
35758d83431R3957J30188J30169Q5014Q444o0144q7711q2919p8087q1530p3856
35747d99906m6116j1245K1572N4118P8999Q0720O1510M2322L4621L1254K4875
35736a27276J5709M746j264J2824M4105N4721J3395n3379q4479n3787J4004Q7731
35724g2950J50638J81367J58664R4068K6413k2526n8219q0676p7311n1129k0665
$$ y = [-26821, -158056, -237097, -259358, -248582, -221784, -187279, -153438, -118804, -68979, -1771, 56938, 78876, 64361, 33918, 508, -35916, -77891, -130477, -203503, -298657, -398745, -479607, -527031, -535646, -502359, -432214, -343736, -259226, -193958, -157020, -151762, -171055, -203849, -250485, -318558, -400796, -474103, -525984, -563649, -590315, -594074, -572457, -547353, -537163, -527100, -483431, -389474, -259286, -129117, -44103, -35659, -95803, -183514, -266433, -344520, -426050, -499906, -546022, -557267, -535695, -481577, -402578, -321858, -260348, -218026, -183405, -152151, -127276, -111567, -106821, -108085, -95261, -51156, 3565, 16960, -36419, -120898, -174685, -160681, -72950, 77688, 259055, 417719, 511787, 538200, 515674, 457455, 376779, 299468, 248339, 227674]
35713B27674J2037N8066J02547J06760N8299j4066q1778j38194j73263j66359
35703h277j19623o6288l0378l357K9614O6293R7428J14595J04260O1277R929j8286
35691B37187k7370m3621o1315m3332J6985P4502Q5100M7822j1297o2247p3643
35680A38771l2522K8662O0919O1118O7767R1893R9621P3853M3695L3214K5547
35669F92538L57l2416n7209p3951p5649m4115J1112M8671N3426O1270J00925J46384
35657H31343J54392J18255N9091n737n7776o8083k3758M9456J09423J31158J13964
35646A411728P7539N5699O9707J04997J37061J70059K12762K29125J67942M2303
35636B678922p7729j58092k26372k94441l23967k95193k46983k12779j70841r6395
$$ y = [227674, 239711, 297777, 400324, 507084, 565383, 551317, 469539, 331345, 158082, -8277, -127900, -194188, -224566, -227923, -198309, -132016, -34588, 80007, 184267, 245544, 255473, 237187, 209817, 166196, 104881, 61549, 78534, 153036, 238136, 285958, 274661, 212414, 138771, 106249, 134911, 195830, 256948, 324715, 416608, 516229, 590082, 633777, 666991, 692538, 692895, 660479, 603270, 529319, 453670, 409555, 420667, 469338, 522764, 584034, 684959, 831343, 985735, 1103990, 1163081, 1157344, 1099568, 1031485, 1007727, 1057183, 1166606, 1297764, 1411728, 1489267, 1544966, 1614673, 1719670, 1856731, 2026790, 2239552, 2468677, 2636619, 2678922, 2601193, 2443101, 2216729, 1922288, 1598321, 1303128, 1056145, 843366, 672525, 576130]
35626E76130j6605K5619K5448K823k7613m7533l6189o340j5k8174n7823p4355
35614C35373j01250j36473j32723p4364j3570Q481J6728L6675L6740q249m9441
35603h2073k3133N8413J29472J52990J34761R0249M3469K7615M4202N0129J8814
35592F44908k0660l4628l0150j6646K5678R7336J49678J49768J29197J25377J24912
35581A344770J11839J17580J67322K26055K55759K81213L42757M28680N08933
35572C784908N83764O34758N79719L57500K9979k67847m55671n33527n21006m41086
35562C751491l40208k60650k04424j62152j45146j49100j29640o2924J1062N2152
35552B360461P9535J18822J42516J19617P5069M3737J5417j9482k4200K6270R4984
$$ y = [576130, 559525, 585144, 610592, 613415, 585802, 538269, 502080, 495740, 495725, 467551, 409728, 335373, 234123, 97650, -35073, -109437, -123007, -114526, -97798, -61123, -24383, -32632, -82073, -105206, -46793, 82679, 235669, 370430, 460679, 504148, 531763, 575965, 626094, 644908, 624248, 589620, 559470, 542824, 568502, 665838, 815516, 965284, 1094481, 1219858, 1344770, 1456609, 1574189, 1741511, 1967566, 2223325, 2504538, 2847295, 3275975, 3784908, 4368672, 5003430, 5583149, 5940649, 5970628, 5702781, 5247110, 4713583, 4192577, 3751491, 3411283, 3150633, 2946209, 2784057, 2638911, 2489811, 2360171, 2297247, 2308309, 2360461, 2439996, 2558818, 2701334, 2820951, 2896020, 2939757, 2955174, 2935692, 2911492, 2937762, 3032746]
35541C032746J45336J94445K52248K77839K55988K42002K66457K75925K36689
35532E179675K07568K30667K45341K02931J70505K14504K72009K52249J84912
35523G160361J57011J85632K60646M16947O43959Q22895Q84901R35349J091623
35514A2559324J305055J481412J657467J902758K171077K419747K750359L254791
35506B9501990L858345M498436N295966O343111P508364Q691450J0066586J1811508
35498H7575756J3849977J6179041J9139612K2957520K7362557L2050273L6717861
35491B55832597L9509198L6110766K2691218Q55478k1595833l6319408m0693278
35484B56390738l8085177l3096463k8001851k3209749j8980154j5646176j3087560
$$ y = [3032746, 3178082, 3372527, 3624775, 3902614, 4158602, 4400604, 4667061, 4942986, 5179675, 5387243, 5617910, 5863251, 6066182, 6236687, 6451191, 6723200, 6975449, 7160361, 7317372, 7503004, 7763650, 8180597, 8824556, 9647451, 10532352, 11467701, 12559324, 13864379, 15345791, 17003258, 18906016, 21077093, 23496840, 26247199, 29501990, 33360335, 37858771, 43154737, 49497848, 57006212, 65697662, 75764248, 87575756, 101425733, 117604774, 136744386, 159701906, 187064463, 219114736, 255832597, 295341795, 331452561, 354143779, 354999257, 333403424, 297084016, 256390738, 218305561, 185209098, 157207247, 133997498, 115017344, 99371168, 86283608]
35477H6283608j0959778r201414p875728o819154n828476m951537m288233l724904
35469C2634384l126930k586676k236977j999699j737995j490958j352144j266731
35461A6836274j142784j027357r89621r53251q20282o52023n61455n23337m47437
35452I718727l53144l22035l49854l79597m12961m65496m78952l98715k79371
35443F278602k04755j62931j03144n2852o9112j27088j62352j80214k26312k88249
35433D701593l16400l07975k91485k63999k15160j73182j59161j39017q5321l7841
35423B712052l6312m6099k2563L009k0591p0512r2421r5070j19638j49076j31893
35412A930886p4493l4761l9067o7641j01760j26554j10573m2392L3009O7886P7165
$$ y = [86283608, 75323830, 66122416, 58246688, 51427534, 45599058, 40647521, 36359288, 32634384, 29507454, 26920778, 24683801, 22684102, 20946107, 19455149, 18103005, 16836274, 15693490, 14666133, 13676512, 12723261, 11902979, 11250956, 10689501, 10166164, 9718727, 9365583, 9043548, 8693694, 8314097, 7901136, 7435640, 6956688, 6557973, 6278602, 6073847, 5910916, 5807772, 5754920, 5685808, 5558720, 5396368, 5216154, 4989842, 4701593, 4385193, 4077218, 3785733, 3521734, 3306574, 3133392, 2974231, 2835214, 2749893, 2712052, 2675740, 2629641, 2607078, 2610087, 2589496, 2518984, 2426563, 2331493, 2211855, 2062779, 1930886, 1856393, 1821632, 1782565, 1714924, 1613164, 1486610, 1376037, 1333645, 1366654, 1434540, 1511705]
35401A511705R9260J23160J13405P9470N8124M8782K6589L77k264O940j0517o1288
35389A993743j23060j89216k59494l01898k78372k02265j25887p8397n2388l5267
35379C47499j3870L2882J01545J40396J02569J0823o9189j04102j03618p8613
35369C66322l5353M146K2354L6930P1607J09620J14736Q2950L4722k3639q5946
35358F98449j14171p4328N426O2842Q0851R0594J02998R2152N0875J2823O502
35347A015013K5121N1815Q1410J08913J26370J37994J51505J50180J00931j993
35337A947259j20922k05593k25792j81000j00486l0294J366M406J53j1371l6950
35326A040776n9595n2573j6742K0847L6963J8516m4733j40837k18848k27575j72624
$$ y = [1511705, 1610965, 1734125, 1847530, 1927000, 1985124, 2033906, 2060495, 2060872, 2058608, 2065548, 2055031, 1993743, 1870683, 1681467, 1421973, 1120075, 841703, 639438, 513551, 435154, 382766, 347499, 333629, 366511, 468056, 608452, 711021, 721844, 652655, 548553, 444935, 366322, 330969, 335115, 357469, 394399, 466006, 575626, 690362, 773312, 808034, 784395, 698449, 584278, 509950, 515376, 578218, 659069, 749663, 852661, 944813, 995688, 1008511, 1015013, 1040134, 1091949, 1173359, 1282272, 1408642, 1546636, 1698141, 1848321, 1949252, 1947259, 1826337, 1620744, 1394952, 1213952, 1113466, 1083172, 1084538, 1088944, 1089097, 1077726, 1040776, 981181, 928608, 911866, 932713, 969676, 988192, 943459, 802622, 583774, 356199, 183575]
35315A83575j09025p9010q0085q7700q1053m8407O044N7796Q3127Q2975P1827
35304F4N4094L1362J9270K9912M6044L9974J1899j5696l4205n1801o5501n8950
35292F466k8638R921M0865N4996M5536J8055k955N85J5473J7500N254q804k6602
35279A47652n5010p9421p7913n3770k3255K0081R3699J82838K45197K60999K47368
35268I08465K21387J80710J25055O6976J3970l6009p7668j00408j07749j09676
35258A085053r7472n6473m723J5843m101k4507q307L5286P1346P7816N0637m728
35246A135670o8840j13039j25578j22314j22466j27555j31116j30708j18698p8152
35236b796m427P7919J32050J37705R8770L3495l3828p9897r2223p3065l4639N885
$$ y = [183575, 74550, -4460, -84545, -172245, -253298, -301705, -295661, -237865, -154738, -71763, 64, 54158, 85520, 104790, 134702, 180746, 220720, 232619, 216923, 182718, 130917, 65416, 6466, -22172, -12251, 28614, 83610, 129146, 147201, 144246, 144831, 160304, 177804, 183058, 174254, 147652, 92642, 13221, -64692, -118462, -141717, -121636, -27937, 154901, 400098, 661097, 908465, 1129852, 1310562, 1435617, 1502593, 1516563, 1480554, 1402886, 1302478, 1194729, 1085053, 987581, 931108, 926385, 942228, 938127, 913620, 905313, 940599, 1011945, 1089761, 1140398, 1135670, 1066830, 953791, 828213, 705899, 583433, 455878, 324762, 194054, 75356, -2796, -7223, 70696, 202746, 340451, 439221, 472716, 438888, 358991, 266768, 193703, 159064, 164949]
35224A64949L2999M6217O2523R0322J04624O9902q064p5045q5368n1310k2519
35213C29230k7953n3674p0816o6310m2129J183O5798J41275J99080K12626J82196
35202H70506J32789Q6969M6691J620n3913j12894j54081j49056q7304N32O0531
35191F42390O5680L6394O845j0526j9757k4762l4453o3197j04819j23767r7046
35180B72982n2296l8374o5530r7123r3582m3984L6128J12234J41149J00823J4744
35169B87171o7805j13922j19977r7008o4563m7567n2754n3023j8626M0899Q7724
35158b19451J00839Q5894N0130m31m3282n4430m4842m9405p2418p4813k7282N0726
35146b98765J18372J56131J65893J48555J01169K8410n4067j22865j52972j33290
$$ y = [164949, 197948, 244165, 306688, 397010, 501634, 571536, 563472, 488427, 403059, 351749, 329230, 301277, 247603, 176787, 110477, 68348, 69531, 135329, 276604, 475684, 688310, 870506, 1003295, 1090264, 1136955, 1138575, 1084662, 971768, 817687, 668631, 581327, 581859, 642390, 708070, 744464, 751309, 740783, 721026, 696264, 661811, 598614, 493795, 370028, 272982, 220686, 182312, 116782, 19659, -73923, -117907, -81779, 30455, 171604, 272427, 287171, 219366, 105444, -14533, -111541, -176104, -223671, -276425, -329448, -348074, -307175, -219451, -118612, -32718, 17412, 16981, -26301, -80731, -125573, -174978, -247396, -322209, -349491, -298765, -180393, -24262, 141631, 290186, 391355, 419765, 365698, 242833, 89861, -43429]
35136d3429p8513j3899N0509J16034J70211J88752J66253J23627P9180L2867j2978
35125G78614l8946l0628m631N55m2385j26251k11272k52102k34773j87461j46817
35114d96097j20381r3768o1885k9949P407N7881J03805J13764Q6903N6805M4264
35103c31251L6296K3841K8856P0644J26156J50185J27561Q6599O3305O2852N5881
35092E00925J0888o6043j29144j41735j19790j08178j19502j22489r0999l5670
35082d21737J9069O1850Q8714R6218R1445Q6399P5175M3901J1381K3953R0207
35071B66575J53898J59717J19442Q2911O8349N9320N4349P5920J29149J84778
35061A354408K10692K00252J68369J39252J39295J83636K65238L66024M73188
$$ y = [-43429, -121942, -135841, -85332, 30702, 200913, 389665, 555918, 679545, 758725, 791592, 778614, 739668, 709040, 704409, 704964, 662579, 536328, 325056, 72954, -161819, -349280, -496097, -616478, -710246, -772131, -802080, -794673, -736792, -632987, -519223, -432320, -375515, -331251, -294955, -271114, -242258, -171614, -45458, 104727, 232288, 318887, 382192, 445044, 500925, 511813, 445770, 316626, 174891, 55101, -53077, -172579, -295068, -386067, -421737, -402668, -340818, -252104, -155886, -64441, 21958, 97133, 141034, 152415, 176368, 266575, 420473, 580190, 699632, 782543, 850892, 910212, 964561, 1040481, 1169630, 1354408, 1565100, 1765352, 1933721, 2072973, 2212268, 2395904, 2661142, 3027166, 3500354]
35052C500354N73319O44228O77440P03349P66264Q70701R74844J040535J063924
35043A0814958J045765R56996P59818M57858J09091k10150m45417n77285o16770
35034A2294864n98889n70985n70467o05641o59320p11235p51740p72828p58004
35025F295755o95827o02498n16763m65251m38639m05433l42876k52250j53596
35016B422622p3501l3012l7713p5563j23993j60277j71628j62692j50310j42687
35006A291246j26395q4214k3771K4933M2420L7859L0898K6679J4414j6218n9319
34995A158532q8208p3144j8692K1642p435r5122j65279j56251q2951r239K2367
34984E06220J7844O095Q951L0347N6768O8300N8220L8014J8075o304m1764q1819
$$ y = [3500354, 4073673, 4717901, 5395341, 6098690, 6864954, 7735655, 8710499, 9751034, 10814958, 11860723, 12817719, 13577537, 14035395, 14144486, 13934336, 13488919, 12911634, 12294864, 11695975, 11124990, 10554523, 9948882, 9289562, 8578327, 7826587, 7053759, 6295755, 5599928, 4997430, 4480667, 4015416, 3576777, 3171344, 2828468, 2576218, 2422622, 2349121, 2316109, 2278396, 2202833, 2078840, 1918563, 1746935, 1584243, 1433933, 1291246, 1164851, 1080637, 1056866, 1081799, 1124219, 1162078, 1192976, 1219655, 1234069, 1217851, 1158532, 1070324, 997180, 978488, 1000130, 992695, 897573, 732294, 576043, 493092, 483853, 506220, 524064, 530159, 539110, 569457, 626225, 694525, 752745, 790759, 808834, 802530, 760766, 678947]
34972F78947j15430j38359j44218j18796o1061J037L5593M0880L6571K8865O419
34961B50448l2840p4107j05527j23420j15024o1302L0099J12862J40734J12320
34951A34243O7516M6793O3000J03997J46577J66991J51545J06392N4954K0125
34941A062133P111M151n95n789k035J2665K7640L0578J9964M496p295j4964k4969
34928A113091m1359n6095n1642j9289K5853N5289N3791K9133n168m6559r7212
34917I59833j48642j81118j77059j31707n4466L5007J13257J59546J59463J08920
34907H43034K2585o3915j12365j09747p5406m0047k1718j9531k0677j1401J0169
34896D00981K9085K8270R145j0257j7972j9812k8558n1303q4652j08150q6168
$$ y = [678947, 563517, 425158, 280940, 162144, 101083, 102120, 137713, 178593, 215164, 244029, 250448, 217608, 143501, 37974, -85446, -200470, -261772, -231673, -118811, 21923, 134243, 201759, 248552, 311552, 415549, 562126, 729117, 880662, 987054, 1042008, 1062133, 1069244, 1073395, 1072800, 1067011, 1064976, 1077641, 1105281, 1135859, 1155823, 1160319, 1153024, 1138060, 1113091, 1071732, 1015637, 963995, 944706, 970559, 1025848, 1079639, 1108772, 1103604, 1057045, 959833, 811191, 630073, 453014, 321307, 266841, 301848, 415105, 574651, 734114, 843034, 865619, 801704, 689339, 579592, 504186, 464139, 442421, 422890, 402213, 390812, 400981, 430066, 458336, 467481, 457224, 439252, 419440, 390882, 339579, 254927, 146777, 60609]
34885F0609l59J13387J83882J75065J20680P5862N3468K7794j5343n9569q3923
34874F51553q4662p0745n5142n1547o4935q3392q9960q1917o8389n2410k8264
34863g9810M532L6617N8174O3390M8936K0164m124q637n108k4532p9998j46274
34851a16670j81345j62711j01251k7121L4653P9459J16970J49437J60823J33431
34841H5675P1327k35n5730q3201q3492o7241m9910l7789j9158K0410P4782J20185
34829b4377J40594J38225J19132Q3623L6258p407l2550l6583k4659l423J4789
34818D03622J2009j9698o7097j09415j39748j64201j82865j83661j58562j18072
34808g27688q4532p4653q9692j14154j17680o8061M0089J67316K55158K78901
$$ y = [60609, 60250, 173637, 357519, 532584, 653264, 729126, 782594, 810388, 795045, 735476, 651553, 566891, 496146, 441004, 389457, 324522, 241130, 151170, 69253, 864, -51546, -79810, -75278, -38661, 19513, 82903, 131839, 152003, 147879, 139242, 134134, 109602, 29604, -116670, -298015, -460726, -561977, -589098, -554445, -474986, -358016, -208579, -47756, 85675, 157002, 156767, 101037, 17836, -65656, -132897, -182807, -220596, -239754, -219344, -144562, -24377, 116217, 254442, 373574, 457197, 493455, 486048, 453498, 416915, 392256, 388833, 403622, 415631, 395933, 328836, 219421, 79673, -84528, -267393, -451054, -609616, -727688, -812220, -886873, -976565, -1090719, -1208399, -1276460, -1236371, -1069055, -813897, -534996]
34798e34996K64779K47689K27151J81517J12345M7065p44m4442q8603j06039o8436
34787B37286J6361J14198J97415K50115K55256K03014J11403J9589m2580o9717
34777A292340p2160o7073p3588r9111j29261j43860j41715j37522j38713j41513
34767A47824j46577j57638j62304j34969o7966J4912Q3644J27374J47500J41103
34757g097J05370N0735k269l6273m2338k0603J4859L7629K6218j9149p8884j28210
34745a00012j47054j26621p7501k7955m246j0597l1020m6942m8191l2654o042
34734f58835J7990K8198L1233M9530R5587J50894J79008J61951J17608P7549N4475
34723C05188L9073K3133J0873M273r098m2935r2762j37844j58483j46420j07066
$$ y = [-534996, -270217, -22528, 204623, 386140, 498485, 545550, 544806, 500364, 411761, 305722, 237286, 253647, 367845, 565260, 815375, 1070631, 1273645, 1385048, 1404637, 1362057, 1292340, 1220180, 1153107, 1079519, 980408, 851147, 707287, 565572, 428050, 289337, 147824, 1247, -156391, -318695, -453664, -521630, -506718, -423074, -295700, -148200, -7097, 98273, 149008, 146739, 110466, 68128, 47525, 62384, 100013, 126231, 107082, 28198, -100012, -247066, -373687, -451188, -479143, -483389, -493986, -525006, -571948, -620139, -652793, -658835, -640845, -612647, -581414, -531884, -436297, -285403, -106395, 55556, 173164, 250713, 305188, 344261, 367394, 378267, 382540, 373442, 330507, 237745, 99901, -58582, -205002, -312068]
34712c12068o2342m4292p0171j22368j62382j64124j25966n7328K8388J06833
34702i85820J48758J43921J09040O5310J9519k4220m6921k5543M0514J24322J92806
34691b38314K27315K26926K01689J64768J25719Q8400N4633K5649k456l8871q7251
34680G48207j37322j71913j78751j51234q6297N313Q9697J27867J11268P0658
34670D27493M2627L3615K2491r946o3504j23024j66086j68961j21650m2785L1607
34659a38123Q0103J07107J18479J03222N4894j582k9778k9386m1139r3837j61902
34648c1942j89082j45667n1079N1347J26520J58861J51463J23905J02037R7773
34638C94136R6536P0101P271o7610j11216j00735n5784j7963j1415k8014m6073
$$ y = [-312068, -374410, -418702, -488873, -611241, -773623, -937747, -1063713, -1121041, -1092653, -985820, -837062, -693141, -584101, -518791, -499272, -523492, -570413, -595956, -555442, -431120, -238314, -10999, 215927, 417616, 582384, 708103, 796503, 851136, 876785, 874329, 835458, 748207, 610885, 438972, 260221, 108987, 22690, 28003, 117700, 245567, 356835, 427493, 470120, 503735, 526226, 516280, 452776, 329752, 163666, -5295, -126945, -169730, -138123, -58020, 49087, 167566, 270788, 325682, 324100, 294322, 264936, 223797, 129960, -31942, -221024, -366691, -417770, -366423, -239903, -81042, 70421, 194326, 296363, 394136, 490672, 560773, 568044, 500434, 389218, 288483, 232699, 214736, 203321, 175307, 129234]
34627A29234n2422m6782l7401l6916n2076p2000p5787n7405l4227k5577l3374
34616c94733n0173p2708r5604j03824q7924n9753l6463j3991K5342Q0296J24598
34605f84937J36964J21799R5096O4602L2418N651p248o610j040m73j4590n2426
34593c10794j14134j81508k21772k06738j33904l2368N4342R7356R8397P8821
34583h72302N6581L5700J2745j3405l7535m9131l8195l696M4034R0159J21176
34572f53869J24329R1728L2401k7668o8121r2758j16586j39529j44876j21262
34562a116211p4177j6412M0714Q5483J07537J07061R5757Q5557Q0810Q1067Q5245
34551d37569R3157J07733J32525J60965J75227J67658J57308J67554J87962J77700
$$ y = [129234, 76812, 30030, -7371, -44287, -96363, -168363, -244150, -301555, -335782, -361359, -394733, -444906, -517614, -613218, -717042, -804966, -864719, -901182, -915173, -889831, -809535, -684937, -547973, -426174, -331078, -266476, -234058, -228407, -235655, -242265, -243305, -243778, -258368, -310794, -424928, -606436, -828208, -1034946, -1168850, -1201218, -1146876, -1049520, -951123, -872302, -815721, -780021, -767276, -780681, -818216, -867347, -905542, -909238, -865204, -775045, -653869, -529540, -437812, -405411, -433079, -501200, -593958, -710544, -850073, -994949, -1116211, -1190388, -1206800, -1166086, -1080603, -973066, -866005, -770248, -684691, -603881, -522814, -437569, -344412, -236679, -104154, 56811, 232038, 399696, 557004, 724558, 912520, 1090220]
34541A090220J12881J5019p4491j32994j60715j62707j44063j16150r0998o9490
34531B66512m6279k6696k7649n6060r1870j00118o3401j170M7065N9138M6598
34520F070L1585J6243j3875o0034r9010j06402q2840n2440l9948m9401n9116m0249
34508e49417R520N3293N1064J0035j8968k148L8736O1661O1168O7978R9219J33542
34496A5683J40686J18366Q9407P0857N6650L0698q339l9793m2396k3087j6294
34485C92438m5833r1093j03329n9357J0076N2472M8171K3788J3823K1289K1791
34474B84236k648m4592q2220r7348q2086m0692R083M6480O7431Q5743J06945J11774
34462C62106Q0116K5568j0927l783L2165N9979N3952J5481l2361o4076p4101p8850
$$ y = [1090220, 1203101, 1218120, 1143629, 1010635, 849920, 687213, 543150, 427000, 336002, 266512, 220233, 193537, 165888, 109828, 17958, -82160, -145561, -146731, -99666, -40528, 6070, 37655, 53898, 40023, -20011, -119021, -225423, -308263, -360703, -400651, -450052, -509168, -549417, -539897, -486604, -435540, -425505, -444473, -446621, -407885, -346224, -285056, -217078, -117859, 15683, 156369, 274735, 364142, 434999, 491649, 522347, 514008, 474215, 431819, 408732, 392438, 346605, 255512, 152183, 92826, 102902, 155374, 203545, 227333, 241156, 262445, 284236, 281588, 236996, 154776, 57428, -24658, -65350, -56267, -9787, 57644, 143387, 250332, 362106, 442222, 467790, 456863, 453080, 485245, 545224, 599176, 614657, 582296, 518220, 444119, 365269]
34450C65269q7849q0294k9910M7593R5066P1130r144r6926j53497j62009j19943
34439a60514m4850K2287M3487J5844l2129o9664p8905n3782n337L5517M1429J7122
34427b69495j0528k9449m9850p2936p6218m3309Q960N0681P5456R7973J20352
34416a98363J22679R2632M8402K0240J6531J8922P472j9865n1573p3889p3832
34405i0644m3811M292L5686J9788l4764q2843q7703n7075k8589k5392l5413l2376
34393d58844p364K4221M1002L5241J5308o567k6325m8228p4342r4858r0914n1481
34381g43151R405N5902N8804K2334k3291n6091p8815r8228j03729q1520m0419
34370a078799l813K1887N0949Q8089J15152J17156J04399R5125Q9492P6897N9722
$$ y = [365269, 277420, 197126, 167216, 214809, 309875, 381005, 371861, 274935, 121438, -40571, -160514, -205364, -183077, -139590, -123746, -155875, -225539, -304444, -358226, -363563, -328046, -286617, -269495, -280023, -309472, -359322, -432258, -508476, -551785, -542825, -492144, -416688, -318715, -198363, -75684, 16948, 65350, 85590, 102121, 121043, 128515, 108650, 57077, -16812, -90644, -134455, -130163, -94477, -74689, -109453, -192296, -279999, -337074, -365663, -391055, -426468, -458844, -466208, -441987, -400985, -365744, -350436, -357003, -383328, -431556, -505898, -600756, -691670, -743151, -733746, -677844, -619040, -596706, -619997, -676088, -754903, -853131, -956860, -1038380, -1078799, -1082612, -1060725, -1009776, -921687, -806535, -689379, -584980, -489855, -400363, -323466, -263744]
34359b63744N0383M7238L2433j351l5869m7327l3363j1960J814R161J7749K6021
34347b08815K2391j401l9548p4985r0793q0050m9906j7944J245J0742K8453O3955
34335d36656J02401J18974J06253P8401N0614K5979L947j0404j2973j0766j8796
34324c026m6675q7702j19590j20933r3708o4959n6857o0044m9525k2308k81N288
34312g20320J0342L0464N5592O6099O0623N3176N2253N6941O6162P7720Q3175
34301a07773P6151O1643M6398K5531q370m6268o6256n6869k7746J999J7966J5319
34289f8275n56j7538k7334l1939l5533l5410k8509k0684j7657j0131J8127O5677
34277b09762J08751J26010J19883J08465J02257R5066P6475M8728K8246K8823
$$ y = [-263744, -213361, -166123, -133690, -135041, -170910, -218237, -251600, -263560, -261746, -252585, -234836, -208815, -186424, -187825, -227373, -302358, -393151, -473201, -523107, -541051, -539806, -529064, -500611, -436656, -334255, -215281, -109028, -30627, 19987, 45966, 49913, 39509, 26536, 15770, -3026, -49701, -137403, -256993, -377926, -471634, -536593, -593450, -653494, -703019, -725327, -725608, -720320, -709978, -679514, -623922, -557823, -497200, -444024, -391771, -334830, -268668, -190948, -107773, -31622, 30021, 76419, 101950, 93580, 47312, -18944, -75813, -103559, -101560, -83594, -68275, -68831, -86369, -113703, -145642, -181175, -216585, -245094, -265778, -283435, -293566, -275439, -209762, -101011, 24999, 144882, 253347, 355604, 450670, 527145, 575873, 604119, 632942]
34267F32942M5016N6708M9757K5590r492n2591r5265j18008j07087p2147l4729
34256C20694j934L5123P5580R4912O6103p677q6630j23787j04653n8756k8048
34245A80927k3776k2031k740K1490K5683R817r15J1521M1959P7399J10633J32760
34233E62727J27096Q3483J5141m7491q1217q6780q2630q4327r0974r1910q4092
34222A39026p7940q5208j05752j26670j28776r5067k5116N3815J01845J02367
34212b47476P5514M8824K5644n843m3347o8274o9476n4298l7864l4375n5937j03615
34200e70523j57225j86606j76449j32907o9309J478O2476R8017J09866J16741
34190i04441J32343J52424J66361J71316J69806J61211J41270J05889N3707j0545
$$ y = [632942, 677958, 734666, 784423, 810013, 800521, 747930, 652665, 534657, 427570, 355423, 320694, 318760, 353883, 429463, 524375, 590478, 582801, 496171, 372384, 267731, 208975, 180927, 157151, 135120, 132380, 153870, 179553, 189370, 188455, 199976, 241935, 319334, 429967, 562727, 689823, 773306, 788447, 740956, 659739, 572959, 490329, 406002, 315028, 223118, 139026, 61086, -24122, -129874, -256544, -385320, -480387, -505503, -451688, -349843, -247476, -171962, -123138, -97494, -103337, -146684, -214958, -284434, -338732, -376596, -410971, -466908, -570523, -727748, -914354, -1090803, -1223710, -1293019, -1291541, -1229065, -1131048, -1021182, -904441, -772098, -619674, -453313, -281997, -112191, 49020, 190290, 296179, 349886, 339341]
34180C39341p5051j27953j63515j76784j59174j10683n1737q488J2686K3107K7379
34169d70872J9087K051m682Q177K5360K6527P558k5920p0582j16090j35162j03764
34157h38312l2792L3202N4105K7206j7378m7850n3663m0175q808M6368J18885
34146g59212J78551J93734J62416J10283O1721K6102Q955J6771M5384P8421J02521
34135B25647J11341R3803M0528k7825n9932k1933O2855J37259J64441J45436R5846
34124I67466K9890l3260p0734p5144o3095n6933o3138p3591q2828r5842j16439
34113B66352j33069j24961q6279l7179k446J5211K8628L8245L0483O885o442R506
34101D934M1387O3836P1542P3624O5889K9982l9064j18930j76705j93044j72199
$$ y = [339341, 264290, 136337, -27178, -203962, -363136, -473819, -525556, -534044, -521358, -498251, -470872, -451785, -449734, -454416, -446239, -420879, -394352, -386794, -412714, -483296, -599386, -734548, -838312, -871104, -837902, -783797, -756591, -773969, -821819, -875482, -915657, -924465, -878097, -759212, -580661, -386927, -224511, -114228, -52507, -26405, -17450, -679, 44705, 123126, 225647, 336988, 430791, 471319, 443494, 383562, 361629, 424484, 561743, 726184, 871620, 967466, 997356, 964096, 893362, 818218, 755123, 698190, 635052, 561461, 478633, 382791, 266352, 133283, 8322, -77957, -115136, -117582, -102371, -73743, -35498, -5015, 1870, -4572, 4934, 46321, 110157, 181699, 255323, 321212, 351194, 312130, 193200, 16495, -176549, -348748]
34090c48748j35270j00989o9051k8875J2765K9085J0188j3405m976L0279N4655
34079e64342N0943M1323N1977Q1945J12869J29120J19984Q0014J8952m0592q3873
34068a680j12164j26407j18736q8470n0263j3893K9811Q7272J37331J46714J07184
34057c301M3560j2426m4451n1309l8666j3696J9243N7707R2523J07279R5319P0589
34045C22371N0375L3330P604k6167n7943q9992j32221j72839j78515j36155p5181
34034d55333l1961p301K1808O0177Q7483Q8850O9299L5936j2986p3519j27135
34023c44682j56550j59600j40016r7593l9517R206K3750O975j2702j1105J2805
34012i09029M5789P5115Q9606P6495K9809l5525q4071q3326l3636K5666M7632
$$ y = [-348748, -484018, -585007, -654058, -682933, -670168, -641083, -630895, -644300, -649276, -618997, -564342, -513399, -472076, -420099, -338154, -225285, -96165, 23819, 103833, 122785, 82193, -1680, -113844, -240251, -358987, -447457, -497720, -511613, -481802, -394530, -257199, -110485, -3301, 40259, 27833, -16618, -67927, -106593, -120289, -101046, -43339, 49184, 156463, 251782, 322371, 372746, 406076, 413680, 387513, 329570, 239578, 107357, -65482, -243997, -380152, -455333, -487294, -494595, -472787, -412610, -325127, -236277, -166978, -131042, -144028, -217547, -344682, -501232, -660832, -800848, -898441, -937958, -928752, -905002, -898027, -910729, -921834, -909029, -863240, -788125, -698519, -622024, -592215, -627740, -711811, -795137, -828773, -803107, -755475]
34001g55475K0948j9744k8316J1816Q0170J40275J60019J23869M5637k9927n6775
33990c07503k9439J2040K5120N451k0039k9777k5329j7989j2209n851J952R371
33978c94202J5520K1827L0131L9982M6432M1232K0375p286k2045q999K7040O4106
33966a25887Q0706O8841L1836k1461p3563r6197o5881J2710J05553J75113K02098
33955B93868J81946J15561J7047p8108j32421j38754j22367j06901q8763n2158
33945a11050j003L5831L2589n165m2679m6165j2680K6902L3533q505p9028j35106
33933c12526j39570q6416l481P2533J24147J52871J58199J35231R6440P2833P6619
33922C46880P9292M8221p675n3878q0927j06240j28565j19855p3555k5087l062
$$ y = [-755475, -734527, -754271, -782587, -770771, -690601, -550326, -390307, -266438, -220801, -250728, -307503, -336942, -324902, -299782, -294331, -314370, -344147, -369476, -387465, -399674, -405525, -403573, -394202, -378682, -356855, -326724, -286742, -240310, -199078, -178703, -185989, -208034, -217033, -189993, -125887, -45181, 23660, 55496, 34035, -39528, -135725, -201606, -188896, -83343, 91770, 293868, 475814, 591375, 608422, 530314, 397893, 259139, 136772, 29871, -58892, -111050, -112053, -76222, -43633, -48798, -91477, -137642, -150322, -123420, -89887, -98392, -177420, -312526, -452096, -538512, -541993, -469460, -345313, -192442, -34243, 100988, 197428, 270261, 346880, 426172, 474393, 466718, 412840, 331913, 225673, 97108, -22747, -96302, -121389, -124451]
33911a24451J0581M4487Q4802R1721N7638J6361k897l215j185n444j8057l6825
33899A13516n1742n6633o5938r9233j44351j58517j17581m6650J0247L4656L4747
33888e47479J9748m296k1474j2080K5497P2047J06435J16268R5485N1638J7825
33877h0386L4820J06830J87505K24080K06872J62120J07531L8418m3465j13434
33867H30891j48007j48745j29490r4872m8546j0961n951l1577o3881r0020j17961
33856e9120j49509j64620j44280r4961l8575J0995N0598P7929R2331R8825R9617
33845b20770Q7223N6610J7979j3718l5775n1537n3045k6230K6272Q0837J13974
33834a8180J19127J04150Q4334P8917J00846J42117J74624J70775J23666N1277
$$ y = [-124451, -113870, -69383, 15419, 107140, 164778, 181139, 178242, 175027, 173842, 168398, 150341, 113516, 61774, 5141, -60797, -160030, -304381, -462898, -580479, -627129, -616882, -582226, -547479, -527731, -532027, -553501, -565581, -540084, -468037, -361602, -245334, -149849, -98211, -80386, -45566, 61264, 248769, 472849, 679721, 841841, 949372, 987790, 944325, 830891, 682884, 534139, 404649, 309777, 261231, 250270, 244319, 212742, 148861, 58841, -59120, -208629, -373249, -517529, -612490, -651065, -640070, -589472, -511543, -419212, -320387, -220770, -133547, -76937, -58958, -72676, -108451, -159988, -213033, -239263, -212991, -132154, -18180, 100947, 205097, 289431, 368348, 469194, 611311, 785935, 956710, 1080376, 1131653]
33824A131653j3268m0450k4577J3094M6402O5913P2785O1300K4277k8089p4344
33813A234696j08568j42643j77984j95494j83558j57527j37015j19466r4562p2899
33803a55020p6467j02121j15473q7235k2770M9381J06885J44163J61660J55252
33793E8255J18427N2898k4606q9151j24521j32215j21262r2801m0987L1443J05099
33782b59421J54142J62832J33074Q0253K2430k9828p4650j10016j27287j18054
33772a66525q5058l9844R490N9699R9974J08735P2446M682o1637j01113j10087
33761b09238r6704o7160k6420J4524M0809M3261K2540j3575n1997p6690p8827
33750d99477o7023n9197n8795m5558J773P5803J40888J63419J37489Q3184K7487
$$ y = [1131653, 1118385, 1077935, 1053358, 1066452, 1112854, 1178767, 1251552, 1312852, 1337129, 1309040, 1234696, 1126128, 983485, 805501, 610007, 426449, 268922, 131907, 12441, -82121, -155020, -231487, -333608, -449081, -536316, -559086, -509705, -402820, -258657, -96997, 58255, 176682, 229580, 204974, 115823, -8698, -140913, -262175, -354976, -395963, -364520, -259421, -105279, 57553, 190627, 270880, 293310, 263482, 188832, 78816, -48471, -166525, -251583, -291427, -281937, -222238, -122264, -13529, 58917, 63599, 1962, -99151, -209238, -305942, -373102, -399522, -384998, -344189, -300928, -278388, -291963, -343960, -420650, -499477, -566500, -625697, -684492, -730050, -728277, -652474, -511586, -348167, -210678, -127494, -100007]
33739a00007j2151l3322m3621m9934n3642n8594p7730j19905j69180j90560j64732
33728a073378j09178n6760k1180N833L0854M9469O0997P5652R8942J19598J22057
33717f97094J03778P1831L0015j8143n7402o7619m7222j8949m816k126Q333L5088
$$ y = [-100007, -112158, -145480, -189101, -239035, -292677, -351271, -429001, -548906, -718086, -908646, -1073378, -1182556, -1239316, -1260496, -1254663, -1223809, -1174340, -1113343, -1037691, -938749, -819151, -697094, -593316, -521485, -491470, -509613, -567015, -634634, -681856, -700805, -705621, -707747, -699414, -664326]
$$ [...]
##END NTUPLES=NMR SPECTRUM
##END=
