##TITLE=31Pdec_85-2021
 CDCl3, 24 sc
 26.08.2021
##JCAMPDX= 6.0         $$ Bruker NMR JCAMP-DX V2.0
##DATA TYPE= NMR SPECTRUM
##DATA CLASS= NTUPLES
##ORIGIN= UXNMR, Bruker Analytische Messtechnik GmbH
##OWNER= root
$$ XWIN-NMR		Version 3.5
$$ Thu Aug 26 11:19:51 2021 Russian Standard Time (UT+4h)  she@DPX200
##.OBSERVE FREQUENCY= 81.013821
##.OBSERVE NUCLEUS= ^31P
##.ACQUISITION MODE= SIMULTANEOUS
##.ACQUISITION SCHEME= undefined
##.AVERAGES= 24
##.DIGITISER RES= 16
##SPECTROMETER/DATA SYSTEM= spect
##.PULSE SEQUENCE= zgpg30
##.SOLVENT NAME= CDCl3
##.SHIFT REFERENCE= (INTERNAL, CDCl3, 0, 248.564)
##AUDIT TRAIL= $$ (NUMBER, WHEN, WHO, WHERE, WHAT)
$$ ##TITLE= Audit trail, XWIN-NMR		Version 3.5
$$ ##JCAMPDX= 5.01
$$ ##ORIGIN= Bruker BioSpin GmbH
$$ ##OWNER= she
$$ F:/spectra/data/she/nmr/P31/1/pdata/1/auditp.txt
$$ ##AUDIT TRAIL=  $$ (NUMBER, WHEN, WHO, WHERE, WHAT)
(   1,<2021-08-26 11:18:36.51 +0400>,<she>,<DPX200>,
      <created by zg, POWCHK disabled, PULCHK disabled
       configuration hash MD5:
       00 E9 B6 7A A2 85 ED C7 34 08 36 98 17 FE 4E 26
       data hash MD5: 32K
       A8 25 58 EB F3 E1 85 2F 92 9E 9B B0 E0 36 48 7C>)
(   2,<2021-08-26 11:18:39.62 +0400>,<she>,<DPX200>,
      <Start of raw data processing
       efp BC_mod = 2 LB = 1 FT_mod = 6 PKNL = 1 PHC0 = -7779.986 PHC1 = 169.8735 SI = 64K 
       data hash MD5: 64K
       CF F0 70 B7 A1 6A 00 B7 0A 5C CE 30 1B 2C 47 DE>)
(   3,<2021-08-26 11:19:01.73 +0400>,<she>,<DPX200>,
      <pk PHC0 = -1.640941 PHC1 = 7.8 
       data hash MD5: 64K
       DD D5 70 4B 6B AF 94 CC B7 2C AB C2 6F 05 E1 68>)
(   4,<2021-08-26 11:19:04.84 +0400>,<she>,<DPX200>,
      <abs ABSG = 5 
       data hash MD5: 64K
       A2 50 55 D0 86 E9 B5 D6 5B 8A 1A C9 B9 B5 08 73>)
$$ ##END=
$$ 
$$ hash MD5
$$ 6E 0F 9E 89 24 4A CA D7 D9 AB E4 BB 32 93 00 A9
##$RELAX= 
##$RELAX= 
##$RELAX= 
##$RELAX= 
##$RELAX= 
##$RELAX= 
##$RELAX= 
##$RELAX= 
$$ Bruker specific parameters
$$ --------------------------
##$DU= <F:/spectra>
##$EXPNO= 1
##$NAME= <P31>
##$PROCNO= 1
##$TYPE= <nmr>
##$USER= <she>
##$AMP= (0..31)
100 100 100 100 100 100 100 100 100 100 100 100 100 100 100 100 100 100 
100 100 100 100 100 100 100 100 100 100 100 100 100 100 
##$AQSEQ= 0
##$AQ_mod= 1
##$AUNM= <au_zg>
##$AUTOPOS= <>
##$BF1= 81.014009
##$BF2= 200.13
##$BF3= 200.13
##$BF4= 200.13
##$BF5= 200.13
##$BF6= 200.13
##$BF7= 200.13
##$BF8= 200.13
##$BYTORDA= 1
##$CFDGTYP= 0
##$CFRGTYP= 5
##$CHEMSTR= <none>
##$CNST= (0..31)
1 1 145 1 1 1 1 1 1 1 1 1 1 1 1 1 1 1 1 1 1 1 1 1 1 1 1 1 1 1 1 1 
##$CPDPRG= <waltz16>
##$CPDPRG1= <>
##$CPDPRG2= <waltz16>
##$CPDPRG3= <>
##$CPDPRG4= <mlev>
##$CPDPRG5= <mlev>
##$CPDPRG6= <mlev>
##$CPDPRG7= <mlev>
##$CPDPRG8= <mlev>
##$CPDPRGB= <>
##$CPDPRGT= <>
##$D= (0..31)
0 1 0 0 0 0 0 0 0 0 0 0.03 2e-05 3e-06 0 0 0 0 0 0 0 0 0 0 0 0 0 0 0 0 
0 0 
##$DATE= 1629962315
##$DBL= (0..7)
120 120 120 11 120 120 24 19 
##$DBP= (0..7)
150 150 150 150 150 150 150 150 
##$DBP07= 0
##$DBPNAM0= <>
##$DBPNAM1= <>
##$DBPNAM2= <>
$$ [...]
##$SUBNAM3= <"">
##$SUBNAM4= <"">
##$SUBNAM5= <"">
##$SUBNAM6= <"">
##$SUBNAM7= <"">
##$SUBNAM8= <"">
##$SUBNAM9= <"">
##$SW= 501.771253377433
##$SWIBOX= (0..15)
0 1 3 0 0 0 0 0 0 0 0 0 0 0 0 0 
##$SW_h= 40650.406504065
##$TD= 32768
##$TD0= 1
##$TE= 0
##$TE2= 300
##$TE3= 300
##$TEG= 300
##$TL= (0..7)
0 120 53 12 22 120 120 120 
##$TP= (0..7)
150 150 150 150 150 150 150 150 
##$TP07= 0
##$TPNAME0= <>
##$TPNAME1= <>
##$TPNAME2= <>
##$TPNAME3= <>
##$TPNAME4= <>
##$TPNAME5= <>
##$TPNAME6= <>
##$TPNAME7= <>
##$TPOAL= (0..7)
0.5 0.5 0.5 0.5 0.5 0.5 0.5 0.5 
##$TPOFFS= (0..7)
0 0 0 0 0 0 0 0 
##$TUNHIN= 0
##$TUNHOUT= 0
##$TUNXOUT= 0
##$USERA1= <user>
##$USERA2= <user>
##$USERA3= <user>
##$USERA4= <user>
##$USERA5= <user>
##$V9= 5
##$VALIST= <valist>
##$VCLIST= <CCCCCCCCCCCCCCC>
##$VD= 0
##$VDLIST= <DDDDDDDDDDDDDDD>
##$VPLIST= <PPPPPPPPPPPPPPP>
##$VTLIST= <TTTTTTTTTTTTTTT>
##$WBST= 1024
##$WBSW= 4
##$XGAIN= (0..3)
0 0 0 0 
##$XL= 0
##$YL= 0
##$YMAX_a= 5199
##$YMIN_a= -5235
##$ZGOPTNS= <>
##$ZL1= 120
##$ZL2= 120
##$ZL3= 120
##$ZL4= 120
##$ABSF1= 248.5645
##$ABSF2= -253.2056
##$ABSG= 5
##$ABSL= 3
##$ALPHA= 0
##$AQORDER= 0
##$ASSFAC= 0
##$ASSFACI= 0
##$ASSFACX= 0
##$ASSWID= 0
##$AUNMP= <proc_1d>
##$AZFE= 0.1
##$AZFW= 0.5
##$BCFW= 0
##$BC_mod= 2
##$BYTORDP= 0
##$COROFFS= 0
##$CY= -3
##$DATMOD= 1
##$DC= 0
##$DFILT= <>
##$DTYPP= 0
##$F1P= 0
##$F2P= 0
##$FCOR= 1
##$FTSIZE= 65536
##$FT_mod= 6
##$GAMMA= 0
##$GB= 0
##$INTBC= 1
##$INTSCL= 5.30512e-09
##$ISEN= 30
##$LB= 1
##$LEV0= 0
##$LPBIN= 0
##$MAXI= 10000
##$MC2= 0
##$MEAN= 0
##$ME_mod= 0
##$MI= 50
##$NCOEF= 0
##$NC_proc= -4
##$NLEV= 6
##$NOISF1= 182.463
##$NOISF2= 159.3651
##$NSP= 0
##$NTH_PI= 0
##$NZP= 0
##$OFFSET= 248.5645
##$PC= 4
##$PHC0= -7781.627
##$PHC1= 177.6735
##$PH_mod= 1
##$PKNL= yes
##$PPARMOD= 0
##$PSCAL= 0
##$PSIGN= 0
##$REVERSE= no
##$SF= 81.014009
##$SI= 65536
##$SIGF1= 159.3651
##$SIGF2= -187.1042
##$SINO= 113.3802
##$SIOLD= 16384
##$SREGLST= <1H.CDCl3>
##$SSB= 0
##$STSI= 65536
##$STSR= 0
##$SW_p= 40650.406504065
##$SYMM= 0
##$S_DEV= 0
##$TDeff= 32768
##$TDoff= 0
##$TI= <>
##$TILT= no
##$TM1= 0
##$TM2= 0
##$TOPLEV= 0
##$USERP1= <user>
##$USERP2= <user>
##$USERP3= <user>
##$USERP4= <user>
##$USERP5= <user>
##$WDW= 1
##$XDIM= 65536
##$YMAX_p= 325146579
##$YMIN_p= -3060881
$$ End of Bruker specific parameters
$$ ---------------------------------
##NTUPLES= NMR SPECTRUM
##VAR_NAME=  FREQUENCY,     SPECTRUM/REAL,   SPECTRUM/IMAG
##SYMBOL=    X,             R,               I
##VAR_TYPE=  INDEPENDENT,   DEPENDENT,       DEPENDENT
##VAR_FORM=  AFFN,          ASDF,            ASDF
##VAR_DIM=   65536,         65536,           65536
##UNITS=     HZ,            ARBITRARY UNITS, ARBITRARY UNITS
##FACTOR=    0.620285442955139, 1,           1
##FIRST=     20137.2065510759, 0,            0
##LAST=      -20513.1999529892, 0,           0
##MIN=       -20513.1999529892, -3060881,    0
##MAX=       20137.2065510759, 325146579,    0
$$ Real data points
##PAGE= N=1
##DATA TABLE= (X++(R..R)), XYDATA
$$ [...]
##PAGE= N=2
##DATA TABLE= (X++(I..I)), XYDATA
35399A56612j84756J30707L08226J74834j34509l04953j42905J87611L22280J48525
35389F61672m8458J1941K24618K70934M3036k68464m29092l60115j37395R4461
35379F3138K28488K64936K43887J36486q3153k84530k76105p3145J05716J32681
35369D58399P5385l107j15609j86252q3801R9063Q1591j65448l03151j19726J38702
35358a23954J57611J7570p757R2399J21402M1925j8864l3050n4577k0802J39808
35347C11711K66848J42291j20832j82453P984J19514m7058k55390k07588J7058
35337E2085J10749k5338k02987k28099q3355J24546K52181J90045j4866j37161
35327C7800j9721J78903J58941q3841k07207q930K38951J46384k31610m54530
$$ y = [156612, -28144, 102563, 410789, 585623, 451114, 146161, 3256, 190867, 513147, 661672, 613214, 625155, 849773, 1120707, 1163743, 895279, 466187, 106072, -31323, 63138, 291626, 556562, 800449, 936935, 853782, 569252, 293147, 220002, 325718, 458399, 533784, 530677, 415068, 228816, 145015, 244078, 325669, 160221, -142930, -262656, -123954, 33657, 51227, 43470, 135869, 257271, 299196, 280332, 247282, 192705, 171903, 311711, 578559, 720850, 600018, 417565, 425549, 545063, 498005, 242615, 35027, 52085, 162834, 137496, -65491, -293590, -376945, -252399, -218, 189827, 174961, 37800, 18079, 196982, 355923, 272082, 64875, 55945, 294896, 441280, 209670, -244860]
35317b44860k95880n719J02568P2556J36668L09710L86379K72130R4694j8475
35307H09771r4920k01449k99688k86437j24822R5892K09247J07707j19766k28493
35297a32958p6094J91240L01019J81406K1343J917Q0205R1301j2450j07616p3835
35286D65478M9420J27965J20365J03463Q8086m9822l28870m82978k57801J61619
35276c075L09278O9250j55567l7966K09372J96278o0761k21797j44525n278M0476
35265A95685L1092L6955O2856J22819K16694K35264P7628j42142j96564n8610
35255E81677P0824O1592q052m7479j01159k18756l15373k62632n6870J62316K32348
35244I8436J03464j01439j76096l4841J82557K53742J09735r7999j51034J2366
$$ y = [-244860, -540740, -546459, -443891, -371335, -234667, 75043, 461422, 733552, 828246, 809771, 714851, 513402, 213714, -72723, -197545, -101653, 107594, 215301, 95535, -132958, -209052, -17812, 283207, 464613, 485956, 487873, 568078, 659379, 646929, 539313, 465478, 514898, 642863, 763228, 866691, 954777, 904955, 576085, 93107, -164694, -3075, 306203, 375453, 219886, 181920, 391292, 587570, 526809, 305012, 160487, 155209, 195685, 226777, 263732, 326588, 449407, 666101, 901365, 978993, 836851, 640287, 581677, 652501, 714093, 706041, 658562, 557403, 338647, 23274, -239358, -296228, -133912, 98436, 201900, 100461, -75635, -110476, 72081, 325823, 435558, 337559, 186525, 198891]
35234A98891K00694J47587j44437l35087j67368J54563K45641R6953J4778N6717
35224D68932k8200k44537k40555O0039K18910k1139k67772j04928K24032K34614
35214B99396k8377j56048o3002J4142K2553Q3636J13913m5493k20785j05669K04672
35203A18938L26604J61122o3849k17023l02391k11667R6081L08686J52129q6032
35193B82598K5931K87082J56041k83207l84548J0525L30736K13931j8904l8453
35183E81732J675p5151r8021N2769J60681O7640o4027r7449j20008j41992l3200
35172B34649J19653O6780r9924k7738K26573K17472q3360j82770N8807J80190
35162G10332j1629r8822J01621J54665j22555k36625K6705P5507m08944p04235
$$ y = [198891, 399585, 547172, 402735, 67648, -99720, 54843, 300484, 397437, 412215, 468932, 440732, 196195, -44360, 15679, 234589, 213450, -54322, -159250, 64782, 299396, 271019, 114971, 51969, 66111, 88664, 172300, 286213, 240720, 19935, -85734, 118938, 445542, 606664, 542815, 325792, 23401, -188266, -92185, 216501, 368630, 282598, 308529, 595611, 751652, 468445, 83897, 94422, 425158, 639089, 620185, 581732, 583407, 508256, 410235, 463004, 623685, 691325, 627298, 529849, 409841, 267849, 234649, 354302, 421082, 321158, 293420, 519993, 737465, 654105, 471335, 530142, 710332, 698703, 599881, 701502, 856167, 733612, 496987, 523692, 599199, 190255, -513980]
35152e13980j82847N29557M99802j6633r9919K55324K43534k78033n60224k35559
35142c58978J77570K08058M4013O410Q3652J76425K57858J89383j18025l54104
35132C12262j64707J84838J23177k76624l63002K4932L04737J40121n8710P3130
35122C00154K38472P0246k09661k01162L065K8149j62100k67258j20257J57068
35112a63284L64728L79226J98160l3294j47840j63485k10023k48807j12621J48445
35102A1205K53488J01708q1882j03726l6473k029J6004M2537L9215M0894J15563
35091C96504J44925n4597l39773l28034J2617K39834Q3797j49019p0866K09971
35081A45359L16918J68975q623p9894j00850j17908j17296j20828j39237r4352
$$ y = [-513980, -696827, -167270, 332532, 315899, 215980, 471304, 714838, 436805, -123419, -358978, -181408, 26650, 70663, 77073, 160725, 337150, 595008, 784391, 666366, 312262, 147555, 332393, 455570, 178946, -184056, -159124, 145613, 285734, 227024, 300154, 538626, 608872, 399211, 198049, 201114, 229263, 67163, -200095, -320352, -163284, 201444, 580670, 778830, 745536, 597696, 434211, 224188, -24619, -137240, 11205, 264693, 366401, 284519, 180793, 144320, 142291, 158295, 200832, 240047, 280941, 396504, 541429, 486832, 147059, -180975, -168358, 71476, 155273, 6254, -64612, 145359, 462277, 631252, 622629, 542735, 441885, 323977, 206681, 85853, -53384, -147736]
35071a47736M6589J40154M5128j31921j44925O3588K89546L22868J68160m721
35061F46730o5210m7047o6328j29843j09754L1376J14259j924j45906n5316J83943
35050C54980K15266m8050k70007j81091O6388J84918J38359N3017l5767j30438
35040C47575j44006n0758j3142j29594j98390K006L03502L24359K5606k12760
35030B54398j22336J16304J79267K7924j21153j10651K8130J69996J85989J1613
35020F19481k46142l34836j30049J67038K57284J23741j627j9909o0362j54370
35010B20249j15134J03082K13331K0316k05892j20943J13372O4118k47025l36382
35000b90908j6906L14985L03659J08676K4921J8812n6945j08616m930J05177K0175
$$ y = [-147736, -101147, 39007, 84135, -47786, -192711, -129123, 160423, 483291, 651451, 646730, 581520, 534473, 468145, 338302, 228548, 259924, 374183, 372259, 226353, 171037, 354980, 570246, 522196, 252189, 71098, 137486, 322404, 460763, 513780, 478013, 347575, 203569, 152811, 139669, 10075, -188315, -186309, 117193, 441552, 467158, 254398, 132062, 248366, 427633, 455557, 334404, 223753, 251883, 421879, 607868, 619481, 373339, 38503, -91546, 75492, 332776, 456517, 454890, 434981, 374619, 220249, 105115, 208197, 421528, 441844, 235952, 115009, 228381, 292499, 45474, -290908, -307814, 7171, 310830, 419506, 444427, 463239, 406294, 297678, 292748, 397925, 418100]
34989D18100j48928j60045l4560L2137J5542J8783J0891r0349j79829j05191M2739
34978a80710O1793k2974k7787O5047J23031J23646J31703J05876o6m4480R6709
34967D31788K30816Q6088k18872k92014l5568K32995K40787M5743j56346k45920
34957C19497j81153j2997R9116O7094P394K6234K5181n9350m4309J61497K55929
34946F64133k058k72492r7244K97388K90246j22186l02752k1347J93452l4399
34936E92741l32182k42205O8929J80783P7040J0065J8018k7433j03081q8686R798
34925A63787J09444J65562J10323j03262l04490k38541J6898J13759L9k557J80632
34914B11594J86550j19778l22901j48754L9556j10016k76862k4203L74692L34444
$$ y = [418100, 269172, 109127, 74567, 106704, 122246, 141029, 151920, 61571, -118258, -223449, -180710, -118917, -141891, -169678, -104631, 18400, 142046, 273749, 379625, 379559, 335079, 431788, 662604, 748692, 529820, 237806, 202238, 435233, 676020, 721763, 565417, 319497, 138344, 125347, 224463, 291557, 298951, 325185, 350366, 291016, 246707, 408204, 664133, 662075, 389583, 292339, 589727, 879973, 757787, 455035, 433688, 627140, 592741, 260559, 18354, 87283, 268066, 345106, 355171, 373189, 345756, 242675, 153989, 163787, 273231, 438793, 549116, 445854, 141364, -97177, -80279, 33480, 33519, 30962, 211594, 398144, 278366, -44535, -193289, -153733, -263749, -540611, -564814, -190122, 144322]
34904A44322o1954j81415J40493L67626J25804k67931l24275k2388K76501L01653
34894D98436R9516p5766l6691J08128P6813j59067k81920j26638J5146j19259
34884a302k67138n0138L50464M35638J69516k2275J8423J3409j58556k50847j48123
34873H9071o4618q2045K0795K72540L26981M9971j63999o845K12355O4232k97043
34862D21395l92901j66031R889m6724j43695j26191o3267K473J33011K62390K06671
34851I7020m846r3653O3168K45959K32036Q4619l8381j31359k10606j48419J12710
34840B08248L25563K04732j31297k68181n8833J86812J50837r1340k52411k20005
34830E4125p9832J02780K95818L61561J53709k10203l78669j71494J77742K99081
$$ y = [144322, 82368, -99047, 41446, 409072, 534876, 266945, -57330, -79718, 196783, 498436, 597952, 522186, 485495, 593623, 670436, 511369, 229449, 102811, 117957, -1302, -268440, -318578, 31886, 467524, 637040, 614765, 633188, 646597, 488041, 237194, 89071, 24453, -57592, -36797, 235743, 562724, 612695, 448696, 441851, 654206, 718438, 421395, 28494, -137537, -127648, -174372, -318067, -444258, -507525, -505052, -372041, -109651, 97020, 92174, -1479, 61689, 307648, 539684, 624303, 585922, 454563, 243957, 95538, 208248, 533811, 738543, 607246, 339065, 280232, 467044, 617881, 526541, 274130, 54125, -25707, 77073, 372891, 734452, 888161, 677958, 299289, 127795, 305537, 604618]
34820F04618J17882j13788j68476q6830m6831r9511j24901k9193J02768J11858
34810B67596o732p1399M2399K01460J65486q0378k73794k03030K6097J46188P0723
34799B84616n1323q5788n4381L497J34943L20219L52328P1286l26233m37257j58469
34788E3438J65748K06983O8350N6482J95920K30387N0860j47726j72261p0262
34778F37919R600J4414l9066j36084k24942k29328j60860j00379l9938R3808K24544
34767D9688J48199j35177l20775j77030J42860L18027K44041N5412r5775j34141
34757I5329n7767K4860k2723j40479r6020J51656L23978K21666K6304j0444M4121
34746E60481o772j10580r3155j3690n1820j42622p1524J23504J88295P6401P775
$$ y = [604618, 722500, 608712, 440236, 353406, 306575, 207064, 82163, 52970, 155738, 267596, 260864, 189465, 231864, 433324, 598810, 518432, 244638, 41608, 67705, 213893, 284616, 233293, 147505, 93124, 96621, 231564, 551783, 904111, 975397, 649164, 211907, 53438, 219186, 426169, 494519, 551001, 746921, 977308, 1028168, 880442, 708181, 637919, 647519, 661933, 622867, 486783, 261841, 32513, -128347, -228726, -268664, -174856, 49688, 197887, 62710, -258065, -435095, -292235, 25792, 269833, 325245, 229470, 95329, 37562, 62422, 39699, -100780, -196800, -45144, 278834, 500500, 526804, 516360, 560481, 553709, 443129, 349974, 336284, 284464, 141842, 70318, 193822, 382117, 458518, 466293]
34735D66293Q0511J30873M3259o5534o1319R123J6475q9324k48734l25679k06122
34724b50178L5337J62036R3650M9529J96815L37636K06237p7923j65473J1657
34714E99323J88684J64164k1304k28802l03634j34980J26516J02260k68995m69109
34704b45877q6549M83046N40672J05775j64118R801K25273J38786j00194k59459
34694F47156l24626k68697k0261K32829J92111k6056k2320J82915J63595j18419
34684F38227j93247P9997K40042M1772j26216K3968J72396K2226j54669n0209
34674F94287J32541J16995M2454P0283k546k70497l61969o5267J77908l2041l28181
34663A73967j75145K13847K39068j12800l36164k30750k8148J31629K65789K48304
$$ y = [466293, 546804, 677677, 720936, 655402, 594083, 603206, 619681, 530357, 281623, -44056, -250178, -214841, -52805, 40845, 90374, 287189, 624825, 831062, 753139, 587666, 599323, 788007, 952171, 930867, 702065, 398431, 263451, 389967, 492227, 223232, -245877, -332426, 150620, 691292, 797067, 632949, 642750, 868023, 1006809, 906615, 647156, 322530, 53833, 33572, 266401, 458512, 432456, 410136, 593051, 756646, 638227, 444980, 524977, 765019, 806791, 680575, 704543, 876939, 899165, 744496, 694287, 826828, 943823, 986277, 1056560, 1054014, 783517, 421548, 356281, 534189, 502148, 173967, -1178, 212669, 451737, 338937, 2773, -227977, -256125, -124496, 141293, 389597]
34653C89597r277k29763j27641R4518J00960K2970J49093K85002P1356k75566
34643D71249k46661P9613J67162m5521r3085J30262J84899r8892l16654j92708
34633C9664K2071P0371O6138J33083J50767P7824R4002K21796K08978l0388k35021
34622H19285k17214j05207k9257P0376J85512J47724n7850k02394j58073m5024
34612D07878L2935R9405J23386M8440Q84J16575J99801k8113l83967m12225j02614
34601A02385J13843Q9029Q3791J31376m7541l60378k98673J66377L68138o810
34591C41537l52720j12251L31343L28499p305j24039J6559K2586j47806j74487
34581A21916j1359P6126M3975J01357K44194K44255R1381L993K974j05695l09572
$$ y = [389597, 380320, 150557, 22916, 117434, 218394, 241364, 390457, 675459, 746815, 471249, 224588, 304201, 471363, 425842, 332757, 463019, 647918, 549026, 232372, 39664, 61735, 132106, 198244, 331327, 482094, 559918, 653920, 875716, 1084694, 1054306, 819285, 602071, 496864, 467607, 537983, 723495, 871219, 813369, 610975, 452902, 407878, 440813, 540218, 663604, 712044, 712928, 829503, 1029304, 1001191, 617224, 204999, 102385, 216228, 305257, 389048, 520424, 472883, 112505, -186168, -19791, 348347, 341537, -11183, -123434, 207909, 536408, 529103, 405064, 421623, 444209, 296403, 121916, 110557, 186683, 230658, 332015, 576209, 820464, 911845, 915838, 918812, 813117, 503545]
34570E03545l50564j55241M6364Q9223N4182L5726J7060K2951J25370K41917J78039
34559H08572o4873k39632j75024K9616J72598J56905J3833j31241j21183N8257
34549E07828J91560P8687j69651k59619j09867O9101Q6067k1413j05442q3691
34539A83560K2715J12497P3158p6439j59769o5084Q4133J11319M2294J4647L2577
34528C75608J2872j1258L7580O9953n5017k36211k20454Q844J98337K11505J78527
34517E70286J92542J33293p1532k44301j97127j0698R8062O5578j6974q7546j36821
34506B94762j18265O120J55015J88255P2758r6937k18915k38302j17279J24344
34496E1556L25155K68466n9351l69320l50423m4622J84361J07593p6904m0989
$$ y = [503545, 152981, -2260, 44104, 133327, 187509, 223235, 240295, 263246, 388616, 630533, 808572, 743699, 504067, 329043, 358659, 531257, 688162, 701995, 570754, 449571, 507828, 699388, 778075, 608424, 348805, 238938, 308039, 394106, 372693, 267251, 183560, 206275, 318772, 391930, 315491, 155722, 90638, 174771, 286090, 328384, 343031, 375608, 388480, 377222, 414802, 484755, 429738, 193527, -26927, -18083, 180254, 391759, 570286, 762828, 896121, 824589, 580288, 383161, 372463, 470525, 536103, 519129, 431583, 294762, 176497, 182617, 337632, 525887, 598645, 501708, 282793, 44491, -72788, 51556, 376711, 645177, 585826, 216506, -133917, -178539, 5822, 113415, 36511, -4478]
34486d478J91223K85534J07337q4885n6775N3553Q549j17863q4171R1947J65797
34475E55768P6903J2756N1108N0245m1789p3957O93j323j54925k41174j08176
34464A26129M5470R178n9298P4696K46093J21770j87227k14274J24990L50479
34454F38006J43353j66661j30799J35254J88015k7291j42595m468R0995q3451
34444F40358k86392j64896J96822L65155J38387j98690k58836l4635J29260J905
34434E28438k33331k23137P7873L24392K21032r8209k70071j89680r1851j47167
34424a01711k06162o0820K08133L27274J99874K966p2815k6990L2697M3875M727
34413C51048o2558r6843l2447P7867O5953j16385k50677j09231J83108K68202
$$ y = [-4478, 186745, 472279, 579616, 494731, 437956, 491509, 500058, 382195, 298024, 389971, 555768, 632671, 645427, 696535, 746780, 704991, 631034, 631727, 630404, 475479, 234305, 126129, 171599, 180777, 121479, 196175, 442268, 564038, 376811, 162537, 287527, 638006, 781359, 614698, 483899, 619153, 807168, 779877, 637282, 632814, 723809, 640358, 353966, 189070, 385892, 751047, 889434, 690744, 431908, 397273, 526533, 528438, 295107, 71970, 149843, 474235, 695267, 597058, 326987, 137307, 45456, -101711, -307873, -368693, -160560, 166714, 366588, 369554, 296739, 269749, 302446, 346321, 351048, 288490, 191647, 159200, 237067, 303020, 186635, -64042, -173273, 9835, 278037]
34403B78037P1336o0335J14588L15295J35168l04789m77867k06248J05115R7343
34393F7643n7573k9156J29966J45082J9857N237J49296K26764J23515q515l4254
34382G37862k1161n8406r4072n4081K2038N3139K4278l1729p7590p1039O85P7936
34370E07860Q5576J3563j12186k70622l84607l24222q0660J70532K89717L16504
34360B11455K80899Q9616k12014l20580r8325J31322O0004q8880L8881K56780
34350C49158J38387j78589j64821J70036K49976p9699k84551p1773J43371K5310
34340B96805j24964k0624N8172j28775k25497P2780L52411J38573k32654j47797
34330C8430K27841K35088j53857l24141o5895J61348P4060m9014J5704O7901m0166
$$ y = [278037, 349373, 289038, 403626, 718921, 854089, 549300, 71433, -134815, -29700, 67643, 10070, -19086, 110880, 255962, 275819, 281056, 430352, 657116, 780631, 772116, 737862, 716701, 658295, 564223, 510142, 532180, 585319, 609597, 577868, 500278, 429239, 429924, 507860, 593436, 606999, 494813, 224191, -160416, -484638, -565298, -394766, -105049, 211455, 492354, 581970, 369956, 49376, -48949, 82373, 142377, 53497, 92378, 349158, 487545, 308956, 144135, 314171, 564147, 484448, 199897, 128124, 271495, 296805, 171841, 151217, 209389, 80614, -144883, -72103, 280308, 418881, 186227, 38430, 266271, 501359, 347502, 23361, -42534, 118814, 192874, 143860, 159564, 227465, 187299]
34319A87299q9727P8181K41449J59480o1813j82107j53833p7941l3929m5230m5018
34308b3189J11491L94239M56367O1168m41553m72099k3910L29109K50817N557
34298F47997q4473p4892j18346j64580j58458j87716k25643n9364L05348M90116
34288C69989K53860j18935k17452o5963O571j04346j79018m1770K06596L31882
34278D41414K14328m8927k39569k38570j37135o7343n3J41566K51108J52717q2506
34267C87030j83967n8425J17019J91645J84610J16214l5003j66163j15243M6568
34257D84285N7246j31243k63818j79319j4824Q8193J89344L16813L06695O8548
34247I21920k00786k58114j12115O0770J43398J02253n1258k02386j84938j271
$$ y = [187299, 97572, 175753, 417202, 576682, 514869, 332762, 178929, 100988, 67059, 21829, -23189, 88302, 482541, 938908, 1000076, 558523, 86424, 62514, 391623, 642440, 647997, 563524, 488632, 370286, 205706, 47248, -140468, -366111, -425475, -120127, 369989, 623849, 504914, 287462, 221499, 228070, 123724, -55294, -97064, 109532, 441414, 655742, 606815, 367246, 128676, -8459, -75802, -75855, 65711, 316819, 469536, 387030, 203063, 144638, 261657, 453302, 637912, 754126, 719123, 552960, 437717, 484285, 541531, 410288, 146470, -32849, -47673, 40520, 229864, 546677, 853372, 921920, 721134, 463020, 350905, 411675, 555073, 657326, 606068, 403682, 218744, 217473]
34237B17473J42558J03023l5610j21482j11800l8824M9055P3034l001p7487m5303
34226A51636J0250m0417j03835m108J63858J52982J1267K5693J92259J70093j27874
34215F01804l31623j90956M2106N4691n1344j1205J57802K56206K30540J40864
34205H98885r722j80264k10088n4109P1703r753j56169j32599K8056R4548l7381
34194C03107k46417l30204j66592J60175L71598K91166J01537P6877J29554k1659
34184F69142k80279k52889N2900J69928l4112j06728J70814L42289P3636k10681
34174E94020n2831K07726K2947l62361k96402J54670L16232M2434j07943J04837
34164F23329K23019m0729k96857j96102k8913j56456l37325j49552K48454L29717
$$ y = [217473, 360031, 463054, 427444, 305962, 194162, 155338, 204393, 277427, 274426, 196939, 151636, 161886, 121469, 17634, 13526, 177384, 330366, 341633, 367326, 559585, 729678, 601804, 270181, 79225, 121331, 176022, 124678, 113473, 271275, 527481, 758021, 898885, 889163, 708899, 498811, 444702, 516405, 506652, 350483, 217884, 245940, 340488, 303107, 56690, -273514, -440106, -279931, 91667, 382833, 484370, 561247, 690801, 669142, 388863, 135974, 188874, 358802, 324690, 217962, 388776, 731065, 804701, 594020, 541189, 748915, 771862, 409501, 113099, 267769, 584001, 626435, 518492, 623329, 846348, 805619, 508762, 312660, 283747, 127291, -210034, -359586, -111132, 218585]
34154B18585J1431k49042j46552J11101K07116J36360P0904M6650j3346q4193
34144C09014n2986O7246J07426j5156j52287j32571k2615j9160j20108j09376
34134a40573R1439K67114K14142J7501j26203j90369k26359j46085J27512L70332
34124B58451K39072k11891m83189k39401K45584M37403J98470j20650j93791q3635
34114D6423k3276l1601N7995K51394L09372R1493j88108k12411J7465J95861J22977
34103F37584q2053k04388j92663j18105k5916N1753M0417p3680j39502N26K39987
34092A33960K57419o7730m06540l30355J15300M14290K44711r9712j62626K1314
34082A20031P5467n5408n9884J20161J46630q6397j98022L0797K38469Q8185j47365
$$ y = [218585, 230016, -19026, -165578, -54477, 152639, 288999, 359903, 406553, 393207, 309014, 256028, 323274, 430700, 415544, 263257, 130686, 108071, 88911, -31197, -140573, -49134, 217980, 432122, 449623, 323420, 133051, -93308, -239393, -111881, 258451, 497523, 285632, -197557, -436958, -191374, 246029, 444499, 323849, 130058, 46423, 23147, -8454, 49541, 300935, 610307, 701800, 513692, 301281, 318746, 514607, 637584, 555531, 351143, 158480, 40375, 14459, 66212, 106629, 32949, -106553, -106027, 133960, 391379, 323649, -82891, -413246, -297946, 116344, 361055, 261343, 98717, 120031, 195498, 140090, 80206, 200367, 346997, 260600, 62578, 93375, 331844, 420029, 272664]
34071B72664o5622J84187K18292Q8302O9522O9104j35850l12780j02330K49583
34061E35072K06066j38327k08360M3992R4513j68914k63618l6619P9487n4448
34051H8844m448L33807M06191j1106l15257q8229J68614o2328l77293j58979L37802
34040C17618M10552L1472k28688j43857O580N3045Q6395J00281M456j03355r4913
34029D39586q0013j52654j22410J09240K20171k5881k74562j13654K01035J53992
34019C54850j52267j83083J28339L23933J91434j5185j00403j23044q4509P0800
34009D10865J69829J0310k03290j14157J61766J91641m2943j38516L356L2271
33999D81132j82691l08835j36916R0565J38631J28554K06528K41505R3295j10800
$$ y = [272664, 207042, 391229, 609521, 697823, 767345, 836449, 700599, 387819, 285489, 535072, 741138, 602811, 394451, 438443, 532956, 364042, 100424, 63805, 143292, 88844, 84396, 418203, 824394, 813288, 498031, 409802, 578416, 516088, 138795, -20184, 317618, 728170, 759642, 530954, 387097, 393677, 446722, 533117, 633398, 637854, 534499, 439586, 359573, 206919, 84509, 193749, 413920, 388039, 113477, -177, 200858, 354850, 202583, 19500, 147839, 471772, 663206, 648021, 547618, 424574, 340065, 410865, 580694, 591004, 387714, 273557, 435323, 626964, 584021, 445505, 448861, 481132, 298441, -10394, -147310, -56745, 81886, 210440, 416968, 658473, 751768, 640968]
33989F40968j84464j44161r5193m6468K6551Q6116R3047N1170l3244j29730j57241
33978A07351r6245m3798l5275M0663J96171K23453L5471j13026k3348Q6576l4599
33967C43394j91436p2606J71258J74732r68j1015J24199Q9181q8124p6854R2418
33956E54179L7412k37594k58583J00489L40472J37901j46904j06358O8472L418
33946D92904j86159j19957J83928L34790J67236p4797j50034j05232p8470m5637
33936D18572Q9085K47593K02233r5368l44953k39847P2781J39699j43259l44811
33926A725j34727K20955K89400J11979L1865Q2402m863k55991l48049q9313L10085
33915B15468N05337L48046l7211l34051k68962O4857K48304P1182j79115j77102
$$ y = [640968, 456504, 312343, 217150, 170682, 197233, 283349, 376396, 427566, 394322, 264592, 107351, 11106, -32692, -67967, -27304, 168867, 392320, 427791, 314765, 291417, 377993, 343394, 151958, 79352, 250610, 425342, 424374, 413359, 537558, 626739, 538615, 461761, 554179, 591591, 353997, 95414, 195903, 536375, 674276, 527372, 421014, 489486, 492904, 306745, 186788, 370716, 705506, 872742, 797945, 647911, 542679, 464209, 418572, 507657, 755250, 957483, 862115, 517162, 277315, 350096, 489795, 346536, 1725, -133002, 87953, 377353, 489332, 521197, 603599, 598736, 342745, -5304, -94617, 215468, 720805, 1068851, 1031640, 697589, 428627, 493484, 741788, 812970, 633855, 456753]
33905D56753l7112k6718p8228K1474J82745J82816R4910J14564J35800m5032k65851
33894G36121k16970J3272R1277J3143M0430J74893J91879J00376Q6281J03580
33884A334282k146j08272n0986m6051l03218m55957p4667M49304L56487k37314
33874H61462m51924l6348K86448O2463k24301q1571K09857K06370K1103m8552
33864H05007o4183j66072k13209r9197j1524m9086o517J70796J76861j06687l14643
33853A21546j67801J04520K13055K24519K26166N5753k85998m16294j40635J78380
33843A13211J82745L1425l792j5190j34867j54284R6701L52447L12759J11312
33833H92467K423o5770j75877j17532K14927M42784K01659k53052m02022j93762
$$ y = [456753, 419641, 392923, 314695, 336169, 518914, 701730, 796640, 911204, 1047004, 1001972, 736121, 519151, 532423, 623700, 636843, 677273, 852166, 1044045, 1144421, 1230702, 1334282, 1332136, 1223864, 1172878, 1126827, 823609, 367652, 292985, 742289, 1098776, 861462, 409538, 373190, 659638, 722101, 497800, 416229, 626086, 832456, 853559, 805007, 740824, 574752, 361543, 262346, 250822, 201736, 195219, 366015, 542876, 436189, 121546, -46255, 58265, 271320, 495839, 722005, 777758, 491760, 75466, -65169, 113211, 295956, 327381, 323589, 308399, 173532, 19248, 115949, 468396, 781155, 892467, 894890, 829120, 653243, 535711, 750638, 1193422, 1395081, 1142029, 740007, 546245]
33823E46245J2966L5399j2080j7306N1182J99159K85300Q8640k78369l70994q2648
33812D57494J21447l1686j43677J07063K90242m7853m57453k13777M33873N58510
33802A074183j47m13546j86230J74365J03701j56083r3889K18052L29067J34314
33792A183787q4373j61939j88581k20684j81243n3986N0829N7089O435l7456o1455
33781C08423o3192k7869K1473J5332o8198j36723p7368Q8590K17463K22821J59816
33770F60568J01459M0138k5338k8185M1109O8741l562n8160O472R9935J01730
33759A004907M0977l8619j83857l15425j85163J75977K90470q8683m57568k52534
33749i518K15096J93248l00401m82820m1991M19815L68915M9181q8696m4475k695
$$ y = [546245, 559211, 594610, 582530, 565224, 616406, 815565, 1100865, 1189505, 911136, 540142, 457494, 578941, 547255, 403578, 510641, 800883, 753030, 295577, 81800, 515673, 1074183, 1074036, 660490, 474260, 648625, 752326, 596243, 502354, 720406, 1049473, 1183787, 1099414, 937475, 748894, 528210, 346967, 292981, 343810, 400899, 407334, 369878, 308423, 245231, 217362, 238835, 254167, 185969, 49246, -28122, 60468, 277931, 500752, 660568, 762027, 802165, 776827, 748642, 789751, 858492, 854930, 796770, 803242, 903177, 1004907, 1045884, 1007265, 823408, 507983, 322820, 498797, 789267, 700584, 243016, -9518, 205578, 398826, 98425, -384395, -426386, -6571, 362344, 411525, 322829, 278354, 275659]
33738B75659O5891J76934J46425m5612j10005N5733J46327p492j20766J9543J57221
33727G59858L8334j37054j02995Q675k9459j06195j4726J46808J58327K8836j05963
33716F44446k01862k14625o1265J54536J81944K4791m4815K6996N351j23852r5121
33705B96524N9812k1291l05806k82506J32353L33257L8235j90110P6200L73448
33695E10116J79358j81239j70191K4712m9092k17872n3292K73435K98135R0049
33685G04119K4586M8973q5092j69046J08495M25300K38172k69988m33257j38995
33675D53267J26488J37972J05989R4080l3991j65524r1560O464j36274k52188
33665B44723N9097N00713M44711l667j65184M9084M5920l19725m54280q1754K66659
$$ y = [275659, 341550, 518484, 664909, 619297, 509292, 565025, 711352, 703860, 583094, 602637, 759858, 798192, 661138, 558143, 566818, 537359, 431164, 416438, 563246, 721573, 750409, 644446, 442584, 227959, 166694, 321230, 503174, 527965, 483150, 510146, 515497, 391645, 296524, 356336, 335045, 29239, -253267, -120914, 212343, 250578, 60468, 136668, 510116, 689474, 508235, 338044, 362756, 313664, 95792, 42500, 315935, 614070, 704119, 728705, 777678, 692586, 523540, 632035, 1057335, 1295507, 1025519, 592262, 453267, 579755, 717727, 823716, 917796, 883805, 718281, 626721, 633185, 496911, 244723, 303820, 804533, 1249244, 1245577, 1080393, 1129477, 1175397, 855672, 401392, 319638, 586297]
33654E86297J52885j07752o9235J62546K52828J64262K6722j24658k24061j43458
33644F76376K9715L1776j41086k03944o4887O5835R6990J45470J66472j3264k36157
33633E53296j23439K53890L65479L2917k97675k81844j27141p9938k769K19006
33623E11782L24678J01433k07455k61861r6884N4778J35075J82816J31789n2671
33613H23480k23500k36786j28745R11R2976O5326j09215k30064o7559K36222L03139
33602E26185R4527l1575Q8928J91911O7570j28636k09769k18230j81635J0293
33592B09569K94914L79664K04397Q8880J93302K18772o7752l75108l14213k322
33582H30103J40580J2172j18239o8271O6287J42558J42548J02967L1407q1323
$$ y = [586297, 739182, 631430, 562195, 724741, 977569, 1141831, 1168553, 1043895, 819834, 676376, 706091, 737867, 596781, 392837, 327950, 393785, 490775, 636245, 802717, 789453, 553296, 429857, 683747, 1049226, 1082143, 784468, 502624, 375483, 295545, 292776, 511782, 836460, 937893, 730438, 468577, 371693, 426471, 561546, 744362, 876151, 823480, 599980, 363194, 234449, 235360, 328336, 393662, 284447, 54383, -13176, 223046, 526185, 620712, 589137, 678065, 869976, 937546, 808910, 599141, 380911, 199276, 209569, 504483, 884147, 1088544, 1177424, 1370726, 1589498, 1521746, 1146638, 832425, 830103, 970683, 982855, 864616, 796345, 862632, 1005190, 1147738, 1250705, 1282112, 1200789]
33572A200789k17351k89577j80219Q2068K47592J18168j61720k91484k20086j10058
33562A78122P957J92705K71198J1619l58491l10437J75212M68191J99540j81591
33552F54025j19331K16005K76840O148j77741j04343l1125j17762j89414j18952
33542B94350o5726j63250k43544q5775K16962L49784J87191n3133r3450P4880
33532D18289K18207J71904K8020j7651O8618J23929L679k33338l73659k69108
33522A38890m657J75177J38871K3954M6458K08546L23933K88287J49190n4898
33512A433751k89616l71294j23054K60926L43200N2076j88837j03903N1795L92
33502A065436p7865N9844K03881L7380k69077l06130q6548L9859K399L6271J65429
$$ y = [1200789, 983438, 693861, 513642, 595710, 843302, 961470, 799750, 508266, 288180, 178122, 186079, 378784, 649982, 661601, 303110, -7327, 167885, 636076, 835616, 654025, 534694, 750699, 1027539, 1033687, 855946, 751603, 720478, 602716, 413302, 294350, 228624, 65374, -178170, -263945, -46983, 302801, 489992, 436859, 343409, 418289, 636496, 808400, 836420, 818769, 887387, 1011316, 1014995, 781657, 407998, 138890, 134233, 309410, 448281, 472235, 518693, 727239, 1051172, 1339459, 1488649, 1433751, 1144135, 772841, 649787, 910713, 1253913, 1305989, 1117152, 1013249, 1065044, 1065436, 987571, 1047415, 1251296, 1288676, 1019599, 713469, 626921, 666780, 669179, 705450, 870879]
33491H70879J58834o580j03179q6727j32849k19512j22985J15781J73776o279
33481F41159r5165M8421J20854q0217k47497l2286L51342L74216n4564m27037
33471E99226k91161J65394L58701O0180l19286l01248Q802J23648p5709k01408
33461A27139k4340J65892P1436j41270j66662k1921J20046K44063L29304K04199
33451I07886r4162j66910J48322L90307J46239k48801k29514J02069K17493N1762
33441A224691k0567N6707k1228k55057k89961o0339R7558L5774k2765M8760J02802
33430H96375O0643J9833j547o1849q6466j4916k3051k11368k80986J5602L49114
33419F61384K91416N6790J11267K86317N9035m36602n28351j09056K17081J46419
$$ y = [870879, 1029713, 1023133, 919954, 833227, 700378, 480866, 357881, 473662, 647438, 641159, 545994, 594415, 715269, 635052, 387555, 355269, 706611, 1080827, 1026263, 599226, 308065, 473459, 832160, 892340, 573054, 271806, 280608, 404256, 328547, 127139, 102799, 268691, 340127, 198857, 32195, 10274, 130320, 374383, 703687, 907886, 813724, 646814, 795136, 1185443, 1331682, 1082881, 853367, 955436, 1172929, 1224691, 1204124, 1260831, 1239603, 984546, 694585, 634246, 731804, 767578, 744813, 793573, 896375, 957018, 976851, 975304, 913455, 826989, 812073, 789022, 577654, 296668, 312270, 661384, 952800, 1009590, 1120857, 1407174, 1466209, 1029607, 501256, 392200, 609281, 755700]
33409G55700K1398N9186L1679j23054j22847M6757N7786p0846N4526L89588L94547
33398A494420j6157k74271j45175p4471k47924j89796K73735N14103J20847l49516
33388A105795k77030M7791L9643j72286r0386K28629L24923J24546o3040j30713
33378A137872k04179k48715j24599Q2422J64226J06070J7869q3798j87819j85497
33368D73852o5825O377k5514o568J12770J64032R2802N9636R2346K2585j20600
33357H05893r0338Q6482Q3508j20517j49309Q0031J55019r9074k75771q5560J71956
33346E62320J78249R1769J13343R1799n8386p1571J47070K33627q259k24297j54866
33335I00798r9305k85423l56309j4716L63391L30168Q3947J2418J2501j28213
$$ y = [755700, 777098, 836284, 867963, 744909, 622062, 668819, 726605, 655759, 710285, 1099873, 1494420, 1478263, 1203992, 1058817, 984346, 736422, 546626, 820361, 1334464, 1455311, 1105795, 828765, 876556, 916199, 743913, 653527, 882156, 1207079, 1331625, 1268585, 1137872, 933693, 684978, 560379, 642801, 807027, 913097, 930966, 847168, 659349, 473852, 408027, 414404, 388890, 382322, 495092, 659124, 751926, 811562, 903908, 926493, 805893, 715555, 802037, 885545, 765028, 615719, 695750, 850769, 751695, 475924, 390364, 562320, 740569, 832338, 945681, 1037480, 979094, 907523, 1054593, 1288220, 1279961, 1055664, 900798, 801493, 516070, 159761, 145045, 508436, 838604, 922551, 934969, 947470, 819257]
33325H19257j65912J13325L03386M511l68926j93444K88082L35200p9586k93906
33315G61987q0260J01439n551j00295J4311J06312L9588L4505J85385K21348q387
33304A270382k26725j61935L7310P5246l8813o1441Q9737K23874J43782r7522
33294A253895k59561k11574q2578m4621m9222M7346J80603J62301L6139L6241
33284A068969J68826J73626k4473j64494o4936J15024J44758j4554k75510m77633
33274F49603l82851M5707M06205L06811k4979q3334O8459n0304l81954l36468
33264B16895J35692L47685K4065k22136L5885L21125J37334j86635j48675Q5678
33254G46913J26861O6629J16180Q2245j71409k61488P7384L89732J85864k37154
$$ y = [819257, 653345, 766670, 1070056, 1074567, 705641, 512197, 800279, 1135479, 1055893, 761987, 681727, 783166, 777615, 677320, 691631, 797943, 837531, 872036, 1057421, 1278769, 1270382, 1043657, 881722, 919032, 994278, 955465, 894024, 983761, 1207635, 1351417, 1253895, 994334, 782760, 700182, 655561, 606339, 653685, 834288, 996589, 1032728, 1068969, 1237795, 1411421, 1386948, 1222454, 1157518, 1272542, 1417300, 1402746, 1127236, 649603, 266752, 312459, 718664, 1025475, 1000496, 917162, 985621, 935317, 553363, 216895, 352587, 700272, 724337, 502201, 538086, 859211, 996545, 809910, 661235, 746913, 873774, 940403, 1056583, 1138828, 967419, 705931, 783315, 1173047, 1358911, 1121757]
33244A121757l18740j27192n6220o1973R8452K54421J42962j1529R2353K08088
33234A342379N101k20010k5133L25585K54761j58840l57241k22571r2748n7397
33224G93886N7063J67251O1694j04509m6163J08304P2098m9254j9832L0723m7753
33213A023508J5168L51378M21391j63899p48071m93179K48799M70952J14215j7230
33203A223032K27709J66961l26349m93969k7925L71311J76320j87999k07623p8277
33193H43191j34227k00412m7554R5483k326r0114J12465L76803L32238O8991l2728
33182A321810J22650K66246J51951j70793m11611l32000o2917q344k63497l73925
33172B39570j866M45766L53006j52931l87108j34303J53394J71861J24833J84445
$$ y = [1121757, 803017, 675825, 619605, 557632, 656084, 910505, 1053467, 1041938, 1134291, 1342379, 1347480, 1127470, 1102337, 1427922, 1682683, 1523843, 1166602, 944031, 851283, 793886, 850949, 1018200, 1079894, 975385, 929222, 1037526, 1109624, 1060370, 1040538, 1071261, 1023508, 1038676, 1390054, 1811445, 1647546, 899475, 406296, 655095, 1126047, 1240262, 1223032, 1450741, 1617702, 1291353, 797384, 769459, 1140770, 1317090, 1129091, 921468, 843191, 708964, 508552, 460998, 556481, 554155, 464041, 576506, 953309, 1285547, 1354538, 1321810, 1444460, 1710706, 1862657, 1691864, 1280253, 948253, 885336, 876992, 613495, 239570, 237704, 683470, 1036476, 883545, 496437, 362134, 515528, 687389, 812222, 996667]
33162I96667K01166J03311N8143R0620K6387p7001N1656L28936K96797j52532
33152A924150n34409m73907j95975p6119j12275j06664l2349M1767J32198K37902
33142H04319K63625J84771R5915K3474r6143k16552k00280o7816R715j9525n5001
33131G26502o1343p9493o3401M2353J22435N0042n2932J0954J75138K24795J40981
33120A236031M4148n9896j70222j12124J73577L59193J57951j68385j85811J1406
33110A285868m840k41494k95603o7095J08262O4003J6284R6830J37946L0532q4376
33099A046317p5786J9836J26398J66431L8946j92538k42446j3623J63035L6741
33089A073311j11024M2944K45379R5068j99597j44323J73405K41931J0159j09011
$$ y = [996667, 1197833, 1301144, 1359287, 1449907, 1476294, 1399293, 1450949, 1779885, 2076682, 1924150, 1389741, 915834, 719859, 643740, 531465, 424801, 392452, 434219, 566417, 804319, 1067944, 1252715, 1348630, 1372104, 1275961, 1059409, 859129, 791313, 801028, 781503, 726502, 665159, 585666, 522265, 564618, 687053, 737095, 684163, 695117, 870255, 1095050, 1236031, 1280179, 1220283, 1050061, 937937, 1111514, 1470707, 1628658, 1460273, 1274462, 1285868, 1281028, 1039534, 743931, 676836, 785098, 849101, 865385, 962215, 1100161, 1130693, 1046317, 970531, 990367, 1116765, 1283196, 1322142, 1129604, 887158, 873535, 1036570, 1073311, 962287, 1005231, 1250610, 1345678, 1146081, 1001758, 1175163, 1417094, 1427253, 1318242]
33079A318242l8669r5148k58348j43489K23952L38033O1849j35294K4402K28414
33069A523944J85999M6353k9392j61247l59175l45842m7821J79031Q7756q5119
33059I94487m2561J20534J46056J6791j01689j23129p3294n355K6903K2351N4951
33048A036045J35366J48652O2952K2213O2476q114k21150k64380O027K26454Q5658
33037A292199j43886q5660J05805J02994J6805P2452O0387k35984m40852j49703
33027E94557K52483J47578k38915j98684K50128M45884K29011N1006J4977k15403
33017A332622n35107l99085J82418N50651M36917K43223J72838l4537l43567l00434
33007A305939R6006K52584k4735k13929l1407J11250o3540j93886M943K14209
$$ y = [1318242, 1279573, 1184425, 926077, 782588, 1006540, 1344573, 1406422, 1271128, 1295530, 1523944, 1709943, 1756296, 1726904, 1565657, 1206482, 860640, 812819, 991850, 1079606, 994487, 951926, 1072460, 1218516, 1235307, 1133618, 1010489, 937195, 931840, 958743, 981094, 1036045, 1171411, 1320063, 1383015, 1405228, 1467704, 1459590, 1238440, 974060, 980087, 1206541, 1292199, 1148313, 1062653, 1168458, 1271452, 1288257, 1360709, 1421096, 1185112, 744260, 594557, 847040, 994618, 755703, 557019, 807147, 1253031, 1482042, 1533048, 1548025, 1332622, 797515, 398430, 580848, 1131499, 1568416, 1811639, 1984477, 1949940, 1606373, 1305939, 1401945, 1654529, 1629794, 1415865, 1384458, 1495708, 1432168, 1238282, 1243225, 1457434]
32997A457434J10996j06355j64352j48650j72819j14244N0418J15734M8644N0991
32987A127797J12118J8749j32062k6771K10862J28506k21497k78627Q2689L49689
32977A371453K55259J04840N3940j42002m32721l43212J58283M35165J64990j80552
32967A445443j80451p0127j29144j57566J6893J27365k1814j73122r9663L4343
32957G92157P9312J49482K37052J28078r4181m9061K48479L16555J9775j94913
32947A632735p6579P8458N6245L0689M4177j20087l58913k70522O4339R9488j91738
32936I88292j95518K38307M65866J51784j78384p6374J76035K47231K64107K52187
32926B333533q4118o10197o55992j05565K79160Q1106j39448N5980K15331m3141
$$ y = [1457434, 1568430, 1462075, 1297723, 1149073, 976254, 862010, 912428, 1028162, 1076806, 1127797, 1239915, 1258664, 1126602, 1099831, 1310693, 1439199, 1217702, 939075, 1021764, 1371453, 1626712, 1731552, 1785492, 1643490, 1210769, 867557, 1025840, 1461005, 1625995, 1445443, 1264992, 1194865, 1065721, 908155, 925048, 1052413, 1030599, 857477, 757814, 792157, 871469, 1020951, 1258003, 1386081, 1291900, 1242839, 1491318, 1807873, 1827648, 1632735, 1556156, 1634614, 1690859, 1721548, 1765725, 1645638, 1286725, 1016203, 1080542, 1180030, 988292, 792774, 1031081, 1496947, 1648731, 1470347, 1393973, 1570008, 1817239, 2081346, 2333533, 2249415, 1639218, 983226, 877661, 1156821, 1237927, 1098479, 1154459, 1369790, 1326649]
32916A326649k36213P2889M05808K05100j97927k40636q3436j28046k01905M613
32906I26896K46806K02855J09024K34349K74506m4558l19525j35054J62410O8815
32896A726524k20130k68499j99027k94730l01422Q9690M95060L66340q3726k32076
32886A078004k1266J21444P5306O7400J35371J39511J24525J86683K04996J02409
32876B214383O7484J53432O0257k95289m59671j36530K71594K85211M2155j01012
32866B102014j68664k70122k05735J00483K57400K9420j81205j3419J95971K0534
32856A866677k77003k10159J01453J97802L2907j03829j08228j8973K03516M31490
32846B115653L09781j50435l87336j15417J94093J12209n8044P1998K34843M4294
$$ y = [1326649, 1090436, 1163325, 1569133, 1774233, 1576306, 1335670, 1252234, 1124188, 922283, 926896, 1173702, 1376557, 1485581, 1719930, 1994436, 1949878, 1630353, 1495299, 1657709, 1726524, 1506394, 1237895, 1038868, 744138, 442716, 532406, 1027466, 1393806, 1310080, 1078004, 1056738, 1178182, 1253488, 1320888, 1456259, 1595770, 1720295, 1906978, 2111974, 2214383, 2281867, 2435299, 2495556, 2200267, 1740596, 1604066, 1875660, 2160871, 2203026, 2102014, 1933350, 1663228, 1457493, 1557976, 1815376, 1844796, 1663591, 1650172, 1846143, 1866677, 1589674, 1379515, 1480968, 1678770, 1711677, 1607848, 1499620, 1480647, 1684163, 2115653, 2425434, 2274999, 1887663, 1772246, 1966339, 2078548, 2020504, 2092502, 2327345, 2371639]
32836B371639k50143k14904L158R125j34335j38068n6371o5837l6871J54514K57641
32825A899548P3073j38234j13662l3704r2580r6282R5062K24252J36523Q1381
32815B035377J42591o588l83635m41736N927L53174J97532k0047P4395R7830k06953
32804A847867k86992K19509O36419L05416k73891l09251j1902k5572k10843o3560
32794A827200K02235O7903k40951j58428J59841J74623r632O7044K62262J34198
32784B486295j36617r5390N1531j64874m65584k46360K56756K96813p9404j53410
32774A749756J34341J10130k99131k62306O02904J462560J314955K39592p94402
32765D258399j022434n21029M1042J23821j71980l47225k02011L371Q8411J81691
$$ y = [2371639, 2121496, 1906592, 1909750, 1918875, 1784540, 1646472, 1590101, 1524264, 1487393, 1641907, 1899548, 1972621, 1834387, 1720725, 1687021, 1594441, 1498159, 1593221, 1817473, 1953996, 2035377, 2177968, 2171380, 1787745, 1346009, 1351936, 1705110, 1902642, 1882595, 1956990, 2054820, 1847867, 1560875, 1780384, 2416803, 2722219, 2448328, 2139077, 2127175, 2101603, 1890760, 1827200, 2029435, 2097338, 1856387, 1697959, 1857800, 2032423, 2022791, 2089835, 2352097, 2486295, 2349678, 2254288, 2305819, 2140945, 1675361, 1429001, 1685757, 1982570, 1903166, 1749756, 1884097, 1994227, 1695096, 1432790, 2035694, 3498254, 4813209, 5052801, 4258399, 3235965, 2714936, 2755978, 2879799, 2707819, 2360594, 2158583, 2161954, 2250365, 2432056]
32755B432056K89697J79869j02827j75292j147q758k75331l06760N4844K79793
32745B366144R4895l2267J93103L35088J05213n4883J47192K48201o7066l15609
32735C020011j35678K0329j85341k65434J10349L61317O4225j75866J51030M24316
32725C389258K0636m47327j79249L57986K63242k23103k47616J35827K25506j5486
32715C279674q3354K5498k9224j20894K3966J28610r9185k50551O3587L70394
32705C308521J48729j73217k8587J81794j18863m82058k07859L11488K50979j97914
32695B993013k63029K4432Q6234l2884O9373J73430j22342m35602j98638K47170
32685B541157K53131L6820J40378K89784k5261m01129j78709K86998K54016m7174
$$ y = [2432056, 2721753, 2901622, 2798795, 2623503, 2622356, 2613598, 2338267, 2031507, 2086351, 2366144, 2461039, 2428772, 2621875, 2956963, 3062176, 3007293, 3154485, 3402686, 3335620, 3020011, 2884333, 2904662, 2719321, 2453887, 2564236, 2925553, 2989778, 2813912, 2964942, 3389258, 3409894, 2962567, 2783318, 3141304, 3404546, 3181443, 2933827, 3069654, 3295160, 3279674, 3196320, 3221818, 3192594, 3071700, 3095666, 3224276, 3125091, 2874540, 2938127, 3308521, 3457250, 3284033, 3255446, 3437240, 3318377, 2836319, 2628460, 2939948, 3190927, 2993013, 2729984, 2754416, 2840650, 2807766, 2877139, 3050569, 2928227, 2492625, 2293987, 2541157, 2794288, 2831108, 2971486, 3261270, 3236009, 2834880, 2656171, 2943169, 3197185, 3150011]
32675C150011N4570L15883P2068m01979l58886K2911K1480k48636j31728K66359
32665B762053L24718R8308P4948J40542o4667k21233Q7852L92606R7253l50243
32655C342137k36450J12386M3807j06868K44064N89582J75689m78920l96673J43435
32645C432189K06441q9461J449K98643J22611k64055j70491J15860o3011l31352
32635C258823r911M19634J70660k41462P3523N83220K55990m28164k90570L65037
32625D156780L54626j73491j48162K95515J48838m13020l50798J96332J96454
32616D263074k55544j87684K84262K20405k15914p7034M18822K47730l91305l92258
32606C914554J91649L55469R2825J75052L75042n6307n72266j14115P23236N23611
$$ y = [3150011, 3204581, 3520464, 3592532, 3190553, 2831667, 2854578, 2876058, 2627422, 2495694, 2762053, 3086771, 3185079, 3260027, 3400569, 3335902, 3114669, 3202521, 3595127, 3692380, 3342137, 3105687, 3218073, 3261880, 3155012, 3399076, 3988658, 4164347, 3685427, 3288754, 3432189, 3638630, 3549169, 3550618, 3849261, 3971872, 3707817, 3537326, 3653186, 3590175, 3258823, 3248912, 3668546, 3839206, 3597744, 3671267, 4254487, 4510477, 4082313, 3791743, 4156780, 4511406, 4337915, 4189753, 4485268, 4634106, 4221086, 3870288, 4066620, 4263074, 4007530, 3819846, 4104108, 4324513, 4108599, 4031565, 4450387, 4698117, 4306812, 3914554, 4106203, 4461672, 4554497, 4729549, 5104591, 5048284, 4476018, 4361903, 5085139, 5608750]
32596E608750l74172m42068K78573L93190j75543k16146K70418J11491n81713
32587D872780m95801L44897N59464l3923k34909J42053P7712m11973k40519M77638
32577E057419M78634k56849m61621N1803K56401N8305K71015O18906J57026n57651
32567E673388k10931O52231L95090o45810o77618K36136L59536l76560l21788
32558E083674O06410P29058j47120m00962K46923L21157l86873m28686L62754
32549E986335N40095p0284j10201M81033L74713l03639j25501O20605K95571p24136
32539F964591m81557P51079P37979n31802p29758M68722Q39891j48345n01496
32530G369304L09327M59119m37927n47003M44616O63670j74718k10187P17710
$$ y = [5608750, 5234578, 4792510, 5071083, 5464273, 5288730, 5072584, 5343002, 5454493, 4872780, 4376979, 4721876, 5281340, 5247417, 5012508, 5154561, 5232273, 4820300, 4579781, 5057419, 5536053, 5279204, 4817583, 4869386, 5125787, 5184092, 5455107, 6074013, 6231039, 5673388, 5462457, 6114688, 6509778, 5863968, 5186350, 5422486, 5782022, 5405462, 5083674, 5690084, 6419142, 6272022, 5871060, 6117983, 6439140, 6052267, 5623581, 5986335, 6526430, 6456146, 6345945, 6826978, 7201691, 6898052, 6772551, 7393156, 7688727, 6964591, 6483034, 7234113, 7972092, 7440290, 6710532, 7179254, 8019145, 7870800, 7369304, 7678631, 8137750, 7699823, 7152820, 7597436, 8261106, 8086388, 7876201, 8593911]
32521H593911O54781m43287m05089Q33293Q87179m51073o88978N58329Q31029
32512A0370095l26901n25303O11213O45302o58735o01539J083154J358007l74926
32503A1580367j007232M10417R91610k65155o38389P45377J118725l42385p85596
32494A1807739O34229J064637k52791m17992J117778J175435o88319q61651J241434
32485A4820499J651700n02040j051819J154625J852909l39010j116044J066357
32477A7537177J897261k13175q98359J366245K009747m02214r00713J961030K661311
32468B5018310m91695j445367J949246L331956J56987j026748K498507L833180
32460C3824376J86350q98699L556162N145473N36115p98137N080038P505357J737188
$$ y = [8593911, 9248692, 8805405, 8400316, 9233609, 10120788, 9669715, 8980737, 9539066, 10370095, 10043194, 9517891, 10129104, 10774406, 10115671, 9514132, 10597286, 11955293, 11580367, 10573135, 10983552, 11975162, 11710007, 11071618, 11816995, 12935720, 12593335, 11807739, 12441968, 13506605, 13253814, 12835822, 13953600, 15129035, 14440716, 13579065, 14820499, 16472199, 15970159, 14918340, 16072965, 17925874, 17586864, 16470820, 17537177, 19434438, 19221263, 18322904, 19689149, 21698896, 21296682, 20395969, 22356999, 25018310, 24526615, 23081248, 25030494, 28362450, 28519437, 27492689, 29991196, 33824376, 34010726, 33112027, 36668189, 41813662, 42349777, 41551640, 46631678, 54137035, 55874223]
32451E5874223k15789P288979J0511863K874285R21792J2719392J7033830K648631
32443A09657206j080718K5242499L6558735k1656589j14541687j41537015o9783039
32436a77140608J9204945M1467952J2082527l448010R883001J7449660O594363
32429g3906170M3904P207483J0723760L137499j198854M176709P124172J842791
32421d0848706j324455K761631N082327J050717j332937K052260L990339P14934
32413b7853890j235304J565907L122722L27172j224537J325818K679857J32028
32405b1160227j292807J009024K274677j4856j312938Q91816K307364L91382r42214
32396a7848779P16345J742935o4096j182634N39347J726785K18814q81103M61087
$$ y = [55874223, 55658434, 62947413, 73459276, 76333561, 77255353, 89974745, 107008575, 109657206, 108576488, 133818987, 170377722, 148721133, 34179446, -107357569, -177140608, -157935663, -116467711, -104385184, -107833194, -97950193, -80500533, -73906170, -73862266, -66654783, -55931023, -52793524, -53992378, -49815669, -42691497, -40848706, -42173161, -39411530, -34329203, -33278486, -34611423, -32559163, -28568824, -27853890, -29089194, -27523287, -24400565, -24073393, -25297930, -23972112, -21292255, -21160227, -22453034, -21444010, -19169333, -19184189, -20497127, -19605311, -17297947, -16906565, -17848779, -17132434, -15389499, -15453595, -16636229, -16096882, -14370097, -14151283, -15032386, -14571299]
32387a4571299J364270J8381p66860O23149J316578k33915j046147N43046J554103
32378a1198694J24692r62513K32342J157154q8335j086946P6641J168880K87464
32369a0289315n76622L11878J053056L4860q60401j2521Q51274J98825m13531
32360i702497L07889Q07145O663l99486N62394R85399j81558q80384J57868R04403
32350g432164r9632r61813q9842Q55328K79777m02278K17398P76793K1472o05098
32340g440059J53463Q17794N7174p09636j04971N71315j7171o36698P183P21535
32330f580071K31097l40563K04378P30173O1318o28609p7299O26224J72573n06995
32320f107774j61211M17652J26462k89167J10563N22488R0719l17492J13224M67659
$$ y = [-14571299, -13207029, -13188648, -13955508, -13332359, -12015781, -12249696, -13295843, -12752797, -11198694, -11074002, -12036515, -11804173, -10647019, -10735354, -11822300, -11745659, -10576779, -10289315, -10865937, -10554059, -9501003, -9466143, -10326544, -10339065, -9487791, -9288966, -9702497, -9394608, -8587463, -8580800, -8980286, -8417892, -7432493, -7614051, -8494435, -8336567, -7432164, -7531796, -8493609, -8583451, -7728123, -7448346, -7850624, -7633226, -6856433, -6834961, -7440059, -7286596, -6468802, -6411628, -7121264, -7226235, -6654920, -6672091, -7308789, -7301606, -6580071, -6348974, -6689537, -6485159, -5754986, -5693668, -6322277, -6399576, -5773352, -5600779, -6107774, -6268985, -5851333, -5724871, -6014038, -5903475, -5380987, -5290268, -5607760, -5494536, -5026877]
32310e026877l0164l94614J44701N32801j9847l89137K54424O84667q0880q01109
32300e126035k70335M61545J32070m07923K6022O59727L29723l11716j79151J98752
32290d487321p0931m28706j07146K62155j0484k04951L08377O39156N5743m84251
32280d528359q7800L93991N0739l56537J2894L99806K3075l03804J75709N39549
32270c680737n1037o06652j13718N21227J65643m52444k17590L04581J48190j44165
32260d126702K24290N39960l3628o47156k45859M29711K17051l42713j54622L47928
32250c791740J80127k45531k4274M23758K46045j42677J5345K32948j82328n69958
32240c858285j15565M69198K05910k90124R348N60767K86177l82927l56923J05503
$$ y = [-5026877, -5057041, -5451655, -5306954, -4774153, -4794000, -5183137, -4928713, -4244046, -4324926, -5126035, -5396370, -4934825, -4802755, -5210678, -5184656, -4524929, -4195206, -4506922, -4686073, -4487321, -4558252, -4986958, -5094104, -4831949, -4842433, -5047384, -4739007, -4099851, -4044108, -4528359, -4616159, -4222168, -4171429, -4527966, -4515072, -4115266, -4092191, -4395995, -4220286, -3680737, -3731774, -4338426, -4452144, -3930917, -3765274, -4217718, -4435308, -4130727, -3982537, -4126702, -3902412, -3362452, -3396080, -4043236, -4289095, -3859384, -3642333, -3985046, -4139668, -3791740, -3611613, -3857144, -3881418, -3457660, -3211615, -3354292, -3338947, -3105999, -3288327, -3858285, -3973850, -3504652, -3298742, -3588866, -3579518, -3018751, -2732574, -3115501, -3472424, -3366921]
32230c366921O9678k27156J628L98518J51272l46011k13115K38793J74601j41147
32220c259860K4236L56233J72596j41239Q0418L54782m0782n50877l01510K53322
32210c052681K19716o8756J18972L29998j23024n51318m3507O43396K66080o21965
32200b883089n85384J63216K45924l58524m02343K88654O09040K33987k525J87392
32190b503652J85042j26117j56862J22131J28268j24960r4060J15519n4022l83780
32180b892493j71495L85624M20552r5877l43896o3790K12568K32263K12304J20216
32170a984024j84492l28435L4830L97693J45205l03616j98414J93321J34681j81830
32160b275081o8970K76182J63535k17902j65999J61643R3114j93514l3074L29465
$$ y = [-3366921, -3297243, -3524399, -3522771, -3124253, -2972981, -3318992, -3532107, -3293314, -3118713, -3259860, -3235624, -2879391, -2706795, -2848034, -2767616, -2412834, -2453616, -3004493, -3306003, -3052681, -2832965, -2901721, -2782749, -2452751, -2575775, -3127093, -3170600, -2527204, -2261124, -2883089, -3468473, -3305257, -3059333, -3417857, -3820200, -3531546, -2922506, -2688519, -2691044, -2503652, -2318610, -2444727, -2601589, -2479458, -2351190, -2476150, -2570210, -2454691, -2508713, -2892493, -3063988, -2678364, -2257812, -2353689, -2697585, -2761375, -2548807, -2316544, -2104240, -1984024, -2168516, -2496951, -2462121, -2064428, -1919223, -2222839, -2421253, -2227932, -2093251, -2275081, -2344051, -2067869, -1904334, -2122236, -2288235, -2126592, -2033478, -2226992, -2260066, -1930601]
32150a930601J29147m05996l81270J31741K42656j16205j51382K39233L05015
32141a937662j13214l23243q7561M2734j56685k51035n8629J03829J49572K80439
32131b351455L58749J06913k01437j33666N5934j05160l24142n0325L89062K78964
32121a976563j84484k56096L056m3225k94869j18756L40901L56465j5524m7828
32111b236923K75157K73559q4178j32741J92919K55073n0584j46614Q5926J56546
32101a411860j3387k2320P1466j43632m31651j74711L96902M36945o3222k74608
32091a630078n525P8605k05839k67287M9058J78611k1079j9247K72667K83540
32081a286574p6184j86936R9018J65760j76258l10708J6505K09319p9743l41033
$$ y = [-1930601, -1801454, -2207450, -2588720, -2456979, -2214323, -2330528, -2481910, -2242677, -1937662, -2050876, -2374119, -2461680, -2418946, -2575631, -2826666, -2885295, -2781466, -2631894, -2351455, -1992706, -1885793, -2087230, -2220896, -2164962, -2270122, -2594264, -2644589, -2255527, -1976563, -2161047, -2417143, -2414087, -2457312, -2752181, -2870937, -2530036, -2173571, -2189095, -2236923, -1961766, -1688207, -1772385, -1905126, -1712207, -1457134, -1507718, -1654332, -1568406, -1411860, -1425247, -1447567, -1376101, -1519733, -1951384, -2126095, -1729193, -1292248, -1355470, -1630078, -1635603, -1556998, -1762837, -2030124, -1981066, -1802455, -1823534, -1842781, -1570114, -1286574, -1362758, -1549694, -1450676, -1284916, -1461174, -1771882, -1755377, -1546058, -1625801, -1966834]
32071a966834j52170J39397J24238l8890r0015q7924o2974J11385K93170J57994
32061a572623j61476j88460P9381J75380J4546k8651R1170M2328j19578K000K92822
32050a373161K15198j84246k71334O7721K44688L4377j14208p488j1186k04662
32040a604301j58142J75805K46133j10590l23504o8746K07124J07961j11081j30519
32030a769860p7070r8093m2744J20139J37193j9871l5989J48254J86495l3819
32020a485365j70576l5870J19936J10746Q5392J39880J38302M0056l0356q5553
32010a173408k20659k92182j05905J58591J82286L2258k4508k1498r2579o2537
32000a620141J80660K59360q3196l55171o7318L36709J96899j79979j02844J74675
$$ y = [-1966834, -2119004, -1979607, -1855369, -1894259, -1984274, -2072198, -2135172, -2023787, -1730617, -1572623, -1734099, -1922559, -1843178, -1667798, -1653252, -1681903, -1590733, -1548405, -1667983, -1665983, -1373161, -1157963, -1342209, -1613543, -1545822, -1301134, -1266757, -1380965, -1388453, -1399639, -1604301, -1762443, -1586638, -1340505, -1451095, -1774599, -1843345, -1636221, -1528260, -1639341, -1769860, -1846930, -1945023, -1987767, -1867628, -1730435, -1750306, -1786295, -1638041, -1451546, -1485365, -1655941, -1691811, -1571875, -1461129, -1375737, -1235857, -1097555, -1057499, -1087855, -1173408, -1394067, -1686249, -1792154, -1633563, -1451277, -1419019, -1443527, -1465025, -1557604, -1620141, -1439481, -1180121, -1263317, -1618488, -1685806, -1349097, -1152198, -1332177, -1435021, -1260346]
31990a260346o5695n26280k70432N56819Q11370K05396l11648k05104l0765j65779
31980a262464j76746J24229K00103j43103k97543L4880K76822K5246k68676j75162
31970a662414J8187k4971j06412k0627N0092K4828J15379K71089J60511j11560
31960a285898p0751K05456J34527k60054k91991J29665K70385j03535k90337N3176
31950a509357L05987P0383j38031K4431L3221m18380o52874j41111M81040L97901
31940a546790j11414k44952O5513K90206K33359R5656l7394j64442j38326O4779
31930a493805J67130K6430j17555q2205J3900J19376L19183M03279L5035m97815
31920a107047m77608Q8659L63735R481l01951r5445J45619m0655k59051m9252
$$ y = [-1260346, -1326041, -1852321, -2122753, -1565934, -754564, -549168, -860816, -1065920, -1096685, -1262464, -1439210, -1314981, -1114878, -1257981, -1555524, -1520644, -1243822, -1218576, -1487252, -1662414, -1644227, -1669198, -1775610, -1796237, -1746145, -1721317, -1605938, -1334849, -1174338, -1285898, -1356649, -1151193, -1016666, -1276720, -1568711, -1439046, -1168661, -1272196, -1562533, -1509357, -1203370, -1132987, -1271018, -1246587, -1213366, -1631746, -2284620, -2425731, -1944691, -1546790, -1658204, -1903156, -1837643, -1547437, -1314078, -1218422, -1255816, -1420258, -1558584, -1493805, -1326675, -1300245, -1417800, -1500005, -1486105, -1366729, -1047546, -644267, -609232, -1107047, -1584655, -1495996, -1132261, -1122780, -1424731, -1520176, -1374557, -1415212, -1674263, -1723515]
31910a723515K75889K58367P6231N9163O2615p2501o3736K24875L64302J02197
31900d36113j15003N9835K14957n5950l78537k67537K3304K5127j10472j1452
31890a051841J57805M7858j72516j31720P4229J24211N1860M5900J2631j62337
31880a003920k57513p9977J53185J90372J29430R6225j3115j60924o5516K15411
31870g96342J99820j79735l29504J4274K86922P4848j76741k6307J56887n7131
31860h33009l15246j59569R5429j6193j94925N5562M41023L47567r5056k82514
31850i56931j44392o6593r2228J1421J35756L2294r3257R8168L83369K96153o7526
31839d63766k40985j79187j85501k35345n8412K34437K58092O766j71023j59819
$$ y = [-1723515, -1447626, -1189259, -1113028, -1053865, -991250, -1063751, -1127487, -902612, -538310, -436113, -551116, -491281, -276324, -332274, -710811, -978348, -955044, -929917, -1040389, -1051841, -894036, -846178, -1018694, -1150414, -1076185, -951974, -900114, -854214, -841583, -1003920, -1261433, -1341410, -1188225, -997853, -868423, -772198, -785313, -946237, -1011753, -796342, -596522, -776257, -1105761, -1091487, -804565, -729717, -906458, -932765, -775878, -833009, -1148255, -1307824, -1212395, -1228588, -1423513, -1367951, -926928, -579361, -674417, -956931, -1101323, -1167916, -1260144, -1248723, -1112967, -1080673, -1173930, -1075762, -692393, -396240, -463766, -704751, -883938, -1069439, -1304784, -1363196, -1128759, -870667, -863901, -1034924, -1194743]
31829a194743j19456o1534J07705K41799J35182o5646o8791Q3042J39662P8001
31819g24779K9974k0005j06522r5821L4807L6151j55490j87766R1471K40755o3911
31808i21136l85279j83764K87685M05131J59207L2141J32320J33978o1040k11783
31798f12540k04069j34173l7383O2615K0070j51976j45387J28880K60605m588
31788h17946k68229j40041P8341k6523j90092K5210L52818K49311j23578j74658
31778a035387R3948J72680q330m2195J33466J70013K9776L1241J77468J39139
31768a38181q7559j75212j15294k07649l92741k75922J22026L01079Q3368j28018
31758a014103l4572J58271J86656J04891O4110Q5088J37275J48028k2793l10926
$$ y = [-1194743, -1314199, -1375733, -1268028, -1026229, -891047, -956693, -1025484, -942442, -802780, -724779, -694805, -714810, -821332, -917153, -882346, -846195, -1001685, -1189451, -1097980, -857225, -921136, -1306415, -1490179, -1202494, -797363, -638156, -606015, -473695, -339717, -400757, -612540, -816609, -950782, -988165, -925550, -905480, -1057456, -1202843, -1073963, -813358, -817946, -1086175, -1226216, -1147875, -1174398, -1364490, -1339280, -986462, -737151, -860729, -1035387, -941439, -768759, -777089, -819284, -685818, -515805, -486029, -454788, -277320, -138181, -225740, -400952, -516246, -723895, -1116636, -1392558, -1270532, -969453, -886085, -1014103, -1048675, -890404, -703748, -598857, -534747, -449659, -312384, -164356, -187149, -498075]
31748d98075l25265R6048M42611J83264l57652m27038N359K59305O3277j20889
31738f79055J3761J65137P7345k2711O0310J10373m1266j57799k7206J46368R9714
31727b55029o5243j07707l5859l833k5313j9270J655l7038j39700k29542k02952
31716a119831k167K70521L80804K40521N6018L9163J13037J04699N4039O7650
31706B04454M0506j51700l17987j70618J89684L55838J79487m0690J4922K61803
31696E65699K73222k52622j028909j285175o17573L48831O21774J60866j17075
31687a330962K16815M82808J18425l43355k18254J53478O5332k95574k38460J80717
31677a209030L18745J00916J7801J31022O6653j00937N0017L43315J69980l57505
$$ y = [-498075, -823340, -727292, -284681, -101417, -459069, -886107, -880748, -621443, -558166, -679055, -665294, -500157, -422812, -445523, -385213, -274840, -316106, -473905, -501111, -354743, -255029, -320272, -427979, -463838, -467671, -492984, -512254, -510599, -547637, -687337, -916879, -1119831, -1121998, -851477, -470673, -230152, -174134, -134971, -21934, 82765, 136804, 204454, 244960, 93260, -224727, -395345, -205661, 150177, 329664, 288974, 303896, 565699, 838921, 586299, -442610, -1727785, -2345358, -1996527, -1374753, -1213887, -1330962, -1114147, -631339, -512914, -856269, -1074523, -921045, -855713, -1151287, -1389747, -1209030, -890285, -789369, -771568, -640546, -573893, -674830, -624813, -281498, -111518, -469023]
31667d69023m36512R3056M49473J92127j55583j11656L0196q9736k32673q9250
31657h19581J64544K70639K91089K62909J9150l36356l73279o2073O9800j68993
31647f82151k64429P9906L52778R7225k73395j56301K50269L18811J923j92388
31637d67752l2857K01164K27132O7944r6440j07368N6167J87647O0225j93859
31627i7997k08451L9418J81765R2407P2120K28274K22098r4171l35357k13609
31617a13503Q452M6530M9659J50207J11728j43210k13933Q7208K93278O9029j52992
31606A92453M8432K66236r140l86884j89754L45420M38938N5875j51139j1703
31596E98734K6754j38492j26958P9018O5837j54226r4676K82207M44056K23359
$$ y = [-469023, -905535, -812479, -363006, -170879, -326462, -438118, -407922, -497658, -730331, -819581, -655037, -384398, -93309, 169600, 188750, -147606, -520885, -582958, -513158, -682151, -946580, -866674, -513896, -416671, -690066, -846367, -596098, -277287, -275364, -467752, -500609, -299445, -72313, -4369, -100809, -208177, -152010, 35637, 95862, -97997, -306448, -267030, -85265, 7142, 79262, 307536, 529634, 435463, 100106, -113503, -105051, -58521, -8862, 141345, 253073, 109863, -104070, -16862, 276416, 345445, 192453, 240885, 507121, 497981, 111097, -78657, 266763, 705701, 761576, 610437, 598734, 625488, 486996, 360038, 439056, 504893, 350667, 255991, 538198, 982254, 1205613]
31586A205613L8015M8602l8916j88374K0576M70373N05776R9256j7432L25650
31576B469139M27031J04343J11134O17174O86264M8146j42244O19553J031666
31567E972206L97916L53321J885659K281841j589376p546939r472644n161217
31559a2879233O36921K569472J038557o4447N92053J161135O50767K10741N28057
31550e555977P07280K20002j39448J40737M12487K20001J02008M07152N56766
31541b928992J59900k16064p1758J64746p223k59142r1845K66700L08851Q3895
31531b590932k2176N5008J29055J59933J77285J07445k9276n8017K2608J4190
31521b034877o3149K3028J99466J17171j81310k26500Q5063K94053J65987J9861
$$ y = [1205613, 1243628, 1292230, 1253314, 1064940, 1085516, 1555889, 2061665, 2160921, 2143489, 2469139, 2896170, 3000513, 3111647, 3728821, 4415085, 4463231, 4320987, 4940540, 5972206, 6370122, 6723443, 8609102, 10890943, 9301567, 1754628, -7718016, -12879233, -12242312, -9672840, -8634283, -8698730, -8106677, -6945542, -6294775, -6084034, -5555977, -4848697, -4628695, -4768143, -4627406, -4214919, -3994918, -3892910, -3485758, -2928992, -2769092, -2985156, -3056914, -2892168, -2899391, -3158533, -3250378, -2983678, -2674827, -2590932, -2613108, -2558100, -2429045, -2269112, -2091827, -1984382, -2013658, -2071675, -2049067, -2034877, -2098026, -2074998, -1875532, -1758361, -1939671, -2166171, -2081108, -1787055, -1621068, -1601207]
31511a601207N4361L2035j15841p9817J54189J56000j22718j47105K36527M51445
31501i82131J95950o0889l2847j35862n02956m69576K28683P02532K39878m75315
31491a292533m58476M5489J97061K3761Q0769K31841k861l24462j18860K97132
31481a321139J35584m12224m51531M6709K43704l5581p3995L15937M19205m1742
31471a175073l69674j15854J95078N7000j99468j16999J15867J44713Q4904J68304
31461a211202K53168J37549l7548o1205P382L0487N981p1968k30765l10106j09636
31450a597863K10922K90426J31299N4026J16822R7740J7675R2552J81616o3399
31440d68184m72220m81016o9540J55447l8036j72354M4243K36051R8413p8082
$$ y = [-1601207, -1546846, -1514811, -1630652, -1710469, -1556280, -1400280, -1522998, -1670103, -1433576, -982131, -786181, -847070, -879917, -1015779, -1518735, -1988311, -1759628, -1057096, -817218, -1292533, -1751009, -1705520, -1508459, -1484698, -1403929, -1172088, -1174949, -1499411, -1618271, -1321139, -1185555, -1597779, -2049310, -2002601, -1758897, -1794478, -1868473, -1552536, -1133331, -1175073, -1544747, -1660601, -1465523, -1408523, -1607991, -1724990, -1609123, -1464410, -1379506, -1211202, -958034, -820485, -858033, -919238, -911856, -881369, -875388, -947356, -1178121, -1488227, -1597863, -1386941, -1096515, -965216, -911190, -794368, -696628, -678953, -586401, -404785, -468184, -940404, -1421420, -1490960, -1335513, -1373549, -1545903, -1501660, -1265609, -1167196, -1245278]
31430a245278q169R3434L1207N5441L15928M23887O9483l55853k83743J86031
31420g17632M46574K01806k58526m82044k95831P5560K17407j5076k63733j38178
31410a229673J86770K43564K9911n5448J9054j12469m16595l75704J05125M43687
31400a161778L20891J45629K13504J48041l09768o45622l51350J90206K91788
31391a158459R246r6066P9614J63100N1628J2328J13184J29089K326p3843l1138
31380g98991n40k8870m7829p5510j47611j28305J01707L47658L08057K9460j46433
31369e87207o7089P3775O8045n3327j31966q1015N2995J27735K3791k02432l39936
31358a116631k58447m7853J19609J62910R2081l5442j09361m1909J09077K01298
$$ y = [-1245278, -1253447, -1160013, -1128806, -1073365, -757437, -333550, -264067, -619920, -903663, -717632, -271058, -69252, -327778, -809822, -1105653, -1030093, -812686, -827762, -1091495, -1229673, -1042903, -799339, -769428, -824876, -805822, -918291, -1334886, -1710590, -1605465, -1161778, -840887, -695258, -481754, -333713, -643481, -1289103, -1640453, -1450247, -1158459, -1149213, -1245279, -1165665, -1002565, -950937, -938609, -825425, -696336, -694010, -767853, -798991, -799531, -828401, -876230, -951740, -1099351, -1227656, -1125949, -778291, -470234, -440774, -587207, -654296, -580521, -512476, -565803, -697769, -778784, -725789, -598054, -574263, -776695, -1116631, -1375078, -1422931, -1303322, -1140412, -1048331, -1083773, -1193134, -1235043, -1125966, -924668]
31348i24668J93746J48263Q2667j5486p4680k5150N1113M2340n332k0155q1195
31337f28537k12162j93667Q0139K69319M8469k98529k71177K8359R1859r0376
31327a176303m3579K76051L56884M8257j70351n7513P367j93179k90125o3732
31317a306223J08212j7481n6492K46488M28862R1512l21450k16728J67639K13540
31307f62121m1886r3931R1366J07230q6885j34057L694j3034k23993k62118j3704
31296a329439J65431M0312j55063j37492J9217Q7551L7715P763O8267J41289J08536
31285i45913k4680q4804N4932K31198J76044l0666j3321K79018L84095M342m83568
31274d53323n41602k07494O4252P4876q880n8165r0238n8617J03237K69630K49757
$$ y = [-924668, -730922, -582659, -499992, -515478, -590158, -615308, -564195, -521855, -527187, -547342, -628537, -840699, -1034366, -954227, -684908, -636439, -934968, -1206145, -1177786, -1085927, -1176303, -1219882, -943831, -586947, -538690, -709041, -766554, -759187, -952366, -1242491, -1306223, -1198011, -1215492, -1271984, -1025496, -596634, -505122, -826572, -1043300, -875661, -662121, -704007, -797938, -706572, -599342, -686227, -820284, -816590, -829624, -1053617, -1315735, -1329439, -1164008, -1123696, -1278759, -1416251, -1397034, -1309483, -1271768, -1264005, -1195738, -1054449, -945913, -970593, -1055397, -1000465, -769267, -593223, -623889, -637210, -358192, 25903, 30245, -453323, -994925, -1202419, -1138167, -1063291, -1072171, -1130336, -1220574, -1279191, -1175954, -906324, -656567]
31263f56567Q2217m3004p4225p0659j024J57671K24428K0382k83734l22873m1332
31252a008720K15812J58188r9900k18898n3999J79732J65836j05623k88302j37739
31242a193613J20205J12617j05176j47421P1817K23940J26179j9217n3535q7443
31232i51647j45198l5430K17272K59687k2056k51905j48818O6408J29193J43068
31222g39426K15107J52461r8450j80972O8147K09249j03915m64818l36051O0187
31212a218481J30132j15706j74527N6427K03261J42939J36944K34870J57171j45999
31202e92969l38999k18840K2863J45053J23845K9524o4415m8940Q0314J20142
31192g42422l6065j36412N6321K98191J80911k12309m13025k55310j4717R9827
$$ y = [-656567, -574350, -617354, -691579, -762238, -763262, -605591, -381163, -360781, -644515, -967388, -1008720, -792908, -634720, -734620, -953518, -1007517, -827785, -661949, -767572, -1055874, -1193613, -1073408, -960791, -1065967, -1213388, -1141571, -917631, -791452, -810669, -864204, -951647, -1096845, -1132275, -915003, -655316, -677372, -929277, -1078095, -1011687, -882494, -739426, -524319, -371858, -470308, -651280, -583133, -373884, -477799, -942617, -1278668, -1218481, -1088349, -1204055, -1378582, -1322155, -1118894, -975955, -839011, -604141, -446970, -592969, -931968, -1150808, -1127945, -982892, -859047, -829523, -893938, -942878, -862564, -742422, -778487, -914899, -858578, -560387, -379476, -591785, -1004810, -1260120, -1274837, -1175010]
31182a175010J54055J88073J23053O304n125O8073O6315p31O755N9816K0598o5215
31170e53039o5048n3825j50344j77810Q0663L78989K56979k21419m86719k80155
31160a271728M1119J33788J24061K24258L04458J40170j72199l21178j75571J00163
31150h72659K55316J96888O9284P6662J86507J42660j25388l22817k20281k3156
31140f36984j9477j01065j4340J29317N6861j14108m8082J73673J51222j12129
31130e35112j68336J10675K98171J20945j25582j26302m3641j41137k85943j97584
31120a093846N6846J67357L9126j36415j83556r8068M7246J88019K68924K44898
31110d99469R7161j25925k61692j44160J34595K35288K7726j50830K6466L24446
$$ y = [-1175010, -1020955, -832882, -709829, -703525, -708650, -640577, -574262, -574993, -568238, -508422, -487824, -553039, -618087, -671912, -822256, -1000066, -919403, -540414, -283435, -504854, -991573, -1271728, -1230609, -1096821, -972760, -748502, -444044, -303874, -476073, -797251, -972822, -872659, -617343, -420455, -351171, -274509, -88002, 54658, -70730, -393547, -613828, -636984, -656461, -757526, -771866, -642549, -585688, -699796, -747878, -574205, -422983, -535112, -703448, -592773, -294602, -173657, -299239, -425541, -469182, -610319, -896262, -1093846, -1037000, -869643, -830517, -966932, -1150488, -1248556, -1201310, -1013291, -744367, -499469, -402308, -528233, -789925, -934085, -799490, -564202, -536476, -687306, -660840, -336394]
31100c36394K67515j05424k89165j06210O3060m4510j73178n3574J27620Q7050
31090e63210n6291n571K02378K61415O2618j96628l14843k64982j09233O3057
31080i21290J26548J8999j39730j56339j0398J11610O3931n9837n2826J07262
31070i12070J94875L7484k09298k38671j7032J67345J22915O468M2453J88280
31060f17251K43188J39019l6701j73649j64891L0968K25645J23764k22872l56395
31050h09175m9813K92190K08106j22109j95622R233P8886q2803j21090J01081
31040f91116K40620N7043j87004j56255N6168J25531k6224j92891k00126p3941
31030a048195M8213P1750L7974P0084J81307K14809Q6328k9221N4685K03414J30161
$$ y = [-336394, -68879, -174303, -463468, -569678, -506618, -551128, -724306, -777880, -650260, -563210, -619501, -625072, -422694, -161279, -98661, -295289, -610132, -875114, -984347, -921290, -794742, -775743, -915473, -1071812, -1082210, -970600, -906669, -966506, -1019332, -912070, -717195, -679711, -889009, -1127680, -1144712, -977367, -854452, -847984, -805531, -617251, -374063, -235044, -271745, -445394, -610285, -579317, -353672, -229908, -452780, -809175, -858988, -566798, -358692, -480801, -676423, -667190, -588304, -671107, -792197, -691116, -450496, -393453, -580457, -736712, -680544, -555013, -581237, -774128, -974254, -1048195, -999982, -928232, -890258, -820174, -638867, -424058, -337730, -366951, -312266, -108852, 21309]
31019B1309j49293l03683j46215J31085K34033R3822j27527k24498j23384M0032
31009e54319N9112o1464r3318M7442J28735j8563j83664j08898P0455N5384j09912
30998g69010j29776N0038K06103K21986J62801L2999j93579l58004k70848l3646
30988a080936J09086J52360K31473K61869P6680j72187j83144j3637J8154j11536
30978g11818j34470j3736J8587n7091k1852J08608Q9827l7641K9509K54967K39615
30967b35495q0007k72360j21153N9249L0721K92J15754J33334p9850k10383l9834
30956f99732J31700N491j90353j33414J2566o2549k01777l7614L29914M29923
30946d15845J24135k23014k70621n7581J72408K36900J04765q3746j12137N8750
$$ y = [21309, -127984, -431667, -577882, -446797, -212764, -118942, -246469, -470967, -594351, -554319, -495207, -556671, -649989, -602547, -473812, -492375, -676039, -784937, -714482, -659098, -769010, -898786, -848748, -642645, -420659, -257858, -224859, -418438, -776442, -1047290, -1080936, -971850, -819490, -588017, -326148, -249468, -421655, -604799, -618436, -600282, -711818, -846288, -860024, -841437, -898528, -920380, -811772, -721945, -759586, -730077, -475110, -235495, -315502, -587862, -709015, -649766, -619045, -618753, -502999, -369665, -449515, -659898, -699732, -568032, -562541, -752894, -886308, -873742, -936291, -1138068, -1175682, -845768, -415845, -291710, -514724, -785345, -842926, -670518, -433618, -328853, -412599, -524736, -465986]
30936d65986K10163J53437l2668j71292k21087k02646r2746M3079K9709j16326
30926h66363j03429J83329L98785K16264j27981j51439J49226L08388R8634j80229
30916g4815k00336m6819Q426p3089j17204n2668N55n3192j28743q1962P8015J89755
30904e52077J57346P1873N2963N9165k2357j54241j77058n6122N5057L3654n6087
30893e87884p4145J5359J11267P6006j13599k79770j97268R3071K66527J44865
30883e45571k9656L4798K13101J77441n1818j49396l1131M4105n2669j32752n7873
30872e81421N8556J20399J82281K09661N5692j92193k07499N6351K04410j1223
30862a04986k84195k25483N6187J86987J12617P8422J61920J89255P5476n7938
$$ y = [-465986, -255823, -102386, -135054, -306346, -527433, -730079, -822825, -779746, -750037, -866363, -969792, -786463, -387678, -171414, -299395, -450834, -301608, 6780, 105414, -74815, -275151, -321970, -313544, -386633, -503837, -556505, -555950, -609142, -737885, -819847, -741832, -552077, -394731, -322858, -269895, -210730, -233087, -387328, -564386, -620508, -565451, -531797, -587884, -662029, -646670, -535403, -459397, -572996, -852766, -1050034, -956963, -690436, -545571, -575227, -540429, -327328, -149887, -201705, -351101, -382232, -338127, -390796, -523548, -581421, -522865, -402466, -220185, -10524, 45168, -147025, -354524, -298173, -93763, -104986, -389181, -614664, -558477, -371490, -258873, -180451, -18531, 170724, 246200, 188262]
30852A88262j14741j33965j43135r2943K0580J06544R3599J0619o4268q2070n4994
30841b66512m5558j02950j88776k00507q4647J04151K47997K34976L2764k31865
30831e00927l23598j39618J38032K44233J43118J5415j6824K293J2444L8415J11582
30820b75435J86487J66630L81k09207k25139M0558K86331J27661l12583m68182
30810f82498j19409K80453L02286J26419P7570K8414k26263l98291j43109K24079
30800e30349J48959k20795k58309Q5281K32096o971j61356K6797K10447J33095
30790c41105K9413O9309L6272j47043j64086J06453K91560J40394o8784o3662
30780a11279k7020j68589l10833k56994j53463j50637j07024N0889Q4647j14212
$$ y = [188262, 73521, -60444, -203579, -296522, -275942, -169398, -75799, -65180, -129448, -211518, -266512, -312070, -415020, -603796, -804303, -888950, -784799, -536802, -301826, -269062, -500927, -824525, -964143, -826111, -581878, -438760, -423345, -440169, -437876, -425432, -387017, -275435, -88948, 77682, 78063, -131144, -356283, -315725, -29394, 98267, -214316, -682498, -801907, -521454, -219168, -92749, -15179, 13235, -213028, -611319, -754428, -530349, -381390, -602185, -860494, -775213, -543117, -550088, -711444, -684647, -474200, -341105, -311692, -242383, -206111, -353154, -517240, -410787, -119227, 21167, -47617, -111279, -138299, -306888, -617721, -874715, -1028178, -1178815, -1285839, -1234950, -1150303, -1264515]
30770a264515k38487n3562K05837K42985J34092O2395l73o3145L3011K48533K48378
30759d44851m3785k35322r7526O8776J2002m3541Q8304J51431k4356j26930M3411
30748f52387J26271j29865k99824N020L67446K07781k32859k99608K3346K24916
30738f59763J72021J46559J67127J8674j59067k8912K58831K15057j69452l84964
30728d23889k04241N3584J07385M9611M2557J10252K50125L85882K79180j41878
30718E08568n04627m45451j57778m2455m5974J12663K83858J03666k70959l18119
30708g76608J1423K55598K07775Q7946k0477k36118l80510j17559L40946L75793
30698b51791o9329l57742j71727N4165l7484j57130J8426K70627K80266J37782
$$ y = [-1264515, -1503002, -1556564, -1350727, -1107742, -973650, -911255, -911628, -974773, -941762, -693229, -444851, -488636, -723958, -821484, -752708, -740706, -784247, -695943, -544512, -568868, -695798, -652387, -526116, -655981, -955805, -950785, -583339, -375558, -608417, -908025, -884679, -659763, -487742, -341183, -174056, -155382, -314449, -343361, -84530, 130527, -38925, -423889, -628130, -574546, -467161, -417550, -374993, -264741, -14616, 371266, 650446, 508568, 3941, -441510, -599288, -641743, -687717, -575054, -291196, -187530, -458489, -776608, -765185, -509587, -301812, -213866, -234343, -470461, -850971, -968530, -627584, -251791, -321120, -678862, -850589, -796424, -833908, -991038, -972612, -701985, -421719, -283937]
30688b83937K9902j17131l06410k41793J53657M03961J16621l83547n02366j79265
30678a310308J83602L43958L34854J63611j50400l57640k20068Q6228J76802K5315
30668g24046l2246J43219K89418J84661j2712m0433N9059L1431j69130k87710
30658e58489j54683K8363k6950k25598j83427J73809M22192K31751j37726k26065
30648f56823l3767Q1899K1974J4408J14082J03600l9646k8737K13638L22939L2051
30637A45618l73053m37639j60715Q0163J00911Q9037K11744L16372J56631k03971
30627g4902l98483k17730P4290P2004j79290k17266J31932M34962K86144o9437
30617a57776j44980J3090j5794k26813j69582K20913L96843M2886l80368l07680
$$ y = [-283937, -254035, -371166, -677576, -919369, -765712, -361751, -245130, -628677, -1131043, -1310308, -1126706, -782748, -447894, -284283, -434683, -792323, -1012391, -926163, -749361, -724046, -756292, -613073, -323655, -138994, -151706, -192139, -133080, -101649, -270779, -558489, -713172, -684809, -711759, -937357, -1120784, -946975, -524783, -293032, -430758, -656823, -690590, -608691, -586717, -572309, -458227, -354627, -394273, -423010, -209372, 113567, 145618, -227435, -665074, -825789, -745626, -644715, -555678, -343934, -27562, 129069, -74902, -473385, -691115, -616825, -544821, -724111, -941377, -809445, -374483, -88339, -157776, -302756, -289666, -305460, -532273, -701855, -480942, -84099, -41213, -421581, -729261]
30607g29261J10872K93042P2845j80881j78943l1999N0631M7961K0603n3253k00201
30596g78584l22249k68052k3452K28301K71649Q8957j08641j12674O0176K29165
30586g35404K79167K37260J57617M9047p7178j83010k46055k66765k37503j53833
30576a176657l7434Q6074J88052K00533P6419q1928r2024M8617J33526O2661j1462
30565f03623K1485K2986j05830j63054M2700L05447K81089J3600j45637p5374
30555d06211J1890j5294m0449R601K3845n1615q9798q623P6096K6066j23362k10426
30543g98280j15115J17158K67727J50590j02543j36680J16980K65714K0907l16488
30533e30030k82812M3142J90740K9459j12441k3314J48940K48011K77310J75783
$$ y = [-729261, -618389, -325347, -252502, -433383, -612326, -644325, -593694, -545733, -525130, -578383, -778584, -1100833, -1368885, -1392337, -1164036, -892387, -803430, -912071, -1024745, -964569, -735404, -456237, -218977, -61360, -12313, -89491, -272501, -518556, -785321, -1022824, -1176657, -1214091, -1128017, -939965, -739432, -663013, -744941, -836965, -788348, -654822, -592161, -603623, -582138, -559152, -664982, -828036, -785336, -479889, -198800, -185200, -330837, -406211, -394321, -409615, -450064, -440463, -416618, -468233, -558031, -566654, -490558, -464492, -587854, -798280, -913395, -796237, -528510, -377920, -480463, -617143, -500163, -234449, -213542, -530030, -812842, -769700, -578960, -549501, -661942, -685256, -536316, -288305, -10995, 164788]
30523A64788j46203m66961l77845J10739M72243L42622m2981k59884k11684m5787
30513d60953J42818K85704K48437j398k73146l56715k32803j2118J73670J84801
30503c01703r735j88875r7509J49287J69272j03757k70396n5245K70411K93062
30493a45188L9122j25079k7523J41791J44733k6917j97684k24243j40770r6477
30483f58235j35450j11526P9899K77547K42264J5087j26629n8858N5267L7159
30473c83475q8961j71858q6042J64792L69353K41102j89274m68239k68905J16386
30463g65121J80434m5070q5380J87301L62561J63775j48862k09275j9741J66959
30453b12419J62563n5466l06719k69375J18774L90999J07109l93040l64594J92335
$$ y = [164788, 18585, -448376, -826221, -715482, -243239, 99383, 56402, -203482, -415166, -460953, -318135, -32431, 216006, 214608, -58538, -415253, -648056, -660174, -486504, -301703, -311438, -500313, -597822, -448535, -279263, -383020, -653416, -708661, -438250, -145188, -106066, -231145, -258668, -116877, 27856, 939, -196745, -420988, -561758, -658235, -793685, -905211, -825312, -547765, -305501, -290414, -417043, -475901, -420634, -383475, -472436, -644294, -730336, -565544, -196191, 44911, -144363, -612602, -881507, -765121, -584687, -629757, -715137, -527836, -165275, -1500, -150362, -359637, -379378, -212419, -49856, -105322, -412041, -681416, -562642, -171643, -64534, -457574, -822168, -629833]
30443f29833M52419L3580l89597j62981L14898K59417k68573n14822j79312K76746
30433h08058M15958L12329J81030K4358j69756k30673l8265K32060K87382O6936
30423B73301k08866l16636k61283j83309j06849O3541K69280K51187n4148k91177
30413e64959j35479K14857L41071K28407J58600J18578j38258m83196m73817r6399
30403h30595J61408J10622R6331K40856J54754k63787m47538o2971L47123K15503
30393b78294j26718p0372K15740J46240k09065k67402L4301J87244M1118j3919
30383c41127J45316J38563j80626m16446k90728m4225O1026J24709K39288K20426
30373c43824j874j47066m2864O0394n7936j86666p7700Q8297K4836j40771r7966
$$ y = [-629833, -177414, -143834, -533431, -696412, -381514, -122097, -390670, -905492, -1084804, -808058, -392100, -79771, 101259, 125617, -44139, -274812, -313077, -81017, 206365, 273301, 64435, -252201, -513484, -696793, -803642, -740101, -470821, -219634, -273782, -564959, -700438, -485581, -144510, 83897, 242497, 361075, 222817, -260379, -734196, -830595, -669187, -558565, -462234, -221378, -66624, -330411, -777949, -840920, -493797, -278294, -405012, -475384, -259644, -113404, -322469, -589871, -555570, -368326, -327208, -341127, -195811, -57248, -237874, -654320, -945048, -989273, -928247, -803538, -564250, -343824, -345698, -492764, -535628, -475234, -533170, -719836, -797536, -709239, -684403, -825174, -923140]
30362i23140R1717J16106k5384l3260J43759K07955K4466j54774j08851M1546
30352f19860J07809J26707J76124J52806j5983j43960n2011R5879L7343j26052
30342b61198p8131J48447J74036j00596k89778j23585J28413J06047q6125j13695
30332d96165L4919J12521P5161Q5294J32338M0426j54345j99020l9176Q5007K7257
30321b95783p1643o4153m239K3743M6907O6611j0544j86949k88324j73794Q8087
30310h70081L16125L80728K52226R407j90333k57361k56951k49489j49082R2551
30300i22260K85928K17903k9622k09193k45923j95224j4540K92710M40358J66826
30290b13037k88681m20403j34412J91470K80802J88547J2508j81598j87171J16623
$$ y = [-923140, -831423, -715317, -740701, -773961, -630202, -422247, -397781, -552555, -661406, -619860, -512051, -385344, -209220, -56414, -72397, -216357, -268368, -172489, -135146, -261198, -339329, -190882, -16846, -117442, -407220, -530805, -402392, -296345, -382470, -496165, -461246, -348725, -273564, -188270, -55932, -15506, -169851, -368871, -408047, -323040, -295783, -367426, -431579, -435818, -412075, -365168, -298557, -309101, -496050, -784374, -958168, -870081, -553956, -173228, 78998, 88405, -101928, -359289, -616240, -865729, -1014811, -922260, -636332, -418429, -448051, -657244, -903167, -1098391, -1112931, -820221, -379863, -213037, -501718, -922121, -1056533, -865063, -584261, -395714, -383206, -564804, -751975, -635352]
30280f35352L93765K13485k39614l75058j07580P4425n037L0408L05375L86608
30270D1425O9171k16403j40155J5316l5243p0433J03437J92036k9798k32211j02301
30259d05159R2869K2125j12563k4004Q2321o0378k11567p2471J10840J891j62867
30248g38963o862K51100J66817j34453k11561q0607n6176p9727R3211K67815R6896
30237d32510j99576j35478J84056K50844N3964J2621J19788j9821l35400l23591
30227h25103K3782J69486L049N140K76070K85147j24090l41300j3018L31435J81967
30216b7435j33351j17239K8351j20248l45772j47475L32266M64063J01516k39743
30206b05067j85326M1760P4531q2083j56630j0579K10740K56950O4445j32993
$$ y = [-635352, -241587, -28102, -267716, -642774, -750354, -675929, -680966, -650558, -345183, 41425, 110596, -105807, -245962, -230646, -265889, -336322, -232885, -40849, -70647, -302858, -405159, -312290, -290165, -402728, -426732, -344411, -404789, -616356, -688827, -577987, -576096, -738963, -745825, -494725, -327908, -462361, -673922, -754529, -810705, -890432, -797221, -529406, -432510, -632086, -767564, -583508, -332664, -278700, -266079, -146291, -166112, -501512, -825103, -801321, -631835, -628786, -623646, -347576, -62429, -186519, -527819, -540837, -209402, -27435, -160786, -278025, -249674, -369922, -715694, -863169, -530903, -66840, 34676, -205067, -390393, -348633, -274102, -356185, -512815, -523394, -312654, -55704, 8741, -124252]
30196a24252o9575J74639K39861j4956l06608l42011k01616j17079p6937Q1694
30186g56840L12751L74224J84463n4016j23352l9004J9043n7796j89846k16801
30176e47174j01551J9590K7138j3416K3729R8422O7376n1998p9264L5615J15620
30165d05913L6482p5345n1869M8120M0985q6200j46665j6824J99160L05123K29846
30154G6900N6374j04114j88072j63089m9034L3790k7770j35906n4885K09190L15416
30143c1200P5944j90279j13208J19273N6788k33930k50310P9266K39230o529k28349
30132d83304j01159N6165p2009j83135P3409L92523K98129m2152j34403N221L313
30121a87402j08489R283K71795K38452j14364l37085k37379o4556M9597K21299
$$ y = [-124252, -193827, -19188, 220673, 205717, -100891, -442902, -644518, -761597, -838534, -756840, -444089, -69865, 114598, 60582, -62770, -101774, -82731, -140527, -330373, -547174, -648725, -629135, -601997, -615413, -591684, -493262, -425886, -477884, -557148, -521533, -405913, -369431, -444776, -496645, -448525, -407540, -493740, -640405, -657229, -458069, -152946, 76900, 133274, 29160, -158912, -322001, -371035, -337245, -365015, -500921, -555806, -346616, -31200, 44744, -145535, -258743, -139470, -82682, -316612, -566922, -487656, -248426, -254955, -483304, -584463, -528298, -600307, -783442, -710033, -317510, -19381, -61533, -195936, -190715, -187402, -295891, -286608, -14813, 223639, 109275, -227810, -465189, -529745, -480148, -258849]
30111b58849L41904J10084l39725m47633n5544L21728K61313l9170k22628k74777
30101f03297k94486j93344O7398K71114K50407J34607R2601Q9323O1439O7843
30091e6395J16149R4755m160m6744j6675l3372o9976J6005J27690r762l47032
30080b29517m73662k18463R6799J58707M9685l0546p4807j15735q1837K1724O8821
30069h28831O3164J37720K38860J64406k4290l7301J21074J19858j01975k03383
30059c50698n8117K3038j04298j37065P5474J92048j1267k00775n7970J71454
30049d58176J39520j3105R168J04732K9006j23953j48792j30002j78720r6883
30039h67205K31556M48462K32850j08690j13288P3134J3125j95006r9285K40499
$$ y = [-258849, 83055, 193139, -146586, -594219, -649763, -328035, -66722, -105892, -328520, -603297, -897783, -1091127, -1023729, -752615, -502208, -367601, -275000, -185677, -124238, -56395, 59754, 154509, 150349, 103605, 86930, 53558, -16418, -413, 127277, 117515, -229517, -703179, -921642, -824843, -666136, -616451, -646997, -721804, -837539, -919376, -897652, -828831, -765667, -627947, -389087, -224681, -248971, -286272, -165198, -45340, -147315, -350698, -408815, -385777, -490075, -627140, -551666, -359618, -370885, -571660, -629630, -458176, -318656, -331761, -322593, -217861, -188855, -312808, -461600, -591602, -770322, -867205, -635649, -187187, 45663, -63027, -176315, -103181, -90056, -285062, -384347, -143848]
30029a43848K87095q4292l94455l30519j16192q964K7815K4515j12903k71006
30019a122754j49466K29308M70580M10019L12358L14573J71279k04978m43040
30010a2121k88932n1346q0256j81748j3714K45479J63984j88767l14573o5817
30000g87811J78301J63356Q5404J22810J08445q4088k17693p4895J38236J22398
29990b45537k3804k9806K9664j02571l08355k14601J39060K89925J01267k7107
29980c91865J08762J40888j75562m21981j58819L13889M08034J47489R640R4667
29970G5142R7988k2228j1835Q9410k3630k81601k69112L5086J79351J3726r4241
29959b11944K6061P1271q3352j15247Q0102J14870j52090k61554L1273K35178
$$ y = [-143848, 143247, 58955, -335500, -666019, -782211, -791175, -763360, -738845, -851748, -1122754, -1272220, -1042912, -572332, -162313, 150045, 464618, 635897, 430919, -12121, -301053, -352399, -432655, -614403, -628117, -382638, -218654, -407421, -721994, -787811, -609510, -446154, -360750, -237940, -129495, -213583, -431276, -506171, -367935, -245537, -269341, -299147, -269483, -372054, -680409, -895010, -755950, -466025, -364758, -391865, -283103, -142215, -317777, -739758, -898577, -584688, -176654, -29165, -19525, 75142, 173130, 150902, 139067, 228477, 204847, -76754, -345866, -310780, -131429, -117703, -211944, -185883, -114612, -197964, -313211, -233109, -118239, -270329, -531883, -500610, -265432]
29949b65432n5910m18489k91219J09881K36147J18221J26379K00412O3671r9979
29939b76318M9405K65963O8355l43403l37020Q2316K86114R5947q232J53117J46322
29928A82566j98857l96655j37570J78277J43826k1855J7261J01549m3026k40282
29918d14766j77999L4789Q4062k9942r6620q7276p2298K0207J98869K06917q0539
29907d14596k92080l7769M32539N27213J56582k03850k41059j10966p624Q8269
29897a03341J39495j2625k82753l17347l4261J87841R1130n9036M4896K16224
29887a29777J22165j01221p1706J53457J49060j42835k90764r0093J17657N3453
29877b30604o0280J1239L8145k15136m22128j52110L34446L80995n1546l11390
$$ y = [-265432, -321342, -739831, -1031050, -921169, -685022, -566801, -440422, -240010, -176339, -276318, -226913, 39050, 107405, -235998, -573018, -490702, -204588, -108641, -116873, 36244, 182566, -16291, -412946, -550516, -372239, -228413, -250268, -233007, -131458, -174484, -414766, -592765, -557976, -473914, -503856, -600476, -687752, -760050, -739843, -540974, -334057, -414596, -706676, -744445, -311906, 215307, 371889, 168039, -73020, -183986, -191610, -103341, 36154, 23529, -259224, -576571, -610832, -422991, -331861, -390897, -346001, -129777, -7612, -108833, -180539, -27082, 121978, -20857, -311621, -401714, -284057, -230604, -290884, -279645, -241500, -456636, -878764, -1030874, -696428, -315433, -366979, -678369]
29867f78369n6030L01854L28069J54273M8636n4477k19233j94826J01602K20740
29857d7761j53696n38758k96273L11298M42074m4313m00776j74547J80901J49843
29847e72008n9589j0245J97513J81128l5503j16108l627O5563L6786Q3958K12980
29836a9152K13939L2803j43010k03610k21094k07087p2861J14781J44662J3740
29826c46889l1947Q1894J10886p1767k11976r2020P1420l5112k96421l40177j05406
29815a267515J23484J81971J63630J16321k9737j88869j28216J50249L38827K45758
29805b94097J6998j51976k32927j99048K3056K93091K97859M1071o8670J44745
29795a29898K91239M6419k74612k24539K8014J3371k06894j58650J81135L02986
$$ y = [-678369, -734399, -432545, -104476, 49797, 98433, 43956, -175277, -370103, -268501, -47761, -201457, -740215, -1036488, -725190, -283116, -327429, -728205, -902752, -721851, -572008, -631597, -641842, -444329, -263201, -298704, -414812, -418439, -352876, -316090, -232132, -19152, 194787, 227590, 84580, -119030, -340124, -547211, -620072, -505291, -360629, -346889, -378836, -296942, -186056, -257823, -469799, -561819, -490399, -525511, -821932, -1162109, -1267515, -1144031, -962060, -798430, -682109, -711846, -900715, -1028931, -878682, -539855, -294097, -277099, -429075, -662002, -861050, -837994, -544903, -247044, -205973, -274643, -129898, 161341, 207760, -66852, -291391, -263377, -250006, -456900, -615550, -434415, -131429]
29785a31429K3242j97121j0138K66429J73654j95501l82380k05157J00273K52295
29775c05833J93199M8228l1557r886J4662j7718l418J22178J62808q5379m19663
29764c32379m21435q0428J51260L0845j27669K9358L54691M38704J73384j70068
29754D6263k98640j50578J08064K17878N6080k02203k73633j34322j9866m8860
29744f99817q3336j3173P4075R6763J17864J76255J87258J08211J9736k5451n7485
29733i9100o5465j3059K3722m8579j37952j02871k3331m1756l6834J63526L49213
29722c2486J86410j56117j97297M9358R1482j52813j88032J41575K96444n3980
29712a5456m40759l49161J5582J84933J34719O6433l5276j58332n2958K65024
$$ y = [-131429, -108187, -305308, -315446, -49017, 124637, -70864, -453244, -658401, -558128, -305833, -112634, -64406, -95963, -105849, -91187, -108905, -112323, 9855, 172663, 87284, -332379, -753814, -834242, -682982, -652137, -779806, -750448, -395757, 42947, 216331, 46263, -252377, -402955, -294891, -77013, -20933, -223136, -496769, -631091, -650957, -699817, -783153, -796326, -722251, -625488, -507624, -331369, -144111, -35900, -16164, -41615, -99100, -164565, -177624, -153902, -202481, -340433, -443304, -466635, -508391, -545225, -381699, -32486, 153924, -2193, -199490, -150132, -58650, -211463, -399495, -257920, 38524, -15456, -456215, -805376, -789794, -604861, -470142, -403709, -438985, -597317, -650275, -385251]
29702c85251L02312j17096l84141k4166M53027L28224j79638l40082j03503n997
29692d56311j44965j30817P6170J25474J4923P4912K38597J09868k21894k19636
29682e33679J62007L41114P3034j75668m9748J62573J14633n0970o1549L7432
29672A9179Q7975J05775J31982J11489N9800M8752j5173k38611l90653j68162
29662b47647K02163J83160k06252l59920m6529K43308J37351p0310l7902M9411
29652a53167o5753j93695r0933M4354o3605k45521j80560N7928J70127J16812
29642f04013N8140J5048n3065l5505J21568J93677P421k03748j30425J04763J50954
29631c75185j021n5992N5535Q9081o1847j80222p4298J45191K32143R0731j55639
$$ y = [-385251, -82939, -200035, -584176, -608342, -155315, 172909, -6729, -346811, -450314, -456311, -601276, -732093, -655923, -530449, -515526, -440614, -202017, -92149, -314043, -533679, -371672, -30558, 42476, -133192, -182940, -20367, 94266, 43296, -18253, 19179, 107154, 212929, 344911, 456400, 516200, 564952, 549779, 311168, -79485, -247647, -45484, 137676, -68576, -428496, -475025, -231717, -94366, -164676, -202578, -153167, -218920, -412615, -503548, -459194, -522799, -768320, -948880, -890952, -720825, -604013, -545873, -530825, -583890, -619395, -497827, -304150, -296729, -500477, -630902, -526139, -375185, -376206, -432198, -376663, -287582, -349429, -529651, -603949, -458758, -226615, -135884, -291523]
29620b91523k75353j22057J82704L19787J41045j24508j81641p3010n5545j50762
29610f30863j00638J92492M39685L16813j08377m48218m25654j17696J92553K96234
29600c93669J86937L886j00190p3120J0128M3198J5659L492K7442P198r5791j90584
29588e55414j93218j37045m1524J65656M17746M06299J5699l26397j68236K23281
29578a93153J99533k19273l19769J31691M47745J19055l65062l44843p432J03422
29568d48086N3384J96346L20499J8262l79563k06753L38723L95126j50044m53517
29558c15623r9336K86718J49061j60106j37257L7038r534j21750L846J82001P2661
29547a12281j86127k19000l2704Q3729P1481Q2726J14540M9597o1057q0144m0379
$$ y = [-291523, -566876, -688933, -506229, -186442, -45397, -169905, -351546, -424556, -480101, -630863, -731501, -539009, -99324, 217489, 109112, -339106, -764760, -882456, -689903, -393669, -206732, -202846, -303036, -376156, -366028, -322830, -307171, -303679, -276237, -269039, -364830, -555414, -748632, -885677, -927201, -761545, -343799, 62500, 78199, -248198, -416434, -193153, 6380, -212893, -532662, -400971, 46774, 165829, -199233, -544076, -551508, -448086, -394702, -198356, 122143, 140405, -239158, -445911, -107188, 287938, 137894, -315623, -414959, -128241, 20820, -139286, -276543, -239505, -249039, -370789, -366943, -184942, -112281, -298408, -517408, -550112, -466383, -394902, -312176, -197636, -148039, -209096, -289240, -329619]
29536c29619n5619r3951o1619J3064O2688J01764J13653m868k36958l70298k68063
29525a129826l5729J77061L26747L59941K12502q1p6432o6156j77083l12688j43089
29514h64833K66386M07997J10486j54022k7991J72788L6095k62028k96775o5998
29504f77895J24321J67065J39269L2391j28365j41820M5477J37976m9525k30960
29494e82066j11472J07885R9050k9635N048J18007O2517o2737j3929J03409M5641
$$ y = [-329619, -385238, -479189, -540808, -527744, -465056, -363292, -249639, -254507, -491465, -861763, -1129826, -1165555, -988494, -661747, -301806, -89304, -89385, -165817, -231973, -409056, -721744, -864833, -598447, -190450, -79964, -233986, -261977, -89189, -53094, -315122, -611897, -677895, -553574, -386509, -247240, -214849, -343214, -485034, -439557, -301581, -351106, -582066, -693538, -585653, -486603, -516238, -511190, -393183, -330666, -393403, -407332, -303923, -258282]
$$ [...]
##END NTUPLES=NMR SPECTRUM
##END=
