##TITLE=31Pdec_84-2023
 CDCl3 24 sc
 25.9.2023
##JCAMPDX= 6.0         $$ Bruker NMR JCAMP-DX V2.0
##DATA TYPE= NMR SPECTRUM
##DATA CLASS= NTUPLES
##ORIGIN= UXNMR, Bruker Analytische Messtechnik GmbH
##OWNER= root
$$ XWIN-NMR		Version 3.5
$$ Mon Sep 25 14:19:58 2023 Russian Standard Time (UT+4h)  she@DPX200
##.OBSERVE FREQUENCY= 81.013821
##.OBSERVE NUCLEUS= ^31P
##.ACQUISITION MODE= SIMULTANEOUS
##.ACQUISITION SCHEME= undefined
##.AVERAGES= 24
##.DIGITISER RES= 16
##SPECTROMETER/DATA SYSTEM= spect
##.PULSE SEQUENCE= zgpg30
##.SOLVENT NAME= DMSO
##.SHIFT REFERENCE= (INTERNAL, DMSO, 0, 248.564)
##AUDIT TRAIL= $$ (NUMBER, WHEN, WHO, WHERE, WHAT)
$$ ##TITLE= Audit trail, XWIN-NMR		Version 3.5
$$ ##JCAMPDX= 5.01
$$ ##ORIGIN= Bruker BioSpin GmbH
$$ ##OWNER= she
$$ F:/spectra/data/she/nmr/P31/1/pdata/1/auditp.txt
$$ ##AUDIT TRAIL=  $$ (NUMBER, WHEN, WHO, WHERE, WHAT)
(   1,<2023-09-25 14:18:49.57 +0400>,<she>,<DPX200>,
      <created by zg, POWCHK disabled, PULCHK disabled
       configuration hash MD5:
       00 E9 B6 7A A2 85 ED C7 34 08 36 98 17 FE 4E 26
       data hash MD5: 32K
       68 E9 DF 7F A4 39 5E A5 E2 F7 79 43 50 03 AA 1B>)
(   2,<2023-09-25 14:18:52.03 +0400>,<she>,<DPX200>,
      <Start of raw data processing
       efp BC_mod = 2 LB = 5 FT_mod = 6 PKNL = 1 PHC0 = -10901.98 PHC1 = 786.8865 SI = 64K 
       data hash MD5: 64K
       BA 42 9F EB 28 53 04 66 9F 6A 33 83 97 4C E6 5C>)
(   3,<2023-09-25 14:19:22.73 +0400>,<she>,<DPX200>,
      <pk PHC0 = 199.6348 PHC1 = -591.0002 
       data hash MD5: 64K
       6B E1 7B 6E E2 89 13 4A EE 99 99 AA 39 0B 32 AC>)
(   4,<2023-09-25 14:19:25.67 +0400>,<she>,<DPX200>,
      <abs ABSG = 5 
       data hash MD5: 64K
       3A A5 C5 7B B4 14 93 AC C7 DD AB 73 B5 43 4A 21>)
$$ ##END=
$$ 
$$ hash MD5
$$ 4D D2 1C D2 C3 45 A2 E6 D4 BF CE F1 9C 7A 50 E5
##$RELAX= 
##$RELAX= 
##$RELAX= 
##$RELAX= 
##$RELAX= 
##$RELAX= 
##$RELAX= 
##$RELAX= 
##$RELAX= 
$$ Bruker specific parameters
$$ --------------------------
##$DU= <F:/spectra>
##$EXPNO= 1
##$NAME= <P31>
##$PROCNO= 1
##$TYPE= <nmr>
##$USER= <she>
##$AMP= (0..31)
100 100 100 100 100 100 100 100 100 100 100 100 100 100 100 100 100 100 
100 100 100 100 100 100 100 100 100 100 100 100 100 100 
##$AQSEQ= 0
##$AQ_mod= 1
##$AUNM= <au_zg>
##$AUTOPOS= <>
##$BF1= 81.014009
##$BF2= 200.13
##$BF3= 200.13
##$BF4= 200.13
##$BF5= 200.13
##$BF6= 200.13
##$BF7= 200.13
##$BF8= 200.13
##$BYTORDA= 1
##$CFDGTYP= 0
##$CFRGTYP= 5
##$CHEMSTR= <none>
##$CNST= (0..31)
1 1 145 1 1 1 1 1 1 1 1 1 1 1 1 1 1 1 1 1 1 1 1 1 1 1 1 1 1 1 1 1 
##$CPDPRG= <waltz16>
##$CPDPRG1= <>
##$CPDPRG2= <waltz16>
##$CPDPRG3= <>
##$CPDPRG4= <mlev>
##$CPDPRG5= <mlev>
##$CPDPRG6= <mlev>
##$CPDPRG7= <mlev>
##$CPDPRG8= <mlev>
##$CPDPRGB= <>
##$CPDPRGT= <>
##$D= (0..31)
0 1 0 0 0 0 0 0 0 0 0 0.03 2e-05 3e-06 0 0 0 0 0 0 0 0 0 0 0 0 0 0 0 0 
0 0 
##$DATE= 1695637129
##$DBL= (0..7)
120 120 120 11 120 120 24 19 
##$DBP= (0..7)
150 150 150 150 150 150 150 150 
##$DBP07= 0
##$DBPNAM0= <>
##$DBPNAM1= <>
$$ [...]
##$SUBNAM3= <"">
##$SUBNAM4= <"">
##$SUBNAM5= <"">
##$SUBNAM6= <"">
##$SUBNAM7= <"">
##$SUBNAM8= <"">
##$SUBNAM9= <"">
##$SW= 501.771253377433
##$SWIBOX= (0..15)
0 1 3 0 0 0 0 0 0 0 0 0 0 0 0 0 
##$SW_h= 40650.406504065
##$TD= 32768
##$TD0= 1
##$TE= 0
##$TE2= 300
##$TE3= 300
##$TEG= 300
##$TL= (0..7)
0 120 53 12 22 120 120 120 
##$TP= (0..7)
150 150 150 150 150 150 150 150 
##$TP07= 0
##$TPNAME0= <>
##$TPNAME1= <>
##$TPNAME2= <>
##$TPNAME3= <>
##$TPNAME4= <>
##$TPNAME5= <>
##$TPNAME6= <>
##$TPNAME7= <>
##$TPOAL= (0..7)
0.5 0.5 0.5 0.5 0.5 0.5 0.5 0.5 
##$TPOFFS= (0..7)
0 0 0 0 0 0 0 0 
##$TUNHIN= 0
##$TUNHOUT= 0
##$TUNXOUT= 0
##$USERA1= <user>
##$USERA2= <user>
##$USERA3= <user>
##$USERA4= <user>
##$USERA5= <user>
##$V9= 5
##$VALIST= <valist>
##$VCLIST= <CCCCCCCCCCCCCCC>
##$VD= 0
##$VDLIST= <DDDDDDDDDDDDDDD>
##$VPLIST= <PPPPPPPPPPPPPPP>
##$VTLIST= <TTTTTTTTTTTTTTT>
##$WBST= 1024
##$WBSW= 4
##$XGAIN= (0..3)
0 0 0 0 
##$XL= 0
##$YL= 0
##$YMAX_a= 4246
##$YMIN_a= -4213
##$ZGOPTNS= <>
##$ZL1= 120
##$ZL2= 120
##$ZL3= 120
##$ZL4= 120
##$ABSF1= 248.5645
##$ABSF2= -253.2056
##$ABSG= 5
##$ABSL= 3
##$ALPHA= 0
##$AQORDER= 0
##$ASSFAC= 0
##$ASSFACI= 0
##$ASSFACX= 0
##$ASSWID= 0
##$AUNMP= <proc_1d>
##$AZFE= 0.1
##$AZFW= 0.5
##$BCFW= 0
##$BC_mod= 2
##$BYTORDP= 0
##$COROFFS= 0
##$CY= -3
##$DATMOD= 1
##$DC= 0
##$DFILT= <>
##$DTYPP= 0
##$F1P= 0
##$F2P= 0
##$FCOR= 1
##$FTSIZE= 65536
##$FT_mod= 6
##$GAMMA= 0
##$GB= 0
##$INTBC= 1
##$INTSCL= 6.047779e-11
##$ISEN= 30
##$LB= 5
##$LEV0= 0
##$LPBIN= 0
##$MAXI= 10000
##$MC2= 0
##$MEAN= 0
##$ME_mod= 0
##$MI= 50
##$NCOEF= 0
##$NC_proc= -7
##$NLEV= 6
##$NOISF1= 182.463
##$NOISF2= 159.3651
##$NSP= 0
##$NTH_PI= 0
##$NZP= 0
##$OFFSET= 248.5645
##$PC= 4
##$PHC0= -10702.35
##$PHC1= 195.8863
##$PH_mod= 1
##$PKNL= yes
##$PPARMOD= 0
##$PSCAL= 0
##$PSIGN= 0
##$REVERSE= no
##$SF= 81.0140089999694
##$SI= 65536
##$SIGF1= 159.3651
##$SIGF2= -187.1042
##$SINO= 113.3802
##$SIOLD= 16384
##$SREGLST= <1H.CDCl3>
##$SSB= 0
##$STSI= 65536
##$STSR= 0
##$SW_p= 40650.406504065
##$SYMM= 0
##$S_DEV= 0
##$TDeff= 32768
##$TDoff= 0
##$TI= <>
##$TILT= no
##$TM1= 0
##$TM2= 0
##$TOPLEV= 0
##$USERP1= <user>
##$USERP2= <user>
##$USERP3= <user>
##$USERP4= <user>
##$USERP5= <user>
##$WDW= 1
##$XDIM= 65536
##$YMAX_p= 504916765
##$YMIN_p= -11878925
$$ End of Bruker specific parameters
$$ ---------------------------------
##NTUPLES= NMR SPECTRUM
##VAR_NAME=  FREQUENCY,     SPECTRUM/REAL,   SPECTRUM/IMAG
##SYMBOL=    X,             R,               I
##VAR_TYPE=  INDEPENDENT,   DEPENDENT,       DEPENDENT
##VAR_FORM=  AFFN,          ASDF,            ASDF
##VAR_DIM=   65536,         65536,           65536
##UNITS=     HZ,            ARBITRARY UNITS, ARBITRARY UNITS
##FACTOR=    0.620285442955139, 1,           1
##FIRST=     20137.2065510682, 0,            0
##LAST=      -20513.1999529968, 0,           0
##MIN=       -20513.1999529968, -11878925,   0
##MAX=       20137.2065510682, 504916765,    0
$$ Real data points
##PAGE= N=1
##DATA TABLE= (X++(R..R)), XYDATA
$$ [...]
38318A152501Q1064L2308k0972o3547p6092p1881r2764j52487k09736k21131k01455
$$ 1152501 1233565 1265873 1244901 1181354 1105262 1033381 940617 788130 578394 357263 155808
38307A55808k01909k38849k76093k79110k57142k38973k28144k02229j48150p8812
$$ 155808 -46101 -284950 -561043 -840153 -1097295 -1336268 -1564412 -1766641 -1914791 -1993603
38297a993603j4447L5814O6863O6988L1282j7984m1781k0501K9707P9102J11577
$$ -1993603 -2008050 -1972236 -1905373 -1838385 -1807103 -1825087 -1866868 -1887369 -1857662 -1778560 -1666983
38286a666983J28454J43047J80034K60332L66164M31503L91421K45292O1749p6388
$$ -1666983 -1538529 -1395482 -1215448 -955116 -588952 -157449 233972 479264 541013 464625
38276D64625j25843r7378m1643k0472o8397j67124k60704l00714k80255k32982
$$ 464625 338782 241404 199761 179289 110892 -56232 -316936 -617650 -897905 -1130887
38266a130887k02859k03487j99666j42768l4525O2102R3138P6925P2253R8630
$$ -1130887 -1333746 -1537233 -1736899 -1879667 -1914192 -1852090 -1758952 -1682027 -1609774 -1511144
38256a511144J23471J24203J23288J47464J79832J74528J10585J8526m6505n8669
$$ -1511144 -1387673 -1263470 -1140182 -992718 -812886 -638358 -527773 -509247 -555752 -614421
38246f14421n0267p6448j44049j93961j72620j02414n2987n6898q7756j10952
$$ -614421 -664688 -741136 -885185 -1079146 -1251766 -1354180 -1407167 -1464065 -1551821 -1662773
38236a662773j13050q0577M782J33585K61542L46762L69870L19256J99745O7948
$$ -1662773 -1775823 -1856400 -1851618 -1718033 -1456491 -1109729 -739859 -420603 -220858 -152910
38226a52910J1943O3445J56539J97606J52116M5462q4056j97124k46200k03912
$$ -152910 -140967 -77522 79017 276623 428739 474201 390145 193021 -53179 -257091
38216b57091r8193O993O4627O6904L3528J092Q087O0577J17070J28599Q8022K2547
$$ -257091 -355284 -348291 -283664 -216760 -183232 -182140 -174053 -113476 3594 132193 220215 242762
38204B42762n0088j31768k14139k63789k45380j52720j9526R6033J49203J42894
$$ 242762 192674 60906 -153233 -417022 -662402 -815122 -834648 -738615 -589412 -446518
38194d46518J17390J01692R0085P2404O1952P4020R5783J01126Q3814N6224K6569
$$ -446518 -329128 -227436 -137351 -64947 -2995 71025 166808 267934 351748 407972 434541
38183D34541l190k6318l5390k9597q163K7952N9137N8818L9774N6029J25675J79000
$$ 434541 431351 405033 369643 340046 331883 359835 418972 477790 517564 573593 699268 878268
38171H78268J27821k6907j98979l18211l80921m01606l69443k77422j59764o8060
$$ 878268 1006089 979182 780203 461992 81071 -320535 -689978 -967400 -1127164 -1195224
38161a195224j9561J3527O6873J43446K08847K28267K07708J85946J81924J72683
$$ -1195224 -1214785 -1201258 -1134385 -990939 -782092 -553825 -346117 -160171 21753 194436
38151A94436J36180Q6959M3729p439p5797j15859p1134L7159J20787J30740J00872
$$ 194436 330616 417575 461304 453865 378068 262209 191075 228234 349021 479761 580633
38140E80633P1530K3669p8610k17890l32578l74788l32979k20701p4920M8581
$$ 580633 652163 675832 597222 379332 46754 -328034 -661013 -881714 -956634 -908053
38130i08053J10163J17396J08354J13551J47492K20227L28178M32297M67998L93207
$$ -908053 -797890 -680494 -572140 -458589 -311097 -90870 237308 669605 1137603 1530810
38120A530810K29469N2147o9439j30349j82281k57961l16769k89784j72689m2290
$$ 1530810 1760279 1812426 1742987 1612638 1430357 1172396 855627 565843 393154 350864
38110C50864K4777K1771o718k0768m899M0441R9196J42510J50469J24794P2926
$$ 350864 375641 397412 390694 369926 365027 405468 504664 647174 797643 922437 995363
38099I95363k148q2496j25775r9356j7460P0516J20353J11417M2813o4664j68357
$$ 995363 993215 910719 784944 685588 668128 738644 858997 970414 1013227 948563 780206
38088G80206k27114k28149j83063j04923l980R8160J67727J79406J35095O3242
$$ 780206 553092 324943 141880 36957 32977 131137 298864 478270 613365 676607
38078F76607P66l1302l9360m0704l5554o027N3643J18096J50226J32601P5598
$$ 676607 677373 646071 606711 566007 530453 524426 578069 696165 846391 978992 1054590
38067A054590M160n8130j01350j32401j60669j80272j75644j42286q8131j8338
$$ 1054590 1058750 1000620 899270 766869 606200 425928 250284 107998 19867 1529
38057A529N8886J09969Q8360j4353j45969k34696k41835j73721o8444J8036M0965
$$ 1529 60415 170384 258744 244391 98422 -136274 -378109 -551830 -620274 -602238 -561273
38046e61273M502m5506p9331j09712j44743j49937r5534k0226j603o5204j59359
$$ -561273 -556771 -602277 -681608 -791320 -936063 -1086000 -1181534 -1201760 -1203363 -1268567 -1427926
38035a427926k20183k24862j75530p3257O3126J75127J98084J22831P968p7107
$$ -1427926 -1648109 -1872971 -2048501 -2121758 -2058632 -1883505 -1685421 -1562590 -1554622 -1631729
38025a631729j13026j26132j33539j19011p5544m3434o6203j15404j05876P36
$$ -1631729 -1744755 -1870887 -2004426 -2123437 -2198981 -2242415 -2308618 -2424022 -2529898 -2529162
38015b529162J48512K63280L31657L67674L42869K13863J1479j55196j97434j17665
$$ -2529162 -2380650 -2117370 -1785713 -1418039 -1075170 -861307 -849828 -1005024 -1202458 -1320123
38005a320123J8754J43356K09430J99982J37065O3451k123p7404j76649k76956
$$ -1320123 -1301369 -1158013 -948583 -748601 -611536 -548085 -550208 -627612 -804261 -1081217
37995a081217l35172l24079k46654j34454m1918k2241q8293j98322k84990k96259
$$ -1081217 -1416389 -1740468 -1987122 -2121576 -2163494 -2185735 -2274028 -2472350 -2757340 -3053599
37985c053599k16391o8138R8189K29827K94623K83481K08285J13983P2018J22542
$$ -3053599 -3269990 -3338128 -3239939 -3010112 -2715489 -2432008 -2223723 -2109740 -2037722 -1915180
37975a915180K21641K78254K49279J71310J01011O6684Q7194J84140L35372M49899
$$ -1915180 -1693539 -1415285 -1166006 -994696 -893685 -827001 -739807 -555667 -220295 229604
37965B29604M38879L07052J43645K8059l1507p5600j39707k22898k87680k89275
$$ 229604 668483 975535 1119180 1147239 1115732 1040132 900425 677527 389847 100572
37955A00572k20451j25765n8995l3370k7827l0764n3670j03723j63443j98746
$$ 100572 -119879 -245644 -304639 -338009 -365836 -396600 -450270 -553993 -717436 -916182
37945i16182j75123p5346P5392K05446K45541J91384J03670M3988K6308K9345
$$ -916182 -1091305 -1166651 -1091259 -885813 -640272 -448888 -345218 -301230 -274922 -245577
37935b45577L0841J9652n321l3261m9608n4655o1072o6053m5419P328N0947L1239
$$ -245577 -214736 -195084 -200405 -233666 -283274 -337929 -399001 -465054 -510473 -503145 -452198 -420959
37923d20959n3213j38837j58727j08177m2538j4756k3466k7095m148J6452k636
$$ -420959 -474172 -613009 -771736 -879913 -922451 -937207 -960673 -987768 -991916 -975464 -978100
37912i78100m6136n4670k605N7072M9055l1921j07231r2882K2841J76822K85907
$$ -978100 -1024236 -1078906 -1081511 -1024439 -975384 -1007305 -1114536 -1207418 -1184577 -1007755 -721848
37901g21848L01600K33004J32321N0326n188o4499j46945k27008k57859k20847
$$ -721848 -420248 -187244 -54923 -4597 -9785 -74284 -221229 -448237 -706096 -926943
37891i26943j42114o8044l6988o6752j45730k26916k46734j70136k3154J22500
$$ -926943 -1069057 -1137101 -1174089 -1240841 -1386571 -1613487 -1860221 -2030357 -2053511 -1931011
37881a931011K00678J93791J37798R3403J06706J82153K80651L42740L24473K25571
$$ -1931011 -1730333 -1536542 -1398744 -1305341 -1198635 -1016482 -735831 -393091 -68618 156953
37871A56953R0193k2582p5217o5418j5600L7312M5102l0926j78679l23073l79929
$$ 156953 247146 224564 149347 83929 68329 105641 150743 119817 -58862 -381935 -761864
37860g61864l28269k18612j14638m5877j3055m292J1861P9702K06437L25736L44934
$$ -761864 -1090133 -1308745 -1423383 -1469260 -1482315 -1486607 -1474746 -1395044 -1188607 -862871 -517937
37849e17937K39746Q5302j5075j9667L7518J02961J52070J82715J82532J24467
$$ -517937 -278191 -192889 -207964 -227631 -190113 -87152 64918 247633 430165 554632
37839E54632r65j61811l04889l94884m23284l88701k94560j71476p4783l8625
$$ 554632 553667 391856 86967 -307917 -731201 -1119902 -1414462 -1585938 -1660721 -1699346
37829a699346m4328m8422k6393K7919J22267K48013L51166L65796K88605J87584
$$ -1699346 -1743674 -1792096 -1818489 -1790570 -1668303 -1420290 -1069124 -703328 -414723 -227139
37819b27139J21684Q3352M2094J0936K6908P9552J08177Q1712M3713N3363J05327
$$ -227139 -105455 -22103 19991 30927 57835 137387 245564 327276 370989 424352 529679
37808E29679J39093J17710O3840J3876l0138q0465j16737r3590J789J22725K01950
$$ 529679 668772 786482 850322 864198 834060 753595 636858 543268 545057 667782 869732
37797H69732K03462J34209K8215o6129j02306o5580J1775P5332Q6478L4946o6675
$$ 869732 1073194 1207403 1235618 1169489 1067183 1001603 1013378 1088710 1175188 1210134 1143459
37786A143459j83463k67404k89718k59464j94525q8619O4016K19618K99727K66185
$$ 1143459 959996 692592 402874 143410 -51115 -139734 -75718 143900 443627 709812
37776G09812J55822L2070p1542j49114j95120k05435j89211j55766r8094q484
$$ 709812 865634 897704 826162 677048 481928 276493 87282 -68484 -166578 -175062
37766a75062R5718J79288K19867K20627J97613J66367J37210J11631Q1759L7731
$$ -175062 -79344 99944 319811 540438 738051 904418 1041628 1153259 1235018 1272749
37756A272749k4966j02893j79920k26291k19287j73238j36949j51335k14291k86567
$$ 1272749 1247783 1144890 964970 738679 519392 346154 209205 57870 -156421 -442988
37746d42988l19496k80402j76446o2176O78N210K112L0662P4541J03620J27134
$$ -442988 -762484 -1042886 -1219332 -1281508 -1280830 -1275620 -1273508 -1242846 -1168305 -1064685 -937551
37735i37551J72124K31698K73265K84267K70528K18416J04740m9497j75064k22102
$$ -937551 -765427 -533729 -260464 23803 294331 512747 617487 567990 392926 170824
37725A70824k08964j91694k02710k27308k24522j65677o5291K7556Q2920J25293
$$ 170824 -38140 -229834 -432544 -659852 -884374 -1050051 -1115342 -1087786 -1004866 -879573
37715h79573J90270K56019K56738J68060M0942o1795j28576j83790k43981l12230
$$ -879573 -689303 -433284 -176546 -8486 32456 -29339 -157915 -341705 -585686 -897916
37705h97916l88409m58633m93669m79658m32670l64571k57287r4684J00514K88377
$$ -897916 -1286325 -1744958 -2238627 -2718285 -3150955 -3515526 -3772813 -3867497 -3766983 -3478606
37695c478606M52222N87628O64891O37175M88390K56860J9298j37192j54681n3362
$$ -3478606 -3026384 -2438756 -1773865 -1136690 -648300 -391440 -372142 -509334 -664015 -717377
37685g17377O9425J25775J21624J26045J64692J85193J34354L0446n9823q9786
$$ -717377 -647952 -522177 -400553 -274508 -109816 75377 209731 240177 180354 90568
37675I0568o1855j1616J7165k271n8813j12844j36887j41985j59271k03040k53906
$$ 90568 28713 17097 34262 31991 -26822 -139666 -276553 -418538 -577809 -780849 -1034755
37664a034755k68912k11067q7308L9059R2248N0242m2402j28520j87788k30321
$$ -1034755 -1303667 -1514734 -1602042 -1562983 -1470735 -1420493 -1462895 -1591415 -1779203 -2009524
37654b009524k64735k86019k79474k24970j11721L9521J82093K82645L43512L78316
$$ -2009524 -2274259 -2560278 -2839752 -3064722 -3176443 -3136922 -2954829 -2672184 -2328672 -1950356
37644a950356L82087L39080K47163J22489n789r4477j02193l1938N2018P4557
$$ -1950356 -1568269 -1229189 -982026 -859537 -865326 -959803 -1061996 -1093934 -1041916 -967359
37634i67359J7201p5075j41438j41932o6179N5397J46147J26804r463j75116k56210
$$ -967359 -950158 -1025233 -1166671 -1308603 -1374782 -1319385 -1173238 -1046434 -1055897 -1231013 -1487223
37623a487223k01587m7454J27860K61550L32406L52806L44617L19599K77980K21177
$$ -1487223 -1688810 -1736264 -1608404 -1346854 -1014448 -661642 -317025 2574 280554 501731
37613E01731J60210J08311O6230J7154o1433j77423l12795m30902m93741m74705
$$ 501731 661941 770252 836482 853636 792203 614780 301985 -128917 -622658 -1097363
37603a097363l66372j89252P394J66717K55403K74789K45356J86392J05586r84
$$ -1097363 -1463735 -1652987 -1645593 -1478876 -1223473 -948684 -703328 -516936 -411350 -412334
37593d12334j31555k49094k84390k01108n6852L7298L1047k1203m2210j9246J4849
$$ -412334 -543889 -792983 -1077373 -1278481 -1335333 -1298035 -1266988 -1288191 -1330401 -1349647 -1334798
37582a334798M7204Q4941J11043R1317K4641n1276j03922j23390j00909l1161
$$ -1334798 -1287594 -1202653 -1091610 -1000293 -975652 -1026928 -1130850 -1254240 -1355149 -1386310
37572a386310N7543J13041J14332R1399Q1105Q8688R9464R8107O4532j7398j24714
$$ -1386310 -1328767 -1215726 -1101394 -1009995 -928890 -840202 -740738 -642631 -578099 -595497 -720211
37561g20211j90530j57800k9510J41916K95890L85519L88095L22418K44473K01661
$$ -720211 -910741 -1068541 -1098051 -956135 -660245 -274726 113369 435787 680260 881921
37551H81921J91647J76006J25771M2341n5669j48993k22350k63537k62832k17283
$$ 881921 1073568 1249574 1375345 1417686 1362017 1213024 990674 727137 464305 247022
37541B47022j40749o2494k360M7329R8676J34963J26101P4213J3669l6113q3936
$$ 247022 106273 43779 41419 88748 187424 322387 448488 522701 536370 500257 416321
37530D16321j25345j25411o1543M6305J64826K75142L53942L66252L09022K30220
$$ 416321 290976 165565 104022 150327 315153 590295 944237 1310489 1619511 1849731
37520A849731J68245R9842j1026j35760k00336j70837p7329L6752J41647K01310
$$ 1849731 2017976 2117818 2106792 1971032 1770696 1599859 1522530 1559282 1700929 1902239
37510A902239J78342P4619o5361j99375l05459l55702l18634k07170q7633j5298
$$ 1902239 2080581 2155200 2089839 1890464 1585005 1229303 910669 703499 615866 600568
37500F00568J3679K5133J2315m5269j24261j61437j25172n8054l1737o8497j21502
$$ 600568 614247 639380 651695 606426 482165 320728 195556 137502 105765 37268 -84234
37489h4234j31164q6723k3820K5986O0358Q1403P7392N0378M0478Q9265J82125
$$ -84234 -215398 -302121 -325941 -299955 -239597 -158194 -80802 -30424 10054 99319 281444
37478B81444K53576K51465J75804N7836p0270j78721k41460k52578k29301j89095
$$ 281444 535020 786485 962289 1020125 949855 771134 529674 277096 47795 -141300
37468a41300j36262p7536l3870k3799m6708r4136j65010k51411l14242k94983
$$ -141300 -277562 -355098 -388968 -412767 -459475 -553611 -718621 -970032 -1284274 -1579257
37458a579257j65739L3668K14915L02854K84716K07482J35418J08323J24642J50082
$$ -1579257 -1744996 -1711328 -1496413 -1193559 -908843 -701361 -565943 -457620 -332978 -182896
37448a82896J48492J19738J02266J20444J37921R3573j7035j33754k13352k73915
$$ -182896 -34404 85334 187600 308044 445965 539538 522503 388749 175397 -98518
37438i8518l35698l65879l26916k46202j83873j49609j04477l6187K0190L6732
$$ -98518 -434216 -800095 -1127011 -1373213 -1557086 -1706695 -1811172 -1847359 -1827169 -1790437
37428a790437K2034m211k1574M715R6270K13484K85591K99869L09374L37053L31861
$$ -1790437 -1768403 -1772614 -1794188 -1789473 -1693203 -1479719 -1194128 -894259 -584885 -247832 84029
37417H4029K53805J50319R9072J06810J12959P5736J3916k6170j3285M8006J09901
$$ 84029 337834 488153 587225 694035 806994 882730 896646 870476 857191 905197 1015098
37406A015098J05250Q051j33819k45799k96324l00421k70848j98571q2331M4933
$$ 1015098 1120348 1128399 994580 748781 452457 152036 -118812 -317383 -399714 -354781
37396c54781J25350J08182j2776j77081k84770k70610j57550l1450L3711K6285
$$ -354781 -229431 -121249 -134025 -311106 -595876 -866486 -1024036 -1055486 -1021775 -995490
37386i95490q926j6146J8744N2112L1595l5344q2033n6918K8302J31455K24249
$$ -995490 -1004416 -1020562 -1001818 -949706 -918111 -953455 -1035488 -1092406 -1064104 -932649 -708400
37375g08400K84066K80782K11347J24792P2025M2978r014q9627j50691j55950
$$ -708400 -424334 -143552 67795 192587 264612 307590 298576 208949 58258 -97692
37365i7692j22612q5719m8174J4280J05520J78081J58486J7826j79075l13751
$$ -97692 -220304 -306023 -354197 -339917 -234397 -56316 102170 119996 -59079 -372830
37355c72830l16523k15638q0656N0693J68083K47445K60330K14227J45982P9365
$$ -372830 -689353 -904991 -985647 -934954 -766871 -519426 -259096 -44869 101113 180478
37345A80478J8590k5889m2176m5059o3901r8513j15704r1970l4662L5779R4245
$$ 180478 199068 173179 131003 85944 22043 -76470 -192174 -284144 -318806 -283027 -188782
37334a88782J05909N1465l5731r2993j00062r7211j21010j54393j57457j19847
$$ -188782 -82873 -31408 -67139 -160132 -260194 -357405 -478415 -632808 -790265 -910112
37324i10112o2014o329L2985M8767M8555M9985N4764M2389K459m5019p7815j01481
$$ -910112 -972126 -978455 -945470 -896703 -848148 -798163 -743399 -701010 -698551 -743570 -821385 -922866
37312i22866j29051j43698j07600p017J27152K40869K87660K48910J45859L0391
$$ -922866 -1051917 -1195615 -1303215 -1310232 -1183080 -942211 -654551 -405641 -259782 -229391
37302b29391n6580j22288k01879k96353l50473l10324j94650q9199o6500j23327
$$ -229391 -285971 -408259 -610138 -906491 -1256964 -1567288 -1761938 -1851137 -1917637 -2040964
37292b040964j99536k41257k33641j87842j22432n9353j6782L624J2219J3651
$$ -2040964 -2240500 -2481757 -2715398 -2903240 -3025672 -3085025 -3101807 -3098183 -3085964 -3072313
37282c072313J0000K0541O9446J40984J76463J43757R2373J07455K15318L61330
$$ -3072313 -3062313 -3041772 -2972326 -2831342 -2654879 -2511122 -2418749 -2311294 -2095976 -1734646
37272a734646M75548N29158N25009M68175L67049K46803J40040O4149J5685j3406
$$ -1734646 -1259098 -729940 -204931 263244 630293 877096 1017136 1081285 1096970 1083564
37262A083564j8694J3373Q0104J43846J54194R6699P111p0843j25280j62048j74745
$$ 1083564 1064870 1078243 1158347 1302193 1456387 1553086 1560197 1489354 1364074 1202026 1027281
37251A027281j56854j30546j29819j55058j70691j49407r4831j9493P3481J79002
$$ 1027281 870427 739881 610062 455004 284313 134906 40075 20582 94063 273065
37241B73065K81204L64478M18792M31245L89021K94260J61946N820j54112k75703
$$ 273065 554269 918747 1337539 1768784 2157805 2452065 2614011 2619831 2465719 2190016
37231B190016l18960k94681k59510k47350k30487j67336o5219L1584J01590J61106
$$ 2190016 1871056 1576375 1316865 1069515 839028 671692 606473 638057 739647 900753
37221I00753K19346K48238K13455J21375J5636p1273j43442k09644k46578k23599
$$ 900753 1120099 1368337 1581792 1703167 1718803 1647530 1504088 1294444 1047866 824267
37211H24267j60702j23871j43172j63716j07630L3078J95043L15567L64835L18980
$$ 824267 663565 539694 396522 232806 125176 158254 353297 668864 1033699 1352679
37201A352679J61819o2951k43267k82768j86705m7875M1828N4029J6018l4020
$$ 1352679 1514498 1451547 1208280 925512 738807 690932 732760 786789 802807 768787
37191G68787q0096j25917j68134j86598j73465j56456j61782j56149o7004J18207
$$ 768787 688691 562774 394640 208042 34577 -121879 -283661 -439810 -506814 -388607
37181c88607L03432L69420K99509J93928J60789K14181K80734K82785K00127O3717
$$ -388607 -85175 284245 583754 777682 938471 1152652 1433386 1716171 1916298 1980015
37171A980015q3748k05667k61235k05597k2425K40169M72781N53834M18668J10243
$$ 1980015 1896267 1690600 1429365 1223768 1201343 1441512 1914293 2468127 2886795 2997038
37161B997038k32694m65435n37863m99890m09536k71255q2758J03352K17008K50682
$$ 2997038 2764344 2298909 1761046 1261156 851620 580365 497607 600959 817967 1068649
37151A068649K50003K32692J71345O0815n1922j24913j66289k00429k23800k17731
$$ 1068649 1318652 1551344 1722689 1783504 1731582 1606669 1440380 1239951 1016151 798420
37141G98420j78596j16537m8628o176j7712o6299r4233p1953l4407k6727m3641
$$ 798420 619824 503287 454659 448483 430771 364472 270239 198286 163879 137152 93511
37130I3511n0504l6784j5056J1141M1038N2570K3134k9127n6448l5123J4178N6015
$$ 93511 43007 6223 -8833 2308 43346 95916 119050 89923 33475 -1648 12530 68545
37118F8545O6928L6913k8140r9966j44510j53793j50876j60837j85808k06936
$$ 68545 135473 172386 144246 44280 -100230 -254023 -404899 -565736 -751544 -958480
37108i58480j99043j44801n0034M7757R4654N5949n5286j80509k49899k25022
$$ -958480 -1157523 -1302324 -1352358 -1304601 -1209947 -1153998 -1209284 -1389793 -1639692 -1864714
37098a864714j16092L7781J95889L19961L72437L40848K63646K03168J82069J65798
$$ -1864714 -1980806 -1943025 -1747136 -1427175 -1054738 -713890 -450244 -247076 -65007 100791
37088A00791J15811L7908l5008q7595j30529j76217k21978k51354k44582j97065
$$ 100791 216602 254510 219502 131907 1378 -174839 -396817 -648171 -892753 -1089818
37078a089818j31370p6587l1909L0042J17377J99593K45341K55210K41573K03972
$$ -1089818 -1221188 -1297775 -1329684 -1299642 -1182265 -982672 -737331 -482121 -240548 -36576
37068c6576J52776J35837K00741L28443M32471M33479L22382J52108j2229j27662
$$ -36576 116200 252037 452778 781221 1213692 1647171 1969553 2121661 2109432 1981770
37058A981770j77056j62680j05932m5989k0407l3762n1333l7684N35K1850n927
$$ 1981770 1804714 1642034 1536102 1490113 1469706 1435944 1384611 1346927 1347462 1369312 1363385
37047A363385q5486k05931l49300m75526n30141m88157l80852k68793j96466j75092
$$ 1363385 1277899 1071968 722668 247142 -282999 -771156 -1152008 -1420801 -1617267 -1792359
37037a792359j91614k21938k42946k39349k00777j25904m3992j4759p2463j71185
$$ -1792359 -1983973 -2205911 -2448857 -2688206 -2888983 -3014887 -3058879 -3073638 -3146101 -3317286
37027c317286k17858j64923m4007R0415K12641L13955L81773M14813M32006M44975
$$ -3317286 -3535144 -3700067 -3744074 -3653659 -3441018 -3127063 -2745290 -2330477 -1898471 -1453496
37017a453496M41483M10926L65043L20177K79236K41012K06208J69009J27460
$$ -1453496 -1012013 -601087 -236044 84133 363369 604381 810589 979598 1107058
37008A107058J01431J03083Q6966j8860k09680l77423m19222l39456k16136j01626
$$ 1107058 1208489 1311572 1398538 1379678 1169998 792575 373353 33897 -182239 -283865
36998b83865P031J25033K44010L28428L32794K46341J32254Q5192J28744J91626
$$ -283865 -276834 -151801 92209 420637 753431 999772 1132026 1217218 1345962 1537588
36988A537588K04090J69221J10743J0652j46225l11017m18861m69839n00482m97711
$$ 1537588 1741678 1910899 2021642 2032294 1886069 1575052 1156191 686352 185870 -311841
36978c11841m08452k28533k4694J30486J98639J61944L1779j19679j90215j36499
$$ -311841 -720293 -948826 -973520 -843034 -644395 -482451 -450672 -570351 -760566 -897065
36968h97065r974J02182J49742J37359J02806Q4813R2154J01222R4003Q6451J03741
$$ -897065 -907039 -804857 -655115 -517756 -414950 -330137 -237983 -136761 -42758 43693 147434
36957A47434J44427J87936K17473K16547J71383J02751O0906N2415Q877j20236
$$ 147434 291861 479797 697270 913817 1085200 1187951 1248857 1301272 1310149 1189913
36947A189913k73502l38828k93617k21642j96375k10285k23692k21434k00379
$$ 1189913 916411 577583 283966 62324 -134051 -344336 -568028 -789462 -989841
36938i89841j47034n3521O8028J96174L04391L60762L55662L24407L06520K87958
$$ -989841 -1136875 -1190396 -1122368 -926194 -621803 -261041 94621 419028 725548 1013506
36928A013506K24220J16618J8856l5171o1364p2746m7130K5698J00808J16955
$$ 1013506 1237726 1354344 1373200 1338029 1276665 1203919 1156789 1182487 1283295 1400250
36918A400250O5967K465j0888L9289J06992J30572R0916K3342k6589l9787j2706
$$ 1400250 1466217 1468682 1457794 1497083 1604075 1734647 1825563 1848905 1822316 1782529 1769823
36907A769823N3814J28423J43216N4486j02555k47520l25437l20479k34674r9332
$$ 1769823 1823637 1952060 2095276 2149762 2047207 1799687 1474250 1153771 919097 819765
36897H19765J5841N8118M8977M6105O2430O5536M2150J4138l150j5364k8200m7513
$$ 819765 835606 893724 942701 988806 1051236 1116772 1158922 1173060 1169910 1154546 1126346 1078833
36885A078833q5248j28731j29814p2419k3075n3285j33224j70907j41832j04083
$$ 1078833 993585 864854 735040 662621 639546 586261 453037 282130 140298 36215
36875C6215q9872o4020l723N4103P1011N6774M0061L7457O4861J29312J94569
$$ 36215 -53657 -117677 -121400 -67297 3714 60488 100549 138006 202867 332179 526748
36864E26748K01744J38439M7301l6441j07105j47772j27759n5702J5127M6750
$$ 526748 728492 866931 914232 877791 770686 622914 495155 439453 454580 501330
36854E01330L6029k5736j50727k99610l90638l87810l32739k75257k24596j81482
$$ 501330 537359 511623 360896 61286 -329352 -717162 -1049901 -1325158 -1549754 -1731236
36844a731236j56407j29662m8340J03357K70306L85922M27847M02225L23467K32918
$$ -1731236 -1887643 -2017305 -2065645 -1962288 -1691982 -1306060 -878213 -475988 -152521 80397
36834H0397J89508K08749K41553K34951J84761J14840L9450l4576r3019j15518
$$ 80397 269905 478654 720207 955158 1139919 1254759 1294209 1259633 1166614 1051096
36824A051096q1345J3100J21893J66394J28192R3073J41816K26518K31087J32712
$$ 1051096 969751 982851 1104744 1271138 1399330 1492403 1634219 1860737 2091824 2224536
36814B224536J4683o9575j43730k11955k19442j44268m6868Q199J3521k0757r4954
$$ 2224536 2239219 2169644 2025914 1813959 1594517 1450249 1403381 1411580 1425101 1404344 1309390
36803A309390j80670k21485j99406j40014m0204J30765L38051M74059M82108M20016
$$ 1309390 1128720 907235 707829 567815 527611 658376 996427 1470486 1952594 2372610
36793B372610L72471L67996M03478M69730N19448M88424L92288L40301M17196
$$ 2372610 2745081 3113077 3516555 3986285 4505733 4994157 5386445 5726746 6143942
36784F143942O00307Q00732R15250Q37420N22649Q0266k83655m53724m71732m15221
$$ 6143942 6744249 7544981 8460231 9297651 9820300 9900566 9616911 9163187 8691455 8276234
36774H276234l13659k03897j48631j48512j32468p8350m7056o1933o5208l7796
$$ 8276234 7962575 7758678 7610047 7461535 7329067 7250717 7203661 7141728 7076520 7038724
36764G038724m2229q7964p6497M0982J61046J70099R5927L5210J7905K6521O9160
$$ 7038724 6996495 6908531 6832034 6873016 7034062 7204161 7300088 7335298 7353203 7379724 7448884
36753G448884J48647K22700K62336K89730L11592K89228K16469J45857J03165
$$ 7448884 7597531 7820231 8082567 8372297 8683889 8973117 9189586 9335443 9438608
36744I438608O7097N8575J38522K87305M08341M80193N67671O52343O15206M41956
$$ 9438608 9505705 9564280 9702802 9990107 10398448 10878641 11446312 12098655 12713861 13155817
36734A3155817K84522K56951L27309M61863O94938R91711J229339J384623J554721
$$ 13155817 13440339 13697290 14024599 14486462 15181400 16173111 17402450 18787073 20341794
36725B0341794J744085J855253J943260K214332K695114L190267L657644M301858
$$ 20341794 22085879 23941132 25884392 28098724 30793838 33984105 37641749 41943607
36717D1943607N181691O088657O973628Q112871R662792J1445005J3354491J5516076
$$ 41943607 47125298 53213955 60187583 68300454 77963246 89408251 102762742 118278818
36709A18278818J7848185K0086728K2567355K6309369L1880953L8839519M6484926
$$ 118278818 136127003 156213731 178781086 205090455 236971408 275810927 322295853
36702C22295853N3602835N6289038M7943676K4785363p968047l7778471n4269498
$$ 322295853 375898688 432187726 480131402 504916765 496948718 459170247 404900749
36695D04900749n6438539n0430936m2362508l4818401k8445142k3758563k0765234
$$ 404900749 348462210 298031274 255668766 220850365 192405223 168646660 147881426
36688A47881426j8574953j6378814j4174364j2199026j0363476q590232p110535
$$ 147881426 129306473 112927659 98753295 86554269 76190793 67600561 60490026
36681F0490026o066208n247123m474207l851082l435807l046799k595580k264595
$$ 60490026 54423818 49176695 44702488 40851406 37415599 34368800 31773220 29508625
36673B9508625k160643k103757j937737j756664j650008j500729j220058r41181
$$ 29508625 27347982 25244225 23306488 21549824 19899816 18399087 17179029 16237848
36665A6237848q03395p51583p00748o96622p64902p90973o98579n84549n44913
$$ 16237848 15434453 14682870 13982122 13285500 12520598 11729625 11031046 10446497 9901584
36656I901584n20643m33328l24978k54214j98274j57726k10652l59716m65099
$$ 9901584 9380941 8947613 8622635 8368421 8170147 8012421 7801769 7442053 6976954
36647F976954m29974l23483k34006j40602k1945M9087K5581k0603k0611m082J1275
$$ 6976954 6546980 6223497 5989491 5848889 5826944 5876031 5901612 5881009 5860398 5856316 5867591
36636E867591R2014K49729L55988L11443J95487J39133J44311J32915Q3930J7666
$$ 5867591 5959605 6209334 6565322 6876765 7072252 7211385 7355696 7488611 7572541 7590207
36626G590207p3938j79911k26775j76856j02836p8964o6661O331J16686J76982
$$ 7590207 7516269 7336358 7109583 6932727 6829891 6750927 6684266 6690597 6807283 6984265
36616F984265J39621J717k25262m75790o25712o09767m99450m05520l58815l39466
$$ 6984265 7123886 7125603 6900341 6424551 5798839 5189072 4689622 4284102 3925287 3585821
36606C585821l49331l82854l88142l31368k51381j91081j29879m1977L8622P3584
$$ 3585821 3236490 2853636 2465494 2134126 1882745 1691664 1561785 1519808 1558430 1632014
36596A632014Q2549Q7751N4018m9453j76082k50521k45789j67112k0145J50823
$$ 1632014 1714563 1802314 1856332 1806879 1630797 1380276 1134487 967375 947230 1098053
36586A098053K56595K56777K05234J51496O6969o7766j77672j80873j07982n3227
$$ 1098053 1354648 1611425 1816659 1968155 2035124 1967358 1789686 1608813 1500831 1447604
36576A447604n2187q3466j43742k36695l21141l49496l34897l16046k83803k02875
$$ 1447604 1395417 1311951 1168209 931514 610373 260877 -74020 -390066 -673869 -876744
36566h76744p5055P4815K36554L79755M28096L40890J85420O0647j4836p2668
$$ -876744 -951799 -876984 -640430 -260675 167421 508311 693731 754378 739542 666874
36556F66874r9268n7399K5669P8137P6727M4834k1741j43909k83405l59506l45999
$$ 666874 567606 510207 535876 614013 690740 735574 713833 569924 286519 -72987 -418986
36545d18986k85768k11556j20657k9182J9099J2300j5335l6341m6275k5727N3696
$$ -418986 -704754 -916310 -1036967 -1066149 -1047050 -1034750 -1050085 -1086426 -1132701 -1158428 -1104732
36534a104732J70123K49085K42688J78271J17723J00041J29083J82180K17979
$$ -1104732 -934609 -685524 -442836 -264565 -146842 -46801 82282 264462 482441
36525D82441K00046J22398L879j26696k20633k14939r4519O2669J47624J25899
$$ 482441 682487 804885 808764 682068 461435 246496 151977 214646 362270 488169
36515D88169M9602j8551m6559j5449P1986J53917J42468K4938j06620j54457j13147
$$ 488169 537771 519220 472661 457212 529198 683115 825583 850521 743901 589444 476297
36504D76297m5759L167L3278M7860L4099q950n2548o5339m4713p764L7052Q8948
$$ 476297 430538 433705 466983 514843 548942 539992 487444 422105 377392 369628 406680 495628
36492D95628J31047J36622J08127Q1168P0530M3002k3093q0760o9419j2074O923
$$ 495628 626675 763297 871424 952592 1023122 1066124 1043031 962271 892852 880778 887701
36481H87701l2835m9949K4738J49896K26870K11970J37314M9627l1145j07624
$$ 887701 854866 804917 829655 979551 1206421 1418391 1555705 1605332 1574187 1466563
36471A466563j90789k82830l59313l82766l43074k64889j72408p7631n810J2443
$$ 1466563 1275774 992944 633631 250865 -92209 -357098 -529506 -607137 -612947 -600504
36461f00504r526j6234J7641N7008O7338N8866M5087J0367m1325n1978K5933J59155
$$ -600504 -610030 -626264 -608623 -551615 -484277 -425411 -380324 -369957 -411282 -463260 -437327 -278172
36449b78172K67812L02629K57498J45273M432j04415j55622j87260k36682k81198
$$ -278172 -10360 292269 549767 695040 699472 595057 439435 252175 15493 -265705
36439b65705k82138k47025j98760j25261k3002M4900J2023q3308j25798n9670
$$ -265705 -547843 -794868 -993628 -1118889 -1141891 -1096991 -1084968 -1168276 -1294074 -1353744
36429a353744O1942J62667K17151K32969K16808J79716J36886Q5462J0581p8344
$$ -1353744 -1291802 -1129135 -911984 -679015 -462207 -282491 -145605 -60143 -49562 -127906
36419a27906j43027j52631j04716j5260Q8179J70445K10750K14559J87454J19026
$$ -127906 -270933 -423564 -528280 -543540 -455361 -284916 -74166 140393 327847 446873
36409D46873J7875o7370j02436j17154j52239j78870j32975k1689P0213R0542
$$ 446873 464748 397378 294942 177788 25549 -153321 -286296 -307985 -237772 -147230
36399a47230P8884R5209J37191J57503J30806P4868K4545O894K9605P6068J14527
$$ -147230 -68346 26863 164054 321557 452363 527231 551776 558670 588275 664343 778870
36388G78870J18870Q1712J4470n8162j12530j42931j54199j35752o9316K3871
$$ 778870 897740 979452 993922 935760 823230 680299 526100 390348 321032 344903
36378C44903P4876L5357o6456j65547k35283k91883l42081l63573l32922k48232
$$ 344903 419779 455136 388680 223133 -12150 -304033 -646114 -1009687 -1342609 -1590841
36368a590841j30652j8292N8775J12997J84291K75158L36648L41306L23016L05723
$$ -1590841 -1721493 -1739785 -1681010 -1568013 -1383722 -1108564 -771916 -430610 -107594 198129
36358A98129K43009Q9433j03854k33715k64648k37937j78963o9217Q9730K51079
$$ 198129 441138 530571 426717 193002 -71646 -309583 -488546 -557763 -468033 -216954
36348b16954L70410M25889L92465K58240P6618n6428r7211q5112p1909o8295o8959
$$ -216954 153456 579345 971810 1230050 1306668 1250240 1153029 1067917 996008 927713 858754
36337H58754p6518p8485m3636L4269J19085J73037J87064J65187J13442N2194
$$ 858754 782236 703751 660115 694384 813469 986506 1173570 1338757 1452199 1504393
36327A504393N839k6713n9758q0109n9636j1894R006k2976p9251j28272j68497
$$ 1504393 1510232 1483519 1423761 1343652 1284016 1272122 1281128 1258152 1178901 1050629 882132
36316H82132j93074j67924p7890L0151P7235J7727j26249k75691l45319l16212
$$ 882132 689058 521134 443244 473395 550630 568357 442108 166417 -178902 -495114
36306d95114k59571k57890l06550l30028k87169k08283j26110l1671P8466J64142
$$ -495114 -754685 -1012575 -1319125 -1649153 -1936322 -2144605 -2270715 -2302386 -2223920 -2059778
36296b059778J87283J63395J37262J28908J22453Q8034N233j09560j94618j95319
$$ -2059778 -1872495 -1709100 -1571838 -1442930 -1320477 -1232443 -1227210 -1336770 -1531388 -1726707
36286a726707j31014p0443l2841L8533J83516L50070M42027M10425K74877R0054
$$ -1726707 -1857721 -1928164 -1961005 -1922472 -1738956 -1388886 -946859 -536434 -261557 -171503
36276a71503p8426j72803j73184j02103Q890J35913K44119K92799K77820K35402
$$ -171503 -249929 -422732 -595916 -698019 -689129 -553216 -309097 -16298 261522 496924
36266D96924J86307J13741J7969n0704n1720j7555j7099p1308j36323j57471j15128
$$ 496924 683231 796972 814941 764237 712517 694962 677863 606555 470232 312761 197633
36255A97633l0746M8374P9799N9410J7974j8600m4710m9512j3712M9785Q7776
$$ 197633 166887 215261 295060 354470 372444 353844 309134 259622 245910 295695 383471
36244C83471O8164K4147R784L4333O7546Q6690Q5351N1468k8148j42899k58077
$$ 383471 451635 475782 485566 519899 587445 674135 759486 810954 782806 639907 381830
36233C81830l36782l54556l09557k31417j60244r8988n452J48144L23541M43224
$$ 381830 45048 -309508 -619065 -850482 -1010726 -1109714 -1115166 -967022 -643481 -200257
36223b00257M55424L59944J93339J2692j23466j87907j97418j81404j49468j02034
$$ -200257 255167 615111 808450 821142 697676 509769 312351 130947 -18521 -120555
36213a20555n6258m1379p4349j48635k35838k94724k98854k62317k15213j48383
$$ -120555 -176813 -218192 -292541 -441176 -677014 -971738 -1270592 -1532909 -1748122 -1896505
36203a896505j6656J86335L91945N22716N66022N51963M87872L60136J89041L7155
$$ -1896505 -1913161 -1726826 -1334881 -812165 -246143 305820 793692 1153828 1342869 1380024
36193A380024m3480m8149n228M9524Q3851P9315M1799n663m0685m7645j7678M0841
$$ 1380024 1336544 1288395 1283167 1332691 1416542 1495857 1537656 1531993 1491308 1443663 1425985 1466826
36181A466826R5479J09661P5293K3127P74L5793J08729J62056J49794Q3451J9637
$$ 1466826 1562305 1671966 1747259 1770386 1771160 1806953 1915682 2077738 2227532 2310983 2330620
36170B330620L106L4516Q8032J36323J55706J31213O6357k4667j29497k21081
$$ 2330620 2333726 2368242 2456274 2592597 2748303 2879516 2945873 2921206 2791709 2570628
36160B570628k43009j57740j6189O6397K3607j07222k53244l78363m59665m47262
$$ 2570628 2327619 2169879 2153690 2220087 2243694 2136472 1883228 1504865 1045200 597938
36150E97938l08869r5078R2659J98525K44948K78110L17915L61024L98369M16630
$$ 597938 289069 193991 286650 485175 730123 1008233 1326148 1687172 2085541 2502171
36140B502171L99124L35677K29251R5301m3224j67219k66969l26257l13488k22202
$$ 2502171 2901295 3236972 3466223 3561524 3518300 3351081 3084112 2757855 2444367 2222165
36130B222165j19744j08682k15802l53881m21239m08905l79120l69929l66194
$$ 2222165 2102421 1993739 1777937 1424056 1002817 593912 214792 -155137 -521331
36121e21331l48489l21290k86553k22967j08235M5132J79080K19236J33913k8341
$$ -521331 -869820 -1191110 -1477663 -1700630 -1808865 -1763733 -1584653 -1365417 -1231504 -1259845
36111a259845j78763k72849l32069l78512l89530l40031k50219j54559n1811P4547
$$ -1259845 -1438608 -1711457 -2043526 -2422038 -2811568 -3151599 -3401818 -3556377 -3608188 -3533641
36101c533641K07453L07625L58547L64468L21633K33950J44944J06725J16153
$$ -3533641 -3326188 -3018563 -2660016 -2295548 -1973915 -1739965 -1595021 -1488296 -1372143
36092a372143J22075J01382R2637J43520K51226L63899M19690L77789K34332K6399
$$ -1372143 -1250068 -1148686 -1056049 -912529 -661303 -297404 122286 500075 734407 760806
36082G60806j81501l22086l48487k56352r5491N7307J55310K05148K28809K25787
$$ 760806 579305 257219 -91268 -347620 -443111 -385804 -230494 -25346 203463 429250
36072D29250J88693J31497P5630K3929k7170o4928p5088o5687n0765k3395K8677
$$ 429250 617943 749440 825070 848999 821829 756901 681813 616126 565361 541966 570643
36061E70643R1449J34777J45718J30041R2137L7183j8172o1979j05006j61493
$$ 570643 662092 796869 942587 1072628 1164765 1201948 1183776 1121797 1016791 855298
36051H55298k22372k65707k77547k43893j47251k767J21638J58007J03229O755
$$ 855298 632926 367219 89672 -154221 -301472 -304239 -182601 -24594 78635 85390
36041H5390q7906j59666j92235j84288j65156j57485j32131m4037Q8831J84695
$$ 85390 -2516 -162182 -354417 -538705 -703861 -861346 -993477 -1037514 -948683 -763988
36031g63988J83584J05577K3546Q41M3719Q4784L0968j28845k76457k75877j30359
$$ -763988 -580404 -474827 -451281 -450440 -406721 -321937 -290969 -419814 -696271 -972148 -1102507
36020a102507K1553O7996K8700r109j110L2604M9499J6717o6133j50523j73332
$$ -1102507 -1080954 -1012958 -984258 -993367 -994477 -961873 -912374 -895657 -961790 -1112313 -1285645
36009a285645j28307p3287m5680o257R8743K44515L36913L09895J88214N7212
$$ -1285645 -1413952 -1487239 -1532919 -1539176 -1440433 -1195918 -859005 -549110 -360896 -303684
35999c03684r486M928O7495J37554J99797K54836K89447K77194K08036R6941l6561
$$ -303684 -313170 -308242 -240747 -103193 96604 351440 640887 918081 1126117 1223058 1186497
35988A186497j71350k63924k59701j48532Q593J27656J65915J31712N6680j8502
$$ 1186497 1015147 751223 491522 342990 351583 479239 645154 776866 833546 815044
35978H15044n1443k7685J5428J9995k9367q8942j07389p7978k9949J6922O7430
$$ 815044 763601 735916 751344 771339 741972 653030 545641 467663 437714 454636 522066
35967E22066J21811J54578J38134P7207L617n7620j00609j24783j35084j55928
$$ 522066 643877 798455 936589 1013796 1017413 959793 859184 734401 599317 443389
35957D43389k11996k80460k91323k01003m8860Q3165J54347J86570K14832K43181
$$ 443389 231393 -49067 -340390 -541393 -590253 -507088 -352741 -166171 48661 291842
35947B91842K46651J97904R5533k0037q9215r0592o7270p6910j23986j62378j57580
$$ 291842 538493 736397 831930 811893 722678 632086 564816 487906 363920 201542 43962
35936D3962j21973q8859p3421o6565n6428m8466o0376r1854j08502p6859j0876
$$ 43962 -78011 -166870 -240291 -306856 -363284 -411750 -472126 -563980 -672482 -749341 -760217
35925g60217M7480R2801J55166K21435K14865R5170o2881j40828r7931K3673J78463
$$ -760217 -712737 -619936 -464770 -243335 -28470 66700 3819 -137009 -234940 -211267 -32804
35914c2804L36087M40288M26370K93605J11423n4188j79736k53574k61746k17934
$$ -32804 303283 743571 1169941 1463546 1574969 1520781 1341045 1087471 825725 607791
35904F07791j62838j16316o2669P654P5464J20768J41899J40136J13165O4273
$$ 607791 444953 328637 265968 273622 349086 469854 611753 751889 865054 929327
35894I29327j1474j41479l33021n20100o04524n59334m46301l23690j89850l5585
$$ 929327 917853 776374 443353 -76747 -681271 -1240605 -1686906 -2010596 -2200446 -2236031
35884b236031J02281J74905J74258J24347N0724j7108m5815l0859o429J69J347
$$ -2236031 -2133750 -1958845 -1784587 -1660240 -1609516 -1626624 -1672439 -1703298 -1709727 -1709558 -1708211
35873a708211J6697L3200K1955k4332q8313j40774j41326n7270Q8584K09541K28859
$$ -1708211 -1691514 -1658314 -1636359 -1660691 -1749004 -1889778 -2031104 -2088374 -1999790 -1790249 -1561390
35862a561390J59214Q8554Q8153J44520J76786J16151k2222j41981j51078m7905
$$ -1561390 -1402176 -1313622 -1225469 -1080949 -904163 -788012 -810234 -952215 -1103293 -1151198
35852a151198Q5711J69618J85577J64130J46203J61837K14138K68544K76308K18451
$$ -1151198 -1065487 -895869 -710292 -546162 -399959 -238122 -23984 244560 520868 739319
35842G39319J16096L361q9742j38355j39890j27621j35483j53764j54266j49449
$$ 739319 855415 858776 769034 630679 490789 363168 227685 73921 -80345 -229794
35832b29794j76427k21960k20676j43342l4762N6047J30196J94887K18517J76857
$$ -229794 -406221 -628181 -848857 -992199 -1026961 -970914 -840718 -645831 -427314 -250457
35822b50457J10598Q9673J35477K10481K68525K87450K67071K19662J52216M7515
$$ -250457 -139859 -50186 85291 295772 564297 851747 1118818 1338480 1490696 1538211
35812A538211j13478k97778m22097m33353l61147k67259j72887o5624M9307J42608
$$ 1538211 1424733 1126955 704858 271505 -89642 -356901 -529788 -595412 -546105 -403497
35802d03497J91406J88468J39491Q0440P5931J59318K80727L51255L40959L03921
$$ -403497 -212091 -23623 115868 196308 272239 431557 712284 1063539 1404498 1708419
35792A708419L00148L16805K81447J45375n6169k29513l07799l06835k95061l21107
$$ 1708419 2008567 2325372 2606819 2752194 2696025 2466512 2158713 1851878 1556817 1235710
35782A235710l82186m45892m75929m45096l54094k37077j24358r211J16783K11273
$$ 1235710 853524 407632 -68297 -513393 -867487 -1104564 -1228922 -1238133 -1121350 -910077
35772i10077K15322J38178N2436l667o1844j45760k19633k47274k47374k46929
$$ -910077 -694755 -556577 -504141 -507808 -569652 -715412 -935045 -1182319 -1429693 -1676622
35762a676622k24633j50585n0489K0021M6451N8749P7623R4328R5881Q4135P8369
$$ -1676622 -1901255 -2051840 -2102329 -2082308 -2035857 -1977108 -1899485 -1805157 -1709276 -1625141 -1546772
35751a546772J12300K05371L19473L74114L30968K37376J60606J08732M8611k5804
$$ -1546772 -1434472 -1229101 -909628 -535514 -204546 32830 193436 302168 350779 324975
35741C24975q3666j01249q2543m5098q381J6040L9689Q5047J45288J81392J71555
$$ 324975 241309 140060 57517 12419 4038 20078 59767 144814 290102 471494 643049
35730F43049J29276N8538n9487k03246k85301k43449j26645l8459j6198j2894
$$ 643049 772325 830863 771376 568130 282829 39380 -87265 -125724 -141922 -154816
35720a54816K1274Q9462J66495K19481K17127J58894R0163N7509N9302O5508O0871
$$ -154816 -133542 -44080 122415 341896 559023 717917 808080 865589 924891 990399 1051270
35709A051270L3730m4219j70093k61618k24037p0477P6567J12875L9966p6383
$$ 1051270 1085000 1040781 870688 609070 385033 314556 391123 503998 543964 467581
35699D67581j81078k42206k32943j42116L109J42100K10381J73474N2349q0182
$$ 467581 286503 44297 -188646 -330762 -327653 -185553 24828 198302 250651 170469
35689A70469j45203j13750k4155M8257M2513m3670j48134j97126j72573j13084
$$ 170469 25266 -88484 -112639 -64382 -21869 -65539 -213673 -410799 -583372 -696456
35679f96456n0855J9779J04841J83903K40875K81346K93448K35077R9427m4184
$$ -696456 -747311 -727532 -622691 -438788 -197913 83433 376881 611958 711385 667201
35669F67201j22463j43804j63941j90335j76674j03313j1402M5605M6393k660
$$ 667201 544738 400934 236993 46658 -130016 -233329 -244731 -199126 -152733 -155393
35659a55393q2213j65885k32355k68480k49529j41146N1111K55310L89567M32567
$$ -155393 -237606 -403491 -635846 -904326 -1153855 -1295001 -1243890 -988580 -599013 -166446
35649a66446M16654L79138L52904L71948M33562M70044M08343K54263P9150o6738
$$ -166446 250208 629346 982250 1354198 1787760 2257804 2666147 2920410 2999560 2932822
35639B932822j84658k79334l30647l24520k79112k27479j89319j59832j16338
$$ 2932822 2748164 2468830 2138183 1813663 1534551 1307072 1117753 957921 841583
35630H41583m7620J3123Q435p1613j64132k02674j83963j41829r1353l4323J4291
$$ 841583 793963 807086 815521 743908 579776 377102 193139 51310 -40043 -74366 -60075
35619f0075M8827R4518J63373K13908J98136J25247L9006l7988r3925r9437m9179
$$ -60075 -11248 83270 246643 460551 658687 783934 822940 784952 691027 591590 542411
35608E42411l307k2720q1014j02961p4358m8565n4432o5185n8299m2969j9680
$$ 542411 539104 516384 435370 332409 258051 209486 155054 89869 31570 -11399 -31079
35597c1079L4730J29423K43004L45117M05201L96530L30541K66167K39911K11416
$$ -31079 3651 133074 376078 721195 1126396 1522926 1853467 2119634 2359545 2570961
35587B570961J31256L3820n967R983L556o7757j70743k65776l44582l94380l94638
$$ 2570961 2702217 2736037 2730070 2740053 2743609 2675852 2505109 2239333 1894751 1500371 1105733
35576A105733l63228l46336l50884l39638k95562k31509j35131K4098K16215L46255
$$ 1105733 742505 396169 45285 -294353 -589915 -821424 -956555 -932457 -716242 -369987
35566c69987L57933K92588K22832J74856J39230J14311J09512J31166J78609K29935
$$ -369987 -12054 280534 503366 678222 817452 931763 1041275 1172441 1351050 1580985
35556A580985K30949J34222m0878k10744k91587k47757j01316P1629J76032J72532
$$ 1580985 1811934 1946156 1905278 1694534 1402947 1155190 1053874 1125503 1301535 1474067
35546A474067J06020L4695l4575j05916j44584j30738j14497j38807j48890o8763
$$ 1474067 1580087 1614782 1580207 1474291 1329707 1198969 1084472 945665 796775 728012
35536G28012O6753J58226J94429K45483L13287L11839K13857J04958O0323O3800
$$ 728012 794765 952991 1147420 1392903 1706190 2018029 2231886 2336844 2397167 2460967
35526B460967Q0752J16416J60306J56907Q1308j8112q8233j24987j34982j07921
$$ 2460967 2541719 2658135 2818441 2975348 3056656 3038544 2950311 2825324 2690342 2582421
35516B582421n5007j6338n547J709J3409J2597O429J8498L1856J3478o103L5304
$$ 2582421 2527414 2511076 2505529 2507238 2520647 2533244 2539673 2558171 2590027 2603505 2597402 2632706
35504B632706J14036J30124N3442l2741o1015o3002r0075j33016j55990j39542
$$ 2632706 2746742 2876866 2930308 2897567 2836552 2773550 2683475 2550459 2394469 2254927
35494B254927o5179O9687K03458K56364K40851K42251K78514K78967K22648J86387
$$ 2254927 2189748 2259435 2462893 2719257 2960108 3202359 3480873 3759840 3982488 4168875
35484D168875K13149K34074J73269M4495j00115k30669l05302k64934j18226L7692
$$ 4168875 4382024 4616098 4789367 4833862 4733747 4503078 4197776 3932842 3814616 3852308
35474C852308J24147J45762J27469O8523j3920p8847j26780j91537k50554k34656
$$ 3852308 3976455 4122217 4249686 4318209 4304289 4225442 4098662 3907125 3656571 3421915
35464C421915j44658o2573l0331j5918q421l3512o2463k7889N3397R7689J05179
$$ 3421915 3277257 3214684 3184353 3168435 3160014 3126502 3064039 3036150 3089547 3187236 3292415
35453C292415J55248K39896K58755K05206J93043K60037L10690K97782K92613
$$ 3292415 3447663 3687559 3946314 4151520 4344563 4604600 4915290 5213072 5505685
35444E505685L28467L48743L60489M57603O35814P70086Q30469R25317J078606
$$ 5505685 5834152 6182895 6543384 7000987 7636801 8406887 9237356 10162673 11241279
35435A1241279J180797J222209J341260J563448J733139J790519J871654K055690
$$ 11241279 12422076 13644285 14985545 16548993 18282132 20072651 21944305 23999995
35427B3999995K283071K600809L175448L960444M689054N319235O126099P231667
$$ 23999995 26283066 28883875 32059323 36019767 40708821 46028056 52154155 59385822
35419E9385822Q461466R819836J1636499J4057631J6921521K0339770K4758668
$$ 59385822 67847288 77667124 89303623 103361254 120282775 140622545 165381213
35412A65381213L0193997L6161539M2467512M8491890N0706379M2868717K1666492
$$ 165381213 195575210 231736749 274204261 322696151 373402530 416271247 437937739
35405D37937739p617520l3397127m6939670m8385801m3709153l7887764l2332569
$$ 437937739 430320219 396923092 349983422 301597621 257888468 220000704 187668135
35398A87668135k7035690k2403646j8751470j5744614j3063781j0854355r205718
$$ 187668135 160632445 138228799 119477329 103732715 90668934 79814579 70608861
35391G0608861p843406o590616n598171m916633m305249l637215l084917k750204
$$ 70608861 62765455 56174839 50576668 45660035 41354786 37717571 34632654 31882450
35383C1882450k474893k153073j898175j772528j653536j488489j407003j465830
$$ 31882450 29407557 27254484 25356309 23583781 21930245 20441756 19034753 17568923
35375A7568923j526917j487287j403363j306183j119402q45978o25537n20854
$$ 17568923 16042006 14554719 13151356 11845173 10725771 9879793 9254256 8733402
35367H733402m33925l00289j83446j22497p5363o7140j98891m39898n95034n54943
$$ 8733402 8299477 7999188 7815742 7693245 7617882 7550742 7351851 6911953 6316919 5761976
35357E761976m15890k90939j73510n6702j4667p1981j31264j13520n1712J2509
$$ 5761976 5346086 5055147 4881637 4824935 4810268 4738287 4607023 4493503 4441791 4454300
35347D454300R6533J85872K06992J51780J08259J15154J06818M7659q748m3301
$$ 4454300 4550833 4736705 4943697 5095477 5203736 5318890 5425708 5473367 5464619 5421318
35337E421318j18759k45988l36198l51508l73264m48571m95497m43678l53096
$$ 5421318 5302559 5056571 4720373 4368865 3995601 3547030 3051533 2607855 2254759
35328B254759l03152k65621j81615q0697l3023m6082p9694j04689r3753k0374
$$ 2254759 1951607 1685986 1504371 1423674 1390651 1344569 1264875 1160186 1066433 1046059
35318A046059Q5780J52088J72220K25011L45528M62075N03781M81085M12768K69661
$$ 1046059 1131839 1283927 1456147 1681158 2026686 2488761 2992542 3473627 3886395 4156056
35308D156056N2553j61381l14798m33422n33412n51460m41311k68046j32295n8969
$$ 4156056 4208609 4047228 3732430 3299008 2765596 2214136 1772825 1504779 1372484 1313515
35298A313515k1759j2310k0639j0257J9636L161r8601k27865l11910l54739l85035
$$ 1313515 1291756 1279446 1258807 1248550 1268186 1271347 1172746 944881 632971 278232 -106803
35287a06803l75114k86932j51158k7693P4102J69774K32492K20953J50919Q2355
$$ -106803 -481917 -768849 -920007 -947700 -873598 -703824 -471332 -250379 -99460 -17105
35277a7105N5085P8164J50410K45834L08575L06216K63712K14303J53615P4652
$$ -17105 37980 116144 266554 512388 820963 1127179 1390891 1605194 1758809 1833461
35267A833461N804k4760k5996j3373J8914O8687J17092J74178K71644L76217L81065
$$ 1833461 1839265 1814505 1788509 1775136 1794050 1862737 1979829 2154007 2425651 2801868 3182933
35256C182933K36175K6154j35405k25285k65968k37543j25882p569J7178m0573
$$ 3182933 3419108 3445262 3309857 3084572 2818604 2581061 2455179 2447610 2464788 2424215
35246B424215p6867m1068J0265K930p7226j96532l05355l54527l30159k77334
$$ 2424215 2347348 2306280 2316545 2319475 2242249 2045717 1740362 1385835 1055676 778342
35236G78342k50885k44732k06220j14541q689N7552N7319j347p4928j01300n2179
$$ 778342 527457 282725 76505 -38036 -46725 10827 68146 66799 -8129 -109429 -161608
35225a61608L4163R5754J11325J00171P8035M5497Q185k1803l9745m6419m5276
$$ -161608 -127445 -31691 79634 179805 257840 303337 311522 289719 249974 203555 158279
35214A58279n3215q8936j31584j19736j9073J29232K48953K96219K73898K15125
$$ 158279 105064 16128 -115456 -235192 -254265 -125033 123920 420139 694037 909162
35204I09162J75075J99862K68959K96024K14499L6851j82133l87894n06426m54237
$$ 909162 1084237 1284099 1553058 1849082 2063581 2100432 1918299 1530405 1023979 569742
35194E69742k35877J1324J42126J51862J43424J76100K18226K32597K28457K19030
$$ 569742 333865 345189 487315 639177 782601 958701 1176927 1409524 1637981 1857011
35184A857011J91990J43337R5820O5048L9879Q245k5311n5327q2712j00180r2700
$$ 1857011 2049001 2192338 2288158 2353206 2393085 2401330 2376019 2320692 2237980 2137800 2045100
35173B045100n8839j6418J4041K0881K375l2774p4353j25158j87663k30644k01600
$$ 2045100 1986261 1969843 1983884 2004765 2007140 1974366 1900013 1774855 1587192 1356548 1154948
35162A154948r1836M0680J33736J71154J46830K9476j79194l78584m29316k88062
$$ 1154948 1063112 1103792 1237528 1408682 1555512 1584988 1405794 1027210 597894 309832
35152C09832m6626J62394K67915K76394K27273J47919L9893r5174k23112k96051
$$ 309832 263206 425600 693515 969909 1197182 1345101 1384994 1289820 1066708 770657
35142G70657l08855l00586k85328k27111j12955k913L9750L2228L5997O8688J06520
$$ 770657 461802 161216 -124112 -351223 -464178 -467091 -427341 -395113 -359116 -290428 -183908
35131a83908J46425K01179K45218K27182J37373J6674r6708j86653k38145k48476
$$ -183908 -37483 163696 408914 636096 773469 790143 693435 506782 268637 20161
35121B0161k52908k87590l28571l16942k44229j64634j21357j07933j03836r7883
$$ 20161 -232747 -520337 -848908 -1165850 -1410079 -1574713 -1696070 -1804003 -1907839 -2005722
35111b005722o8747Q787J22576K25169K86153L06652K79054J80314K4045j18889
$$ -2005722 -2074469 -2065682 -1943106 -1717937 -1431784 -1125132 -846078 -665764 -641719 -760608
35101g60608j78098j45225o8857o343J7273K2579M7541R0597R8581M0143l0029
$$ -760608 -938706 -1083931 -1152788 -1159131 -1141858 -1119279 -1071738 -981141 -882560 -842417 -872446
35090h72446k6772N5024J34547J48615J13889Q4707R8143J66616K73265L59158
$$ -872446 -899218 -844194 -709647 -561032 -447143 -362436 -264293 -97677 175588 534746
35080E34746L61070K83009J96336J56094J51363J43800J10062L4463q8628k18249
$$ 534746 895816 1178825 1375161 1531255 1682618 1826418 1936480 1970943 1882315 1664066
35070A664066k75890k25499j17662k9425J4022L8783P4314J28235J80461J81476
$$ 1664066 1388176 1162677 1045015 1015590 1029612 1068395 1142709 1270944 1451405 1632881
35060A632881Q7414p7673k21757k72403k39690j72024q7351J3200R4672J07876
$$ 1632881 1720295 1642622 1420865 1148462 908772 736748 649397 662597 757269 865145
35050H65145N7100L277j0087j992j2137l9685m6259j2626K6382J0505q7752k37898
$$ 865145 922245 925522 915435 913443 901306 861621 815362 802736 829118 839623 751871 513973
35038E13973l76632m44499m03104k49737l9518J27874J81890J44975J00798J01854
$$ 513973 137341 -307158 -710262 -959999 -999517 -871643 -689753 -544778 -443980 -342126
35028c42126J33044J60901J81074K03966K21038K06090J41276L5740p1960j31789
$$ -342126 -209082 -48181 132893 336859 557897 763987 905263 941003 869043 737254
35018G37254j18710n3174K3040Q0206R7069N1192m6948j23730r8378K0622J32108
$$ 737254 618544 565370 588410 668616 765685 816877 769929 646199 547821 568443 700551
35007G00551J44017M6787j12828k80734m00978m19939l22812j49772L8783J93255
$$ 700551 844568 891355 778527 497793 96815 -323124 -645936 -795708 -756925 -563670
34997e63670K71728K51826J68175R9928R1001J08743J02571O9440L3366l307m6481
$$ -563670 -291942 -40116 128059 227987 318988 427731 530302 599742 633108 629801 583320
34986E83320p3645n7460j4647J2117J9839N4490J45111K54369L08470K67259J60098
$$ 583320 509675 452215 437568 449685 469524 524014 669125 923494 1231964 1499223 1659321
34975A659321N6714K061j8877m4261p1117n3103L2137J40647K01532J76459O8237
$$ 1659321 1716035 1718096 1699219 1654958 1583841 1530738 1562875 1703522 1905054 2081513 2149750
34964B149750r8016k75126l99666m34378l99867l42391k80839k07913j29479p0099
$$ 2149750 2051734 1776608 1376942 942564 542697 200306 -80533 -288446 -417925 -488024
34954d88024m0111k3169p63K8211N3094O0054L3476l5425j34059k27658k75771
$$ -488024 -528135 -551304 -552067 -523856 -470762 -410708 -377232 -412657 -546716 -774374 -1050145
34943a050145k52250j60312l5027P8605J59433K16449K57271K63801K11591J05648
$$ -1050145 -1302395 -1462707 -1497734 -1419129 -1259696 -1043247 -785976 -522175 -310584 -204936
34933b04936j5779j11231j63932j84074j89660j85208j60887j13367n6172q05
$$ -204936 -220715 -331946 -495878 -679952 -869612 -1054820 -1215707 -1329074 -1385246 -1386051
34923a386051N4654R8147Q8018P732p2320m4783J03406K53807K80042J78637N1380
$$ -1386051 -1331397 -1233250 -1145232 -1137500 -1209820 -1254603 -1151197 -897390 -617348 -438711 -387331
34912c87331j2072k581L1958M0093M686m6385o9987n6237l0939n838L8179R9659
$$ -387331 -399403 -401984 -370026 -329933 -325247 -371632 -441619 -497856 -528795 -534633 -496454 -396795
34900c96795J27939Q1084j5138j00064j42744j39010p9103K7589J17165J23395
$$ -396795 -268856 -187772 -202910 -302974 -445718 -584728 -663831 -636242 -519077 -395682
34890c95682O4096K1853L4389N4858L2500j4750l0190J2728R1801J61504J82251
$$ -395682 -331586 -309733 -275344 -220486 -187986 -202736 -232926 -220198 -128397 33107 215358
34879B15358J47714R7798Q6835J29166J90077K28257K22363J57638K4816j50844
$$ 215358 363072 460870 547705 676871 866948 1095205 1317568 1475206 1500022 1349178
34869A349178l06396l85214l68226k58453o9579J49498L09570L38021K38878Q1936
$$ 1349178 1042782 657568 289342 30889 -38690 110808 420378 758399 997277 1079213
34859A079213n6677j31582j30357p3620j2600O07m4971j09848j37624r7991q130
$$ 1079213 1022536 890954 760597 686977 674377 674984 630013 520165 382541 284550 276420
34848B76420P7287J05005O7534R044k2637k8603n3013j24717k16202k65431k31076
$$ 276420 353707 458712 526246 535290 512653 484050 431037 306320 90118 -175313 -406389
34837d06389j23049J0743J17708J69505J77969J87862K38079L17461L68793L49854
$$ -406389 -529438 -518695 -400987 -231482 -53513 134349 372428 689889 1058682 1408536
34827A408536K80679K10988J48847N1467j07441k90701m34908n11575n27687m83693
$$ 1408536 1689215 1900203 2049050 2100517 1993076 1702375 1267467 755892 228205 -255488
34817b55488l66869j91022j6824Q6116R6316N5191K4145K6228L2677J0136k9225
$$ -255488 -622357 -813379 -830203 -744087 -647771 -592580 -568435 -542207 -509530 -499394 -528619
34806e28619m2467j6328J3573J1175j7615m3968n3853n0504m3493n5831j15509
$$ -528619 -571086 -587414 -573841 -562666 -580281 -624249 -678102 -728606 -772099 -827930 -943439
34795i43439k08066k56755j89723k4908J40503K23396K15509J61355J08126P9263
$$ -943439 -1151505 -1408260 -1597983 -1622891 -1482388 -1258992 -1043483 -882128 -774002 -694739
34785f94739P2431P7750J06832J88077L12565M08389M10211L43449K92318K85381
$$ -694739 -622308 -544558 -437726 -249649 62916 471305 881516 1224965 1517283 1802664
34775A802664K64133J77468N7398k7167n5101n8777o9523q8920j00555q5088l3562
$$ 1802664 2066797 2244265 2301663 2274496 2219395 2160618 2091095 2002175 1901620 1816532 1782970
34764A782970L4203P4082N9082J0138k8974m0967m6344o9897j06623j20990p9306
$$ 1782970 1817173 1891255 1950337 1960475 1931501 1890534 1844190 1774293 1667670 1546680 1467374
34753A467374J1610J01132J41591J35277J19930J13528R7324N1807k0993j15896
$$ 1467374 1478984 1580116 1721707 1856984 1976914 2090442 2187766 2239573 2218580 2102684
34743B102684k29262l27021l40446k27868l2511J40168J97586J12255o8474k39851
$$ 2102684 1873422 1546401 1205955 978087 945576 1085744 1283330 1395585 1327111 1087260
34733A087260k92216j89049r71J52534J95396J27833n808j51471k58121k93728
$$ 1087260 795044 605995 605024 757558 952954 1080787 1074979 923508 665387 371659
34723C71659k64958k09698j62656j32226j07914p9413m6558j7835k531l093j3059
$$ 371659 106701 -102997 -265653 -397879 -505793 -585206 -631764 -649599 -652130 -655223 -668282
34712f68282j6686J1752R1930K00130K58847K00055M8619q6701j21376p1986j3448
$$ -668282 -684968 -673216 -581286 -381156 -122309 77746 126365 39664 -81712 -153698 -167146
34701a67146R860P192L958J6891N4395J09197J51935J53108J10530M5073j9887
$$ -167146 -157286 -150094 -146136 -129245 -74850 34347 186282 339390 449920 494993 475106
34690D75106o5977q7488j05646j49457k03100k05340j32950n0785l1923n3488
$$ 475106 409129 321641 215995 66538 -136562 -341902 -474852 -525637 -557560 -611048
34680f11048k8662P1563J88688K62502K80882K39252J24338l1332j39775j47224
$$ -611048 -639710 -568147 -379459 -116957 163925 403177 527515 496183 356408 209184
34670B09184r5491n8754n6963o8158q4960j07206j06744n7989O110K0984k3149
$$ 209184 113693 54939 -2024 -70182 -155142 -262348 -369092 -427081 -420971 -399987 -423136
34659d23136o1095k4216R6189K53471L79190M11707L29562J71721M398j37258
$$ -423136 -484231 -508447 -412258 -158787 220403 632110 961672 1133393 1137791 1000533
34649A000533k54489l37287l49693k77403j61060o0331j275K5366L2027K3028
$$ 1000533 746044 408757 59064 -218339 -379399 -439730 -441005 -415639 -383612 -360584
34639c60584P589L633K4181O4173R8644R4684L6595n4417j32702j65295j52545
$$ -360584 -352995 -349362 -325181 -261008 -162364 -67680 -31085 -85502 -218204 -383499 -536044
34628e36044j14688p0978l4255j2069n846j5683m5230q9982j24139j19855q2323
$$ -536044 -650732 -721710 -755965 -768034 -773880 -789563 -834793 -924775 -1048914 -1168769 -1251092
34617a251092m2926j1255L8180J15477J78455J73802J00141M399p1912j14348
$$ -1251092 -1294018 -1305273 -1267093 -1151616 -973161 -799359 -699218 -694819 -766731 -881079
34607h81079j13703n9934L4166J29565J93714K20947K13975J64262O5987n9190
$$ -881079 -994782 -1054716 -1020550 -890985 -697271 -476324 -262349 -98087 -32100 -91290
34597i1290j65334k13202j97832j48228j00437p0971n8139o0166p1329o0898Q458
$$ -91290 -256624 -469826 -667658 -815886 -916323 -987294 -1045433 -1105599 -1176928 -1237826 -1229368
34586a229368J18687J84363J42442L6151l4912l6910k2384l2572m3647k9896j9487
$$ -1229368 -1110681 -926318 -783876 -747725 -782637 -819547 -841931 -874503 -918150 -948046 -967533
34575i67533m7096r5786j31051j56743j88198k00512j62519j04738q9648j15258
$$ -967533 -1014629 -1110415 -1241466 -1398209 -1586407 -1786919 -1949438 -2054176 -2143824 -2259082
34565b259082j08804k8272Q4708J74632K44511L22679L92477L99067L16656J80395
$$ -2259082 -2367886 -2396158 -2311450 -2136818 -1892307 -1569628 -1177151 -778084 -461428 -281033
34555b81033N5798q573j1731l926m9462j63468k86729l37103k85239j74522p6498
$$ -281033 -225235 -233808 -245539 -249465 -298927 -462395 -749124 -1086227 -1371466 -1545988 -1622486
34544a622486l5585m3940n3486j8074O2428J42394J81035J81996J72198J57243
$$ -1622486 -1658071 -1702011 -1755497 -1773571 -1711143 -1568749 -1387714 -1205718 -1033520 -876277
34534h76277J21651O7774K8036L0559O8532J11555J36539J41916J42554J58686
$$ -876277 -754626 -686852 -658816 -628257 -559725 -448170 -311631 -169715 -27161 131525
34524A31525K00820K54137K80871K50207J72044R7256P6601J14666J66205J81797
$$ 131525 332345 586482 867353 1117560 1289604 1386860 1463461 1578127 1744332 1926129
34514A926129J55532J22608J12933J17881J04423M8896m9515j72571k82585l28133
$$ 1926129 2081661 2204269 2317202 2435083 2539506 2588402 2538887 2366316 2083731 1755598
34504A755598k77546j56808l9757J1322p818n5146q5057p3488k2477L4764M1291
$$ 1755598 1478052 1321244 1281487 1292809 1284991 1229845 1144788 1071300 1048823 1083587 1124878
34493A124878l7700j62694k35132j87157m9474Q4784J53209J59993J28954N9141
$$ 1124878 1087178 924484 689352 502195 452721 537505 690714 850707 979661 1038802
34483A038802n5792j89404k91554l30449l09850k52425j84422j32010j11499j17472
$$ 1038802 983010 793606 502052 171603 -138247 -390672 -575094 -707104 -818603 -936075
34473i36075j29227j26592r0996m128J28505K53872L01696K54197J69983J26178
$$ -936075 -1065302 -1191894 -1282890 -1287018 -1158513 -904641 -602945 -348748 -178765 -52587
34463e2587J48961K07970K56494K57447J89803O6652n0472q8729l7692K7625J9591
$$ -52587 96374 304344 560838 818285 1008088 1074740 1024268 935539 897847 925472 945063
34452I45063o7724j53763j62619j00809l4762r772j5179k2717k7194l6859m6985
$$ 945063 877339 723576 560957 460148 425386 415614 400435 377718 350524 313665 266680
34441B66680m4128k5512K736L7829P6898J13363J51893K09083K73996K84859J85044
$$ 266680 222552 197040 199776 237605 314503 427866 579759 788842 1062838 1347697 1532741
34430A532741K814j59955k26474k04886j48848r8550p5123r1388j33504j54810
$$ 1532741 1535555 1375600 1149126 944240 795392 696842 621719 530331 396827 242017
34420B42017j22702o2635k9854m3729p0606o5377j2522O6329J27099J31401P8482
$$ 242017 119315 56680 26826 -16903 -87509 -152886 -165408 -99079 28020 159421 237903
34409B37903R258l1114l1018r709P760K828l1680q0831j12870j09924q2459m3585
$$ 237903 247161 216047 185029 175320 183080 185908 154228 73397 -39473 -149397 -231856 -275441
34397b75441Q618O3932Q0700K9086n7156j06592q6887k9620J8468M2569N9052
$$ -275441 -266823 -202891 -122191 -93105 -150261 -256853 -343740 -373360 -354892 -312323 -253271
34386b53271R2169J52068K15653K33386J77347P6364k1618j11758k20218l32955
$$ -253271 -161102 -9034 206619 440005 617352 693716 672098 560340 340122 7167
34376G167l82461l23760j92827p0632j1368j8930o6675j17275j40256j33923j26940
$$ 7167 -375294 -699054 -891881 -962513 -973881 -992811 -1059486 -1176761 -1317017 -1450940 -1577880
34365a577880j48290j98764k49248k54166j75320k2858J24373J74808J17976L6444
$$ -1577880 -1726170 -1924934 -2174182 -2428348 -2603668 -2626526 -2502153 -2327345 -2209369 -2172925
34355b172925P096J7801O411m1588o9044j4857J19321K70129L65404L77053L29837
$$ -2172925 -2165829 -2148028 -2141617 -2183205 -2252249 -2267106 -2147785 -1877656 -1512252 -1135199 -805362
34344h05362K57990J61582K6129j19023k00143j75152q1879J0348P0962J08610
$$ -805362 -547372 -385790 -359661 -478684 -678827 -853979 -935858 -925510 -854548 -745938
34334g45938J33785J55951J93035K42414K57620J94895P2878n3042j62937k69525
$$ -745938 -612153 -456202 -263167 -20753 236867 431762 504640 451598 288661 19136
34324A9136l49300l40345k32454j10635o9706j08785j41346r5867J7468J29404
$$ 19136 -330164 -670509 -902963 -1013598 -1083304 -1192089 -1333435 -1429302 -1411834 -1282430
34314a282430J78846J60843J21495J05932J11119R7212L9052n3456j61888k74303
$$ -1282430 -1103584 -942741 -821246 -715314 -604195 -506983 -467931 -521387 -683275 -957578
34304i57578l65049l93126l44225k54361j69994r9688k2300P5544J89542L03941
$$ -957578 -1322627 -1715753 -2059978 -2314339 -2484333 -2584021 -2606321 -2530777 -2341235 -2037294
34294b037294L81588L68113K43946O7286o7928j18464j11046p9964k1544P9018
$$ -2037294 -1655706 -1287593 -1043647 -976361 -1044289 -1162753 -1273799 -1353763 -1375307 -1296289
34284a296289K04848L09684L48318K97661J69299J5265r6672j32798j13170p5690
$$ -1296289 -1091441 -781757 -433439 -135778 33521 48786 -47886 -180684 -293854 -369544
34274c69544l6081N302L6121L6331O057k9530m4855l3859r136R062J0180J3845
$$ -369544 -405625 -400323 -364202 -327871 -321814 -351344 -396199 -430058 -439194 -430132 -419952 -406107
34262d06107O4764J83459L19884L80587L17556J77856N1854j7365n7690j11000
$$ -406107 -341343 -157884 162000 542587 860143 1037999 1089853 1072488 1014798 903798
34252I03798j78109k26978k35269k07245j57551r8884m8150k8007n1523j11249
$$ 903798 725689 498711 263442 56197 -101354 -200238 -248388 -276395 -327918 -439167
34242d39167j87975k60938l04582k92353k22616j32475o3132j2439N5286J49992
$$ -439167 -627142 -888080 -1192662 -1485015 -1707631 -1840106 -1903238 -1915677 -1860391 -1710399
34232a710399K34037K71987K75383K74011K62733K11009J20572M0363J4100L2523
$$ -1710399 -1476362 -1204375 -928992 -654981 -392248 -181239 -60667 -20304 -6204 26319
34222B6319M6957J8349m8942j06739r5664J49J22143J79500J33848K8868o9407
$$ 26319 73276 91625 42683 -64056 -159720 -159571 -37428 142072 275920 304788 235381
34211B35381j36652j77326j75602j01813L0008J47047J82968J46520J07024J14124
$$ 235381 98729 -78597 -254199 -356012 -326004 -178957 4011 150531 257555 371679
34201C71679J46474J44750Q3831k237o5413r3357j00259q5407l2267M8148J03091
$$ 371679 518153 662903 746734 744497 679084 585727 485468 400061 367794 415942 519033
34190E19033Q5460n51j15044k24839l09622l42721k99809j91958o9655J4705M1891
$$ 519033 604493 603942 488898 264059 -45563 -388284 -688093 -880051 -949706 -935001 -893110
34179h93110K7521K202j1379j4232k4984n1964p8348q3923o9560m5250r171L6806
$$ -893110 -865589 -863387 -874766 -888998 -913982 -965946 -1044294 -1128217 -1197777 -1243027 -1252198 -1215392
34167a215392O3313M0151j4818m9452m6719m4247p0742r9378r0965n3815k3500
$$ -1215392 -1152079 -1111928 -1126746 -1176198 -1222917 -1267164 -1337906 -1437284 -1528249 -1582064 -1605564
34156a605564J775O5311J87684L26466M10868M03155L21138K12788J16425M1169
$$ -1605564 -1603789 -1538478 -1350794 -1024328 -613460 -210305 110833 323621 440046 481215
34146D81215j9249n9179n8381j1973M6959O7492K5289n3718j08727q6252J5222
$$ 481215 461966 402787 344406 332433 379392 446884 472173 418455 309728 223476 238698
34135B38698J33669J90550J61729R3229M0964J2608j8508o3665j07878j34986
$$ 238698 372367 562917 724646 817875 858839 871447 852939 789274 681396 546410
34125E46410j35538r7445k0098O1339R5729O9124J6639k5043n2834p5026q1354
$$ 546410 410872 313427 293329 354668 450397 519521 536160 511117 458283 383257 301903
34114C01903n9199k4726j1221k7971m9914n0218k8834n552K320j0901m0114o5977
$$ 301903 242704 217978 206757 178786 128872 78654 49820 44268 46588 35687 -4427 -70404
34102g0404n5747J3336J21826K09794K24675J64648O5092m7305j64304k65308
$$ -70404 -126151 -112815 9011 218805 443480 608128 673220 625915 461611 196303
34092A96303l14920l09998k98438l18060l34584k79321j44122o98Q0822R8412
$$ 196303 -118617 -428615 -727053 -1045113 -1379697 -1659018 -1803140 -1803838 -1723016 -1624604
34082a624604R1352P9667N4469R004m5889q9322r6789m8922M7085J48207K03677
$$ -1624604 -1533252 -1453585 -1399116 -1390112 -1436001 -1525323 -1622112 -1671034 -1623949 -1475742 -1272065
34071a272065J94763J42177Q0871L5797J3989N518q504l9422p8687j03484r4917
$$ -1272065 -1077302 -935125 -854254 -818457 -804468 -798950 -807454 -846876 -925563 -1029047 -1123964
34060a123964n4073p050Q312k7975r9682j73104k28457k55625k27088j12151O7790
$$ -1123964 -1178037 -1185087 -1176775 -1204750 -1304432 -1477536 -1705993 -1961618 -2188706 -2300857 -2233067
34049b233067K32477L22146L63788M25884N19407N79021N39747M00199K09253
$$ -2233067 -2000590 -1678444 -1314656 -888772 -369365 209656 749403 1149602 1358855
34040A358855K3890j10345j68578j58909j14096o1711j4951O572k4648j08233
$$ 1358855 1382745 1272400 1103822 944913 830817 769106 754155 760727 736079 627846
34030F27846k00255k56124k76309k88372k94842k66045j85615q1164j400K6295
$$ 627846 427591 171467 -104842 -393214 -688056 -954101 -1139716 -1220880 -1222280 -1195985
34020a195985J1825j3063j9775J498M4247J00738J69101K41115K90148K84146
$$ -1195985 -1184160 -1197223 -1216998 -1215500 -1171253 -1070515 -901414 -660299 -370151 -86005
34010h6005K14012J03847q136r6103j57685k06046k49858k74684k46350j42337
$$ -86005 128007 231854 223718 127615 -30070 -236116 -485974 -760658 -1007008 -1149345
34000a149345J7598J77682K84051L13082K68464J66626L2652r8814j90558k14438
$$ -1149345 -1131747 -954065 -670014 -356932 -88468 78158 110810 11996 -178562 -393000
33990c93000j60382m4332Q9370J86808K20907K09115J88043J73895J55633J20131
$$ -393000 -553382 -597714 -508344 -321536 -100629 108486 296529 470424 626057 746188
33980G46188O7249p35q4808j72744k31236k32491j84617j22624p5380n7377q3329
$$ 746188 813437 812702 727894 555150 323914 91423 -93194 -215818 -291198 -348575 -431904
33969d31904j57470k38589k49164j50186O597J29838J84279K05622K25356K22854
$$ -431904 -589374 -827963 -1077127 -1227313 -1220716 -1090878 -906599 -700977 -475621 -252767
33959b52767J68158P7708k005m7097o3728n6500k1812L0472P9012J19597J67233
$$ -252767 -84609 -6901 -8906 -56003 -119731 -176231 -198043 -167571 -88559 31038 198271
33948A98271K21583K51564K26936J52700O3619m947l7084m3284n6174j05316j83865
$$ 198271 419854 671418 898354 1051054 1114673 1109726 1072642 1029358 973184 867868 684003
33937F84003k47494k53964j98873j13831m4187k7852o9058j18603j03044K074
$$ 684003 436509 182545 -16328 -130159 -174346 -202198 -271256 -389859 -492903 -490829
33927d90829J38681K24986K37993K19464K12385K16610K02113J42572L8055p4374
$$ -490829 -352148 -127162 110831 330295 542680 759290 961403 1103975 1142030 1067656
33917A067656j36657j21694o9321m4200n4569m1987L5768J36611J68942Q3373
$$ 1067656 930999 809305 739984 695784 641215 599228 634996 771607 940549 1023922
33907A023922q2018k35923l02651k69892j85352j09437p2929q2309j44632k52922
$$ 1023922 941904 705981 403330 133438 -51914 -161351 -234280 -316589 -461221 -714143
33897g14143l50775l57787k53706j08276m167M3136O5075P5101O9414P2787J28536
$$ -714143 -1064918 -1422705 -1676411 -1784687 -1788854 -1745718 -1680643 -1605542 -1536128 -1463341 -1334805
33886a334805K37493L48670M20669M57821M75384M66106M22019L59212K93311
$$ -1334805 -1097312 -748642 -327973 129848 605232 1071338 1493357 1852569 2145880
33877B145880K09812Q6520o4773k02916k97494l43583l41927k88477j89426p2435
$$ 2145880 2355692 2442212 2377439 2174523 1877029 1533446 1191519 903042 713616 641181
33867F41181K2770N9669J7889q8125j96962k27013j39924J7233J42139J56067
$$ 641181 663951 723620 741509 653384 456422 229409 89485 106718 248857 404924
33857D04924N5360j05267k63279l77749m30048m23030l81620l32354k72802j78769
$$ 404924 460284 355017 91738 -286011 -716059 -1139089 -1520709 -1853063 -2125865 -2304634
33847b304634n3431N1729Q9607Q0268R2366J62248K57172L21935L33850L00281
$$ -2304634 -2358065 -2306336 -2216729 -2136461 -2044095 -1881847 -1624675 -1302740 -968890 -668609
33837f68609K30689J38870O0012L4226O5225J09583J15791P1809J4623k506M6288
$$ -668609 -437920 -299050 -239038 -204812 -139587 -30004 85787 157596 172219 169713 216001
33826B16001J40242K28318K61510K14863R5065n8868j89963k59917k77831k81054
$$ 216001 356243 584561 846071 1060934 1155999 1097131 907168 647251 369420 88366
33816H8366k86825k78119k37053j68633q4070J1123R2838J08570K7835j03884
$$ 88366 -198459 -476578 -713631 -882264 -966334 -955211 -862373 -753803 -725968 -829852
33806h29852j92406j79926q5008L5728J37581J99179K18369K14423K13958K18075
$$ -829852 -1022258 -1202184 -1287192 -1251464 -1113883 -914704 -696335 -481912 -267954 -49879
33796d9879J98541J40418P1502L1727K8408M2951O6958J00732J22527R8812L7945
$$ -49879 148662 289080 360582 392309 420717 463668 530626 631358 753885 852697 890642
33785H90642L21K8440Q6875J03829O5276L5208P6370J76161K61698K66642J70109
$$ 890642 890963 919403 1006278 1110107 1175383 1210591 1286961 1463122 1724820 1991462 2161571
33774B161571n568k04787l53374l96012l34170k19051j05394k2001J8092N988
$$ 2161571 2156003 1951216 1597842 1201830 867660 648609 543215 521214 539306 545294
33764E45294m7427r7920r3223j8850Q5561J55460J45942N5972p7559k03506k79357
$$ 545294 497867 399947 306724 287874 373435 528895 674837 730809 653250 449744 170387
33753A70387k83139k17028j06553R824J01662J59954J87299J80821J36050O5721
$$ 170387 -112752 -329780 -436333 -426509 -324847 -164893 22406 203227 339277 404998
33743D04998k14m0717o3040r0537j33038j69223j57629p4967M5480J23629J02740
$$ 404998 404784 364067 301027 210490 77452 -91771 -249400 -324367 -278887 -155258 -52518
33732e2518J1618o0648n4134J3168Q1275J04326O6753k0215j14492j59486j33868
$$ -52518 -40900 -101548 -155682 -142514 -61239 43087 109840 89625 -24867 -184353 -318221
33721c18221p6991m6454n9814r0137r9812n9650M1993J74776K61047K30647Q7383
$$ -318221 -395212 -441666 -501480 -591617 -691429 -751079 -709086 -534310 -273263 -42616 44767
33710D4767r3663k26905k59091j77857k2203J20116J72166J40183R8536R4634
$$ 44767 -48896 -275801 -534892 -712749 -734952 -614836 -442670 -302487 -203951 -109317
33700a09317R8046N3424m6588j56475k21582k14982j55982j03935j06432j38839
$$ -109317 -11271 42153 -4435 -160910 -382492 -597474 -753456 -857391 -963823 -1102662
33690a102662j23085k3701J04650J86684K10837K13363K10325J92014J67524J61288
$$ -1102662 -1225747 -1249448 -1144798 -958114 -747277 -533914 -323589 -131575 35949 197237
33680A97237J62279J23528K9036p1167j11568p4631J0093J05180J79627J99530
$$ 197237 359516 483044 512080 440913 329345 254714 264807 369987 549614 749144
33670G49144J37046q49j63402k84889l24699k83482j89065p5189K5238P9935P2282
$$ 749144 886190 885341 721939 437050 112351 -171131 -360196 -435385 -410147 -330212 -257930
33659b57930K5317k797L6272J38728K52756L16753K91849J77605J6975j21784
$$ -257930 -232613 -235410 -199138 -60410 192346 509099 800948 978553 995528 873744
33649H73744j90640j93360j63100j17395n4912R175L6120P564l9071l6493N1771
$$ 873744 683104 489744 326644 209249 154337 163512 199632 207196 168125 131632 183403
33638A83403J98282L29563L72407K95916J26199p3011k38169l36702l76464l90772
$$ 183403 381685 711248 1083655 1379571 1505770 1432759 1194590 857888 481424 90652
33628I0652m02879l97655l40955k35723j36001q0851l5443N9825J88229K56602
$$ 90652 -312227 -709882 -1050837 -1286560 -1422561 -1503412 -1538855 -1479030 -1290801 -1034199
33618a034199K10908J05046K5892r092l8181p2231q2551o1758l9541k9006p245
$$ -1034199 -823291 -718245 -692353 -701445 -739626 -811857 -894408 -956166 -995707 -1024713 -1031958
33607a031958K9684L4680l3815j49076k43806k83894k80335k39586j46691r625
$$ -1031958 -1002274 -967594 -1001409 -1150485 -1394291 -1678185 -1958520 -2198106 -2344797 -2354422
33597b354422J12724J53487J00166L77q5264j21986j03022l9567L9641R2700Q9887
$$ -2354422 -2241698 -2088211 -1988045 -1987668 -2072932 -2194918 -2297940 -2337507 -2297866 -2205166 -2115279
33586b115279M3314M158J8615Q2539J45697J66099J54498J56552J96043K51191
$$ -2115279 -2071965 -2067807 -2049192 -1966653 -1820956 -1654857 -1500359 -1343807 -1147764 -896573
33576h96573K87811K93975K68089J94956O7890o7071j26751p2383M3680J34006
$$ -896573 -608762 -314787 -46698 148258 216148 149077 22326 -50057 -6377 127629
33566A27629J63403J55334J25647N2837p2701k03976k75125k76921k68291l04528
$$ 127629 291032 446366 572013 624850 552149 348173 73048 -203873 -472164 -776692
33556g76692l66821l75068k72996r6427N1370R7905O7814M1165N7295Q7099R8825
$$ -776692 -1143513 -1518581 -1791577 -1888004 -1836634 -1738729 -1670915 -1629750 -1572455 -1485356 -1386531
33545a386531J08617J37949J54488J06981J4404l1557K5912J32723J83719J39897
$$ -1386531 -1277914 -1139965 -985477 -878496 -864092 -895649 -869737 -737014 -553295 -413398
33535d13398N9798K5723O5201J42973K06696K31374K26452K03875J45141J9196
$$ -413398 -353600 -327877 -262676 -119703 86993 318367 544819 748694 893835 913031
33525I13031j55764k89136k85182j30822J01546L25860M85862N38045M49157K42782
$$ 913031 757267 468131 182949 52127 153673 479533 965395 1503440 1952597 2195379
33515B195379J6542j28700j72124j65110j56393j56303j64790j91205k31891k57210
$$ 2195379 2211921 2083221 1911097 1745987 1589594 1433291 1268501 1077296 845405 588195
33505E88195k41526j91072j26928n5225K6871J04733J47809J40230R6462M3078
$$ 588195 346669 155597 28669 -26556 315 105048 252857 393087 489549 532627
33495E32627m778m3341o5030n4901o428O3324J22390J52277J63767J78005J94153
$$ 532627 527849 484508 419478 364577 358149 421473 543863 696140 859907 1037912 1232065
33484A232065J85714J32710N1060j5490l1719l43L8489L5846k9453j34798k32293
$$ 1232065 1417779 1550489 1601549 1586059 1554340 1553997 1592486 1628332 1598879 1464081 1231788
33473A231788k82673k72954k14076j36839q4615q4907j17067j24868p5988L91
$$ 1231788 949115 676161 462085 325246 240631 155724 38657 -86211 -162199 -161808
33463a61808M5196K5181n5404j77663l11132m00440l89102k77955j42375o9701
$$ -161808 -116612 -91431 -146835 -324498 -635630 -1036070 -1425172 -1703127 -1845502 -1915203
33453a915203q1075j22460j25141o5816K4880R7706J26362J24071J26144J55970
$$ -1915203 -1996278 -2118738 -2243879 -2309695 -2284815 -2187109 -2060747 -1936676 -1810532 -1654562
33443a654562K05745K47107K56262K28346J72956J01423J9991o4754j35617j66501
$$ -1654562 -1448817 -1201710 -945448 -717102 -544146 -442723 -422732 -487486 -623103 -789604
33433g89604j42323p7622q779L5869N5965O8419P9465O9500Q487j07277k33030
$$ -789604 -931927 -1009549 -1018328 -982459 -926494 -858075 -778610 -709110 -700623 -807900 -1040930
33422a040930l03092k93305k47996k26241k23517j71230k5604J61364K79407K63037
$$ -1040930 -1344022 -1637327 -1885323 -2111564 -2335081 -2506311 -2531915 -2370551 -2091144 -1828107
33412a828107J43901P469q1899j09229q4259j4217R1236K00924K68088K65098
$$ -1828107 -1684206 -1676737 -1758636 -1867865 -1952124 -1966341 -1875105 -1674181 -1406093 -1140995
33402a140995K07005J35944R0850R7767J68244K76918L46855K98475J34708m4759
$$ -1140995 -933990 -798046 -707196 -609429 -441185 -164267 182588 481063 615771 571012
33392E71012j34619j13987l2288O5286J64198K52104L10866L39962L49426L22141
$$ 571012 436393 322406 290118 355404 519602 771706 1082572 1422534 1771960 2094101
33382B094101K22788O3552p4452j18036q1750m1965m5657p7113j07408j38253
$$ 2094101 2316889 2380441 2305989 2187953 2106203 2064238 2018581 1941468 1834060 1695807
33372A695807j84837k41053k80356k80435k34904j49126l7887P3353J52594J71358
$$ 1695807 1510970 1269917 989561 709126 474222 325096 287209 360562 513156 684514
33362F84514J15742l955j51256k76632l40548l30413k63070j74729j00325m9967
$$ 684514 800256 796301 645045 368413 27865 -302548 -565618 -740347 -840672 -890639
33352h90639m220O0331J41660K15476K63245K82118K65964J96185O6861q8360
$$ -890639 -894859 -834528 -692868 -477392 -214147 67971 333935 530120 596981 508621
33342E08621k09611k55573k33815j90250j69917j80535j88527j53834o9404L9985
$$ 508621 299010 43437 -190378 -380628 -550545 -731080 -919607 -1073441 -1142845 -1102860
33332a102860J52386K58506L27953K97797J35651q7907k29363j97397l6109J25512
$$ -1102860 -950474 -691968 -364015 -66218 69433 -18474 -247837 -445234 -481343 -355831
33322c55831J91020J54775O9624j0987o1178q0514p7003m6564K8220J45630K54866
$$ -355831 -164811 -10036 59588 48601 -12577 -93091 -170094 -216658 -188438 -42808 212058
33311B12058K84662K17267J17317O4636O4874N2012j7349j00385j19470o1250
$$ 212058 496720 713987 831304 895940 960814 1012826 995477 895092 775622 714372
33301G14372N755J4500k6126n4583l6476P93P993l0971q7718j21576j19655j11041
$$ 714372 720127 734627 708501 653918 617442 618235 626228 595257 507539 385963 266308 155267
33289A55267j39002k10360k76583k78459k08093j12620l9554O76J6956J2397m919
$$ 155267 16265 -194095 -470678 -749137 -957230 -1069850 -1109404 -1108728 -1091772 -1079375 -1084294
33278a084294q482K1165O4125P7820M6624o39k2554k404M2282P1965M8764l4589
$$ -1084294 -1092776 -1071611 -1007486 -929666 -883042 -883681 -906235 -908639 -866357 -794392 -745628 -780217
33266g80217j43690k28009k57687k30776j56908n3910M3877R9279J04243Q6639
$$ -780217 -923907 -1151916 -1409603 -1640379 -1797287 -1851197 -1807320 -1708041 -1603798 -1517159
33256a517159Q1346J04278J51973K09073K54332K77474K94747L30510L78005L95789
$$ -1517159 -1435813 -1331535 -1179562 -970489 -716157 -438683 -143936 186574 564579 960368
33246I60368L50784K50993J32798L5464q002J7292Q6703J42205J35357N5761q1307
$$ 960368 1311152 1562145 1694943 1730407 1722405 1739697 1826400 1968605 2103962 2159723 2078416
33235B078416k45411l79512m18600l53343k50523j76938j25749n6551J5545K8337
$$ 2078416 1833005 1453493 1034893 681550 431027 254089 128340 71789 87334 115671
33225A15671l1278r4149q8195j1611Q7613J66390J99616J74299J02629K3332l1471
$$ 115671 84393 -9756 -97951 -109562 -21949 144441 344057 518356 620985 644317 612846
33214F12846n5306m2188K5611J36633K24034K22228J43070O2663L5506N2061P9155
$$ 612846 557540 515352 540963 677596 901630 1123858 1266928 1329591 1365097 1417158 1496313
33203A496313J04794J28346J33796R7147J2111j06978k42587l79314m90056n29757
$$ 1496313 1601107 1729453 1863249 1960396 1972507 1865529 1622942 1243628 753572 223815
33193B23815m60185k91575r4467M8261J12350J47324K11097K96510L34465K65945
$$ 223815 -236370 -527945 -622412 -574151 -461801 -314477 -103380 193130 527595 793540
33183G93540J00818q9263k22869k57833k08410j25298n4894j1478J6832M4721
$$ 793540 894358 805095 582226 324393 115983 -9315 -64209 -75687 -58855 -14134
33173a4134P5521R8737R1559L1723p7861k01332k96307l42722l37983k77032j56730
$$ -14134 61387 160124 251683 283406 205545 4213 -292094 -634816 -972799 -1249831 -1406561
33162a406561L378J59482K61022K65405J57070k2504j78436k33323j98247j47751
$$ -1406561 -1403183 -1243701 -982679 -717274 -560204 -582708 -761144 -994467 -1192714 -1340465
33152a340465j26147j09440n9642K2167J07345J67099J74256J18152M3407L6959
$$ -1340465 -1466612 -1576052 -1635694 -1613527 -1506182 -1339083 -1164827 -1046675 -1003268 -966309
33142i66309J39403K92125M04527M49626M57039M37900L70098K52140J22635J9718
$$ -966309 -826906 -534781 -130254 319372 776411 1214311 1584409 1836549 1959184 1978902
33132A978902m3306o1876m1103j9449m9330j35918k25144k65927k55901k17301
$$ 1978902 1935596 1873720 1832617 1813168 1763838 1627920 1402776 1136849 880948 663647
33122F63647j67330j32320j50527k23743k89718k77354j75675k4008J41132K91593
$$ 663647 496317 363997 213470 -10273 -299991 -577345 -753020 -777028 -635896 -344303
33112c44303L80120L61551K51268J25424M6596J1660j5906m6080n4983k8051P096
$$ -344303 35817 397368 648636 774060 820656 832316 816410 770330 715347 687296 694392
33101F94392l134q6699k08033k89341k80691k06090j32158r9860j00035j04209
$$ 694392 691258 604559 396526 107185 -173506 -379596 -511754 -611614 -711649 -815858
33091h15858r3867o0445l905N6938Q9469P4604K0935n1300j25574j82180j92792
$$ -815858 -909725 -970170 -974075 -917137 -827668 -753064 -732129 -783429 -909003 -1091183 -1283975
33080a283975j38679l1853Q9225J82662K20120J90235R6162m5407k00453l16502
$$ -1283975 -1422654 -1454507 -1365282 -1182620 -962500 -772265 -676103 -721510 -921963 -1238465
33070a238465l43478k75689j71117j09196j19177j53947j34406j7144J68797L35671
$$ -1238465 -1581943 -1857632 -2028749 -2137945 -2257122 -2411069 -2545475 -2562619 -2393822 -2058151
33060b058151L96701L36893K25394J39172P9796q553j43706k66187l04000k42797
$$ -2058151 -1661450 -1324557 -1099163 -959991 -880195 -888748 -1032454 -1298641 -1602641 -1845438
33050a845438j19594J5474J10396J25065P4175L4619P2600J75425K82738L61776
$$ -1845438 -1965032 -1949558 -1839162 -1714097 -1639922 -1605303 -1532703 -1357278 -1074540 -712764
33040g12764M11561M13593L37448K01145P6669J7144J1640K3874L7701M3967J8421
$$ -712764 -301203 112390 449838 650983 727652 744796 756436 780310 818011 861978 880399
33029H80399n2203j38779j93575j97295j62677j04177l1279L2114N0325J0161
$$ 880399 828196 689417 495842 298547 135870 31693 414 32528 82853 93014
33019I3014n9506j12222j24760j09528q9929o9979l3159K9899J01332J50077J60164
$$ 93014 33508 -78714 -203474 -313002 -402931 -472910 -506069 -476170 -374838 -224761 -64597
33008f4597J37025R2471L6694j7560n7572q0136r0449r4724j02499j24985j51327
$$ -64597 72428 164899 201593 184033 126461 46325 -44124 -138848 -241347 -366332 -517659
32997e17659j36645m6479Q3995J69137J65503J16262Q3461O4224P146j01472k02516
$$ -517659 -654304 -700783 -616788 -447651 -282148 -165886 -82425 -18201 -11055 -112527 -315043
32986c15043k19208j27652L0020J86725K98073L57426L73938L48001K79736J91254
$$ -315043 -534251 -661903 -631883 -445158 -147085 210341 584279 932280 1212016 1403270
32976A403270J12133L9664n3383j56917k05959j56417n1803K4071M1762L0040
$$ 1403270 1515403 1555067 1501684 1344767 1138808 982391 930588 954659 996421 1026461
32966A026461L21p3452j88903k82775k97706k53156k18362k27684k44464k00647
$$ 1026461 1026782 953330 764427 481652 183946 -69210 -287572 -515256 -759720 -960367
32956i60367n8579J55748L66497N01259N39887N07615M26382K96869J33901j0421
$$ -960367 -1018946 -863198 -496701 4558 544445 1052060 1478442 1775311 1909212 1898791
32946A898791q3459q0407m1342j4090l3431j14794k38947l50695m00415l87743
$$ 1898791 1815332 1734925 1693583 1679493 1646062 1531268 1292321 941626 541211 153468
32936A53468l45534k85970j90214n6880O6569J22005J03118O6158P8154J58142
$$ 153468 -192066 -478036 -668250 -725130 -658561 -536556 -433438 -367280 -289126 -130984
32926a30984K64302L29882L09955K02282L9988j22927k26452k30729j43793j6561
$$ -130984 133318 463200 773155 975437 1015425 892498 666046 435317 291524 274963
32916B74963R9206J83259K36019K53490K28748J67605Q4622j2304j18802k19385
$$ 274963 374169 557428 793447 1046937 1275685 1443290 1527912 1515608 1396806 1177421
32906A177421k89120l07109k61237j53340j5760R2337J32236J23745J12486J07980
$$ 1177421 888301 581192 319955 166615 150855 243192 375428 499173 611659 719639
32896G19639Q5316M1801R868O233Q816o62j1786k6148q1134j93515l08216l48619
$$ 719639 804955 846756 856624 862857 871673 871011 859225 833077 751943 558428 250212 -98407
32884i8407l02032k13886j13991k364R4420J14622L6863p2874j19341o4124O1097
$$ -98407 -400439 -614325 -728316 -730680 -636260 -521638 -484775 -557649 -676990 -741114 -680017
32873f80017J98231K94306L13537K55573J60962P6184J2343m8639j13455j61916
$$ -680017 -481786 -187480 126057 381630 542592 618776 631119 582480 469025 307109
32863C07109j73066j52951j30772j30021j41826j28034o1687L2537R4011R1147
$$ 307109 134043 -18908 -149680 -279701 -421527 -549561 -611248 -578711 -484700 -393553
32853c93553N3563K5929J1800q827k1736J8809J21783K29248K75464K53477J98732
$$ -393553 -339990 -314061 -302261 -311088 -332824 -314015 -192232 37016 312480 565957 764689
32842G64689J23193J008j74298l44536m20889l62394k12751o2130K0122K1437
$$ 764689 887882 888890 714592 370056 -50833 -413227 -625978 -688108 -667986 -646549
32832f46549k2879o0552n7047k2788q512n6103j48320k22262k37568k12229j82124
$$ -646549 -669428 -729980 -787027 -809815 -818327 -874430 -1022750 -1245012 -1482580 -1694809 -1876933
32821a876933j50349r8785l0322L1356P4606J01668J03611O9044K1290J1180N8743
$$ -1876933 -2027282 -2126067 -2156389 -2125033 -2050427 -1948759 -1845148 -1776104 -1754814 -1743634 -1684891
32810a684891J29509J82494K14247K38301K49914K37872K09772J76503J28540
$$ -1684891 -1555382 -1372888 -1158641 -920340 -670426 -432554 -222782 -46279 82261
32801H2261N9404j252j6508o12p783n2820p8382k2821J01244K16245K51899J91393
$$ 82261 141665 140413 123905 123293 115510 62690 -15692 -38513 62731 278976 530875 722268
32789G22268O5163p0411j52445j44002o8043O39m615q4317j76721k19442k05144
$$ 722268 787431 717020 564575 420573 352530 353169 348554 264237 87516 -131926 -337070
32778c37070j77851j80489k10609k24340j75660n1298J20066K79667L63226L33396
$$ -337070 -514921 -695410 -906019 -1130359 -1306019 -1357317 -1237251 -957584 -594358 -260962
32768b60962K05343M3327p6351j10713o9342M796P3075J23708J63721J98149K23729
$$ -260962 -55619 -12292 -88643 -199356 -268698 -263902 -190827 -67119 96602 294751 518480
32757E18480K37764K39271K18187J58382O4023k6582p2346p5208p7882j09308
$$ 518480 756244 995515 1213702 1372084 1436107 1409525 1337179 1261971 1184089 1074781
32747A074781j46100j40429p7913O839O8410Q5852N6611j9746j24897j96142j55639
$$ 1074781 928681 788252 710339 717178 785588 871440 928051 908305 783408 587266 431627
32736D31627P890J98941K84894K12369M3159j20095k19528k50646k22724j49229
$$ 431627 439517 638458 923352 1135721 1178880 1058785 839257 588611 365887 216658
32726B16658p2714o0095j44930k80063l69750l60347k90523k37545k18170j68187
$$ 216658 143944 83849 -61081 -341144 -710894 -1071241 -1361764 -1599309 -1817479 -1985666
32716a985666l4113J38931K44231K32083J56133R7043P7649P1570O0285M7158
$$ -1985666 -2019779 -1880848 -1636617 -1404534 -1248401 -1151358 -1073709 -1002139 -941854 -894696
32706h94696L3534J6443N124J3428L8308O4147P9691P1963K0012p4447j60773
$$ -894696 -861162 -844719 -839595 -826167 -787859 -723712 -644021 -572058 -552046 -626493 -787266
32695g87266j79554j25786l8549O4531J92999L15518L42655K17437m053j97270
$$ -787266 -966820 -1092606 -1131155 -1066624 -873625 -558107 -215452 1985 -2068 -199338
32685a99338k79675k55030j74706r5892o7843j12104j96300k46880k06263p8983
$$ -199338 -479013 -734043 -908749 -1004641 -1072484 -1184588 -1380888 -1627768 -1834031 -1913014
32675a913014P5232J85899K15018J74328J09509O2612M1555K0218l3928j26112
$$ -1913014 -1837782 -1651883 -1436865 -1262537 -1153028 -1090416 -1048861 -1028643 -1062571 -1188683
32665a188683k19153k56680k15439j33202o8972l7564o773L8214O0714K3255n2284
$$ -1188683 -1407836 -1664516 -1879955 -2013157 -2082129 -2119693 -2126466 -2088252 -2027538 -2004283 -2056567
32654b056567j04070r7534m7074K0250R3133J67159K32810K81726L12097L22732
$$ -2056567 -2160637 -2258171 -2305245 -2284995 -2191862 -2024703 -1791893 -1510167 -1198070 -875338
32644h75338L09758K69421J97729R3283k8248j28263j68771j42466p3172M485
$$ -875338 -565580 -296159 -98430 -5147 -33395 -161658 -330429 -472895 -546067 -541582
32634e41582N4857M6838k1671j03771j32102p7962K7710J31711K01970K35075
$$ -541582 -486725 -439887 -461558 -565329 -697431 -775393 -747683 -615972 -414002 -178927
32624a78927K44097K51105K77194L23756L64804L65445L10150K15687J19300M8881
$$ -178927 65170 316275 593469 917225 1282029 1647474 1957624 2173311 2292611 2341492
32614B341492k223o6157j60092k63675l45584l97129m19706l94162k98605j59313
$$ 2341492 2339269 2273112 2113020 1849345 1503761 1106632 686926 292764 -5841 -165154
32604a65154n0292k6350p6433j51885k15852k51572k51479k27043k12348k25327
$$ -165154 -215446 -241796 -318229 -470114 -685966 -937538 -1189017 -1416060 -1628408 -1853735
32594a853735k29587j63217j1319J66813K85089K93146J99300N8515n5263r0692
$$ -1853735 -2083322 -2246539 -2257858 -2091045 -1805956 -1512810 -1313510 -1254995 -1310258 -1400950
32584a400950n6733j4262j6198n7616r1813q6257m7699J294M6355P5527P3078
$$ -1400950 -1457683 -1471945 -1488143 -1545759 -1637572 -1723829 -1771528 -1770234 -1723879 -1648352 -1575274
32573a575274L9481N610L826K8179M4921M1779M1482O0517Q1143P8564N1800R103
$$ -1575274 -1535793 -1530183 -1526357 -1498178 -1453257 -1411478 -1369996 -1309479 -1228336 -1149772 -1097972 -1088869
32561a088869n2268j23819j65581j48544j08408j13169j72407k18816j92145j04284
$$ -1088869 -1141137 -1264956 -1430537 -1579081 -1687489 -1800658 -1973065 -2191881 -2384026 -2488310
32551b488310k746R2768J85720K63720L06734L24008L44072L67320L62430L18334
$$ -2488310 -2491056 -2398288 -2212568 -1948848 -1642114 -1318106 -974034 -606714 -244284 74050
32541G4050K70238K55251K59360K30267J40421K2843n9158p1780l7215m369l07
$$ 74050 344288 599539 858899 1089166 1229587 1252430 1193272 1121492 1084277 1079908 1079601
32530A079601j5809l4375o0824j10271j74750k16649k03180j42737q0288n6157
$$ 1079601 1063792 1029417 968593 858322 683572 466923 263743 121006 40718 -15439
32520a5439p1968r5940r4715n5750J2777Q8465J39663J41942J01875N3812K1858
$$ -15439 -87407 -183347 -278062 -333812 -321035 -232570 -92907 49035 150910 204722 226580
32509B26580k661l2521n2473m4297l2977o8198j53267k27627k36182j87051j21362
$$ 226580 223919 191398 138925 94628 61651 -6547 -159814 -387441 -623623 -810674 -932036
32498i32036n4618K2121J02342J61614J91513K07480K20317K21495K01694J67476
$$ -932036 -986654 -964533 -862191 -700577 -509064 -301584 -81267 140228 341922 509398
32488E09398J32252R8578N3211k1364j23938k17843k47404j84335n7111O8669
$$ 509398 641650 740228 793439 772075 648137 430294 182890 -1445 -58556 10113
32478A0113J33198J11110K3151o9590j08522r5998r2655j37511j96234k17509
$$ 10113 143311 254421 277572 207982 99460 3462 -89193 -226704 -422938 -640447
32468f40447k11161k21562k40883k12578j28441n9940o2470r4303p0751L0192
$$ -640447 -851608 -1073170 -1314053 -1526631 -1655072 -1715012 -1777482 -1871785 -1942536 -1912344
32458a912344J55229K47413K88882K82478K33867J59672Q4740J9981m0311r3370
$$ -1912344 -1757115 -1509702 -1220820 -938342 -704475 -544803 -460063 -440082 -480393 -573763
32448e73763j17007r3128l2744K9539O0976M9429O912l6776m6453J496J00536
$$ -573763 -690770 -783898 -816642 -787103 -726127 -676698 -669786 -706562 -753015 -751519 -650983
32437f50983K03559K40007J66587J3108j33312k02331j93875j53420j11332o6659
$$ -650983 -447424 -207417 -40830 -27722 -161034 -363365 -557240 -710660 -821992 -888651
$$ [...]
##END NTUPLES=NMR SPECTRUM
##END=
