##TITLE=31Pdec_84-2021
 CDCl3, 24 sc
 26.08.2021
##JCAMPDX= 6.0         $$ Bruker NMR JCAMP-DX V2.0
##DATA TYPE= NMR SPECTRUM
##DATA CLASS= NTUPLES
##ORIGIN= UXNMR, Bruker Analytische Messtechnik GmbH
##OWNER= root
$$ XWIN-NMR		Version 3.5
$$ Thu Aug 26 11:10:53 2021 Russian Standard Time (UT+4h)  she@DPX200
##.OBSERVE FREQUENCY= 81.013821
##.OBSERVE NUCLEUS= ^31P
##.ACQUISITION MODE= SIMULTANEOUS
##.ACQUISITION SCHEME= undefined
##.AVERAGES= 24
##.DIGITISER RES= 16
##SPECTROMETER/DATA SYSTEM= spect
##.PULSE SEQUENCE= zgpg30
##.SOLVENT NAME= CDCl3
##.SHIFT REFERENCE= (INTERNAL, CDCl3, 0, 248.564)
##AUDIT TRAIL= $$ (NUMBER, WHEN, WHO, WHERE, WHAT)
$$ ##TITLE= Audit trail, XWIN-NMR		Version 3.5
$$ ##JCAMPDX= 5.01
$$ ##ORIGIN= Bruker BioSpin GmbH
$$ ##OWNER= she
$$ F:/spectra/data/she/nmr/P31/1/pdata/1/auditp.txt
$$ ##AUDIT TRAIL=  $$ (NUMBER, WHEN, WHO, WHERE, WHAT)
(   1,<2021-08-26 11:09:30.09 +0400>,<she>,<DPX200>,
      <created by zg, POWCHK disabled, PULCHK disabled
       configuration hash MD5:
       00 E9 B6 7A A2 85 ED C7 34 08 36 98 17 FE 4E 26
       data hash MD5: 32K
       D7 D4 4C 65 04 65 FD 45 AF F5 8D E3 D3 AB C5 77>)
(   2,<2021-08-26 11:09:35.76 +0400>,<she>,<DPX200>,
      <Start of raw data processing
       efp BC_mod = 2 LB = 1 FT_mod = 6 PKNL = 1 PHC0 = -7783.898 PHC1 = 169.8735 SI = 64K 
       data hash MD5: 64K
       6F 03 2C F6 6E 0F 36 2C 06 15 CB 1E A7 26 3A 7D>)
(   3,<2021-08-26 11:09:59.15 +0400>,<she>,<DPX200>,
      <pk PHC0 = 3.911459 PHC1 = 0 
       data hash MD5: 64K
       B5 AC 39 91 A1 DC 2D 4D F6 AB 4C 27 12 7D F8 34>)
(   4,<2021-08-26 11:10:02.23 +0400>,<she>,<DPX200>,
      <abs ABSG = 5 
       data hash MD5: 64K
       7F D5 69 30 08 4C 57 1F 15 64 33 AA 78 E2 E8 4F>)
$$ ##END=
$$ 
$$ hash MD5
$$ C3 B1 50 E6 93 DF 6A 6E 00 8E 28 B6 8B C9 28 B9
##$RELAX= 
##$RELAX= 
##$RELAX= 
##$RELAX= 
##$RELAX= 
##$RELAX= 
##$RELAX= 
##$RELAX= 
$$ Bruker specific parameters
$$ --------------------------
##$DU= <F:/spectra>
##$EXPNO= 1
##$NAME= <P31>
##$PROCNO= 1
##$TYPE= <nmr>
##$USER= <she>
##$AMP= (0..31)
100 100 100 100 100 100 100 100 100 100 100 100 100 100 100 100 100 100 
100 100 100 100 100 100 100 100 100 100 100 100 100 100 
##$AQSEQ= 0
##$AQ_mod= 1
##$AUNM= <au_zg>
##$AUTOPOS= <>
##$BF1= 81.014009
##$BF2= 200.13
##$BF3= 200.13
##$BF4= 200.13
##$BF5= 200.13
##$BF6= 200.13
##$BF7= 200.13
##$BF8= 200.13
##$BYTORDA= 1
##$CFDGTYP= 0
##$CFRGTYP= 5
##$CHEMSTR= <none>
##$CNST= (0..31)
1 1 145 1 1 1 1 1 1 1 1 1 1 1 1 1 1 1 1 1 1 1 1 1 1 1 1 1 1 1 1 1 
##$CPDPRG= <waltz16>
##$CPDPRG1= <>
##$CPDPRG2= <waltz16>
##$CPDPRG3= <>
##$CPDPRG4= <mlev>
##$CPDPRG5= <mlev>
##$CPDPRG6= <mlev>
##$CPDPRG7= <mlev>
##$CPDPRG8= <mlev>
##$CPDPRGB= <>
##$CPDPRGT= <>
##$D= (0..31)
0 1 0 0 0 0 0 0 0 0 0 0.03 2e-05 3e-06 0 0 0 0 0 0 0 0 0 0 0 0 0 0 0 0 
0 0 
##$DATE= 1629961769
##$DBL= (0..7)
120 120 120 11 120 120 24 19 
##$DBP= (0..7)
150 150 150 150 150 150 150 150 
##$DBP07= 0
##$DBPNAM0= <>
##$DBPNAM1= <>
##$DBPNAM2= <>
$$ [...]
##$SUBNAM3= <"">
##$SUBNAM4= <"">
##$SUBNAM5= <"">
##$SUBNAM6= <"">
##$SUBNAM7= <"">
##$SUBNAM8= <"">
##$SUBNAM9= <"">
##$SW= 501.771253377433
##$SWIBOX= (0..15)
0 1 3 0 0 0 0 0 0 0 0 0 0 0 0 0 
##$SW_h= 40650.406504065
##$TD= 32768
##$TD0= 1
##$TE= 0
##$TE2= 300
##$TE3= 300
##$TEG= 300
##$TL= (0..7)
0 120 53 12 22 120 120 120 
##$TP= (0..7)
150 150 150 150 150 150 150 150 
##$TP07= 0
##$TPNAME0= <>
##$TPNAME1= <>
##$TPNAME2= <>
##$TPNAME3= <>
##$TPNAME4= <>
##$TPNAME5= <>
##$TPNAME6= <>
##$TPNAME7= <>
##$TPOAL= (0..7)
0.5 0.5 0.5 0.5 0.5 0.5 0.5 0.5 
##$TPOFFS= (0..7)
0 0 0 0 0 0 0 0 
##$TUNHIN= 0
##$TUNHOUT= 0
##$TUNXOUT= 0
##$USERA1= <user>
##$USERA2= <user>
##$USERA3= <user>
##$USERA4= <user>
##$USERA5= <user>
##$V9= 5
##$VALIST= <valist>
##$VCLIST= <CCCCCCCCCCCCCCC>
##$VD= 0
##$VDLIST= <DDDDDDDDDDDDDDD>
##$VPLIST= <PPPPPPPPPPPPPPP>
##$VTLIST= <TTTTTTTTTTTTTTT>
##$WBST= 1024
##$WBSW= 4
##$XGAIN= (0..3)
0 0 0 0 
##$XL= 0
##$YL= 0
##$YMAX_a= 3420
##$YMIN_a= -3378
##$ZGOPTNS= <>
##$ZL1= 120
##$ZL2= 120
##$ZL3= 120
##$ZL4= 120
##$ABSF1= 248.5645
##$ABSF2= -253.2056
##$ABSG= 5
##$ABSL= 3
##$ALPHA= 0
##$AQORDER= 0
##$ASSFAC= 0
##$ASSFACI= 0
##$ASSFACX= 0
##$ASSWID= 0
##$AUNMP= <proc_1d>
##$AZFE= 0.1
##$AZFW= 0.5
##$BCFW= 0
##$BC_mod= 2
##$BYTORDP= 0
##$COROFFS= 0
##$CY= -3
##$DATMOD= 1
##$DC= 0
##$DFILT= <>
##$DTYPP= 0
##$F1P= 0
##$F2P= 0
##$FCOR= 1
##$FTSIZE= 65536
##$FT_mod= 6
##$GAMMA= 0
##$GB= 0
##$INTBC= 1
##$INTSCL= 5.30512e-09
##$ISEN= 30
##$LB= 1
##$LEV0= 0
##$LPBIN= 0
##$MAXI= 10000
##$MC2= 0
##$MEAN= 0
##$ME_mod= 0
##$MI= 50
##$NCOEF= 0
##$NC_proc= -5
##$NLEV= 6
##$NOISF1= 182.463
##$NOISF2= 159.3651
##$NSP= 0
##$NTH_PI= 0
##$NZP= 0
##$OFFSET= 248.5645
##$PC= 4
##$PHC0= -7779.986
##$PHC1= 169.8735
##$PH_mod= 1
##$PKNL= yes
##$PPARMOD= 0
##$PSCAL= 0
##$PSIGN= 0
##$REVERSE= no
##$SF= 81.014009
##$SI= 65536
##$SIGF1= 159.3651
##$SIGF2= -187.1042
##$SINO= 113.3802
##$SIOLD= 16384
##$SREGLST= <1H.CDCl3>
##$SSB= 0
##$STSI= 65536
##$STSR= 0
##$SW_p= 40650.406504065
##$SYMM= 0
##$S_DEV= 0
##$TDeff= 32768
##$TDoff= 0
##$TI= <>
##$TILT= no
##$TM1= 0
##$TM2= 0
##$TOPLEV= 0
##$USERP1= <user>
##$USERP2= <user>
##$USERP3= <user>
##$USERP4= <user>
##$USERP5= <user>
##$WDW= 1
##$XDIM= 65536
##$YMAX_p= 377626676
##$YMIN_p= -13867148
$$ End of Bruker specific parameters
$$ ---------------------------------
##NTUPLES= NMR SPECTRUM
##VAR_NAME=  FREQUENCY,     SPECTRUM/REAL,   SPECTRUM/IMAG
##SYMBOL=    X,             R,               I
##VAR_TYPE=  INDEPENDENT,   DEPENDENT,       DEPENDENT
##VAR_FORM=  AFFN,          ASDF,            ASDF
##VAR_DIM=   65536,         65536,           65536
##UNITS=     HZ,            ARBITRARY UNITS, ARBITRARY UNITS
##FACTOR=    0.620285442955139, 1,           1
##FIRST=     20137.2065510759, 0,            0
##LAST=      -20513.1999529892, 0,           0
##MIN=       -20513.1999529892, -13867148,   0
##MAX=       20137.2065510759, 377626676,    0
$$ Real data points
##PAGE= N=1
##DATA TABLE= (X++(R..R)), XYDATA
$$ [...]
$$ plain form
35389 837683 115608 -397539 -214413 221959 271585 -41757 -291808 -387406 -511417 -545919
35379 -545919 -159956 542583 970994 733077 16460 -735967 -1177731 -1094305 -503431 196910
35369 196910 526136 438637 251310 86123 -212517 -610491 -826039 -831663 -921514 -1132837
35359 -1132837 -1108609 -741033 -418708 -341422 -138622 404012 748175 319390 -527588 -901938
35349 -901938 -566056 -135485 -151355 -496520 -761010 -713954 -328351 267947 755555 852459
35339 852459 674072 601177 731219 736551 354103 -237110 -647079 -692420 -469918 -161194
35329 -161194 111134 293282 353701 269733 115270 119260 437415 803453 667652 -122015
35319 -122015 -991988 -1244098 -815434 -194496 216538 328512 131847 -338026 -835083 -1063680
$$ packed form
35389H37683p22075n13147J83126M36372M9626l13342k50051r5598j24011l4502
35379e45919L85963P02539M28411k37917p16617p52427m41764Q3426N90874P00341
35369A96910L29226q7499j87327j65187k98640l97974k15548n624q9851k11323
35359a132837K4228L67576L22325P7286K02800N42634L44163m28785q46978l74350
35349i01938L35882M30571j5870l45165k64490M7056L85603N96298M87608R6904
35339H52459j78387p2895J30042N332l82448n91213m09969m5341K22502L08724
35329a61194K72328J82148O0419q3968j54463L990L18155L66038j35801p89667
35319a22015q69973k52110M28664O20938M11034J11974j96665m69873m97057k28597
$$ plain form
35309 -1063680 -1009289 -831983 -527831 -63654 253314 42991 -477794 -617565 -162263 290349
35299 290349 212394 -99768 -58975 270340 289840 -198001 -690347 -707287 -418372 -320351
35289 -320351 -517427 -615514 -306164 199430 457178 371570 268176 390530 563272 475528
35279 475528 112370 -277288 -512019 -577943 -501766 -349467 -286087 -398245 -485697 -278370
35269 -278370 117177 230367 -215137 -909276 -1225859 -831738 -8998 587076 535239 70002
35259 70002 -186265 38947 374590 367804 99124 -17647 146636 364907 501232 669997
35249 669997 954676 1262518 1462234 1435134 1072227 508592 244591 635307 1296721 1444787
35239 1444787 856161 80651 -349942 -474801 -548088 -590958 -541790 -507755 -608425 -792564
$$ packed form
35309a063680N4391J77306L04152M64177L16968k10323n20785j39771M55302M52612
35299B90349p7955l12162M0793L29315J9500m87841m92346j6940K88915R8021
35289c20351j97076r8087L09350N05594K57748q5608j03394J22354J72742q7744
35279D75528l63158l89658k34731o5924P6177J52299O3380j12158q7452K07327
35269b78370L95547J13190m45504o94139l16583L94121Q22740N96074n1837m65237
35259G0002k56267K25212L35643o786k68680j16771J64283K18271J36325J68765
35249F69997K84679L07842J99716k7100l62907n63635k64001L90716O61414J48066
35239A444787n88626p75510m30593j24859p3287m2870M9168L4035j00670j84139
$$ plain form
35229 -792564 -959508 -1029187 -832930 -281404 269027 241842 -391071 -990257 -1112206 -1029562
35219 -1029562 -1100015 -1130967 -841076 -515384 -583744 -816375 -603375 62165 515084 368551
35209 368551 -27768 -193820 -77620 170920 512871 820026 741606 156359 -453525 -465401
35199 -465401 108970 619850 547593 4645 -570781 -941891 -1128829 -1145769 -958337 -657405
35189 -657405 -423524 -283652 -124385 3358 -126094 -467924 -556516 -112856 416439 344946
35179 344946 -316575 -859350 -841102 -589730 -578773 -719580 -589296 -103979 378015 527558
35169 527558 363429 127275 8038 -2378 -41861 -158381 -208967 -91707 8700 -160250
35159 -160250 -503443 -691147 -693532 -826213 -1163193 -1309334 -982862 -480047 -269494 -390213
$$ packed form
35229g92564j66944o9679J96257N51526N50431k7185o32913n99186j21949Q2644
35219a029562p0453l0952K89891L25692o8360k32631K13000O65540M52919j46533
35209C68551l96319j66052J16200K48540L41951L07155p8420n85247o09884j1876
35199d65401N74371N10880p2257n42948n75426l71110j86938j6940J87432L00932
35189f57405K33881J39872J59267J27743j29452l41830q8592M43660N29295p1493
35179C44946o61521n42775J8248K51372J0957j40807J30284M85317M81994J49543
35169E27558j64129k36154j19237j0416l9483j16520n0586J17260J00407j68950
35159a60250l43193j87704k385j32681l36980j46141L26472N02815K10553j20719
$$ plain form
35149 -390213 -552082 -606796 -591186 -466237 -155623 210734 352309 132664 -323202 -717472
35139 -717472 -712286 -182026 524943 809077 496777 69276 13339 218039 309500 320231
35129 320231 603699 1193490 1655140 1605331 1108973 535193 205479 175682 227645 109905
35119 109905 -146919 -271216 -140332 99166 355869 688654 931136 662316 -127020 -744850
35109 -744850 -621077 -110144 15468 -372070 -716997 -624377 -220036 212692 451524 289806
35099 289806 -222765 -564157 -253683 476967 979503 1027558 846592 488197 -140522 -692941
35089 -692941 -601829 10389 349376 40480 -465286 -725897 -803147 -693406 -93590 834413
35079 834413 1240615 714738 -13320 -139647 58554 -104969 -442160 -250219 330747 373564
$$ packed form
35149c90213j61869n4714J5610J24949L10614L66357J41575k19645m55866l94270
35139g17472N186N30260P06969K84134l12300m27501n5937K04700R1461J0731
35129C20231K83468N89791M61650m9809m96358n73780l29714k9797N1963j17740
35119A09905k56824j24297J30884K39498K56703L32785K42482k68820p89336o17830
35109g44850J23773N10933J25612l87538l44927R2620M04341M32728K38832j61718
35099B89806n12571l41392L10474P30650N02536M8055j80966l58395o28719n52419
35089f92941R1112O12218L38987l08896n05766k60611p7250J09741N99816R28003
35079H34413M06202n25877p28058j26327J98201j63523l37191J91941N80966M2817
$$ plain form
35069 373564 -366413 -969013 -640746 218547 656226 384339 -92509 -274803 -156145 -4175
35059 -4175 1568 -155155 -427842 -743570 -957474 -902695 -603645 -367027 -461499 -717088 -691023
35048 -691023 -270473 182597 372129 403719 421600 310711 47727 -29191 297062 658449
35038 658449 554625 54297 -371399 -505026 -445881 -249520 5251 6065 -378455 -655656
35028 -655656 -299340 366919 586482 379898 497564 1082984 1297517 621847 -278029 -496216
35018 -496216 -56296 422785 695417 904875 1018048 868557 550839 285077 81505 -86396
35008 -86396 -58558 162492 163079 -320455 -891662 -1019935 -772249 -525926 -305932 -9627
34998 -9627 56767 -382956 -832988 -548771 289762 756322 525750 187041 96232 -197848
$$ packed form
35069C73564p39977o02600L28267Q59293M37679k71887m76848j82294J18658J51970
35059d175N743j56723k72687l15728k13904N4779K99050K36618r4472k55589K6065
35048f91023M20550M53070J89532L1590J7881j10889k62984p6918L26253L61387
35038F58449j03824n00328m25696j33627N9145J96361K54771Q14l84520k77201
35028f55656L56316O66259K19563k06584J17666N85420K14533o75670q99876k18187
35018d96216M39920M79081K72632K09458J13173j49491l17718k65762k03572j67901
35008h6396K7838K21050N87m83534n71207j28273K47686K46323K19994K96305
34998i627O6394m39723m50032K84217Q38533M66560k30572l38709r0809k94080
$$ plain form
34988 -197848 -1053935 -2003442 -2340417 -1923166 -1078670 -207713 275938 159887 -169873 -101658
34978 -101658 246216 128041 -539762 -849265 -317169 246558 -18366 -678602 -768899 -292319
34968 -292319 -7143 -153740 -372921 -587992 -969510 -1190735 -711959 214085 730517 605069
34958 605069 416011 463139 387251 39549 -133641 134503 504967 678016 811004 1017442
34948 1017442 1071863 879877 652132 398755 -105100 -642236 -586907 68184 475641 146106
34938 146106 -323424 -219474 291591 692743 950286 1153988 963137 205883 -463654 -339739
34928 -339739 260377 486378 203995 -54875 -126650 -329686 -671307 -793549 -709714 -828836
34918 -828836 -1198803 -1423606 -1384021 -1357461 -1359637 -1073164 -553877 -300513 -420799 -414672 -69591
$$ packed form
34988a97848q56087r49507l36975M17251Q44496Q70957M83651j16051l29760O8215
34978a01658L47874j18175o67803l09503N32096N63727k64924o60236r0297M76580
34968b92319K85176j46597k19181k15071l81518k21225M78776R26044N16432j25448
34958F05069j89058M7128p5888l47702j73190K68144L70464J73049J32988K06438
34948A017442N4421j91986k27745k53377n03855n37136N5329O55091M07457l29535
34938A46106m69530J03950N11065M01152K57543K03702j90851p57254o69537J23915
34928c39739O00116K26001k82383k58870p1775k03036l41621j22242Q3835j19122
34918h28836l69967k24803L9585K6560k176K86473N19287K53364j20286O127L45081
$$ plain form
34907 -69591 84162 -391113 -1095780 -1344812 -1065531 -696565 -480291 -278799 67811 516833
34897 516833 853161 778227 151702 -716800 -1243541 -1174567 -783318 -392186 -42957 232251
34887 232251 254772 91991 195528 750437 1206899 934305 148764 -302176 -18763 531292
34877 531292 703469 405160 24668 -78602 138864 447681 537969 268206 -172965 -392721
34867 -392721 -147887 410887 847314 825633 451614 198479 385385 765003 808888 394806
34857 394806 -46425 -137423 -6735 34013 -40938 -111524 -258448 -569111 -751904 -414255
34847 -414255 278526 672535 459341 47690 -51783 170331 463191 786427 1183220 1454378
34837 1454378 1381592 1121588 957281 765565 215207 -514228 -745579 -204995 537113 766261
$$ packed form
34907f9591J53753m75275p04667k49032K79281L68966K16274K01492L46610M49022
34897E16833L36328p4934o26525q68502n26741O8974L91249L91132L49229K75208
34887B32251K2521j62781J03537N54909M56462k72594p85541m50940K83413N50055
34877E31292J72177k98309l80492j03270K17466L08817R0288k69763m41171k19756
34867c92721K44834N58774M36427k1681l74019k53135J86906L79618M3885m14082
34857C94806m41231r0998J30688M0748p4951p0586j46924l10663j82793L37649
34847d14255O92781L94009k13194m11651r9473K22114K92860L23236L96793K71158
34837A454378p2786k60004j64307j91716n50358p29435k31351N40584P42108K29148
$$ plain form
34827 766261 393290 -214801 -767226 -1073991 -923110 -391429 1919 -69027 -195403 148216
34817 148216 692271 746388 339950 199001 547047 765255 485339 198985 333670 456953
34807 456953 41230 -534607 -504745 80258 416022 102213 -399348 -481108 -73022 444063
34797 444063 655825 427313 45091 -30533 243269 361022 -8996 -478916 -516021 -266226
34787 -266226 -284730 -657632 -962232 -975187 -840832 -599687 -137148 385199 599278 496867
34777 496867 449343 623090 829671 952858 1034268 954354 582369 254963 490830 1130483
34767 1130483 1367100 803690 -60707 -542507 -436048 122197 820622 1080761 517648
34758 517648 -295904 -291954 573928 1116550 676551 154197 559286 1370278 1365280 528980
$$ packed form
34827G66261l72971o08091n52425l06765J50881N31681L93348p0946j26376L43619
34817A48216N44055N4117m06438j40949L48046K18208k79916k86354J34685J23283
34807D56953m15723n75837K9862N85003L35764l13809n01561q1760M08086N17085
34797D44063K11762k28512l82222p5624K73802J17753l70018m69920l7105K49795
34787b66226j8504l72902l04600j2955J34355K41145M62539N22347K14079j02411
34777D96867m7524J73747K06581J23187Q1410p9914l71985l27406K35867O39653
34767A130483K36617n63410q64397m81800J06459N58245O98425K60139n63113
34758E17648q13552L950Q65882N42622m39999n22354M05089Q10992m998q36300
$$ plain form
34748 528980 -27972 178212 460115 214906 -265162 -476505 -400207 -203521 103277 365648
34738 365648 182700 -494533 -1053612 -901513 -211123 320295 273180 -175957 -560787 -507094
34728 -507094 65598 887251 1513409 1703510 1606366 1502199 1435687 1210237 711686 128731
34718 128731 -197461 -123503 142980 271497 149554 -65991 -171043 -46921 370135 1007033
34708 1007033 1511979 1482014 965057 475939 342560 308778 22234 -368801 -462278 -242134
34698 -242134 -50929 -24144 9324 71729 -66555 -418810 -606497 -367736 46507 223947
34688 223947 122781 -7218 -77026 -218245 -425459 -456807 -217013 -16014 -211425 -667057
34678 -667057 -825127 -385966 294977 636595 487045 136038 -179920 -455037 -630148 -522973
$$ packed form
34748E28980n56952K06184K81903k45209m80068k11343P6298J96686L06798K62371
34738C65648j82948o77233n59079J52099O90390N31418m7115m49137l84830N3693
34728e07094N72692Q21653O26158J90101r7144j04167o6512k25450m98551n82955
34718A28731l26192P3958K66483J28517j21943k15545j05052J24122M17056O36898
34708A007033N04946k9965n16957m89118j33379l3782k86544l91035r3477K20144
34698b42134J91205K6785L3468O2405j38284l52255j87687K38761M14243J77440
34688B23947j01166j29999o9808j41219k07214l1348K39794K00999j95411m55632
34678f67057j58070M39161O80943L41618j49550l51007l15958k75117j75111J07175
$$ plain form
34668 -522973 -181583 19146 -131264 -330151 -174552 254791 537502 550184 608548 919144
34658 919144 1186338 961734 259238 -382121 -474467 -103321 201969 58609 -417074 -815221
34648 -815221 -820450 -361583 405032 1116897 1396784 1214414 908905 698990 422031 -8092
34638 -8092 -230932 47430 482030 604188 653151 1145623 1747257 1508008 375746 -462063
34628 -462063 -150112 742038 1223088 1220701 1240445 1322686 1175879 952757 1058517 1385437
34618 1385437 1476894 1348290 1494563 2134311 3011582 3902610 4799692 5609160 6106687 6175755
34608 6175755 5787383 4926471 3883252 3327147 3619281 4304575 4762504 5073220 5751895
34599 5751895 7033395 9029555 12039920 15712482 18257776 17774397 14488322 10646680
$$ packed form
34668e22973L41390K00729j50410j98887J55599M29343K82711J2682N8364L10596
34658I19144K67194k24604p02496o41359r2346L71146L05290j43360m75683l98147
34648h15221n229M58867P66615P11865K79887j82370l05509k09915k76959m30123
34638h092k22840K78362M34600J22158M8963M92472O01634k39249j132262q37809
34628d62063L11951Q92150M81050k387J9744Q2241j46807k23122J05760L26920
34618A385437R1457j28604J46273O39748Q77271Q91028Q97082Q09468M97527O9068
34608F175755l88372q60912j043219n56105K92134O85294M57929L10716O78675
34599E751895J281500J996160L010365L672562K545294m83379l286075l841642
$$ plain form
34591 10646680 8009356 6417282 5014277 3710180 2847290 2335509 1874021 1490635 1291600
34582 1291600 1122216 895586 789348 778409 518372 26837 -143306 200607 489205 345330
34572 345330 238551 610537 1037136 968602 686759 726735 884562 683566 390722 613116
34562 613116 1179963 1384872 1140429 935494 794362 311660 -296469 -266349 407134 780470
34552 780470 419376 71643 387514 855106 684841 52540 -304116 -225806 -91964 13037
34542 13037 316368 714445 833465 686835 643608 726687 529009 -76831 -668437 -864688
34532 -864688 -740816 -495350 -141077 251584 407393 238319 63051 125128 172677 -132668
34522 -132668 -618667 -804152 -542170 -76594 409831 876590 1145301 1026039 726542 642688
$$ packed form
34591A0646680k637324j592074j403005j304097q62890n11781m61488l83386j99035
34582A291600j69384k26630j06238j0939k60037m91535j70143L43913K88598j43875
34572C45330j06779L71986M26599o8534k81843L9976J57827k00996k92844K22394
34562F13116N66847K04909k44443k04935j41132m82702o08129L0120O73483L73336
34552G80470l61094l47733L15871M67592j70265o32301l56656P8310J33842J05001
34542A3037L03331L98077J19020j46630m3227Q3079j97678o05840n91606j96251
34532h64688J23872K45466L54273L92661J55809j69074j75268O2077M7549l05345
34522a32668m85999j85485K61982M65576M86425M66759K68711j19262k99497q3854
$$ plain form
34512 642688 689186 380483 -291563 -675520 -445154 -151665 -338209 -675826 -602486 -328547
34502 -328547 -402906 -617389 -302966 380936 482004 -238547 -815790 -529064 23158 -50297
34492 -50297 -507509 -415975 349452 935245 788740 342615 231315 401825 362405 2546
34482 2546 -241397 -15250 454507 669749 549924 516089 792189 952542 495906 -360883
34472 -360883 -928067 -960443 -789421 -587836 -166583 387377 595767 408687 441635 953904
34462 953904 1255180 731530 -105256 -315816 150174 606338 767843 897913 1002847 753208
34452 753208 219847 -80671 23756 174208 162611 173487 264079 237959 150183 303904
34442 303904 601661 553940 134457 -32326 392704 983190 1323086 1595331 1952418 1946615
$$ packed form
34512F42688M6498l08703o72046l83957K30366K93489j86544l37617P3340K73939
34502c28547p4359k14483L14423O83902J01068p20551n77243K86726N52222p3455
34492e0297m57212R1534P65427N85793j46505m46125j11300J70510l9420l59859
34482B546k43943K26147M69757K15242j19825l3835K76100J60353m56636q56789
34472c60883n67184l2376J71022K01585M21253N53960K08390j87080L2948N12269
34462I53904L01276n23650q36786k10560M65990M56164J61505J30070J04934k49639
34452G53208n33361l00518J04427J50452j1597J0876R0592k6120q7776J53721
34442C03904K97757m7721m19483j66783M25030N90486L39896K72245L57087n803
$$ plain form
34432 1946615 1223674 323570 89998 534130 917107 805730 447690 165992 -29045
34423 -29045 -137986 24568 501411 958057 1014807 709676 459247 532472 660550 344573
34413 344573 -382708 -775584 -286298 539045 611858 -267818 -1153494 -1275652 -946429 -788714
34403 -788714 -728103 -356114 189257 431898 386811 489759 815094 976070 750201 264064
34393 264064 -376571 -1089016 -1499890 -1234748 -575595 -261527 -512100 -762858 -522807 -5067
34383 -5067 301588 258245 33543 -210200 -344510 -253398 10516 227824 260293 123373
34373 123373 -144334 -403951 -308337 303169 952362 977977 460050 118662 220739 249803
34363 249803 -139381 -544998 -559836 -431909 -501739 -557104 -309048 -17428 -39713 -184884
$$ packed form
34432A946615p22941r00104k33572M44132L82977j11377l58040k81698j95037
34423b9045j08941J62554M76843M56646N6750l05131k50429P3225J28078l15977
34413C44573p27281l92876M89286Q25343P2813q79676q85676j22158L29223J57715
34403g88714O0611L71989N45371K42641m5087J02948L25335J60976k25869m86137
34393B64064o40635p12445m10874K65142O59153L14068k50573k50758K40051N17740
34383e067L06655m3343k24702k43743j34310R1112K63914K17308L2469j36920
34373A23373k67707k59617R5614O11506O49193K5615n17927l41388J02077K9064
34363B49803l89184m05617j4838J27927o9830n5365K48056K91620k2285j45171
$$ plain form
34353 -184884 -144334 -165682 -599898 -1109749 -1077564 -548612 -7622 541766 1397170 2195994
34343 2195994 2128173 1213827 443782 407496 626558 556604 410711 542877 773687 874295
34333 874295 1059644 1400143 1348923 561579 -302428 -378418 146183 375968 87133 -85492
34323 -85492 197362 472156 303419 -61603 -179004 -57141 6904 -95720 -257088 -376258
34313 -376258 -403918 -335547 -289961 -428110 -720035 -974038 -1116550 -1195921 -1098052 -611937
34303 -611937 102669 485191 269347 -68252 127770 841870 1413903 1337300 748548 144429
34293 144429 -117148 15312 370823 646196 538453 -12053 -678413 -967724 -686948 -161322
34283 -161322 106413 -6735 -145772 31837 430978 702032 688471 480862 138597 -338856
$$ packed form
34353a84884M0550k1348m34216n09851L2185N28952N40990N49388Q55404P98824
34343B195994o7821r14346p70045l6286K19062o9954j45893J32166K30810J00608
34333H74295J85349L40499n1220p87344q64007p5990N24601K29785k88835j72625
34323h5492K82854K74794j68737l65022j17401J21863O4045j02624j61368j19170
34313c76258k7660O8371M5586j38149k91925k54003j42512p9371R7869M86115
34303f11937P14606L82522k15844l37599J96022P14100N72033p6603n88752o04119
34293A44429k61577J32460L55511K75373j07743n50506o66360k89311K80776N25626
34283a61322K67735j13148j39037J77609L99141K71054j3561k07609l42265m77453
$$ plain form
34273 -338856 -752245 -726486 -148325 612030 1078451 1152362 1098593 1160292 1320449 1381584
34263 1381584 1184229 790426 485470 503206 723081 785727 555315 266522 109515 -81285
34253 -81285 -496177 -916408 -948769 -602521 -270879 -142604 -17682 201201 252831 9271
34243 9271 -138708 192193 679298 634120 12344 -444997 -224667 304033 550082 561627
34233 561627 727106 928770 665504 -26881 -461675 -294377 -33317 -222004 -627732 -730350
34223 -730350 -624550 -808109 -1245714 -1286457 -558045 565514 1475931 1862423 1648982 905396
34213 905396 45450 -325059 -80537 215429 68194 -284613 -312468 -15573 143868 -2537
34203 -2537 -105799 157684 696200 1217722 1523853 1508995 1149097 622192 237315 123812
$$ packed form
34273c38856m13389K5759N78161P60355M66421P3911n3769O1699J60157O1135
34263A381584j97355l93803l04956J7736K19875O2646k30412k88793j57007j90800
34253h1285m14892m20231l2361L46248L31642J28275J24922K18883N1630k43560
34243I271j47979L30901M87105m5178o21776m57341K20330N28700K46049J1545
34233E61627J65479K01664k63266o92385m34794J67298K61060j88687m05728j02618
34223g30350J05800j83559m37605m0743P28412J123559R10417L86492k13441p43586
34213I05396q59946l70509K44522K95966j47235l52807k7855K96895J59441j46405
34203b537j03262K63483N38516N21522L06131j4858l59898n26905l84877j13503
$$ plain form
34193 123812 135215 116775 84420 67875 -16867 -210894 -390836 -434556 -374556 -278910 -135543
34182 -135543 20244 39871 -107924 -217797 -172982 -201602 -499964 -754689 -478302 189092
34172 189092 499633 83104 -524955 -626644 -257646 57723 157251 329480 665736 854114
34162 854114 680089 309492 -12907 -163365 28205 682002 1427928 1538177 824141 11762
34152 11762 -166892 79480 36482 -393682 -599937 -244411 236968 275182 -94903 -364088
34142 -364088 -191388 259157 524434 328333 -73085 -109369 416047 1011069 1090478 702250
34132 702250 326616 123420 -143097 -479050 -507362 -76120 430290 587178 389462 65280
34122 65280 -210715 -262872 40508 477330 560873 159706 -304428 -472329 -478041 -543572 -586349
$$ packed form
34193A23812J1403j8440l2355j6545q4742j94027j79942m3720O0000R5646J43367
34182a35543J55787J9627j47795j09873M4815k8620k98362k54725K76387O67394
34172A89092L10541m16529o08059j01689L68998L15369R9528J72229L36256J88378
34162H54114j74025l70597l22399j50458J91570O53797P45926J10249p14036q12379
34152A1762j78654K46372m2998m30164k06255L55526M81379L8214l70085k69185
34142c64088J72700M50545K65277j96101m01418l6284N25416N95022P9409l88228
34132G02250l75634k03196k66517l35953k8312M31242N06410J56888j97716l24182
34122F5280k75995n2157L03380M36822Q3543m01167m64134j67901n712o5531m2777
$$ plain form
34111 -586349 -539302 -600939 -756434 -508400 362119 1137679 932113 -86156 -883954 -862505
34101 -862505 -342583 171039 527769 674457 513459 211504 135204 299639 344024 184358
34091 184358 160701 353494 339848 -54491 -325111 -61621 329768 239936 -160804 -202976
34081 -202976 200773 436257 181461 -95430 141329 715791 1003221 737785 266651 80270
34071 80270 289148 561496 485810 2270 -496938 -541420 -83352 427587 505257 124306
34061 124306 -279308 -283736 83063 404842 360376 74752 -85100 -14778 -9666 -330074 -764274
34050 -764274 -794485 -207467 571983 846970 374518 -311319 -410943 239522 901506 747943
34040 747943 -130368 -802235 -602926 152493 704348 766069 596558 395087 83659 -317338
$$ packed form
34111e86349M7047o1637j55495K48034Q70519P75560k05566j018269p97798K1449
34101h62505N19922N13622L56730J46688j60998l01955p6300J64435M4385j59666
34091A84358k3657J92793j3646l94339k70620K63490L91389q9832m00740m2172
34081b02976M03749K35484k54796k76891K36759N74462K87430k65436m71134j86381
34071H0270K08878K72348p5686m83540m99208m4482M58068N10939P7670l80951
34061A24306m03614m428L66799L21779m4466k85624j59852P0322N112l20408m34200
34050g64274l0211N87018P79450K74987m72452o85837r9624O50465O61984j53563
34040G47943q78311o71867J99309P55419N51855O1721j69511k01471l11428m00997
$$ plain form
34030 -317338 -525340 -380296 -120573 -79100 -283011 -530389 -699037 -755448 -572106 -32999
34020 -32999 642456 943629 618356 64978 -24530 582062 1418888 1890944 1916047 1833885
34010 1833885 1787049 1499186 773549 -50627 -417612 -244089 -6245 -117003 -474033 -717159
34000 -717159 -684396 -432324 -21000 434087 618909 297778 -234436 -340539 148952 635811
33990 635811 556720 211868 316577 829068 851915 -66271 -1085802 -1055311 -32087 808041
33980 808041 708506 115071 -225346 -284769 -446461 -672693 -586433 -155377 283381 580358
33970 580358 810590 819782 359617 -251083 -262702 449894 1059660 871640 184963 -364586
33960 -364586 -735671 -1101374 -1059280 -162507 980898 1175609 300606 -470528 -401676 -190990
$$ packed form
34030c17338k08002J45044K59723M1473k03911k47378j68648n6411J83342N39107
34020c2999O75455L01173l25273n53378q9508O06592Q36826M72056K5103q2162
34010A833885m6836k87863p25637q24176l66985J73523K37844j10758l57030k43126
34000g17159L2763K52072M11324M55087J84822l21131n32214j06103M89491M86859
33990F35811p9091l44852J04709N12491K2847r18186j019531L0491J023224Q40128
33980H08041r9535n93435l40417n9423j61692k26232Q6260M31056M38758K96977
33970E80358K30232R192m60165o10700j1619P12596O09766j88020o86677n49549
33960c64586l71085l65703M2094Q96773J143405J94711q75003p71134O8852K10686
$$ plain form
33950 -190990 -684403 -1445246 -1456290 -703572 -113727 -155456 -400002 -425932 -318936 -143308
33940 -143308 331312 1088476 1633739 1640022 1392621 1293854 1300587 1144790 780665 327279
33930 327279 -130072 -401655 -166066 580991 1294624 1448518 1159547 927602 927523 919062 748077
33919 748077 549660 438045 303170 9395 -372748 -608724 -527411 -226618 -41544 -173074
33909 -173074 -356572 -147302 427970 848993 854355 797906 999654 1177693 932556 429775
33899 429775 115210 51732 55620 197930 568150 802587 556958 260228 598137 1346538
33889 1346538 1621890 1328294 1360452 2126682 2879698 2977692 2877635 3242653 3877168 4294840
33879 4294840 4667286 5436635 6583731 8027916 10101898 12855691 15782829 19362902
$$ packed form
33950a90990m93413p60843j1044P52718N89845m1729k44546k5930J06996J75628
33940a43308M74620P57164N45263O283k47401r8767O733j55797l64125m53386
33930C27279m57351k71583K35589P47057P13633J53894k88971k31945p9q461j70985
33919G48077j98417j11615j34875k93775l82143k35976Q1313L00793J85074j31530
33909a73074j83498K09270N75272M21023N362n6449K01748J78039k45137n02781
33899D29775l14565o3478L888J42310L70220K34437k45629k96730L37909P48401
33889A346538K75352k93596L2158P66230P53016R7994j00057L65018O34515M17672
33879D294840L72446P69349J147096J444185K073982K753793K927138L580073
$$ plain form
33871 19362902 25758075 35843722 45819019 49278356 43675640 33146150 23917847 18363822
33863 18363822 14766658 11379821 8493365 6843827 6074194 5399595 4615656 3833074 2969263
33854 2969263 2022030 1336972 1177680 1342316 1454049 1357949 1089338 733207 421855 224520
33844 224520 16956 -277012 -384547 5561 684837 1111259 1140833 1111021 1189392 1170978
33834 1170978 1011979 1007446 1243169 1378952 1214401 999026 928778 809248 514413 309044
33824 309044 358894 365000 100522 -89330 203898 760110 1022793 837131 461504 80353
33814 80353 -261542 -456604 -477225 -495918 -496294 -111780 669473 1050455 377693 -730145
33804 -730145 -1018922 -260463 540131 604191 203284 -122134 -327027 -514659 -542836 -395074
$$ packed form
33871A9362902O395173J0085647R975297L459337n602716j0529490r228303n554025
33863A8363822l597164l386837k886456j649538p69633o74599p83939p82582q63811
33854B969263r47233o85058j59292J64636J11733r6100k68611l56131l11352j97335
33844B24520k07564k93968j07535L90108O79276M26422K9574k9812P8371j8414
33834A170978j58999m533K35723J35783j64551k15375p0248j19530k94835k05369
33824C09044M9850O106k64478j89852K93228N56212K62683j85662l75627l81151
33814H0353l41895j95062k0621j8693l76L84514P81253L80982o72762j107838
33804g30145k88777P58459Q00594O4060m00907l25418k04893j87632k8177J47762
$$ plain form
33794 -395074 -370511 -510380 -373548 217749 748614 779953 615156 656652 592737 -79950
33784 -79950 -1040583 -1382444 -764852 262756 1015326 1227391 942719 407784 82098 260897
33774 260897 645949 700349 397794 160794 94390 -155471 -692545 -1074070 -933649 -454000
33764 -454000 -4730 291878 436111 408882 389242 697821 1244097 1448628 1059088 622639
33754 622639 699139 995684 873576 435970 387792 871129 1175707 784818 92572 -230033
33744 -230033 -104283 92427 167631 199803 209149 145974 97041 173157 269634 220342 97590
33733 97590 67395 41562 -183705 -488563 -510362 -206421 33063 -51263 -255744 -322760 -361403
33722 -361403 -585617 -858746 -831107 -458886 -111854 -135179 -452162 -630740 -307150 396789
$$ packed form
33794c95074K4563j39869J36832N91297N30865L1339j64797M1496o3915o72687
33784g9950r60633l41861O17592J027608P52570K12065k84672n34935l25686J78799
33774B60897L85052N4400l02555k37000o6404k49861n37074l81525J40421M79649
33764d54000M49270K96608J44233k7229j9640L08579N46276K04531l89540m36449
33754F22639P6500K96545j22108m37606m8178M83337L04578l90889o92246l22605
33744b30033J25750J96710P5204L2172R346o3175m8933P6116R6477m9292j22752
33733I7590l0195k5833k25267l04858k1799L03941K39484q4326k04481o7016l8643
33722c61403k24214k73129K7639L72221L47032k3325l16983j78578L23590P03939
$$ plain form
33712 396789 865732 554294 -370831 -1124557 -1138475 -615293 -138705 18065 -15326 -63537
33702 -63537 -45577 95440 293973 299051 12636 -214010 23205 540037 713907 324118
33692 324118 -133022 -116769 269838 479673 235180 -173636 -274574 21506 299570 129832
33682 129832 -365709 -634837 -440505 -188632 -300962 -571239 -513160 -114079 206780 238441
33672 238441 104880 -126538 -447442 -604637 -360797 -16091 -51433 -266695 -5963 670704
33662 670704 884513 298469 -263556 -48574 543846 754969 667476 819075 1131656 1117684
33652 1117684 843741 800154 959682 806171 266667 -156658 -206335 -94013 131423 669685
33642 669685 1281698 1302946 657040 165772 422247 925906 841255 175419 -359497 -378770
$$ packed form
33712C96789M68943l11438r25125p53726j3918N23182M76588J56770l3391m8211
33702f3537J7960J41017J98533N078k86415k26646K37215N16832J73870l89789
33692C24118m57140J6253L86607K09835k44493m08816j00938K96080K78064j69738
33682A29832m95541k69128J94332K51873j12330k70277N8079L99081L20859L1661
33672B38441j33561k31418l20904j57195K43840L44706l5342k15262K60732O76667
33662F70704K13809n86044n62025K14982N92420K11123q7493J51599L12581j3972
33652A117684k73943m3587J59528j53511n39504m23325m9677J12322K25436N38262
33642F69685O12013K1248o45906m91268K56475N03659q4651o65836n34916j9273
$$ plain form
33632 -378770 -155494 -20904 58357 218628 356792 247502 -86079 -262003 85053 781995
33622 781995 1152196 789666 145238 -20426 319152 462132 85833 -252662 -24019 415193
33612 415193 390066 -43250 -245544 -18718 172313 27500 -147497 -35826 142825 9729
33602 9729 -363307 -577986 -480229 -302041 -315986 -591025 -1020029 -1352514 -1259976 -645980
33592 -645980 92499 377777 98422 -294839 -433317 -489310 -777835 -1145951 -1124729 -629756
33582 -629756 -144763 -97335 -297545 -171336 546644 1467297 1864008 1326126 165059 -846390
33572 -846390 -1213967 -1134523 -1068773 -1077254 -881442 -494825 -345284 -630989 -941456 -800556
33562 -800556 -338179 -111352 -385665 -867748 -1096768 -888291 -415835 -22614 36069 -242539
$$ packed form
33632c78770K23276J34590P9261J60271J38164j09290l33581j75924L47056O96942
33622G81995L70201l62530o44428j65664L39578J42980l76299l38495K28643M39212
33612D15193k5127m33316k02294K26826J91031j44813j74997J11671J78651j33096
33602I729l73036k14679R7757J78188j3945k75039m29004l32485R2538O13996
33592f45980P38479K85278k79355l93261j38478n5993k88525l68116K1222M94973
33582f29756M84993M7428k00210J26209P17980R20653L96711n37882j161067j011449
33572h46390l67577P9444O5750q481J95812L86617J49541k85705l10467J40900
33562h00556M62377K26827k74313m82083k29020K08477M72456L93221N8683k78608
$$ plain form
33552 -242539 -670391 -1049217 -1211584 -994395 -424512 96173 109519 -337326 -756867 -891759
33542 -891759 -931241 -976680 -799641 -365908 -73329 -96598 -2521 489388 848619 494104
33532 494104 -163067 -227696 328843 665905 388251 3270 -87670 -216325 -687944 -1081519
33522 -1081519 -844120 -146532 369982 428950 258390 92460 -49130 -169314 -219021 -212439
33512 -212439 -218439 -261105 -335319 -421030 -387610 -56619 472502 719339 301552 -506204 -914891
33501 -914891 -432885 534383 1022979 521526 -432104 -836698 -382538 279312 505587 455992
33491 455992 573380 700455 369770 -213953 -269399 368962 876612 579251 -117709 -374598
33481 -374598 -53139 282626 220377 -107589 -322677 -119880 558246 1329402 1518636 871866
$$ packed form
33552b42539m27852l78826j62367K17189N69883N20685J3346m46845m19541j34892
33542h91759l9482m5439J77039M33733K92579k3269R4077M91909L59231l54515
33532D94104o57171o4629N56539L37062k77654l84981r0940j28655m71619l93575
33522a081519K37399O97588N16514N8968j70560j65930j41590j20184m9707O582
33512b12439o000m2666p4214q5711L3420L30991N29121K46837m17787q07756m08687
33501i14891M82006R67268M88596n01453r53630m04594M54160O61850K26275m9595
33491D55992J17388J27075l30685n83723n5446O38361N07650k97361o96960k56889
33481c74598L21459L35765o2249l27966k15088K02797O78126P71156J89234o46770
$$ plain form
33471 871866 14845 -165769 460678 1202076 1426725 1143434 708836 362386 189945 234729
33461 234729 415546 485302 261917 -145111 -446293 -494039 -437484 -543076 -855957 -1075507
33451 -1075507 -876899 -379718 -121208 -426364 -955033 -1090064 -684187 -168048 50710
33442 50710 10994 -28400 33773 119443 119346 -66393 -435475 -701335 -468628 170937 488553
33431 488553 -37526 -890758 -1028686 -209409 729584 1020923 806893 558104 269869 -227339
33421 -227339 -627281 -516784 -131770 -47624 -265345 -311029 -133373 -105060 -153786 194441
33411 194441 759159 678514 -188197 -788651 -379207 380389 551008 314563 358965 571941
33401 571941 421224 134892 344979 843882 846621 351697 113443 306311 361234 183263
$$ packed form
33471H71866q57021j80614O26447P41398K24649k83291m34598l46450j72441M4784
33461B34729J80817O9756k23385m07028l01182m7746N6555j05592l12881k19550
33451a075507J98608M97181K58510l05156n28669j35031M05877N16139K18758
33442E0710l9716l9394O2173Q5670r7j85739l69082k65860K32707O39565L17616
33431D88553n26079q53232j37928Q19277R38993K91339k14030k48789k88235m97208
33421b27339l99942J10497L85014Q4146k17721m5684J77656K8313m8726L48227
33411A94441N64718q0645q66711o00454M09444P59596J70619k36445M4402K12976
33401E71941j50717k86332K10087M98903K739m94924k38254J92868N4923j77971
$$ plain form
33391 183263 334386 791082 739603 31639 -316507 304375 1059006 962480 333882 90963
33381 90963 296193 339370 83941 -70131 28339 189443 322338 331714 -93241 -910089
33371 -910089 -1294004 -562394 714116 1327221 996460 514190 439484 529201 513875 551772
33361 551772 673335 550111 159809 24391 393573 763458 649834 337742 336925 482978
33351 482978 192485 -576809 -1206475 -1242351 -861792 -451947 -133248 132817 270296 174349
33341 174349 -56296 -174586 -60114 162090 281407 237607 191007 344570 675834 900538
33331 900538 783016 426442 117196 -70612 -288178 -515235 -473001 -109910 147242 -28781
33321 -28781 -275374 1558 689857 1043162 734521 263947 121236 107313 -154944 -520023
$$ packed form
33391A83263J51123M56696n1479p07964l48146O20882P54631r6526o28598k42919
33381I0963K05230M3177k55429j54072R8470J61104J32895R376m24955q16848
33371i10089l83915P31610J276510O13105l30761m82270p4706Q9717j5326L7897
33361E51772J21563j23224l90302j35418L69182L69885j13624l12092q17J46053
33351D82978k90493p69294o29666l5876L80559M09845L18699K66065J37479r5947
33341A74349k30645j18290J14472K22204J19317m3800m6600J53563L31264K24704
33331I00538j17522l56574l09246j87808k17566k27057M2234L63091K57152j76023
33321b8781k46593K76932O88299L53305l08641m70574j42711j3923k62257l65079
$$ plain form
33311 -520023 -606978 -435299 -273795 -122389 147385 353748 247158 44711 174888 568605
33301 568605 743055 564692 401588 492882 670093 769340 848563 895299 731033 303622
33291 303622 -258116 -873749 -1432507 -1590576 -1148445 -554259 -431865 -629855 -430991 234999
33281 234999 592154 266090 -103213 49116 270942 -99863 -768495 -914453 -458445 -105120
33271 -105120 -224211 -405130 -219138 137181 185819 -177525 -585867 -612164 -176908 369860
33261 369860 558162 272338 -105832 -118279 235440 494609 285113 -216841 -462805 -184086
33251 -184086 263781 347574 24837 -315959 -503114 -713259 -906351 -733049 -270045 -189103
33241 -189103 -704173 -996000 -392795 451320 464100 -208846 -544328 -324330 -261177 -506685
$$ packed form
33311e20023q6955J71679J61504J51406K69774K06363j06590k02447J30177L93717
33301E68605J74450j78363j63104R1294J77211R9247P9223M6736j64266m27411
33291C03622n61738o15633n58758j58069M42131N94186J22394j97990J98864O65990
33281B34999L57155l26064l69303J52329K21826l70805o68632j45958M56008L53325
33271a05120j19091j80919J85992L56319M8638l63344m08342k6297M35256N46768
33261C69860J88302k85824l78170j2447L53719K59169k09496n01954k45964K78719
33251a84086M47867Q3793l22737l40796j87155k10145j93092J73302M63004Q0942
33241a89103n15070k91827O03205Q44115J2780o72946l35482K19998O3153k45508
$$ plain form
33231 -506685 -334607 465070 1099446 1102331 1047583 1397387 1650494 1297898 750217 584129
33221 584129 601733 390813 203071 498196 1056375 1241333 847954 190086 -326006 -356258
33211 -356258 196811 805403 657569 -260226 -1016491 -1037258 -842549 -1003970 -1144914 -660850
33201 -660850 216196 810180 932879 756938 302601 -258242 -329816 322588 982676 904007
33191 904007 361337 61265 -2615 -288198 -710128 -759700 -351326 181632 666555 1032887
33181 1032887 1043273 731569 674301 1134277 1431654 948909 224046 117144 391858 204860
33171 204860 -382669 -578495 -328396 -366812 -804369 -881233 -340208 56321 -226978 -640320
33161 -640320 -436526 240341 661934 508427 141597 77491 431068 841954 918712 722240
$$ packed form
33231e06685J72078P99677O34376K885n4748L49804K53107l52596n47681j66088
33221E84129J7604k10920j87742K95125N58179J84958l93379o57868n16092l0252
33211c56258N53069O08592j47834r17795p56265k0767J94709j61421j40944M84064
33201f60850Q77046N93984J22699j75941m54337n60843p1574O52404O60088p8669
33191I04007n42670l00072o3880k85583m21930m9572M08374N32958M84923L66332
33181A032887J0386l11704n7268M59976K97377m82745p24863j06902K74714j86998
33171B04860n87529j95826K50099l8416m37557p6864N41025L96529k83299m13342
33161f40320K03794O76867M21593j53507l66830o4106L53577M10886P6758j96472
$$ plain form
33151 722240 623433 776326 1212368 2375755 4646187 7051211 7576372 5529769 2664416
33142 2664416 1029939 622780 282892 -53842 389216 1310751 1489245 797892 421743
33133 421743 876553 1275813 902911 203727 -215934 -438232 -620911 -536231 -167129 98450
33123 98450 214800 578420 1110090 1148221 583275 189513 439176 841143 855449 623944
33113 623944 361432 -145048 -909972 -1367623 -1180534 -813536 -775151 -844397 -582293 -136442
33103 -136442 10457 -212570 -410565 -243827 228103 558385 242515 -676031 -1391730 -1144922
33093 -1144922 -190706 494044 384549 -210956 -794270 -1080087 -873866 -246446 204124
33084 204124 -67726 -752618 -1087017 -903430 -577061 -173929 442082 844648 453798 -325809
$$ packed form
33151G22240r8807J52893M36042J163387K270432K405024N25161k046603k865353
33142B664416j634477m07159l39888l36734M43058R21535J78494o91353l76149
33133D21743M54810L99260l72902o99184m19661k22298j82679Q4680L69102K65579
33123I8450J16350L63620N31670L8131n64946l93762K49663M01967J4306k31505
33113F23944k62512n06480p64924m57651J87089L66998L8385o9246K62104M45851
33103a36442J46899k23027j97995J66738M71930L30282l15870r18546p15699K46808
33093a144922R54216O84750j09495n95505n83314k85817K06221O27420M50570
33084B04124k71850o84892l34399J83587L26369M03132O16011M02566l90850p79607
$$ plain form
33074 -325809 -462876 150564 604454 514479 466702 688423 511332 -381070 -1257517 -1419775
33064 -1419775 -1052773 -543617 112720 755206 832233 275884 -205412 -163861 54614 163542
33054 163542 382119 620996 269526 -628186 -1007402 -306043 571448 590787 41732 -186792
33044 -186792 -35818 -63934 -371347 -619789 -735926 -848822 -848619 -621185 -404621 -396889 -344390
33033 -344390 31359 542430 845292 887886 766060 535609 362680 394161 379330 7945
33023 7945 -358368 -88147 540221 558947 -106191 -397156 174584 761361 644018 293667
33013 293667 281777 258684 -134988 -361097 57474 537484 353822 -192343 -431466 -436922
33003 -436922 -592252 -746053 -685889 -776445 -1237763 -1462298 -959633 -320141 -303738 -610759
$$ packed form
33074c25809j37067O13440M53890q9975m7777K21721j77091q92402q76447j62258
33064a419775L67002N09156O56337O42486P7027n56349m81296M1551K18475J08928
33054A63542K18577K38877l51470q97712l79216P01359Q77491J9339n49055k28524
33044a86792J50974k8116l07413k48442j16137j12896K03K27434K16564P732N2499
33033c44390L75749N11071L02862M2594j21826k30451j72929L1481j4831l71385
33023G945l66313K70221O28368J8726o65138k90965N71740N86777j17343l50351
33013B93667j1890k3093l93672k26109M18571M80010j83662n46165k39123n456
33003d36922j55330j53801O0164r0556m61318k24535N02665O39492J6403l07021
$$ plain form
32993 -610759 -520728 -134096 21744 47616 310292 542913 321985 -25988 30529 257223
32983 257223 196086 154312 603327 1080569 810699 26542 -435263 -485562 -605596 -683178
32973 -683178 -247635 372148 367415 -175764 -406049 -167754 -155451 -559096 -723609 -369123
32963 -369123 -92593 -331995 -720162 -810297 -690775 -549288 -277339 153959 432341 310883
32953 310883 -79811 -477559 -733097 -759530 -551569 -277760 -113933 -43899 7035 42196
32943 42196 157789 497789 850941 753187 246778 -23622 207326 416760 280733 280538
32933 280538 721055 965475 462846 -195143 -175303 278854 416229 277748 366155 536350
32923 536350 348864 111401 403276 890996 787694 227232 7135 191149 183942 33841
$$ packed form
32993f10759R0031L86632J55840K5872K62676K32621k20928l47973N6517K26694
32983B57223o1137m1774M49015M77242k69870p84157m61805n0299j20034p7582
32973f83178M35543O19783m733n43179k30285K38295J2303m03645j64513L54486
32963c69123K76530k39402l88167r0135J19522J41487K71949M31298K78382j21458
32953C10883l90694l97748k55538k6433K07961K73809J63827P0034N0934L5161
32943D2196J15593L40000L53152r7754n06409k70400K30948K09434j36027j95
32933B80538M40517K44420n02629o57989J9840M54157J37375j38481Q8407J70195
32923E36350j87486k37463K91875M87720j03302n60462k20097J84014p207j50101
$$ plain form
32913 33841 384808 1154706 1510958 1247167 1003046 993669 696863 12257 -406522 -270549
32903 -270549 -62747 -28044 221984 747724 922886 481507 32080 51955 170639 -54175
32893 -54175 -367647 -335283 -25970 286852 575535 795372 669719 149142 -326478 -378330
32883 -378330 -153475 19336 83074 140707 228983 377586 572554 568726 120750 -509835
32873 -509835 -698646 -244873 363037 588907 399571 69707 -206905 -367990 -413729 -397736
32863 -397736 -325632 -106176 202477 247886 -209188 -857586 -1123912 -816250 -232744 226424
32853 226424 332031 140434 69414 546794 1316490 1503262 734648 -239031 -493263 -59876
32843 -59876 393085 551513 521562 321446 -15682 -141297 166042 529809 514034 301133
$$ packed form
32913C3841L50967P69898L56252k63791k44121r377k96806o84606m18779J35973
32903b70549K07802L4703K50028N25740J75162m41379m49427J9875J18684k24814
32893e4175l13472L2364L09313L12822K88683K19837j25653n20577m75620n1852
32883c78330K24855J72811O3738N7633Q8276J48603J94968l828m47976o30585
32873e09835j88811M53773O07910K25870j89336l29864k76612j61085m5739J5993
32863c97736P2104K19456L08653M5409m57074o48398k66326L07662N83506M59168
32853B26424J05607j91597p1020M77380P69696J86772p68614r73679k54232M33387
32843e9876M52961J58428k9951k00116l37128j25615L07339L63767j5775k12901
$$ plain form
32833 301133 266831 278704 48747 -219810 -207227 -100522 -173335 -182950 109112 305146 44136
32822 44136 -200117 133810 643222 610614 240597 217419 449442 367454 125360 322178
32812 322178 765121 701065 141099 -201690 -194542 -348735 -652034 -505361 113079 503037
32802 503037 366312 109519 -20822 -172649 -273178 -121915 -42092 -473096 -1010669 -876464
32792 -876464 -228266 94132 11341 188168 629609 587735 -41908 -507345 -546428 -690405
32782 -690405 -1016014 -879863 -221431 110890 -247465 -606977 -483785 -335714 -573600 -864257
32772 -864257 -882027 -771041 -422167 681628 2354612 3392840 2990332 1714606 577878
32763 577878 -101283 -441519 -393879 20418 441673 614173 656470 649547 473832 208471
$$ packed form
32833C01133l4302J1873k29957k68557J2583J06705p2813r615K92062J96034k61010
32822D4136k44253L33927N09412l2608l70017k3178K32023q1988k42094J96818
32812C22178M42943o4056n59966l42789P148j54193l03299J46673O18440L89958
32802E03037j36725k56793j30341j51827j00529J51263P9823m31004n37573J34205
32792h76464O48198L22398q2791J76827M41441m1874o29643m65437l9083j43977
32782f90405l25609J36151O58432L32321l58355l59512J23192J48071k37886k90657
32772h64257j7770J10986L48874J103795J672984J038228m02508j275726j136728
32763E77878o79161l40236M7640M14297M21255J72500M2297o923j75715k65361
$$ plain form
32753 208471 124730 197507 213131 317237 745916 1135120 972585 612656 804840 1288532
32743 1288532 1067739 156719 -266787 269110 819848 648065 319959 547509 1016492
32734 1016492 1095247 844103 629633 442215 190703 72685 187571 326104 429162 654092
32724 654092 833375 600650 170000 140039 405184 231279 -406922 -629966 -98955 407291
32714 407291 268865 -122125 -231559 -159713 -88172 155701 535937 654218 534963 693261
32704 693261 1092904 1004578 287358 -198649 68184 499144 476616 248179 172790 -4723
32694 -4723 -482617 -802983 -552501 5511 500259 979445 1433188 1510164 1165340 925088
32684 925088 1084701 1247283 988687 393824 -271475 -792217 -827972 -245796 350999 269035
$$ packed form
32753B08471q3741P2777J5624J04106M28679L89204j62535l59929J92184M83692
32743A288532k20793r11020m23506N35897N50738j71783l28106K27550M68983
32734A016492P8755k51144k14470j87418k51512j18018J14886J38533J03058K24930
32724F54092J79283k32725m30650k9961K65145j73905o38201k23044N31011N06246
32714D07291j38426l90990j09434P1846P1541K43873L80236J18281j19255J58298
32704F93261L99643q8326p17220m86007K66833M30960k2528k28437p5389j77513
32694d723m77894l20366K50482N58012M94748M79186M53743P6976l44824k40252
32684I25088J59613J62582k58596n94863o65299n20742l5755N82176N96795q1964
$$ plain form
32674 269035 -142741 10223 626778 773189 381813 375729 904460 974248 279865 -109027
32664 -109027 422263 917553 448385 -360052 -392736 279881 749301 637172 314965 216536
32654 216536 469281 825734 755870 116561 -319619 218499 1176546 1297132 496612 -80251
32644 -80251 104388 409592 393557 376147 404714 54441 -461270 -372510 183673 220661 -316247
32633 -316247 -382086 231782 469664 -19435 -222858 288180 474123 -296899 -1098665 -1078390
32623 -1078390 -758904 -783415 -744777 -224606 238752 127691 -191895 -297968 -336522 -309278
32613 -309278 86587 522239 260950 -380155 -289151 465821 654340 174569 330341 1331828
32603 1331828 1691482 871964 323687 876562 1271571 511556 -392438 -392147 -191270 -611941
$$ packed form
32674B69035m11776J52964O16555J46411l91376o084N28731O9788o94383l88892
32664a09027N31290M95290m69168q08437l2684O72617M69420j12129l22207r8429
32654B16536K52745L56453o9864o39309m36180N38118R58047J20586q00520n76863
32644h0251J84639L05204j6035j7410K8567l50273n15711Q8760N56183L6988n36908
32633c16247o5839O13868K37882m89099k03423N11038J85943p71022q01766K0275
32623a078390L19486k4511L8638N20171M63358j11061l19586j06073l8554K7244
32613c09278L95865M35652k61289o41105R1004P54972J88519m79771J55772J001487
32603A331828L59654q19518n48277N52875L95009p60015r03994K91K00877m20671
$$ plain form
32593 -611941 -949902 -445990 208943 244503 157745 412308 370609 -227212 -350932 481064
32583 481064 1083427 583105 -132998 -174792 -124758 -503667 -549872 153639 619902 322537
32573 322537 265859 905479 1008226 -1882 -650298 68752 860644 478263 -176929 -30849
32563 -30849 194978 -190019 -201728 685188 932339 -406559 -1539674 -719920 837368
32554 837368 1167797 734699 936808 1307852 797411 191912 683987 1507652 1417523 1015896
32544 1015896 1247272 1191602 -160188 -1497970 -1113282 212213 715808 605686 1037462
32535 1037462 1592605 1289244 756132 988766 1304266 825910 482072 1213963 1845980
32526 1845980 1142280 256603 645626 1337945 882328 175622 609041 1226272 591306
$$ packed form
32593f11941l37961N03912O54933L5560q6758K54563m1699n97821j23720Q31996
32583D81064O02363n00322p16103m1794N0034l78909m6205P03511M66263k97365
32573C22537n6678O39620J02747j010108o48416P19050P91892l82381o55192J46080
32563c0849K25827l84997j1709Q86916K47151j338898j133115Q19754J557288
32554H37368L30429m33098K02109L71044n10441o05499M92075Q23665r0129m01627
32544A015896K31376n5670j351790j337782L84688J325495N03595j10122M31776
32535A037462N55143l03361n33112K32634L15500m78356l43838P31891O32017
32526A845980p03700q85677L89023O92319m55617p06706M33419O17231o34966
$$ plain form
32517 591306 -286832 174506 1065031 742890 -41968 239148 855969 383043 -400676 -150316
32507 -150316 264717 -401599 -1002809 -97585 1104436 951749 462269 1106839 1696105
32498 1696105 770222 -211165 476513 1357565 546378 -470476 361993 1610530 1095212
32489 1095212 135397 880593 1963706 1164905 -140945 351773 1381715 819100 101579
32480 101579 1279277 2544635 1610085 457011 1582309 2832172 1460789 -195681
32472 -195681 980207 2603081 1199633 -854347 307606 2537368 1856860 302560
32464 302560 1776614 3962859 2707260 513766 1866405 4203086 2927320 996903
32456 996903 3357226 6528631 4858573 2162791 4908948 9119189 7652576 4833871
$$ packed form
32517E91306q78138M61338Q90525l22141p84858K81116O16821m72926p83719K50360
32507a50316M15033o66316o01210R05224J202021j52687m89480O44570N89266
32498A696105r25883r81387O87678Q81052q11187j016854Q32469J248537n15318
32489A095212r59815P45196J083113p98801j305850M92718J029942n62615p17521
32480A01579J177698J265358r34550j153074J125298J249863j371383j656470
32472a95681J175888J622874j403448k053980J161953K229762o80508j554300
32464C02560J474054K186245j255599k193494J352639K336681j275766j930417
32456I96903K360323L171405j670058k695782K746157M210241j466613k818705
$$ plain form
32448 4833871 8530689 13828598 12183917 10220119 18723381 29847844 30317826 30553179
32440 30553179 49271515 74514854 81819058 93433016 165525218 292853584 377626676
32433 377626676 337905599 213144097 112865447 83871722 82174645 63305813 38329536
32426 38329536 30885971 32288794 24799931 14218367 13220493 15911298 11411965 4965682
32418 4965682 6013939 9584679 6793085 1816393 2800290 6204784 4548041 778599
32410 778599 1647188 4566867 3405645 480055 1283738 3442449 1741764 -1391790 -660412
32401 -660412 1892901 1146227 -1223174 -453429 1841992 966961 -1674977 -1353734 1049442
32392 1049442 1068419 -943211 -1113752 446027 596808 -350749 224669 1485499 749225
$$ packed form
32448D833871L696818N297909j644681j963798Q503262J1124463M69982K35353
32440C0553179J8718336K5243339P304204J1613958P2092202J27328366Q4773092
32433C77626676l9721077j24761502j00278650k8993725j697077j8868832k4976277
32426C8329536p443565J402823p488863j0581564r97874K690805m499333o446283
32418D965682J048257L570740k791594m976692R83897L404494j656743l769442
32410G78599Q68589K919679j161222k925590Q03683K158711j700685l133554P31378
32401f60412K553313p46674k369401P69745K295421q75031k641938L21243K403176
32392A049442J8977k011630j70541J559779J50781r47557N75418J260830p36274
$$ plain form
32383 749225 -913151 -579373 818170 335199 -1246963 -1052143 269018 -16859 -1275083
32374 -1275083 -828117 704714 576177 -830257 -886249 259754 324151 -482967 -103230
32365 -103230 994994 550657 -1108716 -1602744 -747456 -367513 -588343 -64847 825561
32356 825561 624280 -122409 146429 771326 8512 -1476569 -1616097 -605929 -278897
32347 -278897 -639895 -272666 567977 462402 -252570 -98596 672533 691584 228847 557695
32337 557695 1331033 1288662 766175 889293 1177797 535043 -355994 -188422 462426 301389
32327 301389 -191990 40243 273968 -509910 -1199396 -426098 588764 53842 -981748
32318 -981748 -453465 854030 731640 -322190 -51573 1300096 1397082 31672 -639385
$$ packed form
32383G49225j662376L33778J397543m82971j582162J94820J321161k85877j258224
32374a275083M46966J532831j28537j406434n5992J146003O4397q07118L79737
32365a03230J098224m44337j659373m94028Q55288L79943k20830N23496Q90408
32356H25561k01281p46689K68838O24897p62814j485081j39528J010168L27032
32347b78897l60998L67229Q40643j05575p14972J53974P71129J9051m62737L28848
32337E57695P73338m2371n22487J23118K88504o42754q91037J67572O50848j61037
32327C01389m93379K32233K33725p83878o89486P73298J014862n34922j035590
32318i81748N28283J307495j22390j053830K70617J351669R6986j365410o71057
$$ plain form
32309 -639385 78466 688743 577837 701964 1155592 955821 306169 385539 941752 685513
32299 685513 -132904 -178920 227676 -413430 -1793202 -2092297 -1178813 -735849 -1205489 -1333900
32289 -1333900 -831942 -808941 -1384648 -1420763 -824186 -699615 -1089893 -945193 -386547 -567535
32279 -567535 -1231466 -899718 367601 881368 208884 -274252 25795 166712 -176166
32270 -176166 -126552 437958 543223 89128 64740 523868 441958 -186963 -243409 319998
32260 319998 346827 -230051 -178628 661904 1025280 582644 447178 909338 889059 159697
32250 159697 -50369 713940 1347211 1229030 1096133 1297040 1115602 427183 137972 389213
32240 389213 181950 -648354 -959489 -394123 -84972 -642021 -1237559 -1303130 -1324314 -1334222
$$ packed form
32309f39385P17851O10277j10906J24127M53628j99771o49652P9370N56213k56239
32299F85513q18417m6016M06596o41106j379772k99095R13484M42964m69640j28411
32289a333900N01958K3001n75707l6115N96577J24571l90278J44700N58646j80988
32279e67535o63931L31748J267319N13767o72484m83136L00047J40917l42878
32270a76166M9614N64510J05265m54095k4388M59128q1910o28921n6446N63407
32260C19998K6829n76878N1423Q40532L63376m42636j35466M62160k0279p29362
32250A59697k10066P64309O33271j18181j32897K00907j81438o88419k89211K51241
32240C89213k07263q30304l11135N65366L09151n57049n95538o5571k1184r908
$$ plain form
32230 -1334222 -495774 1066887 1831857 1110789 56620 -334001 -562045 -1148511 -1453337
32221 -1453337 -933290 -186116 129797 181347 124407 -304225 -798753 -501200 415717 640474
32211 640474 -196842 -837048 -457738 94519 -70812 -492722 -494606 -406106 -700312 -1013626
32201 -1013626 -892927 -583534 -398101 -211291 -89549 -445688 -1126548 -1350348 -919728
32192 -919728 -479596 -323228 -61052 338005 400529 202675 276528 380507 -187013 -988690
32182 -988690 -829931 106710 336993 -424263 -798714 -258327 -50059 -865824 -1586766 -1292074
32172 -1292074 -650000 -307641 258470 1188925 1381021 432811 -305437 38965 309288
32163 309288 -514864 -1301223 -680411 492567 540938 -310522 -588000 -98254 125046 -154198
$$ packed form
32230a334222Q38448J562661P64970p21068j054169l90621k28044n86466l04826
32221a453337N20047P47174L15913N1550n6940m28632m94528K97553R16917K24757
32211F40474q37316o40206L79310N52257j65331m21910j884Q8500k94206l13314
32201a013626J20699L09393J85433J86810J21742l56139o80860k23800M30620
32192i19728M40132J56368K62176L99057O2524j97854P3853J03979n67520q01677
32182i88690J58759R36641K30283p61256l74451N40387K08268q15765p20942K94692
32172a292074O42074L42359N66111R30455J92096r48210p38248L44402K70323
32163C09288q24152p86359O20812J172978M8371q51460k77478M89746K23300k79244
$$ plain form
32153 -154198 -205569 113325 190013 -127691 -432144 -670858 -1048714 -1271237 -898663 -177436
32143 -177436 362100 745135 1152340 1212210 628391 -15306 -70983 46277 -419872 -1162057
32133 -1162057 -1213961 -459170 287895 495241 287204 -183993 -849517 -1352955 -1371731 -1198603
32123 -1198603 -1324538 -1610566 -1517473 -973932 -409848 -113669 -96883 -363177 -793332 -1015946
32113 -1015946 -870198 -701254 -756288 -680277 -116996 598426 914392 860330 788605 665843
32103 665843 254540 -235109 -289316 196495 784766 1004241 724630 181060 -185464 -117749
32093 -117749 137963 176268 40631 24933 -9373 -394966 -780081 -429330 443478 679996
32083 679996 -122620 -940332 -851706 -232459 196689 509467 970712 1215463 966893 810432
$$ packed form
32153a54198n1371L18894P6688l17704l04453k38714l77856k22523L72574P21227
32143a77436N39536L83035M07205N9870n83819o43697n5677J17260m66149p42185
32133a162057n1904P54791P47065K07346k08037m71197o65524n03438j8776J73128
32123a198603j25935k86028R3093N43541N64084K96179J6786k66294m30155k22614
32113a015946J45748J68944n5034P6011N63281P15422L15966n4062p1725j22762
32103F65843m11303m89649n4207M85811N88271K19475k79611n43570l66524O7715
32093a17749K55712L8305j35637j5698l4306l85593l85115L50751Q72808K36518
32083F79996q02616q17712Q8626O19247M29148L12778M61245K44751k48570j56461
$$ plain form
32073 810432 1268253 1744908 1405617 555154 83953 -17232 -452224 -1171278 -1284545 -481212
32063 -481212 440512 708157 508530 459715 649669 600998 34483 -636351 -733506 -205421
32053 -205421 228461 81089 -143009 233036 831085 716811 -15601 -269512 311320 799346
32043 799346 553076 164099 255064 440236 253924 129623 558461 1095277 1118925 864523
32033 864523 800461 679205 167597 -229054 84212 655798 668529 319103 414249 896139
32023 896139 896139 160474 -586261 -734761 -423246 -37919 213674 198555 -74390 -274804 -116050
32012 -116050 186452 238035 34579 -226220 -587930 -1054896 -1196520 -666119 129066 503780
32002 503780 428747 372435 423895 251206 -174422 -463949 -418075 -228093 -73032 55035
$$ packed form
32073H10432M57821M76655l39291q50463m71201j01185m34992p19054j13267Q03333
32063d81212R21724K67645j99627m8815J89954m8671n66515o70834r7155N28085
32053b05421M33882j47372k24098L76045N98049j14274p32412k53911N80832M88026
32043G99346k46270l88977R0965J85172j86312j24301M28838N36816K3648k54402
32033H64523o4062j21256n11608l96651L13266N71586J2731l49426R5146M81890
32023H96139%p35665p46735j48500L11515L85327K51593j5119k72945k00414J58754
32012a16050L02502N1583k03456k60799l61710m66966j41624N30401P95185L74714
32002E03780p5033n6312N1460j72689m25628k89527M5874J89982J55061J28067
$$ plain form
31992 55035 155435 202919 248544 251515 -15738 -599774 -1120842 -1196210 -878873 -420342 87533
31981 87533 554129 744194 624120 508166 567822 594566 518015 643485 1022531 1144520
31971 1144520 696855 106026 -132587 -129466 -154057 -106785 58789 13474 -288407 -285520 235657
31960 235657 570955 213655 -189397 120536 693324 613851 9958 -280132 -115560 -5510
31950 -5510 10308 284395 588521 362969 -179718 -300046 -8941 -9440 -388197 -479923 -100448
31939 -100448 199330 260217 572985 1138150 1175192 420606 -270921 -187331 218495 188744
31929 188744 -178977 -341410 -337549 -628939 -1170952 -1334235 -759463 140290 606959 275762
31919 275762 -517845 -1078080 -1017744 -579151 -232481 -90792 72361 342031 498590 337920
$$ packed form
31992E5035J00400M7484M5625K971k67253n84036n21068p5368L17337M58531N07875
31981H7533M66596J90065j20074j15954N9656K6744p6551J25470L79046J21989
31971A144520m47665n90829k38613L121k4591M7272J65574m5315l01881K887N21177
31960B35657L35298l57300m03052L09933N72788p9473o03893k90090J64572J10050
31950e510J5818K74087L04126k25552n42687j20328K91105m99l78757r1726L79475
31939a00448K99778O0887L12768N65165L7042p54586o91527Q3590M05826k9751
31929A88744l67721j62433L861k91390n42013j63283N74772Q99753M66669l31197
31919B75762p93607n60235O0336M38593L46670J41689J63153K69670J56559j60670
$$ plain form
31909 337920 -55658 -357620 -226043 388274 1038013 1117024 573891 10873 -116561 -17581
31899 -17581 -18214 13171 230005 252154 -326871 -1178651 -1614332 -1495034 -1183744 -856232 -516799
31888 -516799 -437060 -800241 -1069887 -558886 403757 738717 150801 -446752 -279999 305393
31878 305393 588728 507010 425465 384114 174160 -81088 34034 619058 1244240 1435639
31868 1435639 1204023 980248 1049956 1175466 921855 295400 -214593 -267474 -9738 317420
31858 317420 675598 907350 615003 -206485 -823273 -594447 117589 406027 -10129 -597821
31848 -597821 -836704 -717208 -499724 -427651 -620977 -919417 -975974 -782582 -791314 -1153876
31838 -1153876 -1267159 -609164 382663 922144 988142 1059477 1064511 542319 -264852 -472137
$$ packed form
31909C37920l93578l01962J31577O14317O49739P9011n43133n63018j27434R8980
31899a7581o33L1385K16834K2149n79025q51780m35681J19298L11290L27512L39433
31888e16799P9739l63181k69646N11001R62643L34960n87916n97553J66753N85392
31878C05393K83335q1718q1545m1351k09954k55248J15122N85024O25182J91399
31868A435639k31616k23775O9708J25510k53611o26455n09993n2881K57736L27158
31858C17420L58178K31752k92347q21488o16788K28826P12036K88438m16156n87692
31848e97821k38883J19496K17484P2073j93326k98440n6557J93392q732l62562
31838a153876j13283O57995R91827N39481O5998P1335N034n22192q07171k07285
$$ plain form
31828 -472137 165744 885635 1040334 830466 651685 432790 21992 -323666 -289651 -16752
31818 -16752 93958 -96425 -350166 -339237 24421 438848 459590 34923 -385534 -459490
31808 -459490 -372691 -383334 -355507 -176976 -197851 -639444 -949264 -494252 369083 716655
31798 716655 380186 43482 126703 393860 617729 804829 755824 226578 -429459 -582803
31788 -582803 -324100 -308307 -587830 -551138 -143256 -113856 -735321 -1251951 -1064351 -604577
31778 -604577 -509851 -668209 -637664 -401982 -199906 -115844 -235899 -684748 -1183352 -1159181
31768 -1159181 -613979 -248783 -415289 -649751 -585850 -517846 -606376 -400260 230106 532473
31758 532473 17472 -606127 -521247 -127103 -258325 -671742 -495152 174453 377310 -91013
$$ packed form
31828d72137O37881P19891J54699k09868j78781k18895m10798l45658L4015K72899
31818a6752J10710j90383k53741J0929L63658M14427K0742m24667m20457p3956
31808d59490Q6799j0643K7827J78531k0875m41593l09820M55012Q63335L47572
31798G16655l36469l36704Q3221K67157K23869J87100m9005n29246o56037j53344
31788e82803K58703J5793k79523L6692M07882K9400o21465n16630J87600M59774
31778f04577R4726j58358L0545K35682K02076Q4062j20055m48849m98604K4171
31768a159181N45202L65196j66506k34462O3901O8004q8530K06116O30366L02367
31758E32473n15001o23599Q4880L94144j31222m13417J76590O69605K02857m68323
$$ plain form
31748 -91013 -380028 -60816 200610 -173590 -726047 -733698 -275244 29759 -67658 -290374
31738 -290374 -337001 -140516 220565 564302 652435 421577 126226 124413 550164 1219341
31728 1219341 1763409 1858797 1479458 962965 692016 679186 606222 299046 -18997 -43825
31718 -43825 196314 414920 482478 554510 733285 814990 593181 305062 424984 930021
31708 930021 1146746 613181 -206820 -494200 -171241 92971 -78136 -309296 -191502 87414
31698 87414 140242 9319 29867 296382 563007 528768 60487 -650964 -1039661 -608289
31688 -608289 374497 989584 763019 267456 258343 600442 595590 105375 -312386 -314110 -164335
31677 -164335 -125801 -53838 151624 169070 -312270 -1081435 -1662167 -1878449 -1855503 -1619189
$$ packed form
31748i1013k89015L19212K61426l74200n52457p651M58454L05003r7417k22716
31738b90374m6627J96485L61081L43737Q8133k30858k95351j813M25751O69177
31728A219341N44068R5388l79339n16493k70949j2830p2964l07176l18043k4828
31718d3825K40139K18606O7558P2032J78775Q1705k21809k88119J19922N05037
31708I30021K16725n33565q20001k87380L22959K64212j71107k31160J17794K78916
31698H7414N2828j30923K0548K66515K66625l4239m68281p11451l88697M31372
31688f08289R82786O15087k26565m95563r113L42099m852m90215m17761j724J49775
31677a64335L8534P1963K05462J7446m81340p69165n80732k16282K2946K36314
$$ plain form
31667 -1619189 -1062255 -307606 198992 90533 -537840 -1200077 -1409515 -1026546 -349724
31658 -349724 116751 99010 -201556 -369704 -263415 -97693 -41582 30397 243336 400016
31648 400016 239321 -79665 -95568 296040 613166 399997 -149663 -440837 -265819 -78054
31638 -78054 -401018 -1116594 -1503545 -1013482 84193 946688 1032793 580257 172277 60570
31628 60570 100836 147716 197974 226723 182825 107347 2642 -308585 -874616 -1303356 -1190541
31617 -1190541 -767685 -623407 -831362 -928438 -749006 -607045 -574635 -343588 2856 -80482
31607 -80482 -557403 -581185 159319 736096 350596 -396468 -506689 -160054 -216659 -663518
31597 -663518 -750221 -381353 -169127 -208221 19415 479538 477961 -97741 -507002 -405641
$$ packed form
31667a619189N56934P54649N06598j08459o28373o62237k09438L82969O76822
31658c49724M66475j7741l00566j68148J06289J65722N6111P1979K12939J56680
31648D00016j60695l18986j5903L91608L17126k13169n49660k91174J75018J87765
31638g8054l22964p15576l86951M90063J097675Q62495Q6105m52536m07980j11707
31628F0570M0266M6880N0258K8749m3898p5478j04705l11227n66031m28740J12815
31617a190541M22856J44278k07955r7076J79432J41961L2410K31047L46444q3338
31607h0482m76921k3782P40504N76777l85500p47064j10221L46635n6605m46859
31597f63518q6703L68868K12226l9094K27636M60123j577n75702m09261J01361
$$ plain form
31587 -405641 -336950 -597396 -609068 36172 763075 867492 493408 147002 -145266 -540098
31577 -540098 -753854 -436091 158117 475247 407389 231335 49590 -208551 -412560 -338643
31567 -338643 -70519 80122 2083 -124928 -82637 226601 726385 1118368 1095488 764624
31557 764624 604073 806572 948766 584575 -75360 -404305 -150071 299410 393373 -29779
31547 -29779 -637342 -933651 -711874 -192527 305401 685720 915271 777909 164449 -525568
31537 -525568 -740403 -508006 -341405 -419135 -397069 -104544 157612 195587 238226 417778
31527 417778 457761 196201 -42233 62765 365663 592917 731958 772320 507019 -22635
31517 -22635 -308576 -51227 314603 253194 -31155 73585 625239 1044377 918425 433941
$$ packed form
31587d05641O8691k60446j1672O45240P26903J04417l74084l46406k92268l94832
31577e40098k13756L17763N94208L17130o7858j76054j81745k58141k04009P3917
31567c38643K68124J50641p8039j27011M2291L09238M99784L91983k2880l30864
31557G64624j60551K02499J42194l64191o59935l28945K54234M49481R3963m23152
31547b9779o07563k96309K21777N19347M97928L80319K29551j37362o13460o90017
31537e25568k14835K32397J66601p7730K2066K92525K62156L7975M2639J79552
31527D17778L9983k61560k38434J04998L02898K27254J39041M0362k65301n29654
31517b2635k85941K57349L65830o1409k84349J04740N51654M19138j25952m84484
$$ plain form
31507 433941 19151 -93337 44437 175844 40096 -316564 -532459 -397586 -140522 -42903
31497 -42903 -7727 192796 450033 456739 183254 -121473 -307812 -376710 -237908 210642
31487 210642 741476 870944 401613 -304821 -706836 -614202 -263352 29266 157084 170272
31477 170272 80707 -109499 -212114 50424 614667 996750 891427 617294 621196 753981
31467 753981 517769 -72688 -423658 -196881 287905 577844 555826 286680 -134761 -438282
31457 -438282 -320669 112863 443858 551413 659969 728694 407745 -224773 -537486 -253356
31447 -253356 143658 270546 469919 1075863 1642635 1551251 981184 624191 682103 736409
31437 736409 450069 -111530 -748083 -1291871 -1594331 -1645132 -1570172 -1322757 -676291 241979
$$ packed form
31507D33941m14790j12488J37774J31407j35748l56660k15895J34873K57064R7619
31497d2903L5176K00523K57237O706k73485l04727j86339o8898J38802M48550
31487B10642N30834J29468m69331p06434m02015R2634L50850K92618J27818J3188
31477A70272q9565j90206j02615K62538N64243L82083j05323k74133L902J32785
31467G53981k36212n90457l50970K26777M84786K89939k2018k69146m21441l03521
31457d38282J17613M33532L30995J07555J08556O8725l20949o32518l12713K84130
31447b53356L97014J26888J99373O05944N66772r1384n70067l56993N7912N4306
31437G36409k86340n61599o36553n43788l02460n0801P4960K47415O46466R18270
$$ plain form
31427 241979 816184 692543 273595 76278 24936 -149093 -258922 -30070 249301 144642
31417 144642 -113558 35222 497040 644643 395359 392964 963237 1564369 1556566 1004606
31407 1004606 414325 75350 -15412 119201 426051 663493 548404 85096 -402013 -623664
31397 -623664 -649603 -775737 -1056969 -1156301 -830027 -370068 -219983 -281442 -91713 334011
31387 334011 448907 97426 -174627 -38769 62342 -230074 -407953 135683 993816 1177153
31377 1177153 438306 -535586 -1109124 -1210802 -957177 -461184 -65982 -164921 -652083 -1014433
31367 -1014433 -1061908 -1120464 -1383033 -1497120 -1026935 -76910 744814 908827 464662 -12883
31357 -12883 -51380 161994 91858 -278429 -348588 150045 647681 558665 104579 -189671
$$ packed form
31427B41979N74205j23641m18948j97317n1342j74029j09829K28852K79371j04659
31417A44642k58200J48780M61818J47603k49284k395N70273O01132p803n51960
31407A004606n90281l38975r0762J34613L06850K37442j15089m63308m87109k21651
31397f23664k5939j26134k81232r9332L26274M59959J50085o1459J89729M25724
31387C34011J14896l51481k72053J35858J01111k92416j77879N43636Q58133J83337
31377A177153p38847r73892n73538j01678K53625M95993L95202r8939m87162l62350
31367a014433m7475n8556k62569j14087M70185R50025Q21724J64013m44165m77545
31357a2883l8497K13374p0136l70287p0159M98633M97636q9016m54086k94250
$$ plain form
31347 -189671 -336718 -571610 -613143 -57256 713072 860084 296027 -220502 -239351 -131852
31337 -131852 -308791 -600943 -662566 -467212 -178304 44526 -43636 -623978 -1411417 -1782859
31327 -1782859 -1461770 -774101 -175687 133894 122778 -133016 -353816 -264254 46872 264357
31317 264357 270126 87052 -407328 -1184638 -1645610 -1190274 -204829 245924 -167009 -644082
31307 -644082 -488394 -5350 184621 73524 1435 -49917 -343332 -827662 -1140697 -1044582
31297 -1044582 -614523 -164402 -110670 -623508 -1280153 -1401715 -874650 -270053 -35309 -44169
31287 -44169 -119123 -411007 -903475 -1085877 -616883 89409 428655 398817 332467 198704
31277 198704 -226932 -741334 -887833 -635277 -337479 -123130 140143 390027 461333 548223
$$ packed form
31347a89671j47047k34892m1533N55887P70328J47012n64057n16529j8849J07499
31337a31852j76939k92152o1623J95354K88908K22830q8162n80342p87439l71442
31327a782859L21089O87669N98414L09581j1116k55794k20800Q9562L11126K17485
31317B64357N769j83074m94380p77310m60972M55336R85445M50753m12933m77073
31307f44082J55688M83044J89971j11097p2089n1352k93415m84330l13035R6115
31297a044582M30059M50121N3732n12838o56645j21562N27065O04597K34744q860
31287d4169p4954k91884m92468j82402M68994P06292L39246k9838o6350j33763
31277A98704m25636n14402j46499K52556K97798K14349K63273K49884P1306Q6890
$$ plain form
31267 548223 932158 1285810 993397 250908 4344 491879 725375 10778 -815714 -580228
31257 -580228 340288 460508 -621319 -1631943 -1458501 -552862 -7198 -76572 -318458
31248 -318458 -566783 -923296 -1126511 -758682 23421 626563 815523 801683 680886 412306
31238 412306 226248 350065 419960 -48414 -644400 -436779 523076 1065762 582328 -147349
31228 -147349 -283002 -112632 -239787 -469234 -363995 -195087 -384197 -567149 -208513 302132
31218 302132 208907 -297538 -413252 -139151 -207998 -647001 -612769 142313 752146 583130
31208 583130 148483 160245 450701 439992 92202 -211641 -359092 -498531 -583598 -403698
31198 -403698 28959 444935 617271 523527 302512 167286 270819 590142 981705 1275515
$$ packed form
31267E48223L83935L53652k92413p42489k46564M87535K33496p14597q26492K35486
31257e80228R20516J20220j081827j010624J73442R05639N45664o9374k41886
31248c18458k48325l56513k03215L67829P82103O03142J88960j3840j20797k68580
31238D12306j86058J23817O9895m68374n95986K07621R59855N42686m83434p29677
31228a47349j35653J70370j27155k29447J05239J68908j89110j82952L58636N10645
31218C02132r3225n06445j15714K74101o8847m39003L4232P55082O09833j69016
31208E83130m34647J1762K90456j0709l47790l03843j47451j39439q5067J79900
31198d03698M32657M15976J72336r3744k21015j35226J03533L19323L91563K93810
$$ plain form
31188 1275515 1241363 687649 -184640 -772534 -732785 -417191 -298280 -272107 -19329 254307
31178 254307 92161 -396260 -696811 -750805 -910817 -1093563 -791545 -18718 538347 503538
31168 503538 250642 173081 193304 202830 315607 450072 307088 -18742 -73235 114378
31158 114378 -24336 -550686 -741713 -240082 356556 552557 751121 1323748 1671221 1093644
31148 1093644 34804 -477528 -285809 -108223 -305101 -504628 -412118 -218747 -111406
31139 -111406 4247 142311 80528 -252543 -556076 -482386 -29954 430817 458485 -33303
31129 -33303 -591059 -668298 -328803 -191540 -547516 -936156 -844811 -418309 -137653 -171344
31119 -171344 -421082 -833319 -1219775 -1126596 -421516 260179 237463 -231860 -297037 234776
$$ packed form
31188A275515l4152n53714q72289n87894L9749L15594J18911K6173K52778K73636
31178B54307j62146m88421l00551n3994j60012j82746L02018P72827N57065l4809
31168E03538k52896p7561K0223R526J12777J34465j42984l25830n4493J87613
31158A14378j38714n26350j91027N01631N96638J96001J98564N72627L47473n77577
31148A093644j058840n12332J91719J77586j96878j99527R2510J93371J07341
31139a11406J15653J38064o1783l33071l03533P3690M52432M60771K7668m91788
31129c3303n57756p7239L39495J37263l55976l88640R1345M26502K80656l3691
31119a71344k49738m12237l86456R3179P05080O81695k2716m69323o5177N31813
$$ plain form
31109 234776 627580 295003 -399839 -682330 -349717 96021 160861 -71585 -162754 20509
31099 20509 113883 -158423 -470909 -329412 140061 335747 89262 -132309 -9110 253881
31089 253881 481979 782119 975164 530676 -473678 -1046894 -559071 291509 475285
31080 475285 43591 -220623 -71084 137715 257899 311866 -34575 -989125 -1832655 -1623069
31070 -1623069 -616694 35103 -2845 61937 614723 957885 587005 73840 26034 31680
31060 31680 -564309 -1437517 -1663288 -992200 -64338 451684 400539 9329 -311588 -192314
31050 -192314 270346 467427 2638 -741037 -1111159 -1020892 -853274 -754013 -550104 -296498
31040 -296498 -360854 -852515 -1364019 -1446919 -1093985 -633328 -354627 -354113 -583490 -910800
$$ packed form
31109B34776L92804l32577o94842k82491L32613M45738O4840k32446r1169J83263
31099B0509R3374k72306l12486J41497M69473J95686k46485k21571J23199K62991
31089B53881K28098L00140J93045m44488j004354n73216M87823Q50580J83776
31080D75285m31694k64214J49539K08799J20184N3967l46441r54550q43530K09586
31070a623069J006375O51797l7948O4782N52786L43162l70880n13165m7806N646
31060C1680n95989q73208k25771O71088R27862N16022n1145l91210l20917J19274
31050a92314M62660J97081m64789p43675l70122R0267J67618R9261K03909K53606
31040b96498o4356m91661n11504q2900L52934M60657K78701N14k29377l27310
$$ plain form
31030 -910800 -1175486 -1245325 -1052461 -662580 -329292 -305105 -487103 -454155 -55060 258331
31020 258331 9064 -555225 -729708 -335910 56722 1437 -253066 -344481 -457416 -898118
31010 -898118 -1352048 -1236187 -694501 -526449 -975798 -1271125 -758676 61871 211954 -398773
31000 -398773 -941364 -872873 -499211 -267818 -136653 82504 258473 216864 155068 356172
30990 356172 662755 633590 164453 -390277 -725494 -911795 -1123447 -1283349 -1178110 -848138
30980 -848138 -657128 -870105 -1253163 -1293099 -874204 -511863 -691733 -1143537 -1126669 -405133
30970 -405133 457395 860501 828500 718773 653864 575322 577428 761116 881643 562553
30960 562553 -128419 -664398 -700304 -450095 -300810 -287542 -169961 78568 124823 -285102
$$ packed form
31030i10800k64686o9839J92864L89881L33288K4187j81998L2948L99095L13391
31020B58331k49267n64289j74483L93798L92632n5285k54503r1415j12935m40702
31010h98118m53930J15861N41686J68052m49349k95327N12449Q20547J50083o10727
31000c98773n42591O8491L73662K31393J31165K19157J75969m1609o1796K01104
30990C56172L06583k9165m69137n54730l35217j86301k11652j59902J05239L29972
30980h48138J91010k12977l83058l9936M18895L62341j79870m51804J6868P21536
30970d05133Q62528M03106l2001j09727o4909p8542K106J83688J20527l19090
30960E62553o90972n35979l5906K50209J49285J3268J17581K48529M6255m09925
$$ plain form
30950 -285102 -895885 -1166256 -930461 -611625 -643737 -896989 -941049 -725206 -616290 -779448
30940 -779448 -928846 -800155 -502551 -231386 24805 263545 279606 3602 -229108 -103739
30930 -103739 162553 123882 -179526 -241422 120056 390614 30327 -690146 -864607 -33740
30920 -33740 1141925 1546452 897953 54096 -82144 405200 818705 905725 986594 1183637
30910 1183637 1193043 905103 632060 516199 273084 -212812 -578003 -593193 -563203 -716107
30900 -716107 -706035 -237646 254363 160519 -372226 -682586 -565517 -391638 -373735 -320310
30890 -320310 -134779 -40656 -197101 -438962 -483550 -191363 333173 732378 658722 243952
30880 243952 33319 205705 249699 -198273 -645173 -461501 69723 170373 -206129 -392986
$$ packed form
30950b85102o10783k70371K35795L18836l2112k53252m4060K15843J08916j63158
30940g79448j49398J28691K97604K71165K56191K38740J6061k76004k32710J25369
30930a03739K66292l8671l03408o1896L61478K70558l60287p20473j74461Q30867
30920c3740J175665M04527o48499q43857j36240M87344M13505Q7020Q0869J97043
30910A183637R406k87940k73043j15861k43115m85896l65191j5190K9990j52904
30900g16107J0072M68389M92009r3844n32745l10360J17069J73879J7903N3425
30890c20310J85531R4123j56445k41861m4588K92187N24536L99205p3656m14770
30880B43952k10633J72386M3994m47972m46900J83672N31224J00650l76502j86857
$$ plain form
30870 -392986 -168963 -40815 -283391 -509400 -413152 -227936 -169353 -65123 159771 225455
30860 225455 52123 9830 253913 353113 3871 -380615 -291086 77567 193784 60607
30850 60607 144644 575016 936849 862137 435215 -30066 -330301 -429801 -359776 -132712
30840 -132712 249960 639936 657324 35970 -885683 -1335365 -939311 -120996 490888 740919
30830 740919 813361 772300 609831 517994 688881 942850 928269 649281 460257 536323
30820 536323 656197 569048 339136 237792 427185 785358 963646 680417 86464 -259974
30810 -259974 15144 600020 827403 482976 1377 -199437 -261586 -546946 -983414 -1113571
30800 -1113571 -785803 -441763 -516563 -784106 -630960 62471 671766 600663 29217 -356188
$$ packed form
30870c92986K24023J28148k42576k26009R6248J85216N8583J04230K24894O5684
30860B25455j73332m2293K44083R9200l49242l84486Q9529L68653J16217j33177
30850F0607Q4037M30372L61833p4712m26922m65281l00235r9500P0025K27064
30840a32712L82672L89976J7388o21354r21653m49682L96054Q18315O11884K50031
30830G40919P2442m1061j62469r1837J70887K53969j4581k78988j89024P6066
30820E36323J19874q7149k29912j01344J89393L58173J78288k83229n93953l46438
30810b59974K75118N84876K27383l44427m81599k00814o2149k85360m36468j30157
30800a113571L27768L44040p4800k67543J53146O93431O09295p1103n71446l85405
$$ plain form
30790 -356188 -213420 160112 312596 130976 -179486 -383649 -406307 -356894 -397695 -523457
30780 -523457 -544321 -391088 -293939 -461061 -722075 -756425 -550128 -306533 -33255 352730
30770 352730 576459 207542 -585018 -1019244 -689861 -109742 52422 -152917 -265854 -253522
30760 -253522 -481219 -968321 -1202101 -801698 -52706 364773 69960 -629823 -1015509 -713615
30750 -713615 -191385 -271069 -1072596 -1768858 -1612398 -866763 -359698 -394957 -586144 -604556
30740 -604556 -536717 -484488 -330390 -75686 -30246 -435016 -1116342 -1673059 -1840027 -1585904
30730 -1585904 -1053051 -506763 -185498 -115469 -174564 -309364 -503885 -586792 -355134 90611
30720 90611 424676 548792 650835 746046 539777 -69045 -690828 -915962 -826183 -768407
$$ packed form
30790c56188J42768L73532J52484j81620l10462k04163k2658M9413m0801j25762
30780e23457k0864J53233R7149j67122k61014l4350K06297K43595K73278L85985
30770C52730K23729l68917p92560m34226L29383N80119J62164k05339j12937J2332
30760b53522k27697m87102k33780M00403P48992M17479k94813o99783l85686L01894
30750g13615N22230p9684q01527o96262J56460P45635N07065l5259j91187j8412
30740f04556O7839N2229J54098K54704M5440m04770o81326n56717j66968K54123
30730a585904N32853N46288L21265P0029n9095j34800j94521q2907K31658M45745
30720I0611L34065J24116J02043R5211k06269o08822o21783k25134Q9779N7776
$$ plain form
30710 -768407 -829106 -806578 -551678 -105861 352187 519951 150788 -566204 -1056457 -1037821
30700 -1037821 -854575 -830100 -667431 -4159 747670 813601 215823 -186032 118097 711721
30690 711721 1005939 933346 659651 232133 -138086 -15347 596621 1006695 727284 197416
30680 197416 116521 451297 685948 729739 896252 1157850 1111262 670903 208934 -27679
30670 -27679 -128025 -126710 79490 353241 334887 -48949 -490819 -769614 -909272 -861398
30660 -861398 -510980 -62922 76842 -83066 -121664 49150 -8425 -486777 -917311 -851994
30650 -851994 -482412 -208410 -22299 246970 441313 319212 64723 84150 409127 672902
30640 672902 594813 195972 -356117 -840082 -1023251 -877047 -681555 -716359 -930858 -1067505
$$ packed form
30710g68407o0699K2528K54900M45817M58048J67764l69163p16992m90253J8636
30700a037821J83246K4475J62669O63272P51829O5931n97778m01855L04129N93624
30690G11721K94218p2593k73695m27518l70219J22739O11968M10074k79411n29868
30680A97416q0895L34776K34651M3791J66513K61598m6588m40359m61969k36613
30670b7679j00346J315K06200K73751j8354l83836m41870k78795j39658M7874
30660h61398L50418M48058J39764j59908l8598J70814n7575m78352m30534O5317
30650h51994L69582K74002J86111K69269J94343j22101k54489J9427L24977K63775
30640F72902p8089l98841n52089m83965j83169J46204J95492l4804k14499j36647
$$ plain form
30630 -1067505 -977669 -675739 -246559 152812 363027 407455 423765 373152 129789 -83380
30620 -83380 190237 887782 1289862 987624 512633 526218 810974 699316 209184 3172
30610 3172 281683 461112 132252 -267326 -92149 568415 981597 684921 3559 -388497
30600 -388497 -242243 93049 240690 284794 478238 674240 476754 -69291 -427812 -343679
30590 -343679 -200237 -385527 -743625 -945705 -994008 -1015643 -931351 -699763 -550580 -604027
30580 -604027 -592364 -325282 -62519 -22081 71372 456961 761303 543130 77202 -54743
30570 -54743 109081 81351 -170107 -221337 -16264 39378 -142376 -124732 326332 850296
30560 850296 1017973 833216 544198 286129 69210 -88048 -117045 61907 373555 463936
$$ packed form
30630a067505Q9836L01930M29180L99371K10215M4428J6310n0613k43363k13169
30620h3380K73617O97545M02080l02238m74991J3585K84756j11658m90132k06012
30610C172K78511J79429l28860l99578J75177O60564M13182k96676o81362l92056
30600c88497J46254L35292J47641M4104J93444J96002j97486n46045l58521Q4133
30590c43679J43442j85290l58098k02080m8303k1635Q4292K31588J49183n3447
30580f04027J1663K67082K62763M0438R3453L85589L04342k18173m65928j31945
30570e4743J63824k7730k51458n1230K05073N5642j81754J7644M51064N23964
30560H50296J67677j84757k89018k58069k16919j57258k8997J78952L11648R0381
$$ plain form
30550 463936 63759 -452794 -383721 204731 337015 -494873 -1490140 -1675913 -1208739 -778767
30540 -778767 -403794 178206 496899 -44767 -896811 -967599 -335154 -82495 -497009 -774874
30530 -774874 -604691 -648331 -1122008 -1231134 -554398 158404 177299 -203672 -429152 -529742
30520 -529742 -632908 -495470 -98498 101889 31670 251767 846153 1012452 394151 -152478
30510 -152478 94773 526302 265125 -374051 -511303 -162299 -39917 -346048 -708257 -951928
30500 -951928 -1071007 -783327 46349 849415 995031 681815 486103 420491 205151 47345
30490 47345 277175 553005 329545 -153823 -232688 83058 253477 217473 330469 468968
30480 468968 148126 -552252 -1078765 -1336769 -1634488 -1803682 -1365388 -542208 -70010 46010
$$ packed form
30550D63936m00177n16553O9073N88452J32284q31888r95267j85773M67174M29972
30540g78767L74973N82000L18693n41666q52044p0788O32445K52659m14514k77865
30530g74874J70183m3640m73677j09126O76736P12802J8895l80971k25480j00590
30520e29742j03166J37438L96972K00387p0219K20097N94386J66299o18301n46629
30510a52478K47251M31529k61177o39176j37252L49004J22382l06131l62209k43671
30500i51928j19079K87680Q29676Q03066J45616l13216j95712o5612k15340j57806
30490D7345K29830K75830k23460m83368p8865L15746J70419l6004J12996J38499
30480D68968l20842p00378n26513k58004k97719j69194M38294Q23180M72198J16020
$$ plain form
30470 46010 498962 1268164 1426385 718663 158831 438273 787349 246731 -765181 -1121400
30460 -1121400 -652217 -138347 49061 305495 807297 1042654 600103 -136699 -429607
30451 -429607 -49813 559326 853739 717194 422892 215987 85123 -33199 -23283 231789
30441 231789 550051 600183 329470 -16540 -285652 -528270 -691383 -550592 -75876 423794
30431 423794 670432 679010 521068 130750 -436908 -835050 -819356 -621282 -594827 -634082
30421 -634082 -351965 187920 392858 -19115 -508252 -409828 122282 356037 71653 -155320
30411 -155320 116507 537121 552900 179960 -234836 -600012 -889620 -767116 -104275 429094
30401 429094 147538 -464418 -349794 379849 496662 -308693 -763846 -39102 816365 524035
$$ packed form
30470D6010M52952P69202J58221p07722n59832K79442L49076n40618j011912l56219
30460a121400M69183N13870J87408K56434N01802K35357m42551p36802k92908
30451d29607L79794O09139K94413j36545k94302k06905j30864j18322R916K55072
30441B31789L18262N0132k70713l46010k69112k42618j63113J40791M74716M99670
30431D23794K46638Q578j57942l90318n67658l98142J5694J98074K6455l9255
30421f34082K82117N39885K04938m11973m89137R8424N32110K33755k84384k26973
30411a55320K71827M20614J5779l72940m14796l65176k89608J22504O62841N33369
30401D29094k81556o11956J14624P29643J16813q05355m55153P24744Q55467k92330
$$ plain form
30391 524035 -333438 -238570 837865 1416798 746649 -313248 -769316 -644114 -336204
30382 -336204 113148 619039 744413 364460 61559 333048 828997 850046 301125 -266039
30372 -266039 -378856 -91056 213273 277599 249016 473080 934843 1104284 608333 -158158
30362 -158158 -506920 -372041 -245685 -323021 -323980 -157217 -96887 -163319 37173 605452 1036957
30351 1036957 921018 487572 153303 -46019 -247283 -389952 -429969 -596388 -1038390 -1448089
30341 -1448089 -1407464 -957428 -501037 -253168 -74310 205075 527449 675267 478011 -12661
30331 -12661 -492040 -620997 -332254 136479 509791 691114 746706 776630 764426 513399
30321 513399 -101653 -744635 -802324 -205462 289345 51167 -515857 -570613 -81051 237196
$$ packed form
30391E24035q57473R4868J076435N78933o70149j059897m56068J25202L07910
30382c36204M49352N05891J25374l79953l02901K71489M95949K1049n48921n67164
30372b66039j12817K87800L04329O4326k8583K24064M61763J69441m95951p66491
30362a58158l48762J34879J26356p7336r59J66763O0330o6432K00492N68279M31505
30351A036957j15939m33446l34269j99322k01264j42669m0017j66419m42002m09699
30341a448089M0625M50036M56391K47869J78858K79385L22374J47818j97256m90672
30331a2661m79379j28957K88743M68733L73312J81323N5592K9924j2204k51027
30321E13399o15052o42982n7689N96862M94807k38178n67024n4756M89562L18247
$$ plain form
30311 237196 112638 38670 302255 481313 215084 -170499 -194063 111093 406360 510459
30301 510459 354214 -109050 -640338 -759546 -369732 24447 15804 -154738 -51262 308498
30291 308498 577847 541462 169692 -462367 -1042469 -1150172 -779733 -380678 -166307 139448
30281 139448 589126 649481 42650 -596481 -545045 -51472 137371 -23003 52786 474525
30271 474525 679649 390077 28509 -3594 131423 110866 -88140 -364296 -717414 -1045605
30261 -1045605 -1036184 -519146 250611 814482 876950 440359 -189399 -513125 -239608 356212
30251 356212 730190 755031 806468 1116677 1413347 1360207 1018830 645937 311228 -21080
30241 -21080 -252758 -276817 -186421 -97825 88007 457375 741292 566220 47400 -222884
$$ packed form
30311B37196j24558p3968K63585J79058k66229l85583k3564L05156K95267J04099
30301E10459j56245m63264n31288j19208L89814L94179q643j70542J03476L59760
30291C08498K69349l6385l71770o32059n80102j07703L70439L99055K14371L05755
30281A39448M49678O0355o06831o39131N1436M93573J88843j60374P5789M21739
30271D74525K05124k89572l61568l2103J35017k0557j99006k76156l53118l28191
30261a045605R421N17038P69757N63871O2468m36591o29758l23726K73517N95820
30251C56212L73978K4841N1437L10209K96670n3140l41377l72893l34709l32308
30241b1080k31678k4059R0396Q8596J85832L69368K83917j75072n18820k70284
$$ plain form
30231 -222884 98109 657473 855071 536046 38908 -296705 -424069 -439632 -377155 -216709
30221 -216709 25116 266750 374448 246542 -14834 -92853 191799 546493 470249 -95849
30211 -95849 -627865 -642715 -237266 143493 253817 165847 42468 24290 168385 258663
30201 258663 -115187 -958586 -1538324 -1106842 77336 915052 728489 -60495 -643612
30192 -643612 -787681 -812093 -935982 -1026434 -886516 -514554 -99727 93883 -90326 -511249
30182 -511249 -813438 -819382 -732407 -819654 -1017010 -1037361 -798545 -527647 -432768 -467191 -491130
30171 -491130 -498075 -528537 -468367 -173297 189814 209040 -184670 -445427 -64993 659282
30161 659282 964541 689594 437110 544357 542433 23743 -554642 -552118 -188783 -160701
$$ packed form
30231b22884L20993N59364J97598l19025m97138l35613j27364j5563O2477J60446
30221b16709K41825K41634J07698j27906k61376p8019K84652L54694p6244n66098
30211i5849n32016j4850M05449L80759J10324q7970j23379j8178J44095R0278
30201B58663l73850q43399n79738M31482J184178Q37716j86563p88984n83117
30192f43612j44069k4412j23889r0452J39918L71962M14827J93610j84209m20923
30182e11249l02189n944Q6975q7247j97356k0351K38816K70898R4879l4423k3939
30171d91130o945l0462O0170K95070L63111J9226l93710k60757L80434P24275
30161F59282L05259k74947k52484J07247j924n18690n78385K524L63335K8082
$$ plain form
30151 -160701 -477718 -510397 -115388 138357 -19138 -128410 141164 414073 288332 8280
30141 8280 -6208 149242 124628 -63363 -130411 -17525 108771 175272 194235 93715 -166998
30130 -166998 -454889 -644292 -768413 -837458 -754592 -571531 -515456 -573293 -422038 -16107
30120 -16107 192581 -28018 -214937 53263 379644 178170 -234027 -3274 873117 1389973
30110 1389973 959363 222104 33625 260032 162166 -406811 -847280 -755726 -438688 -374885
30100 -374885 -588668 -758393 -657269 -266736 318103 822857 801208 68256 -890049 -1281405
30090 -1281405 -860710 -134450 355781 589922 748837 769619 581557 435706 518408 486170
30080 486170 -50655 -726692 -751717 -71886 432071 103344 -651821 -945068 -432911 477632
$$ packed form
30151a60701l17017l2679L95009K53745j57495j09272K69574K72909j25741k80052
30141H280j4488J55450k4614j87991o7048J12886J26296O6501J8963j00520k60713
30130a66998k87891j89403j24121o9045Q2866J83061N6075n7837J51255M05931
30120a6107K08688k20599j86919K68200L26381k01474m12197K30753Q76391N16856
30110A389973m30610p37259j88479K26407r7866n68977m40469R1554L17038O3803
30100c74885k13783j69725J01124L90533N84839N04754k1649p32952r58305l91356
30090a281405M20695P26260M90231K34141J58915K0782j88062j45851Q2702l2238
30080D86170n36825o76037k5025O79831N03957l28727p55165k93247N12157R10543
$$ plain form
30070 477632 1130725 1136624 663900 336150 565334 994277 990173 614481 494886 725484
30060 725484 696761 249571 122936 753421 1424894 1312483 724000 496992 682335 725273
30050 725273 577300 654385 877193 720789 198224 -111349 -88425 -243525 -677331 -738245
30040 -738245 -86311 642250 725418 343330 144690 246307 236629 -43044 -245465 -25711
30030 -25711 541779 1095929 1353291 1306526 1128621 899658 509638 -69659 -565933 -700007
30020 -700007 -565202 -376104 23986 878771 1727464 1550324 34025 -1795681 -2647182
30011 -2647182 -2343569 -1690556 -1256406 -879524 -343979 60518 -68715 -609127 -993012
30002 -993012 -867361 -463507 -263011 -418790 -643582 -674042 -660614 -906519 -1307447 -1357105
$$ packed form
30070D77632O53093N899m72724l27750K29184M28943m104l75692j19595K30598
30060G25484k8723m47190j26635O30485O71473j12411n88483k27008J85343M2938
30050G25273j47973P7085K22808j56404n22565l09573K2924j55100m33806o0914
30040g38245O51934P28561Q3168l82088j98640J01617r678k79673k02421K19754
30030b5711N67490N54150K57362m6765j77905k28963l90020n79297m96274j34074
30020g00007J34805J89098M00090Q54785Q48693j77140j516299j829706q51501
30011b647182L03613O53013M34150L76882N35545M04497j29233n40412l83885
30002i93012J25651M03854K00496j55779k24792l0460J3428k45905m00928m9658
$$ plain form
29992 -1357105 -813951 -111574 108017 -264978 -744490 -847099 -547199 -161699 22717
29983 22717 -26921 -102325 46943 435455 764915 728197 371344 17187 -150062 -221344
29973 -221344 -252961 -95517 278179 497518 170643 -530914 -993865 -906246 -568722 -358245
29963 -358245 -204787 153404 631835 858815 701166 436175 380084 555489 757195 789505
29953 789505 614182 371232 239908 211640 103269 -111001 -176707 33851 215435 57617
29943 57617 -203378 -96889 310804 467958 186105 -107143 -124248 -185026 -603764 -1059139
29933 -1059139 -1031977 -596617 -294114 -327643 -330838 16809 480446 536589 11182 -685397
29923 -685397 -972211 -701901 -272799 -119000 -249198 -415609 -513010 -518921 -248614 367777
$$ packed form
29992a357105N43154P02377K19591l72995m79512j02609K99900L85500J84416
29983B2717m9638p5404J49268L88512L29460l6718l56853l54157j67249p1282
29973b21344l1617J57444L73696K19339l26875p01557m62951Q7619L37524K10477
29963c58245J53458L58191M78431K26980j57649k64991n6091J75405K01706L2310
29953G89505j75323k42950j31324k8268j08371k14270o5706K10558J81584j57818
29943E7617k60995J06489M07693J57154k81853k93248j7105o0778m18738m55375
29933a059139K7162M35360L02503l3529l195L47647M63637N6143n25407o96579
29923f85397k86814K70310M29102J53799j30198j66411r7401n911K70307O16391
$$ plain form
29913 367777 868122 691161 70905 -110555 455843 1042214 946344 430429 160995 233501
29903 233501 310918 326744 419881 434005 120672 -295387 -350772 -84767 12792 -202029 -323588
29892 -323588 -85188 235812 302001 241107 427604 922635 1340213 1240446 601146 -85958
29882 -85958 -234578 276179 1023076 1497068 1461500 895460 -40292 -847405 -916011 -215564
29872 -215564 535930 687447 354258 28882 -130255 -227472 -211877 -40489 7322 -300394
29862 -300394 -688145 -797881 -811563 -1034937 -1110770 -440186 680564 1200600 749601 160230
29852 160230 264750 851807 1217909 1167772 957004 675383 258522 -121963 -202847 -73626
29842 -73626 -57293 -188442 -194155 -28579 -66679 -590591 -1310603 -1645567 -1415546 -1013573
$$ packed form
29913C67777N00345j76961o20256j81460N66398N86371r5870n15915k69434P2506
29903B33501P7417J5826R3137J4124l13333m16059n5385K66005R7559k14821j21559
29892c23588K38400L21000O6189o0894J86497M95031M17578r9767o39300o87104
29882h5958j48620N10757P46897M73992l5568n66040r35752q07113o8606P00447
29872b15564P51494J51517l33189l25376j59137r7217J5595J71388M7811l07716
29862c00394l87751j09736j3682k23374p5833O70584J120750N20036m50999n89371
29852A60230J04520N87057L66102n0137k10768k81621m16861l80485q0884J29221
29842g3626J6333j31149n713J65576l8100n23912p20012l34964K30021M01973
$$ plain form
29832 -1013573 -827832 -725947 -332616 322723 776268 772527 602515 658384 923280 1087208
29822 1087208 950527 541719 43775 -250551 -148290 148145 245799 173663 367174 843154
29812 843154 937922 281706 -481748 -536552 -55374 154687 -125119 -388355 -313657 -57880
29802 -57880 293166 806906 1186688 899281 -12809 -856710 -1185769 -1193674 -1073722 -638653
29792 -638653 131515 747860 824752 618072 572593 662573 553366 182984 -160001 -218700
29782 -218700 -1173 277921 363623 172143 -105553 -219750 -149805 -17514 177164 461901
29772 461901 632665 443745 24126 -245494 -243092 -139916 4717 240472 352149 18856
29762 18856 -569610 -787304 -458966 -196086 -562824 -1282803 -1611049 -1255794 -616069 -217909
$$ packed form
29832a013573J85741J01885L93331O55339M53545l741j70012N5869K64896J63928
29822A087208j36681m08808m97944k94326J02261K96435R7654p2136J93511M75980
29812H43154R4768o56216p63454n4804M81178K10061k79806k63236P4698K55777
29802e7880L51046N13740L79782k87407r12090q43901l29059p905J19952M35069
29792f38653P70168O16345P6892k06680m5479Q9980j09207l70382l42985n8699
29782b18700K17527K79094Q5702j91480k77696j14197O9945J32291J94678K84737
29772D61901J70764j88920m19619k69620K402J03176J44633K35755J11677l33293
29762A8856n88466k17694L28338K62880l66738p19979l28246L55255O39725L98160
$$ plain form
29752 -217909 -170132 -195716 -75581 65106 15975 -86444 65996 310432 67578 -694636
29742 -694636 -1131980 -662063 105508 259317 -74213 -147520 29296 -202884 -794404 -876178
29732 -876178 -170237 489753 346014 -400438 -1155446 -1598564 -1550745 -975937 -373127 -374800
29722 -374800 -714702 -451110 517140 1123371 722355 17375 -149103 29460 36074 3123
29712 3123 142349 -793 -768005 -1469850 -1228730 -324927 210487 37317 -308557 -439903
29702 -439903 -519059 -726934 -973615 -1088905 -892773 -296747 320880 259565 -545133 -1206013
29692 -1206013 -1054012 -560880 -441897 -448192 60810 813725 933750 336238 -157425 -49114
29682 -49114 350595 662503 876664 991632 895574 691895 619505 664267 691350 774022 890834
$$ packed form
29752b17909M7777k5584J20135J40687m9131j02419J52440K44436k42854p62214
29742f94636m37344M69917P67571J53809l33530p3307J76816k32180n91520q1774
29732h76178P05941O59990j43739p46452p55008m43118M7819N74808O02810j673
29722c74800l39902K63592R68250O06231m01016p04980j66478J78563O614l2951
29712C123J39226j43142p67212p01845K41120R03803N35414j73170l45874j31346
29702d39903p9156k07875k46681j15290J96132N96026O17627o1315q04698o60880
29692a206013J52001M93132J18983o295N09002P52915J20025n97512m93663J08311
29682d9114L99709L11908K14161J14968r6058k03679p2390M4762K7083Q2672J16812
$$ plain form
29671 890834 623585 -176766 -772781 -429991 348554 438826 -222403 -639369 -413612 -233027
29661 -233027 -493898 -589486 -56406 552402 574311 242705 112828 103838 -163348 -508628
29651 -508628 -411203 105860 419177 111790 -564041 -1040433 -1006887 -626670 -293505 -167658
29641 -167658 -25963 291465 478169 164635 -420962 -707310 -649435 -731282 -1020342 -918526
29631 -918526 -158008 597435 643924 267406 311353 984911 1652741 1703697 1164765 472942
29621 472942 26747 13937 369608 767807 817460 399484 -211342 -591258 -536037 -209954
29611 -209954 48001 46810 -160873 -457245 -768308 -951552 -797879 -311480 180814 375947
29601 375947 292290 84397 -171573 -291718 58541 823439 1282334 847407 -62800 -523099
$$ packed form
29671H90834k67249q00351n96015L42790P78545R0272o61229m16966K25757J80585
29661b33027k60871r5588N33080O08808K1909l31606j29877q990k67186l45280
29651e08628R7425N17063L13317l07387o75831m76392L3546L80217L33165J25847
29641a67658J41695L17428J86704l13534n85597k86348N7875q1847k89060J01816
29631i18526P60518P55443M6489l76518M3947O73558O67830N0956n38932o91823
29621D72942m46195j2810L55671L98199M9653m17976o10826l79916N5221L26083
29611b09954K57955j191k07683k96372l11063j83244J53673M86399M92294J95133
29601C75947q3657k07893k55970j20145L50259P64898M58895m34927r10207m60299
$$ plain form
29591 -523099 -340526 -153859 -344718 -565552 -467703 -200890 62727 457759 920319 932770
29581 932770 260741 -478790 -513884 83850 581081 574020 315328 138793 42674 -68774
29571 -68774 -107183 11736 78984 -252409 -972808 -1525754 -1306611 -388853 425042 409354
29561 409354 -359145 -1208075 -1613385 -1527830 -1171110 -819372 -693507 -737331 -598253 -133431
29551 -133431 223196 13092 -464542 -460038 150058 670822 595380 248133 169547 319620
29541 319620 232190 -332197 -1160766 -1788931 -1754248 -938476 136808 629499 230833 -502129
29531 -502129 -848298 -722450 -555601 -589027 -589314 -241017 368701 752643 554666 52555
29521 52555 -77001 393961 934830 1058841 1054028 1398227 1772069 1432102 481070 -99813
$$ packed form
29591e23099J82573J86667j90859k20834R7849K66813K63617L95032M62560J2451
29581I32770o72029p39531l5094N97734M97231p061k58692j76535r6119j11448
29571f8774l8409J18919O7248l31393p20399n52946K19143R17758Q13895j5688
29561D09354p68499q48930m05310Q5555L56720L51738J25865m3824J39078M64822
29551a33431L56627k10104m77634M504O10096N20764p5442l47247p8586J50073
29541C19620q7430n64387q28569o28165L4683Q15772J075284M92691l98666p32962
29531e02129l46169J25848J66849l3426k87L48297O09718L83942j97977n02111
29521E2555j29556M70962N40869J24011m813L44199L73842l39967r51032n80883
$$ plain form
29511 -99813 153385 584864 540003 314590 476612 880965 997943 794709 660007 715949
29501 715949 752463 667442 519761 305876 67200 35529 303936 542372 404836 38980
29491 38980 -164142 -148961 -162549 -295023 -404075 -392612 -278625 -106970 -9919 -168174
29481 -168174 -504549 -671362 -559547 -482428 -589410 -541930 -186669 -71631 -658093 -1370124
29471 -1370124 -1198745 -110830 897165 1129426 838257 474484 68405 -359492 -447066
$$ packed form
29511i9813K53198M31479m4861k25413J62022M04353J16978k03234j34702N5942
29501G15949L6514q5021j47681k13885k38676l1671K68407K38436j37536l65856
29491C8980k03122J5181j3588j32474j09052J1463J13987J71655R7051j58255
29481a68174l36375j66813J11815P7119j06982M7480L55261J15038n86462p12031
29471a370124J71379J087915J007995K32261k91169l63773m06079m27897q7574
$$ [...]
##END NTUPLES=NMR SPECTRUM
##END=
