##TITLE=31Pdec_83-2023
 CDCl3 24 sc
 25.9.2023
##JCAMPDX= 6.0         $$ Bruker NMR JCAMP-DX V2.0
##DATA TYPE= NMR SPECTRUM
##DATA CLASS= NTUPLES
##ORIGIN= UXNMR, Bruker Analytische Messtechnik GmbH
##OWNER= root
$$ XWIN-NMR		Version 3.5
$$ Mon Sep 25 14:27:36 2023 Russian Standard Time (UT+4h)  she@DPX200
##.OBSERVE FREQUENCY= 81.013821
##.OBSERVE NUCLEUS= ^31P
##.ACQUISITION MODE= SIMULTANEOUS
##.ACQUISITION SCHEME= undefined
##.AVERAGES= 24
##.DIGITISER RES= 16
##SPECTROMETER/DATA SYSTEM= spect
##.PULSE SEQUENCE= zgpg30
##.SOLVENT NAME= DMSO
##.SHIFT REFERENCE= (INTERNAL, DMSO, 0, 248.564)
##AUDIT TRAIL= $$ (NUMBER, WHEN, WHO, WHERE, WHAT)
$$ ##TITLE= Audit trail, XWIN-NMR		Version 3.5
$$ ##JCAMPDX= 5.01
$$ ##ORIGIN= Bruker BioSpin GmbH
$$ ##OWNER= she
$$ F:/spectra/data/she/nmr/P31/1/pdata/1/auditp.txt
$$ ##AUDIT TRAIL=  $$ (NUMBER, WHEN, WHO, WHERE, WHAT)
(   1,<2023-09-25 14:26:40.01 +0400>,<she>,<DPX200>,
      <created by zg, POWCHK disabled, PULCHK disabled
       configuration hash MD5:
       00 E9 B6 7A A2 85 ED C7 34 08 36 98 17 FE 4E 26
       data hash MD5: 32K
       7E 90 B4 DC D3 B9 9A 05 CE 52 CE C3 A7 5A 8C 69>)
(   2,<2023-09-25 14:26:43.10 +0400>,<she>,<DPX200>,
      <Start of raw data processing
       efp BC_mod = 2 LB = 5 FT_mod = 6 PKNL = 1 PHC0 = -10702.35 PHC1 = 195.8863 SI = 64K 
       data hash MD5: 64K
       43 44 E7 DF DC 74 DC 33 04 04 60 4D A1 73 DE CC>)
(   3,<2023-09-25 14:26:59.79 +0400>,<she>,<DPX200>,
      <pk PHC0 = -1.99974 PHC1 = 0 
       data hash MD5: 64K
       3C 04 A9 A1 08 1F A2 75 E2 0F 48 33 FA 57 15 83>)
(   4,<2023-09-25 14:27:04.09 +0400>,<she>,<DPX200>,
      <abs ABSG = 5 
       data hash MD5: 64K
       7C 4D DF 62 5F 19 B7 C3 2E 5A 25 62 F4 14 45 E0>)
$$ ##END=
$$ 
$$ hash MD5
$$ 57 D3 A0 BA 5D C8 62 5C BC 23 A2 ED 76 B4 A9 C8
##$RELAX= 
##$RELAX= 
##$RELAX= 
##$RELAX= 
##$RELAX= 
##$RELAX= 
##$RELAX= 
##$RELAX= 
##$RELAX= 
$$ Bruker specific parameters
$$ --------------------------
##$DU= <F:/spectra>
##$EXPNO= 1
##$NAME= <P31>
##$PROCNO= 1
##$TYPE= <nmr>
##$USER= <she>
##$AMP= (0..31)
100 100 100 100 100 100 100 100 100 100 100 100 100 100 100 100 100 100 
100 100 100 100 100 100 100 100 100 100 100 100 100 100 
##$AQSEQ= 0
##$AQ_mod= 1
##$AUNM= <au_zg>
##$AUTOPOS= <>
##$BF1= 81.014009
##$BF2= 200.13
##$BF3= 200.13
##$BF4= 200.13
##$BF5= 200.13
##$BF6= 200.13
##$BF7= 200.13
##$BF8= 200.13
##$BYTORDA= 1
##$CFDGTYP= 0
##$CFRGTYP= 5
##$CHEMSTR= <none>
##$CNST= (0..31)
1 1 145 1 1 1 1 1 1 1 1 1 1 1 1 1 1 1 1 1 1 1 1 1 1 1 1 1 1 1 1 1 
##$CPDPRG= <waltz16>
##$CPDPRG1= <>
##$CPDPRG2= <waltz16>
##$CPDPRG3= <>
##$CPDPRG4= <mlev>
##$CPDPRG5= <mlev>
##$CPDPRG6= <mlev>
##$CPDPRG7= <mlev>
##$CPDPRG8= <mlev>
##$CPDPRGB= <>
##$CPDPRGT= <>
##$D= (0..31)
0 1 0 0 0 0 0 0 0 0 0 0.03 2e-05 3e-06 0 0 0 0 0 0 0 0 0 0 0 0 0 0 0 0 
0 0 
##$DATE= 1695637599
##$DBL= (0..7)
120 120 120 11 120 120 24 19 
##$DBP= (0..7)
150 150 150 150 150 150 150 150 
##$DBP07= 0
##$DBPNAM0= <>
##$DBPNAM1= <>
##$DBPNAM2= <>
$$ [...]
##$SUBNAM3= <"">
##$SUBNAM4= <"">
##$SUBNAM5= <"">
##$SUBNAM6= <"">
##$SUBNAM7= <"">
##$SUBNAM8= <"">
##$SUBNAM9= <"">
##$SW= 501.771253377433
##$SWIBOX= (0..15)
0 1 3 0 0 0 0 0 0 0 0 0 0 0 0 0 
##$SW_h= 40650.406504065
##$TD= 32768
##$TD0= 1
##$TE= 0
##$TE2= 300
##$TE3= 300
##$TEG= 300
##$TL= (0..7)
0 120 53 12 22 120 120 120 
##$TP= (0..7)
150 150 150 150 150 150 150 150 
##$TP07= 0
##$TPNAME0= <>
##$TPNAME1= <>
##$TPNAME2= <>
##$TPNAME3= <>
##$TPNAME4= <>
##$TPNAME5= <>
##$TPNAME6= <>
##$TPNAME7= <>
##$TPOAL= (0..7)
0.5 0.5 0.5 0.5 0.5 0.5 0.5 0.5 
##$TPOFFS= (0..7)
0 0 0 0 0 0 0 0 
##$TUNHIN= 0
##$TUNHOUT= 0
##$TUNXOUT= 0
##$USERA1= <user>
##$USERA2= <user>
##$USERA3= <user>
##$USERA4= <user>
##$USERA5= <user>
##$V9= 5
##$VALIST= <valist>
##$VCLIST= <CCCCCCCCCCCCCCC>
##$VD= 0
##$VDLIST= <DDDDDDDDDDDDDDD>
##$VPLIST= <PPPPPPPPPPPPPPP>
##$VTLIST= <TTTTTTTTTTTTTTT>
##$WBST= 1024
##$WBSW= 4
##$XGAIN= (0..3)
0 0 0 0 
##$XL= 0
##$YL= 0
##$YMAX_a= 4180
##$YMIN_a= -4097
##$ZGOPTNS= <>
##$ZL1= 120
##$ZL2= 120
##$ZL3= 120
##$ZL4= 120
##$ABSF1= 248.5645
##$ABSF2= -253.2056
##$ABSG= 5
##$ABSL= 3
##$ALPHA= 0
##$AQORDER= 0
##$ASSFAC= 0
##$ASSFACI= 0
##$ASSFACX= 0
##$ASSWID= 0
##$AUNMP= <proc_1d>
##$AZFE= 0.1
##$AZFW= 0.5
##$BCFW= 0
##$BC_mod= 2
##$BYTORDP= 0
##$COROFFS= 0
##$CY= -3
##$DATMOD= 1
##$DC= 0
##$DFILT= <>
##$DTYPP= 0
##$F1P= 0
##$F2P= 0
##$FCOR= 1
##$FTSIZE= 65536
##$FT_mod= 6
##$GAMMA= 0
##$GB= 0
##$INTBC= 1
##$INTSCL= 6.047779e-11
##$ISEN= 30
##$LB= 5
##$LEV0= 0
##$LPBIN= 0
##$MAXI= 10000
##$MC2= 0
##$MEAN= 0
##$ME_mod= 0
##$MI= 50
##$NCOEF= 0
##$NC_proc= -6
##$NLEV= 6
##$NOISF1= 182.463
##$NOISF2= 159.3651
##$NSP= 0
##$NTH_PI= 0
##$NZP= 0
##$OFFSET= 248.5645
##$PC= 4
##$PHC0= -10704.35
##$PHC1= 195.8863
##$PH_mod= 1
##$PKNL= yes
##$PPARMOD= 0
##$PSCAL= 0
##$PSIGN= 0
##$REVERSE= no
##$SF= 81.0140089999694
##$SI= 65536
##$SIGF1= 159.3651
##$SIGF2= -187.1042
##$SINO= 113.3802
##$SIOLD= 16384
##$SREGLST= <1H.CDCl3>
##$SSB= 0
##$STSI= 65536
##$STSR= 0
##$SW_p= 40650.406504065
##$SYMM= 0
##$S_DEV= 0
##$TDeff= 32768
##$TDoff= 0
##$TI= <>
##$TILT= no
##$TM1= 0
##$TM2= 0
##$TOPLEV= 0
##$USERP1= <user>
##$USERP2= <user>
##$USERP3= <user>
##$USERP4= <user>
##$USERP5= <user>
##$WDW= 1
##$XDIM= 65536
##$YMAX_p= 376672528
##$YMIN_p= -17042395
$$ End of Bruker specific parameters
$$ ---------------------------------
##NTUPLES= NMR SPECTRUM
##VAR_NAME=  FREQUENCY,     SPECTRUM/REAL,   SPECTRUM/IMAG
##SYMBOL=    X,             R,               I
##VAR_TYPE=  INDEPENDENT,   DEPENDENT,       DEPENDENT
##VAR_FORM=  AFFN,          ASDF,            ASDF
##VAR_DIM=   65536,         65536,           65536
##UNITS=     HZ,            ARBITRARY UNITS, ARBITRARY UNITS
##FACTOR=    0.620285442955139, 1,           1
##FIRST=     20137.2065510682, 0,            0
##LAST=      -20513.1999529968, 0,           0
##MIN=       -20513.1999529968, -17042395,   0
##MAX=       20137.2065510682, 376672528,    0
$$ Real data points
##PAGE= N=1
##DATA TABLE= (X++(R..R)), XYDATA
$$ [...]
38702d76723O4009Q9794J06888J15946J12837R4424O2796K3381j5980m4348n4897
38691G8127n4823n8471o6669o2751l4290J1570O0128J04233J38003J47554J22769
38680C85380P2843J8054k9711o8046r1551r1199o5084k1929K2851M8882L8198
38669B18688o559n7031q4672q7009p8121o1382k8508J9208O7961J09706J45555
38658A57836J67849J56378J00837J6960o5307j22218j43994j34120j06469p5530
38648d7778m5646j4515J4876L5388M7670N9538P2970Q2848Q8478R3089R0441O6622
38636E43981K0306l0800o8123q5685q3464o3433l9155l3163n2091p4093p2284
38625c8004m4221j0920M316j1036n4054j01559j19178r1748m3137j3910j9461
$$ y = [-476723, -412714, -322920, -216032, -100086, 12751, 107175, 169971, 193352, 177372, 133024, 78127, 23304, -35167, -101836, -164587, -198877, -187307, -127179, -22946, 115057, 262611, 385380, 458223, 476277, 446566, 378520, 286969, 195770, 130686, 108757, 131608, 180490, 218688, 212129, 155098, 70426, -16583, -94704, -156086, -184594, -165386, -97425, 12281, 157836, 325685, 482063, 582900, 599860, 534553, 412335, 268341, 134221, 27752, -47778, -93424, -107939, -93063, -57675, -10005, 49533, 122503, 205351, 293829, 386918, 477359, 543981, 564287, 533487, 465364, 379679, 296215, 232782, 193627, 160464, 108373, 34280, -38004, -82225, -93145, -88829, -99865, -153919, -255478, -374656, -466404, -509541, -523451, -542912]
38614e42912l7967l6670j216N7801J15750J49085J47303J14643O1190k880o1830
38603c7703r1644p4111j4422O0967J24350J62553J77064J75073J60756J32502
38593G75385Q9278L9451j405k3029k6929k1400j8197l2429o9656j06330r9918
38582E04821l4516N2682J06303J07985Q1142M8017N263n5027j21800j74088k00487
38571C20295j98651j65908j03950k9402L1631O1653O1070M1792J6025j0878m1386
38560a7709p9259j18910j43031j35544r8051n0866j6362j920R98L700R405J5819
38548f31730K4037L8637N7837O9921O5072M7898L2080K3405J4920P02j2351j1816
38536b81388M331K5244M0673N0990O0904O7997O4428M9869L5675L2347L7164L8300
$$ y = [-542912, -580879, -617549, -618765, -560964, -445214, -296129, -148826, -34183, 27007, 24127, -37703, -129347, -203458, -217880, -156913, -32563, 129990, 307054, 482127, 642883, 775385, 864663, 904114, 902709, 879680, 852751, 831351, 813154, 780725, 711069, 604739, 504821, 470305, 522987, 629290, 737275, 818417, 866434, 871697, 816670, 694870, 520782, 320295, 121644, -44264, -148214, -177616, -145985, -84332, -23262, 18530, 34555, 23677, -17709, -96968, -215878, -358909, -494453, -592504, -643370, -659732, -661652, -660654, -656954, -647549, -631730, -607693, -569056, -511219, -441298, -376226, -328328, -296248, -272843, -257923, -257221, -269572, -281388, -277057, -251813, -211140, -160150, -99246, -31249, 33179, 83048, 118723, 151070, 188234, 226534]
38524B26534K6315m027n7062j28975j96554k24954j93717j12709j3483O7698J01906
38513e09028Q1062K9686q513r172J1866K4104K0652J9184L1571M8792N6029M8773
38501a54994L0755O526j9747m6026p6356j16746j63783k01668k12086j85111j25086
38490a264322n3148R47K2773L0368N6343J11007J73416K18745K38916K32141J92441
38479d0373J26034O5649M5797O2657P4289M6499j0045n2980n2554j8647J2836
38468B59162J6236j990j7158j8941k2751m5197p6162q6181o0896j8525J0368J4214
38456d7821Q112J4944M2555P6495R1642P3123K9545j4372l9463m5968m6831n2248
38444H9713o4136q1175j00757j13926j05595o7111q605M5634P6128Q1729P5783
$$ y = [226534, 252849, 248822, 191760, 62785, -133769, -358723, -552440, -665149, -678632, -610934, -509028, -427966, -398280, -406793, -415965, -404099, -379995, -359343, -340159, -308588, -259796, -203767, -154994, -124239, -117713, -137460, -183486, -259842, -376588, -540371, -742039, -954125, -1139236, -1264322, -1317470, -1316523, -1293750, -1263382, -1207039, -1096032, -922616, -703871, -464955, -232814, -40373, 85661, 151310, 197107, 259764, 334053, 380552, 370507, 317527, 264973, 246326, 259162, 275398, 273408, 256250, 237309, 214558, 169361, 93199, 7018, -53878, -72403, -62035, -47821, -39709, -24765, 17790, 94285, 185927, 259050, 288595, 274223, 234760, 188792, 141961, 89713, 25577, -55598, -156355, -270281, -375876, -442987, -451592, -405958, -329830, -248101, -172318]
38433a72318P2850P9382R1369R6211Q0147M1410k202k3975j0771K5718O0744P6493
38421D15058O9417M4395J0454j8146k6616j2753Q430J9639J8568J3824P093q520
38409E40843l0227l9732k6101n166k752k3339m8699o3988o8682o2465m0480r516
38397A19696R790R236P204K2645M7914O4342P3626R1374J13998J15828Q3050L1630
38385G90333j4685m8909p5945r6336j04293r4867o7974l2263o241m175j7024j9408
38373B08213j826J4571K036m3754j02301j45898j53868j23674p7628m6233l4156
38362e04518j4507L1863Q5548J13197J10722J01238R7807R1166P2017M3006P576
38351B35115l1173n6858m7858q094K9874M3987M6451N3643N0896J2157n3021r8258
$$ y = [-172318, -99468, -20086, 71283, 167494, 247641, 289051, 286849, 262874, 252103, 277821, 338565, 415058, 484475, 528870, 539324, 521178, 494562, 481809, 490239, 509878, 528446, 542270, 549363, 540843, 510616, 470884, 444783, 439617, 436865, 413526, 364827, 300839, 232157, 169692, 129212, 119696, 129486, 138722, 145926, 168571, 216485, 280827, 354453, 445827, 559825, 675653, 758703, 790333, 775648, 726739, 650794, 554458, 450165, 355298, 287324, 255061, 248820, 244645, 227621, 208213, 206387, 220958, 222994, 179240, 76939, -68959, -222827, -346501, -424129, -470362, -504518, -519025, -487162, -401614, -288417, -177695, -76457, 21350, 112516, 184533, 227539, 235115, 203942, 147084, 99226, 91132, 121006, 164993, 211444, 265087, 315983, 328140, 275119, 176861]
38339A76861r0499m3162P213M1761O5881Q6616J00370J03270J00438R7145Q6126
38328G32020N2811m816o6849j06376j12588r6818p7618o3805n1675l4128j0057
38317A60101J3183K4091J3962j8834o8806j24342j68387j83070j59481j04155
38307f15738l5193K7201O8073Q3128Q1369P7162P4578O5390M8798M3440O4873
38296a6919R4967R2676M0125l6564r8812j33014j46338j39588j03511m0178K6073
38285d61083O2476M8889r078p8144j13316r0629k8903K7213M7397L6056J8848
38274e40274J9506M6224Q5679J07946R1446M9960K4149L8700P6211R9449Q8612
38263A87608M8807n003n3607p3211n2316j1049J4589J4029J3524L9371Q3346J14796
$$ y = [176861, 86362, 43200, 50413, 92174, 158055, 244671, 345041, 448311, 548749, 645894, 732020, 784831, 780015, 713166, 606790, 494202, 397384, 319766, 255961, 204286, 170158, 160101, 173284, 197375, 211337, 192503, 123697, -645, -169032, -352102, -511583, -615738, -650931, -623730, -555657, -472529, -391160, -313998, -239420, -174030, -125232, -81792, -16919, 78048, 170724, 210849, 174285, 75473, -57541, -203879, -343467, -446978, -487156, -461083, -398607, -349718, -358796, -436940, -550256, -640885, -669788, -642575, -595178, -559122, -540274, -520768, -474544, -388865, -280919, -189473, -139513, -115364, -76664, -453, 98996, 187608, 236415, 231412, 177805, 104594, 52278, 41229, 55818, 69847, 83371, 122742, 206088, 320884]
38251C20884J16272R5451P0167N4602N3628N5728L5085k2533r3591j30412j05729
38240D49552l4397M9317J20173J62581J62632J18691N3463k183l9053p3138j19723
38229H47915j74067k18639k38944k28249j85449j16343l5919L5448Q1059R6541
38219a36647R1964Q2860P5657O3996M2107J6277l726j9547l9365n8916o0420l6101
38207A8139l799R098o269l4039n3041n6879n4701n6200n9458n5321m2103k9892
38195d24465k6493k4245q068K5548O4564R5044J11814J16862J15153J12190J09101
38184B67005J01328Q8457Q0332Q2431Q0257N5537J7224l238P950L1157M4576M9347
38172I02363N0393L4395j0735o8742j11266j32163j42362j39525j12706p7263
$$ y = [320884, 437156, 532607, 602774, 657376, 711004, 766732, 801817, 779284, 685693, 555281, 449552, 415155, 464472, 584645, 747226, 909858, 1028549, 1082012, 1079829, 1040776, 967638, 847915, 673848, 455209, 216265, -11984, -197433, -313776, -349695, -314247, -233188, -136647, -44683, 38177, 113834, 177830, 219937, 236214, 232488, 212941, 173576, 114660, 54240, 18139, 14340, 23438, 17169, -16870, -69911, -126790, -181491, -237691, -297149, -352470, -394573, -424465, -450958, -475203, -483271, -457723, -393159, -298115, -186301, -69439, 45714, 157904, 267005, 368333, 456790, 537122, 619553, 699810, 755347, 772571, 769333, 777283, 808440, 853016, 902363, 952756, 987151, 976416, 907674, 796408, 664245, 521883, 382358, 269652, 192389]
38162A92389p3538j17401j72530j86711j43477o7275J0020P4320J28111J76134
38152a79958K12226K18720J84719J25562P3642M6205L2544J6394k976j9905l8341
38141F68832o4449r0953j02388r2299o4812k4295K3935O4509P6590N1444J009
38130D47123m9820p5462o1293j5268L2137M9342K8024j6891o5826j03432j14550
38119E4084q9936m2002n21J8107K8873N4289Q8474R9141O6689J0141l1211l5388
38107B20740j1979J4369K4477R744l0519q6434j34900j50206j23464p0249j7484
38096c55905J5381K3309J1865o479j5059j429L1549O4443P4586N3290J3153j8925
38084a10221j7932K2900Q5536J36946J51018J26305Q4047M7850K5136Q374q664
$$ y = [192389, 118851, 1450, -171080, -357791, -501268, -568543, -558523, -484203, -356092, -179958, 32268, 250988, 435707, 561269, 634911, 681116, 713660, 730054, 727078, 707173, 668832, 604383, 513430, 411042, 318743, 253931, 229636, 253571, 318080, 394670, 446114, 447123, 397303, 321841, 260548, 245280, 277417, 326759, 354783, 337892, 272066, 168634, 54084, -35852, -77854, -78375, -60268, -31395, 22894, 111368, 210509, 277198, 287339, 256128, 220740, 208761, 223130, 247607, 257351, 226832, 140398, 5498, -144708, -268172, -338421, -355905, -340524, -317215, -305350, -311829, -326888, -328317, -296768, -232325, -157739, -104449, -91296, -110221, -128153, -105253, -19717, 117229, 268247, 394552, 478599, 526449, 551585, 559959, 551295]
38073E51295k1292k1178p619J1743K6479K4922m218o2068j31567j86886k11690
38062c2079k02441j57253p6244K2054R9027J25175J07682P9007O1129N1382M1054
38051A18493L2788L2638L4937K7012Q000o618l685R536J2669l069k4617l4246
38039B03838k9805k1309j4021o373j419m410n859J6069O5067J10802J18158Q5449
38027E16187L9690M14l3864o5594q6121r0355q6119p7609n3642r330K7311J1279
38015I2247o8772j65244k07472j64630p0498J4380O1003Q8376J25030J66885J83679
38004E4984J60599J16233P5241L8768n450n2756p8568o7034l0306N887K8161M1130
37992B86889N2690O1423N8979M0618J2061j2394j8186O07L7146P4508R3909Q5704
$$ y = [551295, 530003, 508825, 501206, 512949, 539428, 564350, 560132, 498064, 366497, 179611, -32079, -234520, -391773, -468017, -445963, -346936, -221761, -114079, -35072, 26057, 77439, 118493, 151281, 183919, 218856, 245868, 253868, 247250, 243565, 253101, 265770, 262701, 238084, 203838, 174033, 152724, 138703, 132330, 130911, 126501, 120642, 136711, 201778, 312580, 430738, 516187, 555877, 556291, 522427, 456833, 370712, 280357, 194238, 116629, 62987, 53657, 80968, 92247, 23475, -141769, -349241, -513871, -584369, -569989, -508986, -420610, -295580, -128695, 54984, 215583, 331816, 407057, 445825, 440375, 387619, 309051, 242017, 211711, 217598, 245759, 286889, 339579, 401002, 459981, 500599, 512660, 500266, 482080, 482687, 519833, 594341, 688250, 773954]
37980G73954N7323K9387J8082J8307P575k9949q6032j38667j75884k00989k14776
37969E8331k05033j62547r9970m1651M110M8833R5775J22372J04021M9134m931
37958c1556l2495m2604n5240o6332n1305j712N6269Q7771Q6078P3662O9371O6297
37946A58204M5740L004m8769r3543j19724j15934p5075r826M5319N8259K6094
37935a26251k4891o3181p4123o4252n0693m5381m5337l8042j6760J2757M1527
37924d94627O6786Q7294R4243P4791K4901m4730j14176j63280j78877j59323j13483
37913i20481n5002J668M3293O4368P2114P5937P1506M9312K2985K8512P9213J37809
37901c28766J56873J37564J19936J17433R4241K0531p6145j36735j35431r9677
$$ y = [773954, 831277, 860664, 878746, 897053, 904628, 874679, 788647, 649980, 474096, 273107, 58331, -146702, -309249, -409219, -450870, -446760, -397927, -302152, -179780, -75759, -26625, -31556, -64051, -106655, -161895, -228227, -279532, -281244, -224975, -137204, -51126, 22536, 91907, 158204, 203944, 206948, 158179, 64636, -55088, -171022, -246097, -255923, -210604, -152345, -126251, -151142, -214323, -288446, -352698, -403391, -448772, -494109, -532151, -548911, -536154, -494627, -427841, -340547, -246304, -171513, -146612, -191342, -305518, -468798, -647675, -806998, -920481, -975483, -973815, -930522, -866154, -794040, -718103, -646597, -597285, -574300, -545788, -466575, -328766, -171893, -34329, 85607, 203040, 297281, 317812, 241667, 104932, -30499, -130176]
37891a30176p2346p0781q0614p5210l8479K2323Q1235J12193J04646O5503J4310
37880f7396k3276k9002o120K6415N7820R4163J37403J67727J59775J11060M3142
37869F71711k1456p2602j06035j16491j01017o3494j4887K8007M7457L4969l034
37858B83128n1448r4740j18192j11361p9049m2151j7362N20K7288O4482R5042
37847d3843J00885P6865L2261j1552l0291j7144P133J5334K668j6313l4170n7018
37835B4815q6187j13091j35436j57946j67920j30369k6623J09645K10194K25388
37825b47530J55602M0490p0119j40868j63506j52309j25749r4212o5426n0991
37815i14618n7193p3438p9180o1412k0543L5634R4612J38761J52968J35931J00805
$$ y = [-130176, -202522, -273303, -353917, -429127, -467606, -445283, -364048, -251855, -147209, -81706, -67396, -90672, -119674, -125794, -99379, -41559, 52604, 190007, 357734, 517509, 628569, 671711, 650255, 577653, 471618, 355127, 254110, 190616, 175729, 203736, 251193, 286162, 283128, 231680, 136940, 18748, -92613, -171662, -213813, -231175, -230655, -203367, -138885, -43843, 57042, 133907, 166168, 154616, 124325, 107181, 114314, 129648, 132316, 116003, 81833, 24815, -61372, -174463, -309899, -467845, -635765, -766134, -792757, -683112, -472918, -247530, -91928, -51438, -121557, -262425, -425931, -578240, -703989, -798201, -863627, -914618, -971811, -1045249, -1124429, -1185841, -1206384, -1170750, -1076138, -937377, -784409, -648478, -547673]
37804e47673O6123M8025N3610P2297P8133N3172J0078j7500r305K2580M8394M6391
37792g5675J4664l1724p1034q9547r0469q4473p2114m4329j356M0770O8691Q6030
37780c50566J00055J03361Q3338M7002K1547K5569M8597O3732N3718J9729k8238
37769A87844p8593j15255j18220p7998j1542M3464N7684L4110m67k6061m4830
37758a49864o5593q3574q4153o2586l1053n929O291J0529J5928K7654M2198N1648
37746c28504N5978O7147R3361J21108J22682Q3231J2415p0759j51601k12969k30317
37735d38228j90936j15929m9014j9741k4058m0209n2729n6174m5047j2450L8905
37724a005610R0490J19235J17949J03308J00245J17277J39724J48121J39199J25402
$$ y = [-547673, -481550, -433525, -379915, -307618, -229485, -176313, -166235, -183735, -193040, -170460, -122066, -75675, -61011, -92735, -163769, -253316, -343785, -428258, -500372, -544701, -546057, -505287, -436596, -350566, -250511, -147150, -63812, -16810, 4737, 30306, 78903, 142635, 196353, 216082, 187844, 109251, -6004, -124224, -202222, -213764, -170300, -112616, -78506, -78973, -105034, -149864, -215457, -299031, -383184, -445770, -476823, -482752, -476461, -465932, -450004, -422350, -380152, -328504, -272526, -205379, -112018, 9090, 131772, 215003, 227418, 156659, 5058, -207911, -438228, -629164, -745093, -794107, -813848, -837906, -878115, -930844, -987018, -1032065, -1044515, -1005610, -915120, -795885, -677936, -574628, -474383, -357106, -217382, -69261, 69938, 195340]
37714A95340J17250J11685R7898P1579M3231L2615N1307Q7584J11117R6312M0714
37703A056632l7744j13473j60694j61177j18902o3811k7843j5675q250N103R727
37692C63893j5829p3513j42410j94247k08248j77949j11154k3739O6214J37757
37682c79225J68917J51969J06688O6322M7301M2462M4346N9273R0211J18844J17596
37671F34704P5483O185o2852j04748j07779q5874o8176p0347q1922q5712p6820
37660b7858n4405j1247N0170J01524J09799P2362J5365l8052p9529r9676q5340
37649d6887l9796J2424M9872P0869Q0162P4247N1329K5420J7763L6567P0478R7641
37637E00089R8502O7735J9955k0732m0893m4770m3084m3885n3928p5483r6702
$$ y = [195340, 312590, 424275, 522173, 593752, 636983, 669598, 720905, 808489, 919606, 1015918, 1056632, 1018888, 905415, 744721, 583544, 464642, 400831, 372988, 357313, 349063, 354166, 363893, 348064, 274551, 132141, -62106, -270354, -448303, -559457, -583196, -516982, -379225, -210308, -58339, 48349, 114671, 161972, 204434, 248780, 308053, 398264, 517108, 634704, 710187, 716372, 653520, 548772, 440993, 355119, 286943, 216596, 134674, 48962, -27858, -82263, -93510, -43340, 58184, 167983, 240345, 255710, 217658, 138129, 38453, -46887, -86683, -74259, -24387, 46482, 126644, 200891, 252220, 277640, 295403, 331970, 402448, 500089, 598591, 666326, 686281, 665549, 624656, 579886, 536802, 492917, 438989, 363506, 266804]
37626B66804r7840p5167m8545l6808l5588k9758j8655j5915k9907n7324r2676
37615b71379j30651j59565j65628j47920j20648r6119p0832l2013K5242Q9891
37605a079622J42332J68833J69560J53236J26565R2763N8322L2236J5714J514
37595a18547j1319j1821M293J8393N594l3821p2116q5156p5743o3094n7807n2999
37583e54143l6703r500R934m67m1972q9032j13630j11563r5446o6869j3063O5060
37571a057394J38752J77540J79354J62001J32358Q0340K657q2324j48358j80550
37561e95624j77011j41532q3440j9846L1085O0130O7071N3386K0357k6182p4856
37550h86462j13585j31711j18692o9868M21N7236O7680K9684k4231n3575l9636
$$ y = [266804, 168964, 93797, 45252, 8444, -27144, -56902, -75557, -91472, -121379, -178703, -271379, -402030, -561595, -727223, -875143, -995791, -1091910, -1162742, -1194755, -1169513, -1079622, -937290, -768457, -598897, -445661, -319096, -226333, -168011, -135775, -120061, -118547, -129866, -141687, -137394, -119001, -113407, -147228, -219344, -304500, -380243, -443337, -501144, -554143, -590846, -600346, -590412, -590879, -632851, -721883, -835513, -947076, -1042522, -1109391, -1122454, -1057394, -918642, -741102, -561748, -399747, -267389, -187049, -184392, -266716, -415074, -595624, -772635, -914167, -997607, -1017453, -986368, -926238, -859167, -805781, -785424, -811606, -886462, -1000047, -1131758, -1250450, -1320318, -1319897, -1262661, -1194981, -1165297, -1189528, -1243103, -1282739]
37539a282739P667O3848J06156J22194J13404R4799Q6896J00812J28232J47491
37529c11240J41788J11643O9253K3864k1210n5600n4663J835R9195J84313K04830
37518C94008J56002Q3562L5216J2463k2235r0988j64647j91096j54124r1262n1952
37507h5053n0834o7651p8562p2813m7252n311L5692N3480M6563M0509N8099R0165
37495h2968J07337R7379P8466P3181P9623P6433N3137K6173K0086L6575M9348
37484F14770L1295j9488q4674j49644k12147k68456l02480k95121k40889j52596
37474a079430n4155K8343P3964P4587M1835Q056J3472P6691J69220K30496K24221
37463a92700J75331J35237J15961Q3352J7812m9174p7188p2151p3073r6720j24026
$$ y = [-1282739, -1275072, -1211224, -1105068, -982874, -869470, -774671, -687775, -586963, -458731, -311240, -169452, -57809, 11444, 35308, 14098, -41502, -96165, -94330, 4865, 189178, 394008, 550010, 633572, 668788, 681251, 659016, 568028, 403381, 212285, 58161, -33101, -85053, -135887, -203538, -282100, -354913, -402165, -407476, -371784, -318304, -271741, -231232, -173133, -82968, 24369, 121748, 200214, 273395, 353018, 429451, 482588, 508761, 528847, 565422, 614770, 646065, 626577, 541903, 392259, 180112, -88344, -390824, -685945, -926834, -1079430, -1133585, -1105242, -1031278, -956691, -914856, -906800, -893328, -816637, -647417, -416921, -192700, -17369, 117868, 233829, 317181, 334993, 285819, 208631, 136480, 63407, -33313, -157339]
37452a57339j36852j39559j38795j25542q8360k9798L9504J11034J74122K11697
37442b79888K10363J70844J05716L4292j8944l4553j5705J2445K8511L2893L4478
37431B80452K9869P048l6112q7639j31984j56287j51775j21012q2356n6432m7630
37420e53858m6260m5854m6899m4984l0678o209J0496O468j1798l2715n6436q2637
37408i41364r0812n6451R226N6967N1269J2040j2189n664q2k7184p7175j15129
37396a196548j23881j12967r0773m8055K3514J07578J68420J79013J40540P8417
37386h74742K5081M143K0809N9172Q9872Q9064N7339J9492O03J808M274k641n494
37373e11220J5519N8985J01476J22113J18363R6579N8671P369m0565o0135m4006
$$ y = [-157339, -294191, -433750, -572545, -698087, -786447, -816245, -776741, -665707, -491585, -279888, -69525, 101319, 207035, 241327, 222383, 187830, 172125, 184570, 213081, 245974, 280452, 310321, 317369, 281257, 193618, 61634, -94653, -246428, -367440, -449796, -506228, -553858, -600118, -645972, -692871, -737855, -768533, -774742, -764246, -757778, -769576, -802291, -858727, -941364, -1032176, -1088627, -1079401, -1022434, -971165, -959125, -971314, -976978, -977060, -1004244, -1081419, -1196548, -1320429, -1433396, -1524169, -1572224, -1548710, -1441132, -1272712, -1093699, -953159, -874742, -849661, -845518, -824709, -765537, -675665, -586601, -529262, -509770, -509167, -507359, -503085, -505726, -511220, -495701, -436716, -335240, -213127, -94764, 1815, 60486, 67855, 27290, -32845, -76851]
37362g6851j7464j7684n4459r7142j06497p6306l6218j5849j7590k7356l8338
37351e81754n3099p0041q0627p7278n3881l756O7512J27626J34481P7739n184
37340e18262o2365p0977m4927j1272J0214J2365J231o297N750L8128P4247R1307
37328d80858P4736L0086j3822k1508J7972P7100J14294J10426P5822K8765j8168
37317e155n2339o0265m1373j1856J3060L2212M8421N7596N8741O3786Q1712R9346
37305B83886R5131O8961M0071J5812j5880n7272q6028q3311n9849l8158k3293
37294A40070j0838j1984m5265j06444j69459k16316k43239k38153j83829r6453
37284a181910l3189l6456q3299j10437q0620o691P9760J59773K28066K83022L21207
$$ y = [-76851, -94315, -111999, -166458, -263600, -370097, -446403, -482621, -498470, -516060, -543416, -581754, -634853, -704894, -785521, -862799, -916680, -920436, -852924, -725298, -590817, -513078, -518262, -580627, -651604, -696531, -707803, -697589, -685224, -683993, -690290, -684540, -646412, -572165, -480858, -406122, -376036, -389858, -411366, -393394, -316294, -202000, -91574, -15752, 13013, -5155, -57494, -117759, -159132, -170988, -157928, -125716, -77295, -19699, 39042, 102828, 184540, 283886, 379017, 447978, 488049, 503861, 487981, 430709, 344681, 261370, 201521, 163363, 140070, 129232, 117248, 71983, -34461, -203920, -420236, -663475, -901628, -1085457, -1181910, -1215099, -1251555, -1334854, -1445291, -1525911, -1532602, -1452842, -1293069, -1065003, -781981, -460774]
37273d60774L32485L02005K28238J36287O0338J3398j5276l8567o3556j00845
37263C93733j58825k22862k58707k46603k00435j47312j01345o3927l4727j0933
37253a051943J3983M0404O0233P2487Q9784J17765J38799J31448J00106P0311
37243b16623N7587N4811M8792L5042J4227j2617l8629m8848l1147J1431O1010
37232f4964R6351J05633R2843P3278O0590N7061N5603M7676K7954l023l4900m8736
37220D65366k9522J9401P4863J06913R6060M5100k1315p1714q7689p1742m0433
37209D85288j5397j5837m4816p8487q2109m5754N143M1585N9652O5689N0126K518
37197D27601n1822o0483k488P8343J12690P1453j4951r2274j25390j12124p0708
$$ y = [-460774, -128289, 173716, 401954, 538241, 598579, 611977, 596701, 558134, 494578, 393733, 234908, 12046, -246661, -493264, -693699, -841011, -942356, -1006283, -1041010, -1051943, -1037960, -997556, -937323, -864836, -775052, -657287, -518488, -387040, -286934, -216623, -159036, -104225, -55433, -20391, -6164, -18781, -57410, -106258, -137405, -125974, -64964, 31387, 137020, 229863, 303141, 363731, 420792, 476395, 524071, 552025, 549002, 514102, 465366, 435844, 455245, 530108, 637021, 733081, 778181, 756866, 685152, 597463, 525721, 485288, 469891, 454054, 409238, 330751, 248642, 202888, 208031, 249616, 309268, 374957, 425083, 427601, 375779, 315296, 312808, 391151, 503841, 575294, 560343, 468069, 342679, 230555, 159847]
37186A59847k0828K5708O0810P3831N7579K1395j0635k0647j2420k317o57p948
37174C23718k3454m6250o7226p0847n1758k4866j1915j9492l6291n0566o0547
37163a39494o4745n3964k5347K208M277j4831k0115J3441P0762J17493J38305
37152B7990J38720J18319O6099j3317q7007j18595r9307m9528K995M1002O0554
37141H7925O4142N2049K1293k3707o2295o8293l2439K9843R1521J28398J24976
37130D13413Q1277J9328k7957m2879l4630k4322k7239n0612r3489j38844j57043
37119h2997j31856q0545l9226l0291m8773p3716q4643p3187m8396k6827j0525
37108g30982J6850O1376R6611Q8506L8897j5369m6394n6475n0899j5707N8085
$$ y = [159847, 139019, 164727, 225537, 299368, 356947, 378342, 367707, 347060, 334640, 332323, 331666, 323718, 300264, 254014, 186788, 115941, 64183, 39317, 27402, 7910, -28381, -78947, -139494, -204239, -258203, -283550, -281342, -277065, -291896, -312011, -298570, -227808, -110315, 27990, 166710, 285029, 351128, 337811, 250804, 132209, 32902, -16626, -13631, 27371, 87925, 152067, 204116, 225409, 201702, 139407, 71114, 38675, 68518, 160039, 288437, 413413, 494690, 514018, 486061, 443182, 408552, 384230, 356991, 306379, 212890, 74046, -82997, -214853, -295398, -334624, -364915, -413688, -487404, -572047, -645234, -693630, -720457, -730982, -714132, -652756, -556145, -467639, -428742, -444111, -490505, -546980, -597879, -613586, -555501]
37097e55501J43459J94840J94504J64987J36366J16965R7685O8763K5404l0063
37087E57409q1802j05393r0648n5150k5578r840J559J0747O001j5277l2446k3706
37075A35876L938K0049N945k5707m9190n5637n8659p2459q9990q7834n5850j8237
37063c47755j3986n1058r0287q6258l7834J5004L8572L1592P235k4517m7121l4968
37051f41381J7570P7040J01792Q5459N2536K0174j1727l6306l4897n246K7058
37040c47928L7612K8118J2076p116k8317l6863j7295K2959N9656Q0076R2161J07753
37028B892J30131J56151J75391J66274J09785J4464q2548j45154j60905j33622
37018B32859p1137Q061P0186Q8333O8390L9598J9947L567j7794l7166m4411m4508
$$ y = [-555501, -412042, -217202, -22698, 142289, 278655, 395620, 493305, 562068, 587472, 557409, 475607, 370214, 279566, 224416, 198838, 188998, 190557, 201304, 207305, 192028, 159582, 135876, 139814, 159863, 165808, 140101, 90911, 35274, -23385, -95844, -185834, -273668, -329518, -347755, -361741, -412799, -503086, -589344, -627178, -612174, -573602, -542010, -534775, -559292, -606413, -641381, -623811, -546771, -444979, -359520, -306984, -286810, -298537, -334843, -369740, -374986, -347928, -310316, -282198, -270122, -277238, -305555, -342418, -359713, -336754, -277098, -197022, -104861, 2892, 133023, 289174, 464565, 630839, 740624, 755088, 672540, 527386, 366481, 232859, 161722, 169783, 239969, 328302, 396692, 436290, 456237, 459804, 442010, 404844, 360433, 315925]
37006C15925n2202p2968r8219j16017j17260r3693m2343K3113P3003Q1423M5934
36995e3304j1589n8451o5540k0093O3471J46238J88551J77056J28000O6414Q471
36984E69224l6206n5959m1552M16M4560O1711L8856j4410p8879j44822k14457
36973A28482k82338l19806k92574j98135p4912L3592J15376J81430K30912K43472
36963b34501K06298J32459M8426k2104n7784m3416R255N6928O2085L2965R690
36952B00301J1596J6540l840m6215q3029r5184q5751p0160o4607p7702j00623
36941c98674j08499q2960l1904K3016P4897J32392J89954K13939J71429O8977
36931B52567m4713j13601j11216n2396K2440P7022J01575J08916J10174J00457
$$ y = [315925, 263723, 190755, 92536, -23481, -140741, -234434, -276777, -253664, -180661, -99238, -53304, -64893, -123344, -188884, -208977, -145506, 732, 189283, 366339, 494339, 560753, 569224, 533018, 477059, 435507, 435923, 480483, 542194, 581050, 566640, 487761, 342939, 128482, -153856, -473662, -766236, -964371, -1039283, -1005691, -890315, -708885, -477973, -234501, -28203, 104256, 152682, 130578, 72794, 29378, 38633, 95561, 157646, 190611, 200301, 211897, 228437, 224597, 178382, 95353, 169, -85582, -155742, -220349, -298051, -398674, -507173, -590133, -622037, -599021, -524124, -391732, -201778, 12161, 183590, 252567, 207854, 94253, -16963, -69359, -46919, 30103, 131678, 240594, 350768, 451225]
36921D51225P1689L1665l16j5993k7161m8661p7566r4478q5541o0293m4036n0506
36909E0028o6069o8381n9468o8305j14036j76502k13737k02753j53060q7566k6164
36898a186013J4831K6738J8641J0609J0790J0021L097J548J7682M9065Q7823J31344
36886h03824J70551J80720J43346P1822j151n7216r7323j18830j10033p0560j8501
36875g10999K8303O3096P8944O5828K9357k114j439L4203Q9200J43556J71757
36864a0308J46267O3865l8095j10513j36738j35264j24180j02150o6729l2954
36854e46799k1967l6468n3873m3240R031Q4552J44359J59632J30508P4200N524
36843i4541o1300j03941j06758q4284p0735q0732r5326r1832p1373m8638k9940
$$ y = [451225, 522914, 554579, 554263, 538270, 511109, 462448, 384882, 290404, 204863, 144570, 100534, 50028, -16041, -84422, -143890, -212195, -326231, -502733, -716470, -919223, -1072283, -1159849, -1186013, -1171182, -1144444, -1125803, -1115194, -1104404, -1094383, -1091286, -1089738, -1072056, -1022991, -935168, -803824, -633273, -452553, -309207, -237385, -238536, -295752, -393075, -511905, -621938, -692498, -710999, -682696, -619600, -540656, -474828, -445471, -447585, -449024, -414821, -325621, -182065, -10308, 135959, 199824, 161729, 51216, -85522, -220786, -344966, -447116, -513845, -546799, -568766, -605234, -659107, -702347, -693316, -608764, -464405, -304773, -174265, -100065, -94541, -155841, -259782, -366540, -450824, -521559, -602291, -697617, -789449, -860822, -909460, -939400]
36832i39400j4359m811k354L952K6294N9172Q3754R1559R4322J08768J37731J66394
36820a88978J72879J45646R7211N8059M9193O1349O8326N9066M7127M7384N3438
36809F70700M4084O898m9805j04303j34147j23707o9724J1894Q6818J21296J09678
36798E69682Q0032O3602N9334L8853j1763o8014r3387q0214n2330l2281k0023
36787D53491m707J4779K7124K0617o437m4035p6969r5447j00631r8770r1984p8289
36775h1258n8230l6134j4997M966K2372L2743L0908J5027o900j1751K7590J12871
36763C7207K04387K47514K18957J39595M4087m7019j21631j62489j57986j21858
36753B80764q6370p2988p8094q8127r8451j11275j21234j13460q0250l6730j3788
$$ y = [-939400, -953759, -958570, -960924, -956972, -930678, -871506, -787752, -696193, -601871, -493103, -355372, -188978, -16099, 129547, 226758, 284817, 334010, 395359, 463685, 522751, 569878, 617262, 670700, 714784, 721682, 671877, 567574, 433427, 309720, 239996, 251890, 338708, 460004, 569682, 649714, 713316, 772650, 811503, 799740, 731726, 638339, 558125, 505795, 473514, 453491, 448784, 463563, 490687, 511304, 504867, 460832, 383863, 288416, 187785, 89015, -2969, -81258, -139488, -175622, -190619, -185653, -163281, -130538, -99630, -84603, -91503, -103254, -75664, 37207, 241594, 489108, 708065, 847660, 891747, 844728, 723097, 560608, 402622, 280764, 194394, 121406, 43312, -44815, -143266, -254541, -375775, -489235, -569485, -606215, -620003]
36742f20003l0869p5981j15886j26324j08789p7598l8065J4693P6648J24265J31660
36731h46249R8955N7558M1717N5491P1953O4543L3589R60j4064r040M738J2477
36719d27372O998l790m392P845J7002J2658J0626L2501O8122P9773M8630j369
36707a52768l4126l8604k5124l034J9066K3259l968m9026p9518p6405m6029l756
36695d70033L7856O5696P1206O6049P6468J10774J42897J39739R8898M9964K2897
36684D12411K3327L5283L9500K9780J7262J7821L1045L3836N02p0813j54274k16198
36672A99482k35379k09315j50862q1970k4148J1740K9003M0194N9051R2118J30689
36661a39397J49870J22882M3618o2846j52713j88571j59679q8014j6437J9747
$$ y = [-620003, -650872, -726853, -842739, -969063, -1077852, -1155450, -1193515, -1178822, -1102174, -977909, -846249, -747294, -689736, -648019, -592528, -520575, -456032, -422443, -421483, -435547, -444587, -439849, -427372, -420374, -424164, -428556, -420711, -403709, -391051, -380425, -347924, -279802, -200029, -151399, -152768, -186894, -225498, -250622, -253656, -234590, -211331, -215299, -264325, -343843, -420248, -466277, -470033, -432177, -366481, -295275, -229226, -152758, -41984, 100913, 240652, 339550, 389514, 412411, 435738, 471021, 510521, 540301, 557563, 575384, 606429, 640265, 640767, 569954, 415680, 199482, -35897, -245212, -396074, -478044, -502192, -490452, -461449, -421255, -362204, -270086, -139397, 10473, 133355, 176973, 114127, -38586, -227157, -386836, -474850, -491287, -471540]
36651d71540K0809K0980N0796J01221J32763J19297P1011J0781n6276j34657k08860
36640c43675k43593k19220j54207q6286m1266k4530k8968l8442l2394k961L3734
36629a181808N5013N9108O3723P8087R0591Q8152P4340N9595M3367J8156j2371
36618e64047l0384k0871J3276N3130P6785P2524M5940J7101P549K5670O1306R2110
36606a49911R6785O9213K4996q815j6885r384q970k4181m0883m2136l0723k5255
36594a66149l5170m7420m2093j5550J9818N6279R8815J46304J74466J52004P6177
36583D17481j5673p4061p4702l0622K4171O0075O8027N7674M1786K4758P874k104
36571E04684j152j465k0189n0263n8863k5980K7343O2202O3516M4145J7060j5331
$$ y = [-471540, -450731, -429751, -378955, -277734, -144971, -25674, 45337, 56118, -158, -134815, -343675, -587268, -806488, -960695, -1046981, -1088247, -1112777, -1141745, -1180187, -1212581, -1215542, -1181808, -1126795, -1067687, -1003964, -925877, -835286, -747134, -672794, -613199, -569832, -551676, -564047, -594431, -615302, -602026, -548896, -472111, -399587, -353647, -336546, -328997, -303327, -242021, -149911, -53126, 16087, 41083, 32268, 15383, 5999, -2971, -27152, -68035, -110171, -140894, -166149, -201319, -248739, -290832, -306382, -286564, -230285, -131470, 14834, 189300, 341304, 417481, 401808, 327747, 253045, 222423, 246594, 306669, 374696, 432370, 474156, 498914, 506788, 504684, 503532, 502067, 481878, 431615, 372752, 346772, 374115, 436317, 499833, 543978, 561038, 545707]
36559E45707m5825n9115n2485m4701n3159p0204p0770l8552K0494Q4254J27810
36548C43454J36014J10399O4339J2079l2951n1805k6039M0959J15407J55918J45483
36537A013257R9619M8315J3980M07n134j8595m3437o7446p5006o0273l1119p488
36525H67080j3203n5588j09079j32808j13568q1333p3717r5969j26016j45553
36515g9754j49772j36445j06604p2971m9190l1379p221J8547K7197J4649m595
36504e77538k4877n5658r0972r9081o2866j1703J1543M067j462J1716K6179K6103
36492h44549K3626L5795N4686N9958N1846N1659O9668Q8694Q5280N5539J2235
36481b55563l3448p2834q6927n3660K1090R2635J15146Q8035N1240L5706L5202
$$ y = [545707, 499882, 440767, 388282, 343581, 290422, 220218, 149448, 110896, 131390, 215644, 343454, 479468, 589867, 654206, 666285, 633334, 581529, 555490, 596449, 711856, 867774, 1013257, 1112876, 1161191, 1175171, 1175578, 1170444, 1151849, 1108412, 1040966, 965960, 905687, 874568, 867080, 853877, 798289, 689210, 556402, 442834, 361501, 287784, 191815, 65799, -79754, -229526, -365971, -472575, -545546, -594736, -626115, -633336, -614789, -587592, -572943, -577538, -602415, -658073, -749045, -848126, -910992, -922695, -911152, -907085, -908547, -896831, -870652, -844549, -820923, -785128, -730442, -670484, -618638, -566979, -497311, -408617, -323337, -267798, -255563, -289011, -361845, -448772, -502432, -481342, -388707, -273561, -185526, -134286, -98580, -63378]
36470f3378L1014K5145L2843N1187N3656J8364m8711j20960j73345j93560j78247
36459e65992j27634m8330M0555J11342J45415J47698J38332J28728J11123P3343
36449A54580J7674l8535p6070q4428o4796k8080J1778M5069O6101O9336N3783
36438A26412L0608J5386J0046L239p626p851J2970M2782O1511O4739O2386O2014
36426D76616O4129O5345N4974J9680l2335o1984l6770K4371O5072N3103J0287
36415G02488k2094k8713k2605j7620j1772P169M6631R7533J37350J49988J39646
36404A178001J16795P6488O359q5809j71591k31774k67593k77172k43902j64213
36394f4411p1197j0560K100j1793k2573j6395J165R710j5037p9335j56147j99855
$$ y = [-63378, -32364, -7219, 25624, 76811, 130467, 148831, 100120, -20840, -194185, -387745, -565992, -693626, -741956, -701401, -590059, -444644, -296946, -158614, -29886, 81237, 154580, 172254, 133719, 57649, -26779, -91575, -119655, -107877, -62808, 3293, 72629, 126412, 157020, 172406, 182452, 185691, 178065, 170214, 183184, 225966, 287477, 352216, 414602, 476616, 540745, 606090, 661064, 680744, 648409, 586425, 549655, 574026, 639098, 692201, 702488, 680394, 651681, 629076, 611456, 599684, 606853, 653484, 751017, 888367, 1038355, 1178001, 1294796, 1371284, 1377643, 1291834, 1120243, 888469, 620876, 343704, 99802, -64411, -135608, -146168, -144068, -155861, -178434, -194829, -193664, -183954, -198991, -278326, -434473, -634328]
36382f34328j81773j12641l3813J3599J9747J2602K8334P1763J14507J35488J48373
36371d18142J76500K12914K24920J95659J43766R9607P5752O5677O0750O0557
36361H97960O9250Q4624R1325P0569K3259k2079l5924k1292q596j5974k9142k7953
36349A076027j9898l1127o7141r8976r6376o5739m3099m9982o7321n9216j6167
36338D60985L3516N2779K9134j8816n9184p1294o1339n5467p0011q8634p9328
36327G2341l6214P783J5850j5234n8834q8694r5524q2457n7337k8299P14K9111
36315c36794N2432O3076O1825N8797N7447N0417M0641N0947R4357J44158J55633
36304D92936J16883O0984K7499K6850M1874M7302K5226k1776o6111p5664m5052
$$ y = [-634328, -816101, -928742, -962555, -948956, -929209, -916607, -888273, -816510, -702003, -566515, -418142, -241642, -28728, 196192, 391851, 535617, 635224, 710976, 776653, 837403, 897960, 967210, 1051834, 1143159, 1213728, 1236987, 1214908, 1178984, 1157692, 1149096, 1133122, 1103980, 1076027, 1056129, 1025002, 957861, 858885, 762509, 696770, 653671, 603689, 536368, 477152, 460985, 494501, 547280, 576414, 557598, 498414, 427120, 365781, 310314, 240303, 151669, 72341, 36127, 43910, 59760, 44526, -14308, -103002, -198526, -280983, -338320, -366619, -365905, -336794, -284362, -221286, -159461, -100664, -43217, 7200, 47841, 98788, 193145, 337303, 492936, 609819, 670803, 698302, 725152, 767026, 814328, 839554, 817778, 751667, 676003, 630951]
36293F30951O78L2608L6246O483n4068j24249j71337j83226j81299j87584j89901
36282c84698j56673q0951P326P2605J02335J01195P1891J5446n1436r2240p5357
36271d70557n614P4831J22951J29910J15370R3062N5441n240p3512j18539j21743
36260b03640r1038n0484j9805j698J3766L1347L9338K2493j4206m4411m7077k6260
36248c91675j11K0304L3904M0786M3104N0910P4009J05557J21427R8997L4450
36237B31662n4271j33585j66673j35121n8138J5387M4019K5459j0676l8454n7163
36226c37554p6800r1683p9281k6148N2727J24682J64359J63675J25085N8597j2693
36215F4966n7390n8203k8275K220J6598K3802L9745O3975Q1397Q3859P9878P8679
$$ y = [630951, 631629, 664237, 700483, 706966, 652898, 528649, 357312, 174086, -7213, -194797, -384698, -541371, -622322, -614996, -542391, -440056, -338861, -266970, -251524, -302960, -395200, -470557, -476171, -401340, -278389, -148479, -33109, 59953, 115394, 110154, 36642, -81897, -203640, -294678, -345162, -364967, -366665, -352899, -321552, -282214, -259721, -273927, -318338, -365415, -391675, -391786, -371482, -337578, -296792, -253688, -202778, -128769, -23212, 98215, 197212, 231662, 177391, 43806, -122867, -257988, -316126, -300739, -256720, -231261, -241937, -280391, -337554, -414354, -506037, -585318, -611466, -558739, -434057, -269698, -106023, 19062, 77659, 64966, 7576, -50627, -78902, -76682, -60084, -36282, 3463, 67438, 148835, 232694, 312572, 391251]
36203C91251P2855M7371M300l1886l7181r623L3307O9872Q3671O9536L8992J2842
36191G45307N16o333j3589j0870Q160K2851M029m7326r9429j27557j33416j26092
36179B16251j07598q6175q2031j03355j29990j36805j23557j07403r4509p5785
36169h30957m6635j4719J3867M5372R1353J54132K18263K55473K44846J93285
36159C24280J30503Q0173M3996J7501O970J8715M3135O5163Q2854R8380R6344
36148A008014N2262l4543j32457k05407k35754k18589j53366n3500M7543J14538
36138A88741J33658J12586O4705K867n4926q6393p9081m2488k117K1670K9298
36127B88520L4555M2445M1298K0969q133k2978j1884J7247M8347O6080N6676J6546
$$ y = [391251, 464106, 511477, 515777, 483891, 446710, 437087, 470394, 540266, 623937, 693473, 732465, 745307, 745823, 739490, 725901, 715031, 723191, 746042, 750071, 702745, 603316, 475759, 342343, 216251, 108653, 22478, -59553, -162908, -292898, -429703, -553260, -660663, -755172, -830957, -877592, -892311, -878444, -833072, -741719, -587587, -369324, -113851, 130995, 324280, 454783, 534956, 578952, 596453, 603423, 622138, 665273, 730436, 813290, 911670, 1008014, 1060276, 1025733, 893276, 687869, 452115, 233526, 80160, 26660, 74203, 188741, 322399, 434985, 499690, 502557, 447631, 361238, 282157, 239669, 237552, 259222, 288520, 323075, 365520, 406818, 427787, 419654, 396676, 384792, 402039, 450386, 516466, 573142, 589688]
36115E89688l4914o4853n9790m1779m2788o8035r3954r8974q4527o2532l2513
36104i4971J6182P7167J13919R0212J7163m4156l9552K5031R7382J36393J37613
36093E32383J08876N0470k9787j04817j50554j67605j65730j39816q1278n030
36083a52888N6736Q6177Q7185O4349J7710l6424o1438l1843L9828J15091J59950
36072C44433J60243J22259O9924L1238J4494K255k3198n5548p3520o4862k9933
36061D97785K8486J00881J60121J75248J42248Q9328M7508K6386K1629L1824N6490
36050A377934Q3611R0505N9992m528p8137j30393j48946j47915j48141j52301
36040H01681j48738j35198j21357j05909p2456k0138J9816J7405j6118m0605l3262
$$ y = [589688, 554774, 489921, 430131, 388352, 345564, 277529, 183575, 84601, 74, -62458, -94971, -78789, -1622, 112297, 202509, 219672, 175516, 135964, 160995, 258377, 394770, 532383, 641259, 691729, 661942, 557125, 406571, 238966, 73236, -66580, -147858, -152888, -96152, -9975, 77210, 141559, 159269, 122845, 61407, 29564, 69392, 184483, 344433, 504676, 626935, 696859, 728097, 742591, 744846, 721648, 666100, 592580, 527718, 497785, 526271, 627152, 787273, 962521, 1104769, 1194097, 1241605, 1267991, 1289620, 1321444, 1377934, 1461545, 1552050, 1612042, 1607514, 1529377, 1398984, 1250038, 1102123, 953982, 801681, 652943, 517745, 396388, 290479, 218023, 197885, 217701, 235106, 218988, 178383, 145121]
36029A45121l536L2615O8154R1064Q0087L0012l2243p2248q2205p9559p9067q0521
36017A7674q1034q3238q5323p4083l9352N897K9505J0717l5002o7300n8711j8373
36005d78623K0872L2086R850l1009o0525m5257K5792J20625J80798J67780R2170
35994C4559r45o6214p8145l5403L8535J03075J24373R9339N4364J9492N321L705
35982C02056N724J3599L2310N2972N4579K9101k336j0732M922J6591L909k2551
35970D80144m0506m2533l0214N105P3557J58203K12825J97577J12407n168j07545
35959A013852j61951j61144j20767o5548j3559K7368N1023M8973J9832k2882n9192
35948E56005p8438q2430p4629n3287j8569J8308L8834L0588m456n1664q9084r4652
$$ y = [145121, 141585, 174200, 242354, 333418, 413505, 443517, 411274, 339026, 256821, 177262, 98195, 17674, -63360, -146598, -231921, -306004, -345356, -339459, -309954, -299237, -334239, -401539, -460250, -478623, -457751, -425665, -415815, -446824, -507349, -552606, -526814, -406189, -225391, -57611, 34559, 33614, -32600, -110745, -146148, -107613, -4538, 119835, 219174, 273538, 293030, 298351, 302056, 307780, 321379, 353689, 406661, 461240, 490341, 488005, 477273, 482195, 498786, 502695, 480144, 439638, 397105, 366891, 371996, 445553, 603756, 816581, 1014158, 1126565, 1121397, 1013852, 851901, 690757, 569990, 504442, 490883, 518251, 569274, 618247, 638079, 615197, 556005, 477567, 395137, 320508, 267221, 248652, 266960, 305794, 336382, 331926, 280262, 191178, 96526]
35936I6526n9517p06M4913M7544P477m7390q1436o9473j0319O3720R8681O1286
35924A51306k3735q9487q6688k2655N7737J15359J35605J20492Q1491L9382J6987
35913D95794K3614M7720O7392O9629O0899N7615O4267O5760M8393K3355J5081
35902A039519K5088K3575j4762p9206j37291j69009j74005j55079j12848n4675
35892A91307P051O7286J26583J74614J87040J45376N6247m8853j27498j44293
35882F34860r0186P545R9350J43879J27796O3524k1211r2221j22260j07236o7828
35871E76012l1459j4650k1431m8023q1151r8402q2335l6880J5198N2460O9345
35860B98684P2110O7228N7355M4073K8517R949j1333k9099l4513k7332j9359k1394
$$ y = [96526, 37009, 36303, 81216, 128760, 136237, 88847, 7411, -62062, -72381, -8661, 90020, 151306, 127571, 38084, -48604, -71259, -13522, 101837, 237442, 357934, 439425, 478807, 495794, 519408, 567128, 634520, 704149, 765048, 822663, 886930, 952690, 1001083, 1024438, 1039519, 1064607, 1088182, 1073420, 994214, 856923, 687914, 513909, 358830, 245982, 191307, 198358, 265644, 392227, 566841, 753881, 899257, 955504, 906651, 779153, 634860, 544674, 552219, 651569, 795448, 923244, 986768, 965557, 873336, 751076, 643840, 576012, 544553, 529903, 508472, 460449, 379298, 280896, 198561, 161681, 176879, 229339, 298684, 370794, 438022, 495377, 539450, 567967, 577916, 566583, 537484, 502971, 475639, 456280, 434886]
35848D34886k8690k5035j322L4111O3282P1944N6194K3830p063j6468L694M2981
35836F52344Q0781J01046J00675Q7668P1793N4099K5938j8558p1364j17462j49966
35825H16994j69108j67963j33930p0832p512K6721K9445J9701J2658J1430J8909
35814C86513M0939P2721R3804Q7935O6743O5557J09783J84751K42242K40231J75787
35803A767006P8292k2939j15238j90435k32485k27684j81611j17140n6349q450
35793F92967K7534N4085P0164P2943O3802N0316L8765K6288N701k2774n0805p2390
35781I56596q8244j00209j08530j13731j12501r3152m6332J9125Q2006J29674
35771E24702J59938J63803J27495N8577r502n1644p5294r8205j16045j07524o2782
$$ y = [434886, 406196, 381161, 379839, 413950, 477232, 549176, 605370, 629200, 622137, 605669, 609363, 652344, 733125, 834171, 934846, 1022514, 1094307, 1148406, 1174344, 1155786, 1084422, 966960, 816994, 647886, 479923, 345993, 275161, 267649, 294370, 323815, 343516, 356174, 367604, 386513, 427452, 500173, 593977, 681912, 748655, 814212, 923995, 1108746, 1350988, 1591219, 1767006, 1845298, 1822359, 1707121, 1516686, 1284201, 1056517, 874906, 757766, 701417, 692967, 720501, 774586, 844750, 917693, 981495, 1031811, 1070576, 1096864, 1102565, 1079791, 1028986, 956596, 868352, 768143, 659613, 545882, 433381, 340229, 293897, 313022, 395028, 524702, 684640, 848443, 975938, 1034515, 1025013, 973369, 898075, 799870, 683825, 576301, 513519]
35760E13519O152P5404J19880J25433J03863Q7018R3620J10037J13172R8982P4689
35749A521769L7510j7907p8173j15826j11518o0052L3378J44651K29684K55815
35739A839331K30959J84293J27439N7640j0853n1629o4089p6409j02820j23853
35729B010009j19546r8509p9097o0249k8445J7461O2842R2662J01977R8465J00441
35718B098011J22453J55630J72331J58396J30584J10770R0860L8514o1572j82752
35708B833225k76882l14236k99590k54429j93856j24910n7772m650L2208N8864
35698A397972P3872O7441M1253J4752L084J987M390J7275M7232Q0530R3969P9024
35686A922781M3580o33l9815n9459n9447n7046o0424n3565k5840K26k679k2020
$$ y = [513519, 519671, 595075, 714955, 840388, 944251, 1031269, 1124889, 1234926, 1348098, 1447080, 1521769, 1559279, 1541372, 1463199, 1347373, 1235855, 1175803, 1209181, 1353832, 1583516, 1839331, 2070290, 2254583, 2382022, 2439662, 2428809, 2377180, 2313091, 2236682, 2133862, 2010009, 1890463, 1791954, 1712857, 1652608, 1624163, 1641624, 1704466, 1797128, 1899105, 1997570, 2098011, 2220464, 2376094, 2548425, 2706821, 2837405, 2948175, 3039035, 3077549, 3015977, 2833225, 2556343, 2242107, 1942517, 1688088, 1494232, 1369322, 1311550, 1306900, 1339108, 1397972, 1471844, 1539285, 1580538, 1595290, 1598374, 1600361, 1604751, 1622026, 1669258, 1749788, 1843757, 1922781, 1966361, 1965728, 1925913, 1866454, 1807007, 1749961, 1689537, 1635972, 1610132, 1610358, 1607679, 1585659]
35674A585659j8787J9438O6354R4811R9429Q2375M5519K600k3404k2129j221K7783
35662A958427N2037N2998K4642n486J264M8365R9772J20191J00035M7539j5403
35651B484381n1376l2087K8851Q9387J25190J40690J41143J25881J08955J12758
35641C273773J35881J56420J69485J89870K15051K21016K02011J79529J62379
35632D905415J32234Q0042K2072l3512j00531j76578k23405k09632j50784q7974
35622D157347m5517k2961q638J1794M3590P3421Q9300J07414J52018K11337K48003
35611E017108K53470K53842K60189K57749K51421K73777L33247L99699M57269
35602G757771N24282O00443O42319O19041N51746M72457L84647K92131K28065
$$ y = [1585659, 1566872, 1586310, 1652664, 1747475, 1846904, 1929279, 1974798, 1977398, 1953994, 1931865, 1930644, 1958427, 2010464, 2063462, 2088104, 2082618, 2083882, 2132247, 2232019, 2352210, 2452245, 2499784, 2484381, 2433005, 2400918, 2429769, 2519156, 2644346, 2785036, 2926179, 3052060, 3161015, 3273773, 3409654, 3566074, 3735559, 3925429, 4140480, 4361496, 4563507, 4743036, 4905415, 5037649, 5117691, 5139763, 5106251, 5005720, 4829142, 4605737, 4396105, 4245321, 4157347, 4111830, 4088869, 4080231, 4092025, 4135615, 4209036, 4298336, 4405750, 4557768, 4769105, 5017108, 5270578, 5524420, 5784609, 6042358, 6293779, 6567556, 6900803, 7300502, 7757771, 8282053, 8882496, 9524815, 10143856, 10695602, 11168059, 11552706, 11844837, 12072902]
35593A2072902K23247K72270L50123M33564M98255N36023N85358O99840Q78080
35584A6549662J073974J276106J509688J756262J958414K127964K360913K707923
35576C1320906L114775L533202M005975M596896N323303O205423P290286Q574942
35568G3965708J0002060J1583959J3430626J5614981J8138559K1065524K4503309
35561A88304726K8344717L2131508L5072073L5764561L1899735K1222415L932793
35554C76672528j5839013l1922413m0200870m0924598l7230283l2097029k6946248
35547A51512074k2241901j8257289j5081434j2524563j0387759q648850p293669
35540E7076609o193081n252982m505860l962470l521496l101348k729155k431739
$$ y = [12072902, 12296149, 12568419, 12918542, 13352106, 13850361, 14386384, 14971742, 15671582, 16549662, 17623636, 18899742, 20409430, 22165692, 24124106, 26252070, 28612983, 31320906, 34435681, 37968883, 41974858, 46571754, 51895057, 58100480, 65390766, 73965708, 83967768, 95551727, 108982353, 124597334, 142735893, 163801417, 188304726, 216649443, 248780951, 283853024, 319617585, 351517320, 372739735, 376672528, 360833515, 328911102, 288710232, 247785634, 210555351, 178458322, 151512074, 129270173, 111012884, 95931450, 83406887, 73019128, 64370278, 57076609, 50883528, 45630546, 41124686, 37162216, 33640720, 30539372, 27810217, 25378478]
35532B5378478k158436j875376j627177j442713j275153j091627r33829q35545
35524A4138622p60522o72489n92212n38707m85425m18911l70483l45068k87778
35515I667027j69940m5287K8838O9428J20737J85530K52115L38808M62439O05507
35505A1515202P50608Q87491R38140P47649K41009m36545j012120j313144j358322
35496A0959968j256040j092051r16781p64783o45777n43822m45730l55611k79245
35487D660128k15942j68590j40434j18360p9389j9746L8446P5777R7671J19385
35477D248946J36616J21567N1890n8671j63675k21404k25428j96649j56234j15836
35467C421122q2693n7312l2779j2391j8692o4321j22786j53368j48519j29578
$$ y = [25378478, 23220042, 21344666, 19717489, 18274776, 16999623, 15907996, 14974167, 14138622, 13378100, 12705611, 12113399, 11574692, 11089267, 10670356, 10299873, 9954805, 9667027, 9497087, 9451800, 9480638, 9550066, 9670803, 9856333, 10108448, 10447256, 10909695, 11515202, 12265810, 13153301, 14091441, 14839090, 15080099, 14643554, 13631434, 12318290, 10959968, 9703928, 8611877, 7695096, 6930313, 6284536, 5740714, 5294984, 4939373, 4660128, 4444186, 4275596, 4135162, 4016802, 3937413, 3917667, 3956113, 4031890, 4129561, 4248946, 4385562, 4507129, 4559019, 4500348, 4336673, 4115269, 3889841, 3693192, 3536958, 3421122, 3338429, 3281117, 3248338, 3235947, 3217255, 3152934, 3030148, 2876780, 2728261, 2598683]
35457B598683j04872o9140m0790n2417r1651r5372k7682O8645J24535J22405R6622
35446B528966P9927P7047P4540N0610j2114j00288j66750j74350j34461q6620
35436B136507n3621l5471l3339n3957r4075j38926j72809j78765j38393n2244
35426A184907M2459R2432P0972l833q6797j35355j33627j01192p4287p0540p7326
35415G07813p6350o3761l8067J1225Q3056J45496J59892J21922O3625J9323M183
35404A138357K0258O2338J12532J42577J30614P4819q224r4951j67374k19709
35394A191237k53308k66264k52812k12162j51023p9404j3553K1571J1530k2245
35384b6433l4995n422M3840P8655Q9009Q3294O6546M0326J1910j0755k3800j8871
$$ y = [2598683, 2493811, 2424671, 2383881, 2331464, 2239813, 2144441, 2116759, 2185404, 2309939, 2432344, 2528966, 2608893, 2685940, 2760480, 2811090, 2798976, 2698688, 2531938, 2357588, 2223127, 2136507, 2082886, 2047415, 2014076, 1960119, 1866044, 1727118, 1554309, 1375544, 1237151, 1184907, 1227366, 1319798, 1390770, 1386937, 1300140, 1164785, 1031158, 929966, 855679, 785139, 707813, 631463, 567702, 529635, 540860, 623916, 769412, 929304, 1051226, 1114851, 1134174, 1138357, 1158615, 1220953, 1333485, 1476062, 1606676, 1681495, 1673271, 1578320, 1410946, 1191237, 937929, 671665, 418853, 206691, 55668, -23736, -37289, -15718, -4188, -26433, -61428, -66850, -23010, 55645, 144654, 227948, 294494, 334820, 346730, 335975, 312175, 293304]
35372B93304J3908O1972Q7509O7879K5140m270j7151l9392q4039j36211j73122
35361I5527j77207j35545n1782M0752J00088J13777J01162Q0572N5342L1743K4271
35350B78700L2721L3752Q808l2022o4165p4585o3224l1054J6850O0769P4798M9866
35338B91214J478m6785q1228r8239r5575p2765l9312j3171n491j1044j7826k0344
35326b09088j6971k325K4292M6496M3513J7413p074j3060o709J411J1386K2993
35314h7723L0133L9004P0871J26655J65764J46463P8219Q170l8964p9976j32348
35303C26268j83538k10579k06836j74646j09535j2241R0145J54440J58934J24736
35293d2852R5868R8354J18714J21976Q9247L5375q792k5422k0525j4266k3954
$$ y = [293304, 307212, 369184, 456693, 524572, 549712, 545442, 528291, 488899, 404860, 268649, 95527, -81680, -217225, -269007, -228255, -128167, -14390, 86772, 167344, 222686, 254429, 278700, 311421, 345173, 353981, 321959, 257794, 183209, 119985, 88931, 105781, 166550, 241348, 291214, 292692, 245907, 164679, 66440, -29135, -101900, -141212, -154383, -159874, -170918, -188744, -209088, -226059, -228384, -204092, -157596, -114083, -96670, -103744, -116804, -123513, -122102, -110716, -87723, -57590, -18586, 52285, 178940, 344704, 491167, 569386, 577556, 538592, 458616, 326268, 142730, -67849, -274685, -449331, -558866, -571107, -480962, -326522, -167588, -42852, 53016, 151370, 270084, 392060, 481307, 516682, 507890, 482468, 461943, 447677, 423723]
35282D23723m7466n8542k9233L4816R2614J12209J05394J03505J10346J00809
35272I48175O0605K716n7008j15951j67850j90963j69535j17047o5485l6931l3199
35261E7527m4885n8981o0558l7592J1434P4493J28651J48815J24086P1380K6165
35250D40535J0787J2163l409n1515j08697j32856j03370l7623L1022Q1924J07260
35239B46221R6812M5761k1647o2646o4590o3241r3662j40072j58941j38193j02112
35228d56310o4088j1986N2738R6756R5517O8966N5238O2760O7136M5405k484n7599
35216d7951r2404q5095l9820J0346L2832K6740J8303L1590P0900J22669J63659
35205B11769J74852J59214J38458J20747Q2485J358r8494j58017j44190q2017
$$ y = [423723, 376257, 317715, 288482, 323298, 415912, 528121, 633515, 737020, 847366, 948175, 1008780, 1011496, 954488, 838537, 670687, 479724, 310189, 193142, 127657, 90726, 57527, 12642, -46339, -106897, -144489, -133055, -58562, 70089, 218904, 342990, 414370, 440535, 451322, 463485, 460076, 408561, 299864, 167008, 63638, 26015, 57037, 138961, 246221, 343033, 388794, 367147, 304501, 239911, 176670, 83008, -57064, -216005, -354198, -456310, -520398, -532384, -479646, -382890, -287373, -218407, -163169, -100409, -33273, 12132, 9648, -47951, -140355, -225450, -265270, -254924, -222092, -195352, -177049, -145459, -74559, 48110, 211769, 386621, 545835, 684293, 805040, 887525, 888883, 790389, 632372, 488182, 406165]
35195D06165k0472J6623L7247N4169O7059O6982M6994P881m0414q2040j02281
35184D57913r3396n8720j7754l036l6960j03964j54861j49379r2562k4162K2224
35173b54657M1115M1962K9354K501l3403o4456p7763p1157n2908l3226j6948l989
35161d93575N807J2422K0444L8814P1051J07888J33528J37993J20334Q4068L7034
35150B75808n483k7486k6849j8777k1850m4125q1758j21959j44241j30564q4205
35139d31489l1617M477K7627N2202P3003O9122L8387Q293M049J9993L2638K9849
35127a03466J4823q208l5329n4128n0663k7840m969M490N240O798O951m642l1312
35114b82255o3392q5383q6319o6636l8514j6490k530J8705O3749J25845J69827
$$ y = [406165, 385693, 402316, 439563, 493732, 560791, 627773, 674767, 682648, 642234, 560194, 457913, 364517, 305797, 288043, 285007, 248047, 144083, -10778, -160157, -252719, -276881, -254657, -213542, -171580, -142226, -139725, -173128, -237584, -315347, -386504, -439412, -472638, -489586, -493575, -487768, -475346, -454902, -416088, -345037, -237149, -103621, 34372, 154706, 238774, 275808, 270325, 242839, 215990, 197213, 175363, 131238, 49480, -72479, -216720, -347284, -431489, -463106, -458629, -431002, -378800, -305797, -236675, -198288, -189995, -185946, -165953, -133315, -103466, -88643, -96851, -132180, -186308, -236971, -264811, -269780, -265290, -260050, -253252, -246301, -250943, -282255, -345647, -431030, -517349, -583985, -622499, -638989, -641519, -622814, -559065, -433220, -263393]
35103b63393J58321Q7338n238o8402p4551k9966L9138J00339J22631R2825L4603
35092A93645r43K1886R1513J64243K03252J96366J48765P6677M572m9661q9703
35081I60612j27869j56815j51733j07841n9397m6636p0439r2025p4993j9451M2146
35070I5559P4502O7227M1816L0612M1588M4370q09r7378k00494k53112k31639
35059c87758j57060o9319L096N2279Q0339Q7804P3857M4932J7755R408K3167M6348
35047a75152O3507O9698O8622O1943M8451L4867L6595N7894P6291O0659P932m7999
35035C63308o8956m6368K27M5158O5871M1861l3421j35198k16148k41754k13101
35024d38521j54381q8737l1888K054L665k1125n1624o7546o1587l6763M162O1613
$$ y = [-263393, -105072, -17734, -22972, -91374, -165925, -195891, -156753, -56414, 66217, 159042, 193645, 192702, 214588, 306101, 470344, 673596, 869962, 1018727, 1095404, 1099976, 1050315, 960612, 832743, 675928, 524195, 416354, 356957, 310321, 239882, 147857, 72864, 53413, 95559, 170061, 237288, 279104, 309716, 351304, 395674, 394865, 297487, 96993, -156119, -387758, -544818, -614137, -611041, -558762, -478423, -390619, -316762, -271830, -254075, -244667, -221500, -175152, -111645, -41947, 26675, 88618, 137069, 171936, 208531, 266425, 342716, 403375, 411307, 363308, 294352, 247984, 248211, 293369, 359240, 401101, 367680, 232482, 16334, -225420, -438521, -592902, -681639, -713527, -711473, -707808, -728933, -780557, -848103, -909690, -946453, -942291, -880678]
35012h80678J31239J97770K43479K64263K71886K75974K68948K36783J82826J30680
35002A323170R9507Q2939N8049J2115m3986q7079j01657q8216n6366j5684K3607
34991A206399M6009L8091N372k7401m2945n2876p9943j21926j50458j50331j44019
34980E25972j65089k16647k68405k89099k69106k15254j39866o0044M153M1981
34970a051404O1687Q3248J20128J67701K07092K19828K01457J63241J20773Q1468
34960C75219M3353L489l5713o7506q4413q1904o4236m8564n6611r4269j38658
34949b49813j51491j10374k7503O3296J36291J88098K24009K37164K09036J32709
34939F51422L0864n5975j02023j15182j21483j33297j39153j26478j06067j03110
$$ y = [-880678, -749439, -551669, -308190, -43927, 227959, 503933, 772881, 1009664, 1192490, 1323170, 1422677, 1505616, 1563665, 1575780, 1531794, 1444715, 1343058, 1254842, 1198476, 1182792, 1206399, 1252408, 1290499, 1295871, 1268470, 1225525, 1172649, 1092706, 970780, 820322, 669991, 525972, 360883, 144236, -124169, -413268, -682374, -897628, -1037494, -1097538, -1093385, -1051404, -989717, -906469, -786341, -618640, -411548, -191720, 9737, 172978, 293751, 375219, 418572, 422061, 386348, 318842, 234429, 152525, 88289, 39725, -16886, -111155, -249813, -401304, -511678, -539181, -475885, -339594, -151496, 72513, 309677, 518713, 651422, 682286, 626311, 524288, 409106, 287623, 154326, 15173, -111305, -217372, -320482]
34929c20482j23801j42456j30458r2690o3491o4333p5131n6152M244P2187J01363
34918h91200P8389L1499j71L100L9596R8171J60183J96708J80720J08234K967
34907H196r8802j61884j58600q3537K9005J17521J38992R9284L3469l1173q0595
34896a88124r7367o5944P45N8392O7242K7924k0028l1217R500P2887J08297R1830
34884C4137N1099L0887L7500L5344N10m4626o1399m0508p29M3194Q8188J24064
34872B97661J31443J04022N6590L914n5038j22376j81114k03946j81150j29590
34862b79584p2082j6411L9764Q9912J16446J11156R0526Q2786J00064J27365J38272
34851E28214J18186P4038K6742m888j5931j2323K932L3807P6792J10462J12007
$$ y = [-320482, -444283, -586739, -717197, -809887, -873378, -937711, -1012842, -1068994, -1064750, -992563, -891200, -812811, -781312, -781483, -778383, -738787, -640616, -480433, -283725, -103005, 5229, 8196, -90606, -252490, -411090, -494627, -465622, -348101, -209109, -109825, -76356, -107529, -188124, -285491, -351435, -350690, -292298, -225056, -197132, -217160, -248377, -238877, -165990, -57693, 34137, 85236, 116123, 153623, 188967, 189477, 144851, 83452, 42944, 42215, 85409, 173597, 297661, 429104, 533126, 589716, 593630, 538592, 416216, 235102, 31156, -149994, -279584, -351666, -368077, -328313, -238401, -121955, -10799, 79727, 162513, 262577, 389942, 528214, 646400, 720438, 747180, 742292, 726361, 714038, 716970, 750777, 827569, 938031, 1050038]
34840A050038Q2150M0792k325n7188j27790j91520k17827k01843j68270j44009
34830F2208j35593j32222j21691r9786o8357k9917J1996M6726N7219L5126n391
34819c79682l6441m0434k0497R424L4872M4129L6792L1412M7808P5414P7007L5541
34807h4655j9026m6211m5049m6924o6166q1161o5669j9933L3475P0194P6337N4057
34795b40731K2665O652J6704M3873O8863P0512L2934l8355j06437j26421q7870
34784c37611k5423J7648K7857K1148J7468K5029M1783O1425P8320R0399R6386
34773A14429R1918P4855N3142L7368K4088j749m3133q0072q8304o0355m671O2445
34761A79961J16065J29397R8451N2687K4782J3859o036m4507q0576r1942q0045
$$ y = [1050038, 1132188, 1172980, 1170655, 1113467, 985677, 794157, 576330, 374487, 206217, 62208, -73385, -205607, -327298, -427084, -495441, -525358, -513362, -466636, -409417, -374291, -379682, -416123, -456557, -477054, -467630, -432758, -388629, -351837, -320425, -272617, -197203, -120196, -84655, -103681, -149892, -194941, -241865, -308031, -389192, -454861, -474794, -441319, -371125, -294788, -240731, -218066, -211414, -194710, -150837, -81974, -11462, 21472, -16883, -123320, -249741, -337611, -363034, -345386, -317529, -296381, -278913, -253884, -212101, -150676, -72356, 18043, 114429, 206347, 281202, 334344, 371712, 395800, 394051, 350918, 270846, 182542, 122187, 117516, 179961, 296026, 425423, 523874, 576561, 601343, 615202, 609166, 564659, 484083, 392141, 312096]
34750C12096n8193l0490L865L4936M7685M2527L6714M0889M3957K8997j212k4991
34738D76780k9236k7302m2479p7664j10115j17506j02473q7600r0101j04795j09259
34727d21750q3937l0844K5177N8060O6097P0790Q6851J01190R0390N4297K1231
34716C7552J9788N3236J00514J33348J32907J01644O3167M0916L1828R949l7595
34705F87254q8276j09049r7583q4514r3884j13686j12240p7057k9252O54O248
34694a11385J0200L4739P0953Q4451N3144q128o5677j01918j22750j35414j34265
34683d26050j12015p3998l4544n056J0144J2829J0692J1728J3127K005k5829n3442
34671f70409n7942l5329j979K6275M7763O8605R2177J17088J38264J47057J35756
$$ y = [312096, 253903, 223413, 227278, 262214, 309899, 352426, 389140, 430029, 473986, 502983, 501771, 476780, 447544, 420242, 377763, 300099, 189984, 72478, -29995, -117595, -207696, -312491, -421750, -505687, -536531, -511354, -453294, -387197, -316407, -229556, -128366, -37976, 16321, 37552, 57340, 110576, 211090, 344438, 477345, 578989, 642156, 683072, 714900, 724849, 687254, 598978, 489929, 392346, 307832, 213948, 100262, -11978, -89035, -118287, -117633, -111385, -101185, -66446, 4507, 88958, 142102, 133974, 68297, -33621, -156371, -291785, -426050, -538065, -612063, -646607, -651663, -641519, -628690, -617998, -606270, -593143, -591138, -616967, -670409, -728351, -763680, -765659, -739384, -691621, -623016, -530839, -413751, -275487, -128430, 7326]
34660G326J04989O3428J9552k2369n8225q1739q7436p2246l6339J0060M2284L6553
34648g4162m183m8312o6058n5242l2005p464J4261K4154J4385k760j009K5469
34636b12926M7336L3745o925l6475l5814k6848l7409n8067n0355M487P9398J28205
34624a71648J29015R6314N8725L3172J6621n294m1816q5693j19948j37597j48279
34613c76428j60620j66524j53071j23670r3881o8520l6956P808N8481J03813J36770
34602h72798J50462J41498J23354J20653J39723J57317J49586J20280Q7820N7522
34592C75417K5576K235P027L7792O2884N3000J1858k9911m4968l0563o698K654
34580D66303j1094l8453o5675q3391q0197m3499J8940O9063P1283L3692j714r531
$$ y = [7326, 112315, 175743, 195295, 172926, 114701, 32962, -54474, -126720, -163059, -152999, -110715, -74162, -78345, -126657, -192715, -247957, -279962, -287426, -273165, -249011, -234626, -237386, -238395, -212926, -165590, -131845, -138770, -175245, -211059, -237907, -275316, -333383, -383738, -379251, -299853, -171648, -42633, 53681, 112406, 145578, 162199, 156905, 115089, 29396, -90552, -228149, -376428, -537048, -703572, -856643, -980313, -1074194, -1142714, -1179670, -1171862, -1113381, -1009568, -872798, -722336, -580838, -457484, -336831, -197108, -39791, 109795, 230075, 317895, 375417, 400993, 403228, 410255, 448047, 510931, 563931, 575789, 545878, 500910, 470347, 463649, 466303, 455209, 416756, 351081, 267690, 187493, 143994, 162934, 231997, 303280, 336972, 335258, 325727]
34568C25727j951K000L358P985O132j3183l9586n2728n0497m8598n4315n6328
34556B8016m2312j4757J3391L0056K8921J0433j8956n2216q6103j15890j28615
34545c48032j10194o1201L37N3592Q7863J00795R1985O5424L6647K9825O0012
34534G053J13891J50622J30870N2354m4139j08101j19269r5347o6797m9864m0208
34523f8935k3518R109N0130P7256P0260K8666k7964p5470r7778q9115n4667j2172
34511b14198J6187K1426J5482J7720L6019O2670Q2987Q3522N9138K2123J222J9315
34499B23613O8289J13597J26826J07540P2230L4043P01j9818k7388l9031p3204
34488E87398j22565j56411j54954j28747r8216o8075l3377Q66K3167L4303M6198
$$ y = [325727, 323776, 325776, 329134, 337119, 343251, 330068, 290482, 237754, 187257, 138659, 84344, 28016, -14296, -29053, -15662, 14394, 43315, 53748, 34792, -17424, -103527, -219417, -348032, -458226, -519427, -519090, -465498, -377635, -276840, -184855, -119431, -82784, -52959, 7053, 120944, 271566, 402436, 454790, 410651, 302550, 183281, 87934, 21137, -28727, -68935, -92453, -83344, -33214, 44042, 114302, 142968, 115004, 39534, -58244, -147359, -202026, -214198, -198011, -176585, -161103, -143383, -107364, -44694, 38293, 121815, 180953, 203076, 204298, 223613, 291902, 405499, 532325, 639865, 712095, 746138, 746839, 727021, 699633, 660602, 587398, 464833, 308422, 153468, 24721, -73495, -141570, -174947, -174081, -150914, -116611, -70413]
34477g0413O1446O7198N1984J7955k4364o0569o8840k8253N6996J49805K08872
34466C61817K23220K11065J89231J54127R2989N689q7007j53088j68256j32515
34456F97272p2181k2933o457j9722m3010n6625n3106l8038k1208p710K248Q609
34444C67139J2239J9099L4483M9386M2122L626m2757n8023k7169K3816N3301M2879
34432E20141R529j7253k6781l5186o3026j06929j37348j26337p5151j3327K5232
34421d6436K3249j4459o6218j05230j16251j05964r3973r1359r0284p5137m0178
34410h22240N581M8030P9412J00276J11923J10237R0988O0503L4030J9431Q297
34399a53532j0593l4617n2672o2122o7783o5792m4950r901J1500m101m7992r0347
$$ y = [-70413, -8967, 58231, 110215, 128170, 103806, 43237, -25603, -53856, 3140, 152945, 361817, 585037, 796102, 985333, 1139460, 1232449, 1238138, 1151131, 998043, 829787, 697272, 625091, 602158, 595701, 575979, 532969, 476344, 423238, 385200, 363992, 356282, 358530, 367139, 379378, 398477, 432960, 482346, 524468, 528094, 485337, 427314, 400145, 423961, 477262, 520141, 529670, 512417, 485636, 450450, 387424, 280495, 143147, 16810, -58341, -71668, -46436, -23187, -37646, -103864, -209094, -325345, -431309, -525282, -616641, -706925, -782062, -822240, -816659, -768629, -689217, -588941, -477018, -366781, -275793, -215290, -181260, -161829, -153532, -164125, -198742, -251414, -313536, -381319, -447111, -492061, -501962, -490462, -494563, -542555, -632902]
34387f32902j13066j20759j24085j26566j28699j31807j32095j19182q5891l4686
34377a749738K7588R3566J50498J80760J75499J43064R8048M8354Q85k8514k6555
34366h86545l363J3328R514j243p11R571J6374J7121K0695L0914M2530N1866N8831
34353f21118N8999M7436L2748L2860N0157O3523N5136L4857K5336L0509L4334
34342a55223K7177J5412K063k3533o4545r7074q9310l9945J4495L3348M969n3763
34330d25929j17588j63648j72059j33210n8704K4053R2984J41657J67492J61796
34320d83156J21841O5888K2165K143n294j2893j9740k0146j6015j2208p240K775
34308c61880J5204K3241K3663J6447J415j7079k6099j4338J3687M0205N0799M4751
$$ y = [-632902, -745968, -866727, -990812, -1117378, -1246077, -1377884, -1509979, -1629161, -1715052, -1749738, -1722150, -1628584, -1478086, -1297326, -1121827, -978763, -880715, -832361, -831476, -859990, -886545, -889908, -876580, -867066, -868309, -869020, -859449, -843075, -825954, -805259, -774345, -731815, -679949, -621118, -562119, -514683, -481935, -449075, -398918, -335395, -280259, -245402, -220066, -189557, -155223, -128046, -112634, -110571, -134104, -198649, -295723, -385033, -424978, -410483, -377135, -372166, -425929, -543517, -707165, -879224, -1012434, -1071138, -1047085, -954101, -812444, -644952, -483156, -361315, -295427, -273262, -271119, -276413, -289306, -309046, -329192, -345207, -357415, -364655, -361880, -346676, -323435, -299772, -283325, -281910, -298989, -325088, -339426, -325739, -285534, -234735, -189984]
34296a89984L3036L2567N6182R6238J20006R5147K4010n5972j06993j16975r3561
34285a06299n1156j2240m089l5729q3077j10861j07131q6165o2905l9816j7817
34274g17285k750N657J8480M1477O1441N7944K5726k0518n9863p7931p1332m9299
34262g88253l0287k7458l4241l0190l700L6980P7886J15510J50350J71192J61607
34251b00604J25707R3924R1555J07559J06899P2735K4263j0549k8603m9108q2907
34240B50871j14822j18989q8297m6775l1565n8954j06467j32156j13289o2197
34230f22640m308M8674R6853J34292J48389J35352J02908N7137N35n2663p4365
34219b9836m8303P872N6370P3171O2596M3072K7913J9072J0882m288l1267o9647
$$ y = [-189984, -156948, -124381, -68199, 28039, 148045, 243192, 267202, 211230, 104237, -12738, -106299, -157455, -169695, -173784, -209513, -292590, -403451, -510582, -596747, -659652, -699468, -717285, -720035, -714378, -695898, -654421, -592980, -535036, -509310, -529828, -589691, -667622, -738954, -788253, -818540, -845998, -880239, -910429, -914129, -877149, -799263, -683753, -533403, -362211, -200604, -74897, 19027, 110582, 218141, 325040, 397775, 422038, 411489, 382886, 333778, 250871, 136049, 17060, -71237, -118012, -149577, -208531, -314998, -447154, -560443, -622640, -626948, -578274, -481421, -347129, -198740, -63388, 39520, 96657, 97192, 44529, -29836, -78139, -70267, -13897, 59274, 121870, 164942, 192855, 211927, 222809, 218521, 187254, 117607]
34207A17607j12667j44553j41993r0823q498O0038Q2291P1646P0092R9437J41509
34196A44086J66129J63358J42141J11095P3343L3782j727l3992o7379r7195j08100
34185E25541r0019n2211j7190p98l23j881K703P015m399m3485j08247j78245k20630
34172a82169k10269j51811p8604k3447P237K6408M1781N0008N1617N5999O7448
34161c45802P7973P9358P2257N7487K8245k0085p8447j29617j60008j61068j27802
34150g07509o5801M507N9033Q3787P5322L7175j5584n7326p0810o2792n1459m2178
34138h13635k4939R013N8596J15860J65294J85105J64776J20861Q2260O0818M8970
34127A72979M1654M0414L5063M666n2711j07500j27023j05156n7283j768M2936
$$ y = [117607, 4940, -139613, -281606, -372429, -380927, -320889, -238598, -166952, -96860, 2577, 144086, 310215, 473573, 615714, 726809, 800152, 833934, 832207, 798215, 730836, 633641, 525541, 435522, 383311, 366121, 365323, 365000, 363119, 365822, 372837, 368438, 324953, 216706, 38461, -182169, -392438, -544249, -622853, -646300, -639063, -612655, -570874, -520866, -469249, -413250, -345802, -267829, -188471, -116214, -58727, -30482, -50567, -129014, -258631, -418639, -579707, -707509, -773310, -768803, -709770, -625983, -550661, -513486, -529070, -586396, -657206, -719998, -771457, -813635, -838574, -829561, -770965, -655105, -489811, -304706, -139930, -19069, 63191, 124009, 172979, 214633, 255047, 290110, 294776, 242065, 134565, 7542, -97614, -154897, -156665, -113729]
34116a13729N9596M8462L3524L7047N4201O5909O8046P0636P3391O1672K8672
34105D87427j3118m4926n4235l3752J6560P9621J24352J28636R6960N3018J9263
34094H59806M058jj0492m2037r1191j34797j47663j23588p8748l4512K338M0515
34082B43688Q4249J17912J20327R3956O5506N0130K9182k1314q9881j37588j44444
34071D11723j27805j13004j07001j08184j20290j40121j46935j24682q7158o0973
34061g24430m6745j8424L5659R0866J15237J05877Q4099O6063N5953O3054J02559
34050g0232J69403K24803K24560J60035O3132k6213q7228j15164j08156o9156
34040C65784j4318L3486O1386P0998O7543N2939L1936J7114K0850M3417P2259
$$ y = [-113729, -54133, -5671, 27853, 64900, 119101, 185010, 253056, 323692, 397083, 458755, 487427, 474309, 429383, 375148, 341396, 357956, 437577, 561929, 690565, 787525, 840543, 859806, 863864, 863863, 853371, 811334, 720143, 585346, 437683, 314095, 235347, 200835, 203173, 243688, 327937, 445849, 566176, 660132, 725638, 775768, 804950, 783636, 693755, 556167, 411723, 283918, 170914, 63913, -44271, -164561, -304682, -451617, -576299, -663457, -724430, -771175, -789599, -753940, -663074, -547837, -441960, -357861, -291798, -235845, -172791, -70232, 99171, 323974, 548534, 708569, 771701, 745488, 658260, 543096, 434940, 365784, 351466, 384952, 446338, 517336, 584879, 637818, 669754, 686868, 707718, 751135, 823394]
34029H23394R2329R5987Q5293O7537M8348K7623J946k9270o1054q5604r6252r0372
34017H79905p2564n5067m9557n5341n9949n5929n3113o6729r4382j14129j09043
34006I4102q5576o0718l8487j1329J8118L3157K6683J5054J7388L0148L4576K1763
33994I4879m822m4969r7593j38946j29050n4799M6172J18097J35221J08349N7425
33983H9964m090o3465j07151j28464j27205j03514o2547k2086j060J243L561J9426
33971e05388M5446P1570R0026R3435P8468N5624M2462M1589L6672J6208r269j9328
33959C7515l213L6203Q3980J11638R0648K2607n3182r6222j02598r5643r0489
33948e8756q6162q4912r4063j04051q5842k3463O0706J23589J39833J17529Q2547
$$ y = [823394, 915723, 1011710, 1097003, 1164540, 1212888, 1240511, 1242457, 1213187, 1152133, 1066529, 970277, 879905, 807341, 752274, 702717, 647376, 587427, 531498, 478385, 411656, 317274, 203145, 94102, 8526, -52192, -90679, -102008, -83890, -50733, -24050, -8996, 8392, 38540, 73116, 94879, 90057, 45088, -52505, -191451, -320501, -375300, -329128, -211031, -75810, 32539, 89964, 85874, 22409, -84742, -213206, -340411, -443925, -506472, -528558, -529618, -528375, -524814, -505388, -459942, -388372, -298346, -204911, -126443, -70819, -28357, 13232, 49904, 66112, 56843, 37515, 34302, 70505, 154485, 266123, 356771, 379378, 326196, 229974, 127376, 31733, -58756, -144918, -229830, -323893, -427944, -513786, -537249, -476543, -352954, -213121, -95592, -13045]
33937a3045N4918L7218J9157p487l7878n9724o8730p1885p3219o3314k9677K4460
33925b89206P6458R9876Q4216M3887J0205Q761L7216O5173O0575J8211l7462p4539
33913A03371p6884n1550k1908j2476l0385n5656n5025j3087M9758R4167R7390
33902B7715P0622M2629K9462J9860j2186p9657j63358k20652k18051j58267p5251
33891g37134o164K7183J6406l4838j00808j36016j07787k9381N0224R2785J00344
33880h65186R9136J05865J15170J11496Q5502M4139J1350J2952N0299Q9726Q8485
33869e1066L6143l4014p7891q1200o4150n0749m2361k3816J2832N9543J04500
33858b12229J42295J69089J77240J62172J29328Q7675M1487m507l8766n3277n6733
$$ y = [-13045, 41873, 79091, 98248, 90761, 52883, -6841, -75571, -147456, -220675, -283989, -313666, -289206, -212748, -112872, -28656, 15231, 25436, 34197, 71413, 136586, 197161, 215372, 177910, 103371, 26487, -25063, -46971, -59447, -89832, -145488, -200513, -213600, -163842, -69675, 27715, 98337, 140966, 170428, 190288, 178102, 98445, -64913, -285565, -503616, -661883, -737134, -743298, -716115, -699709, -734547, -835355, -971371, -1079158, -1108539, -1058315, -965530, -865186, -766050, -660185, -545015, -433519, -348017, -303878, -292528, -279576, -229277, -139551, -51066, -14923, -48937, -126828, -208028, -272178, -322927, -365288, -389104, -376272, -316729, -212229, -69934, 99155, 276395, 438567, 567895, 655570, 697057, 692550, 653784, 600507, 543774]
33847E43774o5053q0272r1616r6861j06982j25906j40250j35760j11811p4000
33837d84737k6961J6558L4882K0825l677j1272j353L481j4564n6736j13112j60249
33825g96915j61005r3501J4393R9736J23032R9641O8386M5924K3468m628k6176
33814f07645k4157M287M2805O8540P3562P3176Q5560J03243R5857M4777l5646
33803g5641j15134j72361j95733j75639j13809l4326L1518P1938R6503J14300
33793e68384J22260J14020Q8043M6580m84k8606j1636M6171R8973R3652J7716
33782A8305r0469j75704k04489j75126j06009k5594L1864L8872l462n8534q0536
33771h30882n3238j03M3344N9359M9489K0631j6797m2461l4936P234O1354J01978
$$ y = [543774, 478721, 398449, 306833, 209972, 102990, -22916, -163166, -298926, -410737, -484737, -511698, -495140, -460258, -439433, -443110, -454382, -455735, -452254, -466818, -523554, -636666, -796915, -957920, -1051421, -1037028, -937292, -814260, -714619, -646233, -600309, -576841, -581469, -607645, -631802, -627515, -584710, -516170, -442608, -369432, -283872, -180629, -84772, -39995, -75641, -190775, -363136, -558869, -734508, -848317, -882643, -851125, -779187, -682684, -568384, -446124, -332104, -244061, -197481, -197965, -226571, -238207, -192036, -93063, 589, 18305, -72164, -247868, -452357, -627483, -733492, -759086, -727222, -688350, -691812, -750346, -830882, -884120, -884223, -840879, -781520, -732031, -711400, -728197, -770658, -805594, -798360, -737006, -635028]
33759f35028J21117J25272J20499J07226Q5968O1400M0051K5982J7654Q657n375
33748G3423j9610k4056j6363n117K627R806J7809J1989k8852j05723j90190k45787
33736e20044k54422k20931j61827r8054n1932l5130l2954q803O4008J71240K61505
33725h87344K84308K27345J21584J5543n5420q3067q1206p1857p1904q4120r5516
33714g81654q6589m8633N122M9153P0107P9473R7656J27523J50024J45782J13779
33703g8257O7034J8612k2797n1656o9298q4248r8885r9261p0110j9553K3938M2309
33691d42172M4083M5799N0661N4685O2041P9319R9508J06383R5585Q0695P7071
33680C53658Q8004J07567J28154J42137J42649J26550R4572M9871M05m1342o9641
$$ y = [-635028, -513911, -388639, -268140, -160914, -74946, -13546, 26505, 52487, 70141, 78798, 73423, 53813, 29757, 13394, 8277, 10904, 20710, 38519, 50508, 21656, -84067, -274257, -520044, -774466, -995397, -1157224, -1255278, -1307210, -1342340, -1375294, -1384097, -1320089, -1148849, -887344, -603036, -375691, -254107, -238564, -293984, -377051, -458257, -530114, -602018, -686138, -781654, -868243, -916876, -911754, -862601, -792494, -713021, -615365, -487842, -337818, -192036, -78257, -11223, 7389, -15408, -67064, -136362, -220610, -319495, -418756, -488866, -508419, -484481, -442172, -398089, -352290, -301629, -246944, -184903, -105584, -6076, 100307, 195892, 276587, 353658, 441662, 549229, 677383, 819520, 962169, 1088719, 1183291, 1233162, 1233567, 1192225, 1122584]
33669A122584r4481j28754j65552j78498j47907p9542K897P4695J19949J38037
33659F63428J44416J53168J55444J29532P7046K9871Q623p760n1605j18804j74406
33648A008953j97688j95839j75055j27272n6076N738K1795j1626o3005r3160q3348
33637C3417m7081j8282j6682k1436P914P8971J49527J71326J36983P4177R993
33626E58827m2725p7470r5440j10115j29921j36901j02062k5824N2423R0642P8386
33615E9820L2446k5558p7695j07635j04305o7876q554N6484J03489J09637P0174
33604D0427N894n2641q6725r3017p3135l0655K0879N6227N2840R587m8941q9029
33592b88289r3086p1127m6707l2498k3141j0661J389L068r221l0930n4720p0579
$$ y = [1122584, 1028103, 899349, 733797, 555299, 407392, 327850, 330747, 405442, 525391, 663428, 807844, 961012, 1116456, 1245988, 1323034, 1352905, 1361528, 1353768, 1302163, 1183359, 1008953, 811265, 615426, 440371, 313099, 257023, 262761, 284556, 272930, 209925, 116765, 33417, -13664, -31946, -48628, -70064, -62150, 16821, 166348, 337674, 474657, 548834, 558827, 516102, 438632, 343192, 233077, 103156, -33745, -135807, -161631, -109208, -18566, 59820, 92266, 66708, -10987, -118622, -222927, -290803, -299357, -242873, -139384, -29747, 40427, 46321, -6320, -93045, -186062, -259197, -289852, -268973, -212746, -159906, -150319, -199260, -288289, -381375, -452502, -499209, -531707, -554848, -565509, -564120, -561052, -570273, -601203, -655923, -726502]
33580g26502o6049l7461k5K3816K7846K4869K5372K6400K6896L8968O9067R7105
33568d69698R4072O0626K9647K3758K6128O430l3804n7877l5810K1387P2152Q3328
33556a79661N7706K7660K3165M4664O7908P4118O7798O2100N7739M7649L5220
33545C86066L3163M6107O7795R3922J21472J34010J07079L8072m3021j02901j33238
33534G48526j40138j20127o4908J5946R4121J44599J58646J38648R2120K9251
33524A096684m3350j23354j98494k40346k29778j85472j47851j32737j18770q4412
33514d07880l8078k899J1691J1783O926R470L3414P7057J12946J09914O3318m290
33502a6628o4352r4051p9988l1164J6077K8235J2600P306L0637N9716O6486N4630
$$ y = [-726502, -792551, -830012, -830037, -806221, -778375, -753506, -728134, -701734, -674838, -635870, -566803, -469698, -375626, -315000, -285353, -261595, -235467, -229037, -262841, -320718, -356528, -335141, -262989, -179661, -121955, -94295, -71130, -26466, 41442, 115560, 183358, 245458, 303197, 350846, 386066, 419229, 465336, 533131, 627053, 748525, 882535, 989614, 1027686, 984665, 881764, 748526, 608388, 488261, 423353, 439299, 533420, 678019, 836665, 975313, 1067433, 1096684, 1053334, 929980, 731486, 491140, 261362, 75890, -71961, -204698, -323468, -407880, -445958, -448857, -437166, -425383, -418457, -408987, -375573, -298516, -185570, -75656, -12338, -16628, -80980, -175031, -255019, -286183, -270106, -241871, -229271, -221965, -191328, -131612, -65126, -10496]
33490a0496M6864N1462O0090O9680Q6458J09800J27763J29547J11604P4225K6627
33479H83624n842J324M0058O8627N2173m221o9206j20125j53844j73707j82264
33468C36597j84340j83767j76747j58270j33202j09128p9347k8545L9275R1627
33458e85847R6520N4959k113m4100o2154o6291o9680p4992p2134n0653j5108J7303
33446h74290L7026N2472P4331R6636J03142Q9819P2160O9929Q9996J22416J47321
33435H0958J48036J25577J00393R2554R9192R8238P5354L9732J0269o570j9641
33424H44092l8922o5897r6564j26028j46178j43756j09216n1263J778K2263P264
33413I7573k0128l3697k5365m858J4896K9114M2772O4307R3782J15458J08359
$$ y = [-10496, 36368, 87830, 147920, 217600, 304058, 413858, 541621, 671168, 782772, 856997, 883624, 877782, 879106, 919164, 987791, 1039964, 1035743, 966537, 846412, 692568, 518861, 336597, 152257, -31510, -208257, -366527, -499729, -608857, -688204, -716749, -677474, -585847, -489327, -434368, -436481, -480581, -542735, -609026, -678706, -753698, -825832, -876485, -891593, -874290, -837264, -784792, -710461, -613825, -510683, -420864, -348704, -278775, -188779, -66363, 80958, 228994, 354571, 454964, 547518, 646710, 744948, 820302, 860034, 870303, 863733, 844092, 805170, 739273, 642709, 516681, 370503, 226747, 117531, 66268, 68046, 90309, 97573, 77445, 43748, 18383, 13525, 28421, 57535, 100307, 164614, 258396, 373854, 482213]
33402D82213O9101J9690j2003j6302m468N272M5k0843m3915n3021m9999n5481
33390C20289p9562j00971q9662m4049R145M6499O1671N2420J8088k5217m8317
33379A20334l8161q521K4728O0233R2983J01503P4448L6246K1214K6213J1266
33368E22486n1052j44093k26280k64481k45975j78873r4885l8028l0642m9520
33358h01343m6318N343Q6704J54628J77784J53546J00955M5900R301j138O192
33347a08446J3269M906k3593o7933j18495j60592j76767j56199j03336l5176K9105
33336i03257P4306Q9923P3828L8494Q694O452L4339P1946R1218Q1629O2718O5348
33324b04362R5424J22562J12700O6557J5852j3538k0226j1543J1361M4470P1136
$$ y = [482213, 551314, 571004, 559001, 542699, 538231, 543503, 543548, 522705, 478790, 425769, 375770, 320289, 240727, 139756, 50094, 6045, 15190, 61689, 123360, 175780, 193868, 168651, 120334, 82173, 73652, 98380, 158613, 251596, 353099, 427547, 463793, 485007, 511220, 522486, 471434, 327341, 101061, -163420, -409395, -588268, -683153, -721181, -751823, -801343, -847661, -842318, -755614, -600986, -423202, -269656, -168701, -122801, -113500, -114638, -108446, -95177, -90271, -113864, -181797, -300292, -460884, -637651, -793850, -897186, -932362, -903257, -828951, -739028, -665200, -626706, -618012, -611560, -577221, -505275, -414057, -332428, -269710, -204362, -108938, 13624, 126324, 192881, 208733, 195195, 174969, 163426, 174787, 219257, 290393]
33313B90393P4003N1087J2545l1725p2879r8411r8599p7925n3182l9894m3646
33302h8233o2080q9312j17365j34870j26132p7612O439R6624J58286J81952J84976
33291f7327J82383J71304J49489J29593J18470R6747M2849k6668o4392m5260L557
33280F90745L2636J7656k9766q5455j32925j63574j69805j46515j00432n3710
33270a41145l0480l5355m9458n2981m7736n0639o8388q7615q9669o7585k8628
33259g49679J1905L8423M4693L9549L8871M9966O6486P7119P3605N1438J1172
33248b46452l6709p1687p2161k8294M7548J21014J56189J45676J15371R0454O5147
33237B86096K1398k9882n2197l3381p611j1493l5790m2701k1759k602q951k1689
$$ y = [290393, 364396, 415483, 428028, 396303, 323424, 225013, 126414, 48489, -4693, -44587, -88233, -150313, -239625, -356990, -491860, -617992, -695604, -689165, -592541, -434255, -252303, -67327, 115056, 286360, 435849, 565442, 683912, 780659, 823508, 796840, 732448, 687188, 690745, 723381, 741037, 711271, 625816, 492891, 329317, 159512, 12997, -87435, -141145, -171625, -206980, -256438, -309419, -357155, -407794, -476182, -563797, -653466, -721051, -749679, -737774, -699351, -654658, -615109, -576238, -526272, -459786, -382667, -309062, -257624, -246452, -283161, -354848, -427009, -455303, -407755, -286741, -130552, 15124, 130495, 220949, 286096, 307494, 277612, 225415, 192034, 184423, 172930, 137140, 94439, 72680, 70078, 61127, 39438]
33225C9438j803N9181J25282J51792J25812O9109Q569m7610j04736j61916k05157
33214E7961k17649j89966j22030k6243O6714J16136J00293M0296j3058k3346L12
33203b10580J8183N108k3055l0025j874L8053N7006M6118K0284n893k9352m9082
33191a65109o0018n9821n0679l0082Q859O0379R9361J03441P8054N0463M1911
33180G6759N4074P8947J09050J34663J40487J13205N3190k1147q0623j02807q9484
33169D66314o4175m5171k4985J1821N3077O0552J5938n0905r5906j12702j30002
33158H3856j60997j80586j62055j17037q3056q1966j05719j34653j51195j38481
33148a231889q6790r885N6891Q4034O9963L5785P774P532M6737J20298K06204
$$ y = [39438, 37635, 96816, 222098, 373890, 499702, 568811, 577380, 529770, 425034, 263118, 57961, -159688, -349654, -471684, -497927, -431213, -315077, -214784, -174488, -187546, -210892, -210580, -192397, -187289, -210344, -240369, -242243, -204190, -147184, -101066, -80782, -86675, -116027, -165109, -225127, -284948, -335627, -365709, -356850, -296471, -197110, -93669, -15615, 34848, 76759, 130833, 209780, 318830, 453493, 593980, 707185, 760375, 739228, 658605, 555798, 466314, 402139, 356968, 331983, 343804, 396881, 457433, 473371, 422466, 326560, 213858, 83856, -77141, -257727, -419782, -536819, -619875, -701841, -807560, -942213, -1093408, -1231889, -1318679, -1328564, -1271673, -1187639, -1117676, -1081891, -1074117, -1066585, -1019848, -899550, -693346]
33137f93346K75537L02221K70314J87363R1831K8536N421j3104o0031j25786j74775
33126I4181j85432j56683r0993P29Q3167J16166R7722O6893N6902O2282N7786
33115B02720L0708j4186o3909r8883r9205o3009j1041L4294O4728P7002O6111
33104A25330L9357K0107J9985J9934k238l6182n2497m5031l5875l9772m7639m9620
33092h4141n1849n9925o2679m5619j0372K9960O6702R7432J19040J29098J29934
33081B57581J23066J03195O6195K1781q847r424J8804N7432Q0810P1356L3171
33070H15120r863l5242m2170m8993p3319j18827j77026k30964k54770k21819j27888
33059e25761q408P7879R3534N3605R124j850J5909L3019L4752L3075M2895N9262
$$ y = [-693346, -417809, -115588, 154726, 342089, 433920, 462456, 467877, 454773, 394742, 268956, 94181, -91251, -247934, -338927, -338198, -255031, -138865, -41143, 25750, 82652, 144934, 202720, 233428, 219242, 155333, 56450, -42755, -105764, -116805, -82511, -17783, 59219, 125330, 164687, 184794, 204779, 224713, 222475, 186293, 133796, 88765, 52890, 13118, -34521, -84141, -135990, -195915, -258594, -304213, -314585, -284625, -217923, -120491, -1451, 127647, 257581, 380647, 483842, 550037, 571818, 562971, 553547, 572351, 629783, 710593, 781949, 815120, 805257, 770015, 727845, 678852, 605533, 486706, 309680, 78716, -176054, -397873, -525761, -534169, -456290, -362756, -309151, -300027, -301877, -285968, -252949, -218197, -185122, -142227, -82965]
33047h2965O4537N0133K2105j0550m2034o4158o6918n2327m1117n5280r3095j27644
33035d99313j31985j02639n8502k2547p673j4763l6100n8636o9415o4026n1433
33024a117032m8022o3292q9484j05584r2784m7655J6735P8937J18933J27215J10873
33013a111160Q8696P3873O1628L9277O866k1272l6363m4162m7369l1764J3870
33002a007880O8281Q6871M6950k7225r1553j24568j33098j24009q8608k1014N9642
32991a356211J18587J37473J29239J18438J13196J01691P1435K3830k8963p2841
32981f44126r6125r4065p3648m7456j8306K3225Q0331J36044J66597J65282J45795
32970b56452J25159J10075R5914P1115K6725k8397o4690n5781o527N0393Q4769
$$ y = [-82965, -18428, 31705, 53810, 43260, 1226, -62932, -129850, -182177, -223294, -278574, -371669, -499313, -631298, -733937, -792439, -814986, -822659, -837422, -873522, -932158, -1001573, -1065599, -1117032, -1165054, -1228346, -1317830, -1423414, -1516198, -1563853, -1547118, -1468181, -1349248, -1222033, -1111160, -1022464, -948591, -886963, -847686, -840820, -862092, -898455, -942617, -989986, -1021750, -1007880, -939599, -852728, -805778, -833003, -924556, -1049124, -1182222, -1306231, -1394839, -1415853, -1356211, -1237624, -1100151, -970912, -852474, -739278, -637587, -566152, -542322, -571285, -644126, -740251, -834316, -907964, -955420, -973726, -950501, -870170, -734126, -567529, -402247, -256452, -131293, -21218, 74696, 145811, 172536, 144139, 79449, 23668, 17141, 67534, 152303]
32959A52303Q8096O7289L4028K567j4875j6998j1128j24K0531N1355Q3643J07135
32947E63822J14338R7696N4689j915n1055q3755j04634j11430r0530m1877O423
32936C51772K1974O67l0979l7875J303P6869J43660J50673R1692J7398j4759P206
32924G79601N5333R8114J11427P4189j0936r6139j21747p9297j7701K0279M2956
32913H56079P9262J27215J54923J41293R3885K8655m9268j38084k22584k75292
32903G96084k77409k36915j82277j36536j00387o1432j2648M3701J02115J53392
32893H7688J83895J87870J77180J65255J43894R2419J1601o7783j16013j31026
32883G34980j29018j22453j15735j10560j04699r2953p7658p1383q1482r8631
$$ y = [152303, 240399, 307688, 341716, 344283, 329408, 312410, 301282, 301158, 321689, 373044, 456687, 563822, 678160, 775856, 830545, 828630, 777575, 693820, 589186, 477756, 387226, 345349, 351772, 373746, 374413, 343434, 305559, 306862, 383731, 527391, 678064, 769756, 787154, 772395, 779601, 834934, 933048, 1044475, 1118664, 1107728, 1011589, 889842, 810545, 792844, 813123, 856079, 935341, 1062556, 1217479, 1358772, 1452657, 1481312, 1432044, 1293960, 1071376, 796084, 518675, 281760, 99483, -37053, -137440, -198872, -211520, -167819, -65704, 87688, 271583, 459453, 636633, 801888, 945782, 1038201, 1049802, 982019, 866006, 734980, 605962, 483509, 367774, 257214, 152515, 59562, -18096, -89479, -170961, -269592]
32873b69592j07984j05235r4709p8584n6251k9376r18K5330L9018K6469j0311
32862f62143m4840m8895k2111J0072K5591K5331K7947N4211J11313J79503K16083
32851a27938J88952J13458M6680L6192P6188J17371J16788P4163K1574j5996m3086
32840F04346p4620j02399r6320m5059J7931M4603K4206r908k3892j6927p629n640
32828C08692r840k2044m3471o0373n1041j2642L0475N2381N1948M6716M7094M6712
32816C84607L6043J4358j4797n1225r3963j33283j53929j47551j19941q7122o5270
32805d32073n9350n5801k9735L0450J02481J41576J19747N3363j1245l8193k6569
32794b05349M68K2932L7344M8192N4532M9824L2335Q779j4934m1373p4423j07188
$$ y = [-269592, -377576, -482811, -577520, -656104, -712355, -741731, -742649, -717319, -678301, -651832, -662143, -706983, -755878, -777989, -767917, -742326, -716995, -689048, -634837, -523524, -344021, -127938, 61014, 174472, 221152, 257344, 333532, 450903, 567691, 641854, 663428, 647432, 604346, 529726, 427327, 331007, 285948, 303879, 348482, 372688, 362780, 338888, 321961, 314332, 308692, 298852, 276808, 233337, 172964, 121923, 109281, 139756, 192137, 244085, 290801, 337895, 384607, 420650, 435008, 420211, 368986, 275023, 141740, -12189, -159740, -279681, -366803, -432073, -491423, -547224, -576959, -546509, -444028, -302452, -182705, -129342, -140587, -178780, -205349, -204881, -181949, -144605, -96413, -41881, 7943, 40278, 49057, 34123, -7250, -81673, -188861]
32782a88861j24286j17547r4729p0899n4261m0714j8048K4973Q7720J51993J90996
32771b53663J88878J51686R8611M5507j233l8885o2293o4956m5235j1670J7942
32760B4689K5451L695l9234q5903j19827j32855j26279j04776o7558o803Q1583
32749e47817J84988K73314L11620K77173J74507M0800p1784j33277j56424j70489
32739A82611j76249j42046m9337P1983J64067J89555J53385Q9001L6368K4876
32729E44214N7334J05341J30480J14966O8129O518o0553j23890j66265j72793
32719E03481j47188j10687q4455p6159q2309r7640j17425j31846j25081q7162
32709e56471k7034L2902P9022J18014J60408J96836K00647J56950Q3312J7649
$$ y = [-188861, -313147, -430694, -525423, -596322, -650583, -691297, -709345, -684372, -596652, -444659, -253663, -64785, 86901, 185512, 231019, 229786, 190901, 128608, 63652, 18417, 6747, 24689, 50140, 53835, 14601, -71302, -191129, -323984, -450263, -555039, -622597, -629400, -547817, -362829, -89515, 222105, 499278, 673785, 714585, 642801, 509524, 353100, 182611, 6362, -135684, -185021, -113038, 51029, 240584, 393969, 482970, 519338, 544214, 601548, 706889, 837369, 952335, 1020464, 1026982, 966429, 842539, 676274, 503481, 356293, 245606, 161151, 84992, 2683, -94957, -212382, -344228, -469309, -556471, -583505, -550603, -471581, -353567, -193159, 3677, 204324, 361274, 444586, 462235]
32699D62235j2404p641R981J8726J4423J1963K9936O9803J08683J15715P8351
32688H99771J2457n2926r6390j08278q3844k7187L6079O5211L7074k9854r1901
32677E60212j18053j06681p3437l6357j0547l017r151k2762m8104q9711j31973
32666h9581j47204j29852j05911r8357r7386p6765k8074L3471Q6318J12780J03762
32655d36799P0809M5806N0650P1225P7562O4506N3209N5089N6029L8975K276m9486
32643I9851j12847j73525k03526j84035j22943m1693M4706J25734J85127K06537
32633a76614J85580J28694M7229l8320r7278j08097q0135m7015l6313m9074o5758
32622c37101o5699m3165j1693P540O301k715k061R699J8924J6155Q305J2481M1524
$$ y = [462235, 449831, 442190, 452171, 470897, 485320, 497283, 527219, 597022, 705705, 821420, 899771, 912228, 859302, 762912, 654634, 570790, 543603, 579682, 644893, 681967, 652113, 560212, 442159, 335478, 262041, 225684, 215137, 212120, 202969, 180207, 132103, 42392, -89581, -236785, -366637, -472548, -570905, -668291, -745056, -773130, -739659, -653341, -540561, -436799, -365990, -320184, -269534, -198309, -120747, -56241, -3032, 52057, 108086, 147061, 149337, 99851, -12996, -186521, -390047, -574082, -697025, -738718, -694012, -568278, -383151, -176614, 8966, 137660, 184889, 146569, 49291, -58806, -138941, -185956, -222269, -271343, -337101, -402800, -445965, -457658, -450118, -443817, -446532, -448593, -438894, -419970, -403815, -395510, -383029, -341505]
32609c41505R2278J42252J61083J34340P7882K4520l595o402N359K3423M3633
32598C53268O3067P9551Q9428Q3705N2109m743o9317j15696j23462q6375j6129
32587C05406N8456J03495J01801O5166K1965q580k9288n5205r5047j41619j76100
32576A50450j80854j52344j04637n8190k2073J1666N3597R8920J29248J33515
32566E9298J21614J12680J12931J10684R1982N4426M665m9615r9299j30967j33932
32555B54467j11101p6191l8100N682N5764R6616J04410P0103Q988n4038j02706
32544B13894j29788j27888r2539l6935O498R644k5273o7472q6636p7821n7908
32533d72224m2012k8450p783J7641K9913J4948j7491l9940l6067j9115j6711l7866
$$ y = [-341505, -249227, -106975, 54108, 188448, 266330, 290850, 287255, 280853, 286212, 309635, 353268, 416335, 495886, 585314, 669019, 721128, 716385, 647068, 531372, 407910, 321535, 305406, 363862, 467357, 569158, 634324, 656289, 647709, 618421, 563216, 468169, 326550, 150450, -30404, -182748, -287385, -345575, -367648, -355982, -302385, -203465, -74217, 59298, 180912, 293592, 406523, 517207, 609189, 663615, 668280, 618665, 519366, 388399, 254467, 143366, 67175, 29075, 34757, 90521, 187137, 291547, 361650, 370638, 316600, 213894, 84106, -43782, -136321, -173256, -166758, -157114, -182387, -249859, -336495, -414316, -472224, -514236, -542686, -550469, -532828, -502915, -487967, -505458, -545398, -581465, -600580, -617291, -655157]
32521f55157n9446m8521J780O0977Q9386P9129O3216P9125J26158J66344J66956
32510F9947J32776R4019P3142P0070P0299N6188J6031m4959j02928j34603j38890
32499A61092j31698j20936r7276n1103J0865O9162J05270J12072R9724R1157R9779
32488C48108J08129Q0598L364r7976j84812k36295k46678k10096j28234k6209
32478e90101O0676J18654J60090J94793K11746J95673J50323R6198N0046J2188
32468F60286k9127q2853j39072j66839j38843o6527l736k888o5199j39784j72871
32457c47453j54112j15122q9679q1110o7660l3931R610M0670N2979O1067P6213
32446f48528Q8041P8960N1052K5842J6358J1599m574k7769l6686j9335J3627M1739
$$ y = [-655157, -714603, -763124, -761344, -700367, -610981, -531852, -468636, -389511, -263353, -97009, 69947, 202723, 296742, 369884, 439954, 510253, 566441, 582472, 537513, 434585, 299982, 161092, 29394, -91542, -188818, -239921, -229056, -159894, -54624, 57448, 157172, 248329, 348108, 456237, 536835, 540199, 442223, 257411, 21116, -225562, -435658, -563892, -590101, -529425, -410771, -250681, -55888, 155858, 351531, 501854, 598052, 648098, 660286, 631159, 548306, 409234, 242395, 103552, 37025, 33289, 30401, -34798, -174582, -347453, -501565, -616687, -706366, -787476, -855136, -889067, -879457, -838787, -785808, -724741, -648528, -560487, -481527, -430475, -404633, -388275, -376676, -381250, -409019, -445705, -465040, -451413, -409674]
32434d09674N3160M9406L9242L0751K3986R418j9975n2592o2231l4383J7121O5389
32422b90382R5625J07337R9899P1093K9234p621k9431m2242n6183p5458j02166
32411b00295j35356j57337j35052n3957N1115J14786R8007K1912n5785r2249q6527
$$ y = [-409674, -356514, -307108, -267866, -237115, -213129, -203711, -223686, -276278, -338509, -372892, -355771, -290382, -194757, -87420, 12479, 83572, 112806, 105185, 75754, 33512, -22671, -98129, -200295, -335651, -492988, -628040, -681997, -630882, -516096, -418089, -396177, -451962, -544211, -630738]
$$ [...]
##END NTUPLES=NMR SPECTRUM
##END=
